juddi-dev mailing list archives

Site index · List index
Message view « Date » · « Thread »
Top « Date » · « Thread »
From "Daniel Ferreira Castro (JIRA)" <juddi-...@ws.apache.org>
Subject [jira] [Commented] (JUDDI-878) Fix Jboss AS 7.x deployment
Date Mon, 12 May 2014 13:36:19 GMT

    [ https://issues.apache.org/jira/browse/JUDDI-878?page=com.atlassian.jira.plugin.system.issuetabpanels:comment-tabpanel&focusedCommentId=13995083#comment-13995083
] 

Daniel Ferreira Castro commented on JUDDI-878:
----------------------------------------------

1 - I downloaded the the source from the tag https://git-wip-us.apache.org/repos/asf?p=juddi.git;h=c7b7975
2 - Then went inside juddi-c7b7975\juddiv3-war
3 - mvn clean install -Popenjpa-jboss7up -e -X -U
4 - got this

[INFO] ------------------------------------------------------------------------
[INFO] BUILD FAILURE
[INFO] ------------------------------------------------------------------------
[INFO] Total time: 26.469 s
[INFO] Finished at: 2014-05-12T10:26:38-03:00
[INFO] Final Memory: 6M/17M
[INFO] ------------------------------------------------------------------------
[ERROR] Failed to execute goal on project juddiv3-war: Could not resolve dependencies for
project org.apache.juddi:juddiv3-war:war:3.2.1-SNAPSHOT: The following artifacts could not
 be resolved: org.apache.juddi:uddi-ws:jar:3.2.1-SNAPSHOT, org.apache.juddi:juddi-core-openjpa:jar:3.2.1-SNAPSHOT,
org.apache.juddi:juddi-rest-cxf:jar:3.2.1-SNAPSHOT: Could not fin
d artifact org.apache.juddi:uddi-ws:jar:3.2.1-SNAPSHOT in maven2-repository.dev.java.net (http://download.java.net/maven/2)
-> [Help 1]
org.apache.maven.lifecycle.LifecycleExecutionException: Failed to execute goal on project
juddiv3-war: Could not resolve dependencies for project org.apache.juddi:juddiv3-war:war:3
.2.1-SNAPSHOT: The following artifacts could not be resolved: org.apache.juddi:uddi-ws:jar:3.2.1-SNAPSHOT,
org.apache.juddi:juddi-core-openjpa:jar:3.2.1-SNAPSHOT, org.apache.juddi:
juddi-rest-cxf:jar:3.2.1-SNAPSHOT: Could not find artifact org.apache.juddi:uddi-ws:jar:3.2.1-SNAPSHOT
in maven2-repository.dev.java.net (http://download.java.net/maven/2)
        at org.apache.maven.lifecycle.internal.LifecycleDependencyResolver.getDependencies(LifecycleDependencyResolver.java:220)
        at org.apache.maven.lifecycle.internal.LifecycleDependencyResolver.resolveProjectDependencies(LifecycleDependencyResolver.java:127)
        at org.apache.maven.lifecycle.internal.MojoExecutor.ensureDependenciesAreResolved(MojoExecutor.java:257)
        at org.apache.maven.lifecycle.internal.MojoExecutor.execute(MojoExecutor.java:200)
        at org.apache.maven.lifecycle.internal.MojoExecutor.execute(MojoExecutor.java:153)
        at org.apache.maven.lifecycle.internal.MojoExecutor.execute(MojoExecutor.java:145)
        at org.apache.maven.lifecycle.internal.LifecycleModuleBuilder.buildProject(LifecycleModuleBuilder.java:108)
        at org.apache.maven.lifecycle.internal.LifecycleModuleBuilder.buildProject(LifecycleModuleBuilder.java:76)
        at org.apache.maven.lifecycle.internal.builder.singlethreaded.SingleThreadedBuilder.build(SingleThreadedBuilder.java:51)
        at org.apache.maven.lifecycle.internal.LifecycleStarter.execute(LifecycleStarter.java:116)
        at org.apache.maven.DefaultMaven.doExecute(DefaultMaven.java:361)
        at org.apache.maven.DefaultMaven.execute(DefaultMaven.java:155)
        at org.apache.maven.cli.MavenCli.execute(MavenCli.java:584)
        at org.apache.maven.cli.MavenCli.doMain(MavenCli.java:213)
        at org.apache.maven.cli.MavenCli.main(MavenCli.java:157)
        at sun.reflect.NativeMethodAccessorImpl.invoke0(Native Method)
        at sun.reflect.NativeMethodAccessorImpl.invoke(NativeMethodAccessorImpl.java:57)
        at sun.reflect.DelegatingMethodAccessorImpl.invoke(DelegatingMethodAccessorImpl.java:43)
        at java.lang.reflect.Method.invoke(Method.java:606)
        at org.codehaus.plexus.classworlds.launcher.Launcher.launchEnhanced(Launcher.java:289)
        at org.codehaus.plexus.classworlds.launcher.Launcher.launch(Launcher.java:229)
        at org.codehaus.plexus.classworlds.launcher.Launcher.mainWithExitCode(Launcher.java:415)
        at org.codehaus.plexus.classworlds.launcher.Launcher.main(Launcher.java:356)
Caused by: org.apache.maven.project.DependencyResolutionException: Could not resolve dependencies
for project org.apache.juddi:juddiv3-war:war:3.2.1-SNAPSHOT: The following artifac
ts could not be resolved: org.apache.juddi:uddi-ws:jar:3.2.1-SNAPSHOT, org.apache.juddi:juddi-core-openjpa:jar:3.2.1-SNAPSHOT,
org.apache.juddi:juddi-rest-cxf:jar:3.2.1-SNAPSHOT: C
ould not find artifact org.apache.juddi:uddi-ws:jar:3.2.1-SNAPSHOT in maven2-repository.dev.java.net
(http://download.java.net/maven/2)
        at org.apache.maven.project.DefaultProjectDependenciesResolver.resolve(DefaultProjectDependenciesResolver.java:198)
        at org.apache.maven.lifecycle.internal.LifecycleDependencyResolver.getDependencies(LifecycleDependencyResolver.java:195)
        ... 22 more
Caused by: org.eclipse.aether.resolution.DependencyResolutionException: The following artifacts
could not be resolved: org.apache.juddi:uddi-ws:jar:3.2.1-SNAPSHOT, org.apache.juddi
:juddi-core-openjpa:jar:3.2.1-SNAPSHOT, org.apache.juddi:juddi-rest-cxf:jar:3.2.1-SNAPSHOT:
Could not find artifact org.apache.juddi:uddi-ws:jar:3.2.1-SNAPSHOT in maven2-repository
.dev.java.net (http://download.java.net/maven/2)
        at org.eclipse.aether.internal.impl.DefaultRepositorySystem.resolveDependencies(DefaultRepositorySystem.java:384)
        at org.apache.maven.project.DefaultProjectDependenciesResolver.resolve(DefaultProjectDependenciesResolver.java:192)
        ... 23 more
Caused by: org.eclipse.aether.resolution.ArtifactResolutionException: The following artifacts
could not be resolved: org.apache.juddi:uddi-ws:jar:3.2.1-SNAPSHOT, org.apache.juddi:j
uddi-core-openjpa:jar:3.2.1-SNAPSHOT, org.apache.juddi:juddi-rest-cxf:jar:3.2.1-SNAPSHOT:
Could not find artifact org.apache.juddi:uddi-ws:jar:3.2.1-SNAPSHOT in maven2-repository.d
ev.java.net (http://download.java.net/maven/2)
        at org.eclipse.aether.internal.impl.DefaultArtifactResolver.resolve(DefaultArtifactResolver.java:459)
        at org.eclipse.aether.internal.impl.DefaultArtifactResolver.resolveArtifacts(DefaultArtifactResolver.java:262)
        at org.eclipse.aether.internal.impl.DefaultRepositorySystem.resolveDependencies(DefaultRepositorySystem.java:367)
        ... 24 more
Caused by: org.eclipse.aether.transfer.ArtifactNotFoundException: Could not find artifact
org.apache.juddi:uddi-ws:jar:3.2.1-SNAPSHOT in maven2-repository.dev.java.net (http://down
load.java.net/maven/2)
        at org.eclipse.aether.connector.wagon.WagonRepositoryConnector$6.wrap(WagonRepositoryConnector.java:1012)
        at org.eclipse.aether.connector.wagon.WagonRepositoryConnector$6.wrap(WagonRepositoryConnector.java:1004)
        at org.eclipse.aether.connector.wagon.WagonRepositoryConnector$GetTask.run(WagonRepositoryConnector.java:725)
        at org.eclipse.aether.util.concurrency.RunnableErrorForwarder$1.run(RunnableErrorForwarder.java:67)
        at java.util.concurrent.ThreadPoolExecutor.runWorker(ThreadPoolExecutor.java:1145)
        at java.util.concurrent.ThreadPoolExecutor$Worker.run(ThreadPoolExecutor.java:615)
        at java.lang.Thread.run(Thread.java:744)
[ERROR]
[ERROR]
[ERROR] For more information about the errors and possible solutions, please read the following
articles:
[ERROR] [Help 1] http://cwiki.apache.org/confluence/display/MAVEN/DependencyResolutionException

> Fix Jboss AS 7.x deployment
> ---------------------------
>
>                 Key: JUDDI-878
>                 URL: https://issues.apache.org/jira/browse/JUDDI-878
>             Project: jUDDI
>          Issue Type: Bug
>          Components: website
>            Reporter: Daniel Ferreira Castro
>            Assignee: Kurt T Stam
>            Priority: Minor
>         Attachments: jboss-web.xml, juddiv3.war, persistence.xml, server - 20140429.log
>
>
> The online Apache jUDDI Guide specifies at the end of this link (OpenJPA and JBossWS-CXF)
http://juddi.apache.org/docs/3.2/juddi-guide/html_single/#_jbossas_7_x_jbosseap_6_x
> says "and in the `modules/system/layers/base/org/jboss/as/jpa/main/module.xml add dependency
<module name="org.jboss.as.jpa.openjpa"/>"
> But this folder structure does not exists on jboss-as7 and there is no previous instructions
about how to create it and what to put i in.  There are tow previous instrctions to create:
> <jboss>/modules/system/layers/base/org/apache/openjpa/main and
> <jboss>/modules/system/layers/base/org/jboss/as/jpa/openjpa/main
> but not <jboss>/modules/system/layers/base/org/jboss/as/jpa/main/module.xml
> So, when I try to deploy it to Jboss AS 7.1.1 I get an exception
> 11:42:43,356 INFO  [org.jboss.as.jpa] (MSC service thread 1-3) JBAS011401: Read persistence.xml
for juddiDatabase
> 11:42:43,864 ERROR [org.jboss.msc.service.fail] (MSC service thread 1-2) MSC00001: Failed
to start service jboss.module.service."deployment.juddiv3.war".main: org.jboss.msc.service
> .StartException in service jboss.module.service."deployment.juddiv3.war".main: Failed
to load module: deployment.juddiv3.war:main
>         at org.jboss.as.server.moduleservice.ModuleLoadService.start(ModuleLoadService.java:91)
[jboss-as-server-7.1.1.Final.jar:7.1.1.Final]
>         at org.jboss.msc.service.ServiceControllerImpl$StartTask.startService(ServiceControllerImpl.java:1811)
[jboss-msc-1.0.2.GA.jar:1.0.2.GA]
>         at org.jboss.msc.service.ServiceControllerImpl$StartTask.run(ServiceControllerImpl.java:1746)
[jboss-msc-1.0.2.GA.jar:1.0.2.GA]
>         at java.util.concurrent.ThreadPoolExecutor.runWorker(ThreadPoolExecutor.java:1110)
[rt.jar:1.7.0_11]
>         at java.util.concurrent.ThreadPoolExecutor$Worker.run(ThreadPoolExecutor.java:603)
[rt.jar:1.7.0_11]
>         at java.lang.Thread.run(Thread.java:722) [rt.jar:1.7.0_11]
> Caused by: org.jboss.modules.ModuleNotFoundException: Module org.apache.openjpa:main
is not found in local module loader @655c8c (roots: c:\Java\jboss-as-7.1.1.Final\modules)
>         at org.jboss.modules.LocalModuleLoader.findModule(LocalModuleLoader.java:126)
>         at org.jboss.modules.ModuleLoader.loadModuleLocal(ModuleLoader.java:275)
>         at org.jboss.modules.ModuleLoader.preloadModule(ModuleLoader.java:222)
>         at org.jboss.modules.LocalModuleLoader.preloadModule(LocalModuleLoader.java:94)
>         at org.jboss.modules.Module.addPaths(Module.java:841)
>         at org.jboss.modules.Module.link(Module.java:1181)
>         at org.jboss.modules.Module.relinkIfNecessary(Module.java:1207)
>         at org.jboss.modules.ModuleLoader.loadModule(ModuleLoader.java:208)
>         at org.jboss.as.server.moduleservice.ModuleLoadService.start(ModuleLoadService.java:70)
[jboss-as-server-7.1.1.Final.jar:7.1.1.Final]
>         ... 5 more
> 11:42:44,112 INFO  [org.jboss.as.server] (DeploymentScanner-threads - 2) JBAS015870:
Deploy of deployment "juddiv3.war" was rolled back with failure message {"JBAS014671: Failed
se
> rvices" => {"jboss.module.service.\"deployment.juddiv3.war\".main" => "org.jboss.msc.service.StartException
in service jboss.module.service.\"deployment.juddiv3.war\".main: Failed
> to load module: deployment.juddiv3.war:main"}}
> 11:42:44,272 INFO  [org.jboss.as.server.deployment] (MSC service thread 1-4) JBAS015877:
Stopped deployment juddiv3.war in 159ms
> 11:42:44,274 INFO  [org.jboss.as.controller] (DeploymentScanner-threads - 2) JBAS014774:
Service status report
> JBAS014777:   Services which failed to start:      service jboss.module.service."deployment.juddiv3.war".main:
org.jboss.msc.service.StartException in service jboss.module.service.
> "deployment.juddiv3.war".main: Failed to load module: deployment.juddiv3.war:main
> 11:42:44,283 ERROR [org.jboss.as.server.deployment.scanner] (DeploymentScanner-threads
- 1) {"JBAS014653: Composite operation failed and was rolled back. Steps that failed:" =>
{"O
> peration step-2" => {"JBAS014671: Failed services" => {"jboss.module.service.\"deployment.juddiv3.war\".main"
=> "org.jboss.msc.service.StartException in service jboss.module.servi
> ce.\"deployment.juddiv3.war\".main: Failed to load module: deployment.juddiv3.war:main"}}}}



--
This message was sent by Atlassian JIRA
(v6.2#6252)

Mime
View raw message