karaf-dev mailing list archives

Site index · List index
Message view « Date » · « Thread »
Top « Date » · « Thread »
From David Bosschaert <david.bosscha...@gmail.com>
Subject Re: Build failure on Karaf trunk...
Date Fri, 25 Oct 2013 16:06:03 GMT
Hmmm... I just tried mvn 3.0.5 on both OSX as well as on a fresh Linux
(Fedora) machine.
Linux passes OSX fails... Time to whack the .m2 directory ...

On 25 October 2013 16:59, Andreas Pieber <anpieber@gmail.com> wrote:
> 3.1.x does not work by now. Since the karaf plugin does not use the
> abstraction layer this terribly fails with the new maven version --> 3.0.x
> should work
>
> Kind regards,
> Andreas
>
>
> On Fri, Oct 25, 2013 at 5:37 PM, David Bosschaert <
> david.bosschaert@gmail.com> wrote:
>
>> I was actually using the default mvn install on my system which is 3.0.3.
>> I just tried with 3.1.1 which gives me a slightly similar error (below).
>>
>> What Maven version should work?
>>
>> Cheers,
>>
>> David
>>
>> The error with maven 3.1.1:
>> [ERROR] Failed to execute goal
>>
>> org.apache.karaf.tooling:karaf-maven-plugin:3.0.0-SNAPSHOT:features-generate-descriptor
>> (compile) on project framework: Execution compile of goal
>>
>> org.apache.karaf.tooling:karaf-maven-plugin:3.0.0-SNAPSHOT:features-generate-descriptor
>> failed: Unable to load the mojo 'features-generate-descriptor' (or one
>> of its required components) from the plugin
>> 'org.apache.karaf.tooling:karaf-maven-plugin:3.0.0-SNAPSHOT':
>> com.google.inject.ProvisionException: Guice provision errors:
>> [ERROR]
>> [ERROR] 1) No implementation for org.sonatype.aether.RepositorySystem was
>> bound.
>> [ERROR] while locating
>> org.apache.karaf.tooling.features.GenerateDescriptorMojo
>> [ERROR] at
>> ClassRealm[plugin>org.apache.karaf.tooling:karaf-maven-plugin:3.0.0-SNAPSHOT,
>> parent: sun.misc.Launcher$AppClassLoader@7987aeca]
>> [ERROR] while locating org.apache.maven.plugin.Mojo annotated with
>>
>> @com.google.inject.name.Named(value=org.apache.karaf.tooling:karaf-maven-plugin:3.0.0-SNAPSHOT:features-generate-descriptor)
>> [ERROR]
>> [ERROR] 1 error
>> [ERROR] role: org.apache.maven.plugin.Mojo
>> [ERROR] roleHint:
>>
>> org.apache.karaf.tooling:karaf-maven-plugin:3.0.0-SNAPSHOT:features-generate-descriptor
>>
>> On 25 October 2013 16:27, nseb <seb_nicouleau@hotmail.com> wrote:
>> > You use maven 3.1.0 ?
>> >
>> >
>> >
>> > --
>> > View this message in context:
>> http://karaf.922171.n3.nabble.com/Build-failure-on-Karaf-trunk-tp4030054p4030055.html
>> > Sent from the Karaf - Dev mailing list archive at Nabble.com.
>>

Mime
View raw message