karaf-dev mailing list archives

Site index · List index
Message view « Date » · « Thread »
Top « Date » · « Thread »
From Erwin Hogeweg <erwin.hoge...@me.com>
Subject audit/FastDateFormatTest fails in 4.2.0 and master
Date Sat, 09 Jun 2018 14:27:49 GMT
Hi,

The FastDateFormatTest fails on Windows and Mac with Java-8 (and the failure doesn't make
any senseā€¦).

Has anyone else experienced this?


Thanks,

Erwin

[INFO] Running org.apache.karaf.audit.TestPerf
[WARNING] Tests run: 1, Failures: 0, Errors: 0, Skipped: 1, Time elapsed: 0 s - in org.apache.karaf.audit.TestPerf
[INFO] 
[INFO] Results:
[INFO] 
[ERROR] Failures: 
[ERROR]   FastDateFormatTest.test:39 expected:<Nov [10]> but was:<Nov [ 9]>
[INFO] 
[ERROR] Tests run: 9, Failures: 1, Errors: 0, Skipped: 1


Mime
  • Unnamed multipart/alternative (inline, None, 0 bytes)
View raw message