karaf-dev mailing list archives

Site index · List index
Message view « Date » · « Thread »
Top « Date » · « Thread »
From Steinar Bang ...@dod.no>
Subject Re: karaf iTest results on my machine
Date Sun, 23 Jun 2019 21:37:29 GMT
>>>>> Steinar Bang <sb@dod.no>:
> Most iTests work, but I have 3 tests failing with "error" and one
> failing with failure.

> The three failing with error, are:
> org.apache.karaf.itests.FelixHttpTest.txt:4:Tests run: 1, Failures: 0, Errors: 1, Skipped:
0, Time elapsed: 16.438 s <<< FAILURE! - in org.apache.karaf.itests.FelixHttpTest
> org.apache.karaf.itests.JmsTest.txt:4:Tests run: 2, Failures: 0, Errors: 1, Skipped:
0, Time elapsed: 29.595 s <<< FAILURE! - in org.apache.karaf.itests.JmsTest
> org.apache.karaf.itests.examples.RestExampleTest.txt:4:Tests run: 3, Failures: 0, Errors:
1, Skipped: 0, Time elapsed: 24.989 s <<< FAILURE! - in org.apache.karaf.itests.examples.RestExampleTest

> The one failing with failure, is:
> org.apache.karaf.itests.examples.JpaExampleTest.txt:4:Tests run: 1, Failures: 1, Errors:
0, Skipped: 0, Time elapsed: 50.777 s <<< FAILURE! - in org.apache.karaf.itests.examples.JpaExampleTest

The same tests fails in the same way on my system when building with openjdk-8.
Ie. the karaf build issues on my system aren't openjdk-11 related.


Mime
View raw message