karaf-issues mailing list archives

Site index · List index
Message view « Date » · « Thread »
Top « Date » · « Thread »
From "Markus Rathgeb (JIRA)" <j...@apache.org>
Subject [jira] [Commented] (KARAF-3982) Be able to change standard files during distribution assembly
Date Tue, 24 Nov 2015 20:30:11 GMT

    [ https://issues.apache.org/jira/browse/KARAF-3982?page=com.atlassian.jira.plugin.system.issuetabpanels:comment-tabpanel&focusedCommentId=15025297#comment-15025297
] 

Markus Rathgeb commented on KARAF-3982:
---------------------------------------

Is it possible that this pull request has broken the build?

{noformat}
[INFO] --- maven-invoker-plugin:2.0.0:run (integration-test) @ karaf-maven-plugin ---
[INFO] Building: test-aggregate-features/pom.xml
[INFO] run script verify.bsh
[INFO] ..SUCCESS (4.4 s)
[INFO] Building: test-basic-generation/pom.xml
[INFO] run script verify.bsh
[INFO] ..SUCCESS (3.1 s)
[INFO] Building: test-check-dependencies-failure/pom.xml
[INFO] run script verify.bsh
[INFO] ..SUCCESS (4.2 s)
[INFO] Building: test-check-dependencies/pom.xml
[INFO] run script verify.bsh
[INFO] ..SUCCESS (4.1 s)
[INFO] Building: test-include-project-artifact/pom.xml
[INFO] run script verify.bsh
[INFO] ..SUCCESS (3.0 s)
[INFO] Building: test-input-file/pom.xml
[INFO] run script verify.bsh
[INFO] ..SUCCESS (2.9 s)
[INFO] Building: test-kar-classifier/pom.xml
[INFO] run script verify.bsh
[INFO] ..SUCCESS (2.1 s)
[INFO] Building: test-kar-multiple-kars/pom.xml
[INFO] run script verify.bsh
[INFO] ..SUCCESS (2.1 s)
[INFO] Building: test-kar-packaging/pom.xml
[INFO] run script verify.bsh
[INFO] ..SUCCESS (2.2 s)
[INFO] Building: test-kar-with-pom-packaging/pom.xml
[INFO] run script verify.bsh
[INFO] ..SUCCESS (2.1 s)
[INFO] Building: test-recursive/pom.xml
[INFO] run script verify.bsh
[INFO] ..SUCCESS (3.6 s)
[INFO] Building: test-type-classifier/pom.xml
[INFO] run script verify.bsh
[INFO] ..SUCCESS (2.9 s)
[INFO] Building: test-assembly/pom.xml
[INFO] ..SUCCESS (3.4 s)
[INFO] Building: test-rename-main-feature/pom.xml
[INFO] run script verify.bsh
[INFO] ..SUCCESS (3.2 s)
[INFO] Building: test-assembly-prop-edits/pom.xml
[INFO] ..FAILED (1.8 s)
[INFO]   The build exited with code 1. See /home/maggu2810/workspace/projects/karaf/vcs/tooling/karaf-maven-plugin/target/it/test-assembly-prop-edits/build.log
for details.
[INFO] -------------------------------------------------
[INFO] Build Summary:
[INFO]   Passed: 14, Failed: 1, Errors: 0, Skipped: 0
[INFO] -------------------------------------------------
[ERROR] The following builds failed:
[ERROR] *  test-assembly-prop-edits/pom.xml
[INFO] -------------------------------------------------
[INFO] ------------------------------------------------------------------------
[INFO] Reactor Summary:
[INFO] 
[INFO] Apache Karaf ....................................... SUCCESS [  1.021 s]
[INFO] Apache Karaf :: JAAS ............................... SUCCESS [  0.037 s]
[INFO] Apache Karaf :: JAAS :: Boot ....................... SUCCESS [  1.138 s]
[INFO] Apache Karaf :: Util ............................... SUCCESS [  0.988 s]
[INFO] Apache Karaf :: Main ............................... SUCCESS [  0.898 s]
[INFO] Apache Karaf :: Features ........................... SUCCESS [  0.020 s]
[INFO] Apache Karaf :: Service ............................ SUCCESS [  0.021 s]
[INFO] Apache Karaf :: Service :: Guard ................... SUCCESS [  0.756 s]
[INFO] Apache Karaf :: Shell .............................. SUCCESS [  0.013 s]
[INFO] Apache Karaf :: Shell :: Core ...................... SUCCESS [  1.239 s]
[INFO] Apache Karaf :: Tooling ............................ SUCCESS [  0.012 s]
[INFO] Apache Karaf :: Tooling :: Maven Karaf Plugin for Services Metadata SUCCESS [  2.543
s]
[INFO] Apache Karaf :: Features :: Core ................... SUCCESS [  1.862 s]
[INFO] Apache Karaf :: Features :: Command ................ SUCCESS [  0.961 s]
[INFO] Apache Karaf :: KAR :: Core ........................ SUCCESS [  0.882 s]
[INFO] Apache Karaf :: JAAS :: Config ..................... SUCCESS [  0.287 s]
[INFO] Apache Karaf :: JAAS :: Modules .................... SUCCESS [  2.731 s]
[INFO] Apache Karaf :: Bundle ............................. SUCCESS [  0.011 s]
[INFO] Apache Karaf :: Bundle :: Core ..................... SUCCESS [  1.004 s]
[INFO] Apache Karaf :: Bundle :: BlueprintStateService .... SUCCESS [  0.165 s]
[INFO] Apache Karaf :: Bundle :: SpringStateService ....... SUCCESS [  0.264 s]
[INFO] Apache Karaf :: ConfigAdmin :: Core ................ SUCCESS [  0.490 s]
[INFO] Apache Karaf :: Tooling :: Utils ................... SUCCESS [  0.504 s]
[INFO] Apache Karaf :: Deployer ........................... SUCCESS [  0.064 s]
[INFO] Apache Karaf :: Deployer :: Blueprint .............. SUCCESS [  0.280 s]
[INFO] Apache Karaf :: Deployer :: Spring ................. SUCCESS [  0.265 s]
[INFO] Apache Karaf :: Demos :: Profiles :: Registry ...... SUCCESS [  0.060 s]
[INFO] Apache Karaf :: Profile :: Core .................... SUCCESS [  1.646 s]
[INFO] Apache Karaf :: Instance :: Core ................... SUCCESS [  1.117 s]
[INFO] Apache Karaf :: Package :: Core .................... SUCCESS [  0.428 s]
[INFO] Apache Karaf :: HTTP :: Core ....................... SUCCESS [  0.359 s]
[INFO] Apache Karaf :: Service :: Core .................... SUCCESS [  0.367 s]
[INFO] Apache Karaf :: Log :: Core ........................ SUCCESS [  0.501 s]
[INFO] Apache Karaf :: Deployer :: Features ............... SUCCESS [  0.587 s]
[INFO] Apache Karaf :: Deployer :: Karaf Archive (.kar) ... SUCCESS [  0.525 s]
[INFO] Apache Karaf :: Deployer :: Wrap Non OSGi Jar ...... SUCCESS [  0.152 s]
[INFO] Apache Karaf :: Shell :: Various Commands .......... SUCCESS [  0.625 s]
[INFO] Apache Karaf :: Shell :: Console ................... SUCCESS [  1.079 s]
[INFO] Apache Karaf :: Shell :: SSH ....................... SUCCESS [  0.642 s]
[INFO] Apache Karaf :: Shell :: Table ..................... SUCCESS [  0.177 s]
[INFO] Apache Karaf :: JAAS :: Jasypt Encryption .......... SUCCESS [  0.194 s]
[INFO] Apache Karaf :: JAAS :: Command .................... SUCCESS [  0.500 s]
[INFO] Apache Karaf :: JAAS :: Blueprint .................. SUCCESS [  0.022 s]
[INFO] Apache Karaf :: JAAS :: Blueprint :: Config ........ SUCCESS [  0.129 s]
[INFO] Apache Karaf :: JAAS :: Blueprint :: Jasypt ........ SUCCESS [  0.278 s]
[INFO] Apache Karaf :: Client ............................. SUCCESS [  0.232 s]
[INFO] Apache Karaf :: Management ......................... SUCCESS [  0.021 s]
[INFO] Apache Karaf :: Management ......................... SUCCESS [  0.399 s]
[INFO] Apache Karaf :: System :: Core ..................... SUCCESS [  0.431 s]
[INFO] Apache Karaf :: Web :: Core ........................ SUCCESS [  0.402 s]
[INFO] Apache Karaf :: Wrapper :: Core .................... SUCCESS [  0.631 s]
[INFO] Apache Karaf :: Web Console ........................ SUCCESS [  0.008 s]
[INFO] Apache Karaf :: Web Console :: Console ............. SUCCESS [  0.475 s]
[INFO] Apache Karaf :: Web Console :: Features Plugin ..... SUCCESS [  0.639 s]
[INFO] Apache Karaf :: Web Console :: Gogo Plugin ......... SUCCESS [  0.568 s]
[INFO] Apache Karaf :: Web Console :: HTTP Plugin ......... SUCCESS [  0.535 s]
[INFO] Apache Karaf :: Web Console :: Instance Plugin ..... SUCCESS [  0.340 s]
[INFO] Apache Karaf :: Exception .......................... SUCCESS [  0.044 s]
[INFO] Apache Karaf :: Scheduler :: Core .................. SUCCESS [  0.839 s]
[INFO] Apache Karaf :: Declarative Services (DS) .......... SUCCESS [  0.008 s]
[INFO] Apache Karaf :: SCR :: Shell Commands .............. SUCCESS [  0.376 s]
[INFO] Apache Karaf :: SCR :: Management MBeans ........... SUCCESS [  0.173 s]
[INFO] Apache Karaf :: SCR :: Examples .................... SUCCESS [  0.009 s]
[INFO] Apache Karaf :: SCR :: Examples :: Basic Service ... SUCCESS [  0.155 s]
[INFO] Apache Karaf :: SCR :: Examples :: Managed Services  SUCCESS [  0.173 s]
[INFO] Apache Karaf :: SCR :: Examples :: Component Factories SUCCESS [  0.149 s]
[INFO] Apache Karaf :: Diagnostic ......................... SUCCESS [  0.008 s]
[INFO] Apache Karaf :: Diagnostic :: Boot ................. SUCCESS [  0.171 s]
[INFO] Apache Karaf :: Diagnostic :: Core ................. SUCCESS [  0.616 s]
[INFO] Apache Karaf :: OBR :: Core ........................ SUCCESS [  0.366 s]
[INFO] Apache Karaf :: JNDI :: Core ....................... SUCCESS [  0.392 s]
[INFO] Apache Karaf :: JDBC :: Core ....................... SUCCESS [  0.416 s]
[INFO] Apache Karaf :: JMS :: Core ........................ SUCCESS [  0.564 s]
[INFO] Apache Karaf :: JPA :: Parent ...................... SUCCESS [  0.012 s]
[INFO] Apache Karaf :: JPA :: Hibernate ................... SUCCESS [  0.173 s]
[INFO] Apache Karaf :: OSGi Services :: Coordinator ....... SUCCESS [  0.112 s]
[INFO] Apache Karaf :: OSGi Services :: EventAdmin ........ SUCCESS [  0.186 s]
[INFO] Apache Karaf :: OSGi Services :: Static ConfigAdmin  SUCCESS [  0.155 s]
[INFO] Apache Karaf :: OSGi Services ...................... SUCCESS [  0.006 s]
[INFO] Apache Karaf :: Subsystem :: Core .................. SUCCESS [  0.754 s]
[INFO] Apache Karaf :: Tooling :: Maven Karaf Plugin ...... FAILURE [ 48.877 s]
[INFO] Apache Karaf :: Assemblies ......................... SKIPPED
[INFO] Apache Karaf :: Assemblies :: Features ............. SKIPPED
[INFO] Apache Karaf :: Assemblies :: Features :: Base ..... SKIPPED
[INFO] Apache Karaf :: Assemblies :: Features :: Framework  SKIPPED
[INFO] Apache Karaf :: Assemblies :: Features :: Static ... SKIPPED
[INFO] Apache Karaf :: Assemblies :: Features :: Standard . SKIPPED
[INFO] Apache Karaf :: Assemblies :: Features :: Spring ... SKIPPED
[INFO] Apache Karaf :: Assemblies :: Features :: Enterprise SKIPPED
[INFO] Apache Karaf :: Assemblies :: Demos ................ SKIPPED
[INFO] Apache Karaf :: Assemblies :: Minimal Distribution . SKIPPED
[INFO] Apache Karaf :: Assemblies :: Default Distribution . SKIPPED
[INFO] Apache Karaf :: Demos .............................. SKIPPED
[INFO] Apache Karaf :: Demos :: Web ....................... SKIPPED
[INFO] Apache Karaf :: Demos :: Branding :: Shell ......... SKIPPED
[INFO] Apache Karaf :: Demos :: Command :: Extend Console . SKIPPED
[INFO] Apache Karaf :: Demos :: Demo Dump provider ........ SKIPPED
[INFO] Apache Karaf :: Demos :: Deployer .................. SKIPPED
[INFO] Apache Karaf :: Demos :: Deployer :: Kar ........... SKIPPED
[INFO] Apache Karaf :: Demos :: Deployer :: Bundle ........ SKIPPED
[INFO] Apache Karaf :: Demos :: Profiles :: Dynamic Assembly SKIPPED
[INFO] Apache Karaf :: Demos :: Profiles :: Static Assembly SKIPPED
[INFO] Apache Karaf :: Demos :: Profiles .................. SKIPPED
[INFO] Apache Karaf :: Archetypes ......................... SKIPPED
[INFO] Apache Karaf :: Archetypes :: Assembly Archetype ... SKIPPED
[INFO] Apache Karaf :: Archetypes :: Command Archetype .... SKIPPED
[INFO] Apache Karaf :: Archetypes :: Feature Archetype .... SKIPPED
[INFO] Apache Karaf :: Archetypes :: Kar Archetype ........ SKIPPED
[INFO] Apache Karaf :: Archetypes :: Bundle Archetype ..... SKIPPED
[INFO] Apache Karaf :: Archetypes :: Blueprint Archetype .. SKIPPED
[INFO] Apache Karaf :: Integration Tests .................. SKIPPED
[INFO] ------------------------------------------------------------------------
[INFO] BUILD FAILURE
[INFO] ------------------------------------------------------------------------
[INFO] Total time: 01:29 min
[INFO] Finished at: 2015-11-24T21:27:21+01:00
[INFO] Final Memory: 157M/784M
[INFO] ------------------------------------------------------------------------
[ERROR] Failed to execute goal org.apache.maven.plugins:maven-invoker-plugin:2.0.0:run (integration-test)
on project karaf-maven-plugin: 1 build failed. See console output above for details. ->
[Help 1]
[ERROR] 
[ERROR] To see the full stack trace of the errors, re-run Maven with the -e switch.
[ERROR] Re-run Maven using the -X switch to enable full debug logging.
[ERROR] 
[ERROR] For more information about the errors and possible solutions, please read the following
articles:
[ERROR] [Help 1] http://cwiki.apache.org/confluence/display/MAVEN/MojoFailureException
[ERROR] 
[ERROR] After correcting the problems, you can resume the build with the command
[ERROR]   mvn <goals> -rf :karaf-maven-plugin
{noformat}

File will be attached...

> Be able to change standard files during distribution assembly
> -------------------------------------------------------------
>
>                 Key: KARAF-3982
>                 URL: https://issues.apache.org/jira/browse/KARAF-3982
>             Project: Karaf
>          Issue Type: Improvement
>          Components: karaf-tooling
>            Reporter: Jean-Baptiste Onofré
>            Assignee: Jean-Baptiste Onofré
>             Fix For: 4.0.4
>
>         Attachments: build.log
>
>
> The Karaf Maven plugin generates files (etc/org.apache.karaf.features.cfg, etc). It would
be great to mimic pax-exam to be able to change these generated files (like put/append instructions).



--
This message was sent by Atlassian JIRA
(v6.3.4#6332)

Mime
View raw message