lucene-dev mailing list archives

Site index · List index
Message view « Date » · « Thread »
Top « Date » · « Thread »
From Slava Imeshev <vimes...@viewtier.com>
Subject Re: [parabuild] BUILD for lucene-daily (#170) on localhost was BROKEN: Script returned non-zero code "1"
Date Thu, 24 Jan 2008 22:14:12 GMT
Maybe the build accumulates state. I have set it to do a clean checkout every time the build
runs.

Hope this helps.

Slava

--- Doron Cohen <cdoronc@gmail.com> wrote:

> Failure is this:
> 
>     [junit] Testsuite: org.apache.lucene.index.TestIndexWriter
>     [junit] Tests run: 56, Failures: 0, Errors: 1, Time elapsed: 177.901 sec
>     [junit] Test org.apache.lucene.index.TestIndexWriter FAILED
> 
>     [junit] Testcase:
> testIOExceptionDuringCloseDocStoreWithThreads(org.apache.lucene.index.TestIndexWriter):
Caused
> an ERROR
>     [junit] MockRAMDirectory: cannot close: there are still open
> files: {_2.cfs=1, _8.cfs=1, _6.cfs=1, _5.cfs=1, _3.cfs=1, _1.cfs=1,
> _0.cfs=1, _7.cfs=1}
>     [junit] java.lang.RuntimeException: MockRAMDirectory: cannot
> close: there are still open files: {_2.cfs=1, _8.cfs=1, _6.cfs=1,
> _5.cfs=1, _3.cfs=1, _1.cfs=1, _0.cfs=1, _7.cfs=1}
>     [junit] 	at
> org.apache.lucene.store.MockRAMDirectory.close(MockRAMDirectory.java:216)
>     [junit] 	at
> org.apache.lucene.index.TestIndexWriter._testMultipleThreadsFailure(TestIndexWriter.java:2551)
>     [junit] 	at
>
org.apache.lucene.index.TestIndexWriter.testIOExceptionDuringCloseDocStoreWithThreads(TestIndexWriter.java:2611)
> 
> I am not able to recreate it, can anyone else recreate it?
> 
> On Jan 24, 2008 11:26 PM, Build Administrator <vimeshev@viewtier.com> wrote:
> 
> > BUILD result
> > ------------------------------------------------------------
> >
> > BUILD for lucene-daily (#170) on localhost was BROKEN: Script returned
> > non-zero code "1"
> >
> > Build status:
> >
> > http://parabuild.viewtier.com:8080/parabuild/index.htm?view=detailed&buildid=258
> >
> >
> > Suspect Changes
> > ------------------------------------------------------------
> >
> > Change(s) by doronc :
> >
> >  - LUCENE-1136: add ability to not count sub-task doLogic incre;
> >   Time: 10:46 AM 01/24/2008; Change list: 614956
> >
> > Change(s) by gsingers :
> >
> >  - Added javadocs about UNTOKENIZED_TOKEN_FLAG conundrum;
> >   Time: 07:42 AM 01/24/2008; Change list: 614905
> >
> >  - LUCENE-1133: Adds ability to keep certain strings as single ;
> >   Time: 07:05 AM 01/24/2008; Change list: 614895
> >
> >  - fixed javadoc;
> >   Time: 07:01 AM 01/24/2008; Change list: 614894
> >
> >  - LUCENE-1137;
> >   Time: 07:01 AM 01/24/2008; Change list: 614892
> >
> >  - LUCENE-1137: Added Token.get/setFlags()  Release the hounds;
> >   Time: 06:58 AM 01/24/2008; Change list: 614891
> >
> >  - LUCENE-1128 and 1129:  Add highlighting support to benchmark;
> >   Time: 06:39 AM 01/24/2008; Change list: 614885
> >
> >  - LUCENE-1127: added couple of convenience methods to TokenSou;
> >   Time: 06:36 AM 01/24/2008; Change list: 614884
> >
> > Change(s) by buschmi :
> >
> >  - Add 2.3.0 release to doap file.;
> >   Time: 06:44 PM 01/23/2008; Change list: 614772
> >
> > Change(s) Details:
> >
> > http://parabuild.viewtier.com:8080/parabuild/build/changes.htm?buildrunid=7955
> >
> > BUILD logs
> > ------------------------------------------------------------
> >
> > BUILD log:
> >  http://parabuild.viewtier.com:8080/parabuild/build/log.htm?logid=11329
> > Error Lines:
> >  http://parabuild.viewtier.com:8080/parabuild/build/log.htm?logid=11330
> >
> > Log Lines Around Error
> > ------------------------------------------------------------
> >
> >      [junit] Tests run: 7, Failures: 0, Errors: 0, Time elapsed: 2.931 sec
> >      [junit] Testsuite: org.apache.lucene.search.TestThreadSafe
> >      [junit] Tests run: 1, Failures: 0, Errors: 0, Time elapsed: 39.826sec
> >      [junit] Testsuite: org.apache.lucene.search.TestWildcard
> >      [junit] Tests run: 5, Failures: 0, Errors: 0, Time elapsed: 1.904 sec
> >      [junit] Testsuite:
> > org.apache.lucene.search.function.TestCustomScoreQuery
> >      [junit] Tests run: 4, Failures: 0, Errors: 0, Time elapsed: 168.663sec
> >      [junit] Testsuite:
> > org.apache.lucene.search.function.TestFieldScoreQuery
> >      [junit] Tests run: 12, Failures: 0, Errors: 0, Time elapsed: 2.935sec
> >      [junit] Testsuite: org.apache.lucene.search.function.TestOrdValues
> >      [junit] Tests run: 5, Failures: 0, Errors: 0, Time elapsed: 2.375 sec
> >      [junit] Testsuite:
> > org.apache.lucene.search.payloads.TestBoostingTermQuery
> >      [junit] Tests run: 4, Failures: 0, Errors: 0, Time elapsed: 4.281 sec
> >      [junit] Testsuite: org.apache.lucene.search.spans.TestBasics
> >      [junit] Tests run: 19, Failures: 0, Errors: 0, Time elapsed: 18.238sec
> >      [junit] Testsuite:
> > org.apache.lucene.search.spans.TestNearSpansOrdered
> >      [junit] Tests run: 10, Failures: 0, Errors: 0, Time elapsed: 1.935sec
> >      [junit] Testsuite:
> > org.apache.lucene.search.spans.TestSpanExplanations
> >      [junit] Tests run: 31, Failures: 0, Errors: 0, Time elapsed: 3.091sec
> >      [junit] Testsuite:
> > org.apache.lucene.search.spans.TestSpanExplanationsOfNonMatches
> >      [junit] Tests run: 31, Failures: 0, Errors: 0, Time elapsed: 2.32 sec
> >      [junit] Testsuite: org.apache.lucene.search.spans.TestSpans
> >      [junit] Tests run: 21, Failures: 0, Errors: 0, Time elapsed: 3.086sec
> >      [junit] Testsuite: org.apache.lucene.search.spans.TestSpansAdvanced
> >      [junit] Tests run: 1, Failures: 0, Errors: 0, Time elapsed: 1.968 sec
> >      [junit] Testsuite: org.apache.lucene.search.spans.TestSpansAdvanced2
> >      [junit] Tests run: 4, Failures: 0, Errors: 0, Time elapsed: 2.574 sec
> >      [junit] Testsuite: org.apache.lucene.store.TestBufferedIndexInput
> >      [junit] Tests run: 4, Failures: 0, Errors: 0, Time elapsed: 5.773 sec
> >      [junit] Testsuite: org.apache.lucene.store.TestHugeRamFile
> >      [junit] Tests run: 1, Failures: 0, Errors: 0, Time elapsed: 18.816sec
> >      [junit] Testsuite: org.apache.lucene.store.TestLock
> >      [junit] Tests run: 1, Failures: 0, Errors: 0, Time elapsed: 1.056 sec
> >      [junit] Testsuite: org.apache.lucene.store.TestLockFactory
> >      [junit] Tests run: 13, Failures: 0, Errors: 0, Time elapsed: 13.175sec
> >      [junit] Testsuite: org.apache.lucene.store.TestMMapDirectory
> >      [junit] Tests run: 1, Failures: 0, Errors: 0, Time elapsed: 1.178 sec
> >      [junit] Testsuite: org.apache.lucene.store.TestWindowsMMap
> >      [junit] Tests run: 1, Failures: 0, Errors: 0, Time elapsed: 2.144 sec
> >      [junit] Testsuite: org.apache.lucene.util.TestBitVector
> >      [junit] Tests run: 6, Failures: 0, Errors: 0, Time elapsed: 7.34 sec
> >      [junit] Testsuite: org.apache.lucene.util.TestPriorityQueue
> >      [junit] Tests run: 4, Failures: 0, Errors: 0, Time elapsed: 1.076 sec
> >      [junit] Testsuite: org.apache.lucene.util.TestSmallFloat
> >      [junit] Tests run: 2, Failures: 0, Errors: 0, Time elapsed: 1.391 sec
> >      [junit] Testsuite: org.apache.lucene.util.TestStringHelper
> >      [junit] Tests run: 1, Failures: 0, Errors: 0, Time elapsed: 1.022 sec
> >  BUILD FAILED
> >  /opt/parabuild/etc/build/b258co/a/u/t/o/common-build.xml:386: Tests
> > failed!
> >  Total time: 21 minutes 55 seconds
> >
> > Timings
> > ------------------------------------------------------------
> >
> > BUILD took 21 minutes 56 seconds
> >
> >
> 


---------------------------------------------------------------------
To unsubscribe, e-mail: java-dev-unsubscribe@lucene.apache.org
For additional commands, e-mail: java-dev-help@lucene.apache.org


Mime
View raw message