lucene-dev mailing list archives

Site index · List index
Message view « Date » · « Thread »
Top « Date » · « Thread »
From Yonik Seeley <yo...@lucidimagination.com>
Subject Re: Lucene-Solr-tests-only-trunk - Build # 2959 - Failure
Date Sat, 25 Dec 2010 02:28:31 GMT
Woops, when I saw clustering fail, I assumed it was due to the same
failures yesterday.
I'll add back the deprecated AnalysisRequestHandler for now.

-Yonik
http://www.lucidimagination.com



On Fri, Dec 24, 2010 at 8:53 PM, Apache Hudson Server
<hudson@hudson.apache.org> wrote:
> Build: https://hudson.apache.org/hudson/job/Lucene-Solr-tests-only-trunk/2959/
>
> 2 tests failed.
> FAILED:  junit.framework.TestSuite.org.apache.solr.handler.clustering.ClusteringComponentTest
>
> Error Message:
> org.apache.solr.common.SolrException: RequestHandler init failure
>
> Stack Trace:
> java.lang.RuntimeException: org.apache.solr.common.SolrException: RequestHandler init
failure
>        at org.apache.solr.util.TestHarness.<init>(TestHarness.java:153)
>        at org.apache.solr.util.TestHarness.<init>(TestHarness.java:135)
>        at org.apache.solr.util.TestHarness.<init>(TestHarness.java:125)
>        at org.apache.solr.SolrTestCaseJ4.initCore(SolrTestCaseJ4.java:239)
>        at org.apache.solr.SolrTestCaseJ4.initCore(SolrTestCaseJ4.java:102)
>        at org.apache.solr.SolrTestCaseJ4.initCore(SolrTestCaseJ4.java:90)
>        at org.apache.solr.handler.clustering.AbstractClusteringTestCase.beforeClass(AbstractClusteringTestCase.java:33)
> Caused by: org.apache.solr.common.SolrException: RequestHandler init failure
>        at org.apache.solr.core.RequestHandlers.initHandlersFromConfig(RequestHandlers.java:170)
>        at org.apache.solr.core.SolrCore.<init>(SolrCore.java:565)
>        at org.apache.solr.util.TestHarness$Initializer.initialize(TestHarness.java:191)
>        at org.apache.solr.util.TestHarness.<init>(TestHarness.java:140)
> Caused by: org.apache.solr.common.SolrException: Error loading class 'solr.AnalysisRequestHandler'
>        at org.apache.solr.core.SolrResourceLoader.findClass(SolrResourceLoader.java:406)
>        at org.apache.solr.core.SolrCore.createInstance(SolrCore.java:424)
>        at org.apache.solr.core.SolrCore.createRequestHandler(SolrCore.java:461)
>        at org.apache.solr.core.RequestHandlers.initHandlersFromConfig(RequestHandlers.java:155)
> Caused by: java.lang.ClassNotFoundException: solr.AnalysisRequestHandler
>        at java.net.URLClassLoader$1.run(URLClassLoader.java:217)
>        at java.security.AccessController.doPrivileged(Native Method)
>        at java.net.URLClassLoader.findClass(URLClassLoader.java:205)
>        at java.lang.ClassLoader.loadClass(ClassLoader.java:321)
>        at java.net.FactoryURLClassLoader.loadClass(URLClassLoader.java:615)
>        at java.lang.ClassLoader.loadClass(ClassLoader.java:266)
>        at java.lang.Class.forName0(Native Method)
>        at java.lang.Class.forName(Class.java:264)
>        at org.apache.solr.core.SolrResourceLoader.findClass(SolrResourceLoader.java:390)
>
>
> FAILED:  junit.framework.TestSuite.org.apache.solr.handler.clustering.carrot2.CarrotClusteringEngineTest
>
> Error Message:
> org.apache.solr.common.SolrException: RequestHandler init failure
>
> Stack Trace:
> java.lang.RuntimeException: org.apache.solr.common.SolrException: RequestHandler init
failure
>        at org.apache.solr.util.TestHarness.<init>(TestHarness.java:153)
>        at org.apache.solr.util.TestHarness.<init>(TestHarness.java:135)
>        at org.apache.solr.util.TestHarness.<init>(TestHarness.java:125)
>        at org.apache.solr.SolrTestCaseJ4.initCore(SolrTestCaseJ4.java:239)
>        at org.apache.solr.SolrTestCaseJ4.initCore(SolrTestCaseJ4.java:102)
>        at org.apache.solr.SolrTestCaseJ4.initCore(SolrTestCaseJ4.java:90)
>        at org.apache.solr.handler.clustering.AbstractClusteringTestCase.beforeClass(AbstractClusteringTestCase.java:33)
> Caused by: org.apache.solr.common.SolrException: RequestHandler init failure
>        at org.apache.solr.core.RequestHandlers.initHandlersFromConfig(RequestHandlers.java:170)
>        at org.apache.solr.core.SolrCore.<init>(SolrCore.java:565)
>        at org.apache.solr.util.TestHarness$Initializer.initialize(TestHarness.java:191)
>        at org.apache.solr.util.TestHarness.<init>(TestHarness.java:140)
> Caused by: org.apache.solr.common.SolrException: Error loading class 'solr.AnalysisRequestHandler'
>        at org.apache.solr.core.SolrResourceLoader.findClass(SolrResourceLoader.java:406)
>        at org.apache.solr.core.SolrCore.createInstance(SolrCore.java:424)
>        at org.apache.solr.core.SolrCore.createRequestHandler(SolrCore.java:461)
>        at org.apache.solr.core.RequestHandlers.initHandlersFromConfig(RequestHandlers.java:155)
> Caused by: java.lang.ClassNotFoundException: solr.AnalysisRequestHandler
>        at java.net.URLClassLoader$1.run(URLClassLoader.java:217)
>        at java.security.AccessController.doPrivileged(Native Method)
>        at java.net.URLClassLoader.findClass(URLClassLoader.java:205)
>        at java.lang.ClassLoader.loadClass(ClassLoader.java:321)
>        at java.net.FactoryURLClassLoader.loadClass(URLClassLoader.java:615)
>        at java.lang.ClassLoader.loadClass(ClassLoader.java:266)
>        at java.lang.Class.forName0(Native Method)
>        at java.lang.Class.forName(Class.java:264)
>        at org.apache.solr.core.SolrResourceLoader.findClass(SolrResourceLoader.java:390)
>
>
>
>
> Build Log (for compile errors):
> [...truncated 8366 lines...]
>
>
>
> ---------------------------------------------------------------------
> To unsubscribe, e-mail: dev-unsubscribe@lucene.apache.org
> For additional commands, e-mail: dev-help@lucene.apache.org
>
>

---------------------------------------------------------------------
To unsubscribe, e-mail: dev-unsubscribe@lucene.apache.org
For additional commands, e-mail: dev-help@lucene.apache.org


Mime
View raw message