lucene-dev mailing list archives

Site index · List index
Message view « Date » · « Thread »
Top « Date » · « Thread »
From jenk...@sd-datasolutions.de
Subject [JENKINS] Lucene-Solr-trunk-Windows-Java7-64 - Build # 305 - Failure!
Date Wed, 13 Jun 2012 07:33:37 GMT
Build: http://jenkins.sd-datasolutions.de/job/Lucene-Solr-trunk-Windows-Java7-64/305/

1 tests failed.
REGRESSION:  org.apache.solr.spelling.suggest.SuggesterTest.testRebuild

Error Message:
Exception during query

Stack Trace:
java.lang.RuntimeException: Exception during query
	at __randomizedtesting.SeedInfo.seed([D037897784DC2C1C:8B122B34B0DC5686]:0)
	at org.apache.solr.SolrTestCaseJ4.assertQ(SolrTestCaseJ4.java:459)
	at org.apache.solr.SolrTestCaseJ4.assertQ(SolrTestCaseJ4.java:426)
	at org.apache.solr.spelling.suggest.SuggesterTest.testRebuild(SuggesterTest.java:105)
	at sun.reflect.NativeMethodAccessorImpl.invoke0(Native Method)
	at sun.reflect.NativeMethodAccessorImpl.invoke(NativeMethodAccessorImpl.java:57)
	at sun.reflect.DelegatingMethodAccessorImpl.invoke(DelegatingMethodAccessorImpl.java:43)
	at java.lang.reflect.Method.invoke(Method.java:601)
	at com.carrotsearch.randomizedtesting.RandomizedRunner.invoke(RandomizedRunner.java:1969)
	at com.carrotsearch.randomizedtesting.RandomizedRunner.access$1100(RandomizedRunner.java:132)
	at com.carrotsearch.randomizedtesting.RandomizedRunner$6.evaluate(RandomizedRunner.java:814)
	at com.carrotsearch.randomizedtesting.RandomizedRunner$7.evaluate(RandomizedRunner.java:875)
	at com.carrotsearch.randomizedtesting.RandomizedRunner$8.evaluate(RandomizedRunner.java:889)
	at com.carrotsearch.randomizedtesting.rules.SystemPropertiesRestoreRule$1.evaluate(SystemPropertiesRestoreRule.java:53)
	at org.apache.lucene.util.TestRuleSetupTeardownChained$1.evaluate(TestRuleSetupTeardownChained.java:50)
	at org.apache.lucene.util.TestRuleFieldCacheSanity$1.evaluate(TestRuleFieldCacheSanity.java:32)
	at org.apache.lucene.util.AbstractBeforeAfterRule$1.evaluate(AbstractBeforeAfterRule.java:45)
	at com.carrotsearch.randomizedtesting.rules.SystemPropertiesInvariantRule$1.evaluate(SystemPropertiesInvariantRule.java:55)
	at org.apache.lucene.util.TestRuleReportUncaughtExceptions$1.evaluate(TestRuleReportUncaughtExceptions.java:68)
	at org.apache.lucene.util.TestRuleThreadAndTestName$1.evaluate(TestRuleThreadAndTestName.java:48)
	at org.apache.lucene.util.TestRuleMarkFailure$1.evaluate(TestRuleMarkFailure.java:48)
	at com.carrotsearch.randomizedtesting.RandomizedRunner.runSingleTest(RandomizedRunner.java:821)
	at com.carrotsearch.randomizedtesting.RandomizedRunner.access$700(RandomizedRunner.java:132)
	at com.carrotsearch.randomizedtesting.RandomizedRunner$3$1.run(RandomizedRunner.java:669)
	at com.carrotsearch.randomizedtesting.RandomizedRunner$3.evaluate(RandomizedRunner.java:695)
	at com.carrotsearch.randomizedtesting.RandomizedRunner$4.evaluate(RandomizedRunner.java:734)
	at com.carrotsearch.randomizedtesting.RandomizedRunner$5.evaluate(RandomizedRunner.java:745)
	at com.carrotsearch.randomizedtesting.rules.SystemPropertiesRestoreRule$1.evaluate(SystemPropertiesRestoreRule.java:53)
	at org.apache.lucene.util.AbstractBeforeAfterRule$1.evaluate(AbstractBeforeAfterRule.java:45)
	at org.apache.lucene.util.TestRuleReportUncaughtExceptions$1.evaluate(TestRuleReportUncaughtExceptions.java:68)
	at org.apache.lucene.util.TestRuleStoreClassName$1.evaluate(TestRuleStoreClassName.java:38)
	at org.apache.lucene.util.TestRuleIcuHack$1.evaluate(TestRuleIcuHack.java:51)
	at com.carrotsearch.randomizedtesting.rules.SystemPropertiesInvariantRule$1.evaluate(SystemPropertiesInvariantRule.java:55)
	at org.apache.lucene.util.TestRuleNoInstanceHooksOverrides$1.evaluate(TestRuleNoInstanceHooksOverrides.java:53)
	at org.apache.lucene.util.TestRuleNoStaticHooksShadowing$1.evaluate(TestRuleNoStaticHooksShadowing.java:52)
	at org.apache.lucene.util.TestRuleAssertionsRequired$1.evaluate(TestRuleAssertionsRequired.java:36)
	at org.apache.lucene.util.TestRuleMarkFailure$1.evaluate(TestRuleMarkFailure.java:48)
	at org.apache.lucene.util.TestRuleIgnoreTestSuites$1.evaluate(TestRuleIgnoreTestSuites.java:56)
	at com.carrotsearch.randomizedtesting.RandomizedRunner.runSuite(RandomizedRunner.java:605)
	at com.carrotsearch.randomizedtesting.RandomizedRunner.access$400(RandomizedRunner.java:132)
	at com.carrotsearch.randomizedtesting.RandomizedRunner$2.run(RandomizedRunner.java:551)
Caused by: java.lang.RuntimeException: REQUEST FAILED: xpath=//lst[@name='spellcheck']/lst[@name='suggestions']/lst[@name='ac']/int[@name='numFound'][.='2']
	xml response was: <?xml version="1.0" encoding="UTF-8"?>
<response>
<lst name="responseHeader"><int name="status">0</int><int name="QTime">1</int></lst><lst
name="spellcheck"><lst name="suggestions"/></lst>
</response>

	request was:q=ac&spellcheck.count=2&qt=/suggest&spellcheck.onlyMorePopular=true
	at org.apache.solr.SolrTestCaseJ4.assertQ(SolrTestCaseJ4.java:452)
	... 39 more




Build Log:
[...truncated 10626 lines...]
   [junit4]   2> 
   [junit4]   2> 401 T505 oashc.SpellCheckComponent$SpellCheckerListener.newSearcher Loading
spell index for spellchecker: suggest_fst
   [junit4]   2> 401 T505 oasss.Suggester.reload reload()
   [junit4]   2> 402 T505 oashc.SpellCheckComponent$SpellCheckerListener.newSearcher SEVERE
Exception in reloading spell check index for spellchecker: suggest_fst java.io.FileNotFoundException:
C:\Jenkins\workspace\Lucene-Solr-trunk-Windows-Java7-64\solr\build\solr-core\test\J0\.\solrtest-SuggesterTest-1339571855956\suggest_fst\fst.bin
(The system cannot find the file specified)
   [junit4]   2> 	at java.io.FileInputStream.open(Native Method)
   [junit4]   2> 	at java.io.FileInputStream.<init>(FileInputStream.java:138)
   [junit4]   2> 	at org.apache.solr.spelling.suggest.Suggester.reload(Suggester.java:164)
   [junit4]   2> 	at org.apache.solr.handler.component.SpellCheckComponent$SpellCheckerListener.newSearcher(SpellCheckComponent.java:673)
   [junit4]   2> 	at org.apache.solr.core.SolrCore$3.call(SolrCore.java:1352)
   [junit4]   2> 	at java.util.concurrent.FutureTask$Sync.innerRun(FutureTask.java:334)
   [junit4]   2> 	at java.util.concurrent.FutureTask.run(FutureTask.java:166)
   [junit4]   2> 	at java.util.concurrent.ThreadPoolExecutor.runWorker(ThreadPoolExecutor.java:1110)
   [junit4]   2> 	at java.util.concurrent.ThreadPoolExecutor$Worker.run(ThreadPoolExecutor.java:603)
   [junit4]   2> 	at java.lang.Thread.run(Thread.java:722)
   [junit4]   2> 
   [junit4]   2> 402 T505 oashc.SpellCheckComponent$SpellCheckerListener.newSearcher Loading
spell index for spellchecker: suggest_wfst
   [junit4]   2> 402 T505 oasss.Suggester.reload reload()
   [junit4]   2> 402 T505 oashc.SpellCheckComponent$SpellCheckerListener.newSearcher SEVERE
Exception in reloading spell check index for spellchecker: suggest_wfst java.io.FileNotFoundException:
C:\Jenkins\workspace\Lucene-Solr-trunk-Windows-Java7-64\solr\build\solr-core\test\J0\.\solrtest-SuggesterTest-1339571855956\suggest_wfst\wfst.bin
(The system cannot find the file specified)
   [junit4]   2> 	at java.io.FileInputStream.open(Native Method)
   [junit4]   2> 	at java.io.FileInputStream.<init>(FileInputStream.java:138)
   [junit4]   2> 	at org.apache.solr.spelling.suggest.Suggester.reload(Suggester.java:164)
   [junit4]   2> 	at org.apache.solr.handler.component.SpellCheckComponent$SpellCheckerListener.newSearcher(SpellCheckComponent.java:673)
   [junit4]   2> 	at org.apache.solr.core.SolrCore$3.call(SolrCore.java:1352)
   [junit4]   2> 	at java.util.concurrent.FutureTask$Sync.innerRun(FutureTask.java:334)
   [junit4]   2> 	at java.util.concurrent.FutureTask.run(FutureTask.java:166)
   [junit4]   2> 	at java.util.concurrent.ThreadPoolExecutor.runWorker(ThreadPoolExecutor.java:1110)
   [junit4]   2> 	at java.util.concurrent.ThreadPoolExecutor$Worker.run(ThreadPoolExecutor.java:603)
   [junit4]   2> 	at java.lang.Thread.run(Thread.java:722)
   [junit4]   2> 
   [junit4]   2> 405 T505 oasc.SolrCore.registerSearcher [collection1] Registered new searcher
Searcher@41e3e3ad main{StandardDirectoryReader(segments_2:3 _0(5.0):C3)}
   [junit4]   2> 405 T504 C34 UPDATE [collection1] webapp=null path=null params={} {commit=}
0 21
   [junit4]   2> 408 T504 C34 REQ [collection1] webapp=null path=null params={q=ac&spellcheck.count=2&qt=/suggest&spellcheck.onlyMorePopular=true}
status=0 QTime=1 
   [junit4]   2> 410 T504 oas.SolrTestCaseJ4.assertQ SEVERE REQUEST FAILED: xpath=//lst[@name='spellcheck']/lst[@name='suggestions']/lst[@name='ac']/int[@name='numFound'][.='2']
   [junit4]   2> 		xml response was: <?xml version="1.0" encoding="UTF-8"?>
   [junit4]   2> 	<response>
   [junit4]   2> 	<lst name="responseHeader"><int name="status">0</int><int
name="QTime">1</int></lst><lst name="spellcheck"><lst name="suggestions"/></lst>
   [junit4]   2> 	</response>
   [junit4]   2> 	
   [junit4]   2> 		request was:q=ac&spellcheck.count=2&qt=/suggest&spellcheck.onlyMorePopular=true
   [junit4]   2> 413 T504 oasc.SolrException.log SEVERE REQUEST FAILED: q=ac&spellcheck.count=2&qt=/suggest&spellcheck.onlyMorePopular=true:java.lang.RuntimeException:
REQUEST FAILED: xpath=//lst[@name='spellcheck']/lst[@name='suggestions']/lst[@name='ac']/int[@name='numFound'][.='2']
   [junit4]   2> 		xml response was: <?xml version="1.0" encoding="UTF-8"?>
   [junit4]   2> 	<response>
   [junit4]   2> 	<lst name="responseHeader"><int name="status">0</int><int
name="QTime">1</int></lst><lst name="spellcheck"><lst name="suggestions"/></lst>
   [junit4]   2> 	</response>
   [junit4]   2> 	
   [junit4]   2> 		request was:q=ac&spellcheck.count=2&qt=/suggest&spellcheck.onlyMorePopular=true
   [junit4]   2> 		at org.apache.solr.SolrTestCaseJ4.assertQ(SolrTestCaseJ4.java:452)
   [junit4]   2> 		at org.apache.solr.SolrTestCaseJ4.assertQ(SolrTestCaseJ4.java:426)
   [junit4]   2> 		at org.apache.solr.spelling.suggest.SuggesterTest.testRebuild(SuggesterTest.java:105)
   [junit4]   2> 		at sun.reflect.NativeMethodAccessorImpl.invoke0(Native Method)
   [junit4]   2> 		at sun.reflect.NativeMethodAccessorImpl.invoke(NativeMethodAccessorImpl.java:57)
   [junit4]   2> 		at sun.reflect.DelegatingMethodAccessorImpl.invoke(DelegatingMethodAccessorImpl.java:43)
   [junit4]   2> 		at java.lang.reflect.Method.invoke(Method.java:601)
   [junit4]   2> 		at com.carrotsearch.randomizedtesting.RandomizedRunner.invoke(RandomizedRunner.java:1969)
   [junit4]   2> 		at com.carrotsearch.randomizedtesting.RandomizedRunner.access$1100(RandomizedRunner.java:132)
   [junit4]   2> 		at com.carrotsearch.randomizedtesting.RandomizedRunner$6.evaluate(RandomizedRunner.java:814)
   [junit4]   2> 		at com.carrotsearch.randomizedtesting.RandomizedRunner$7.evaluate(RandomizedRunner.java:875)
   [junit4]   2> 		at com.carrotsearch.randomizedtesting.RandomizedRunner$8.evaluate(RandomizedRunner.java:889)
   [junit4]   2> 		at com.carrotsearch.randomizedtesting.rules.SystemPropertiesRestoreRule$1.evaluate(SystemPropertiesRestoreRule.java:53)
   [junit4]   2> 		at org.apache.lucene.util.TestRuleSetupTeardownChained$1.evaluate(TestRuleSetupTeardownChained.java:50)
   [junit4]   2> 		at org.apache.lucene.util.TestRuleFieldCacheSanity$1.evaluate(TestRuleFieldCacheSanity.java:32)
   [junit4]   2> 		at org.apache.lucene.util.AbstractBeforeAfterRule$1.evaluate(AbstractBeforeAfterRule.java:45)
   [junit4]   2> 		at com.carrotsearch.randomizedtesting.rules.SystemPropertiesInvariantRule$1.evaluate(SystemPropertiesInvariantRule.java:55)
   [junit4]   2> 		at org.apache.lucene.util.TestRuleReportUncaughtExceptions$1.evaluate(TestRuleReportUncaughtExceptions.java:68)
   [junit4]   2> 		at org.apache.lucene.util.TestRuleThreadAndTestName$1.evaluate(TestRuleThreadAndTestName.java:48)
   [junit4]   2> 		at org.apache.lucene.util.TestRuleMarkFailure$1.evaluate(TestRuleMarkFailure.java:48)
   [junit4]   2> 		at com.carrotsearch.randomizedtesting.RandomizedRunner.runSingleTest(RandomizedRunner.java:821)
   [junit4]   2> 		at com.carrotsearch.randomizedtesting.RandomizedRunner.access$700(RandomizedRunner.java:132)
   [junit4]   2> 		at com.carrotsearch.randomizedtesting.RandomizedRunner$3$1.run(RandomizedRunner.java:669)
   [junit4]   2> 		at com.carrotsearch.randomizedtesting.RandomizedRunner$3.evaluate(RandomizedRunner.java:695)
   [junit4]   2> 		at com.carrotsearch.randomizedtesting.RandomizedRunner$4.evaluate(RandomizedRunner.java:734)
   [junit4]   2> 		at com.carrotsearch.randomizedtesting.RandomizedRunner$5.evaluate(RandomizedRunner.java:745)
   [junit4]   2> 		at com.carrotsearch.randomizedtesting.rules.SystemPropertiesRestoreRule$1.evaluate(SystemPropertiesRestoreRule.java:53)
   [junit4]   2> 		at org.apache.lucene.util.AbstractBeforeAfterRule$1.evaluate(AbstractBeforeAfterRule.java:45)
   [junit4]   2> 		at org.apache.lucene.util.TestRuleReportUncaughtExceptions$1.evaluate(TestRuleReportUncaughtExceptions.java:68)
   [junit4]   2> 		at org.apache.lucene.util.TestRuleStoreClassName$1.evaluate(TestRuleStoreClassName.java:38)
   [junit4]   2> 		at org.apache.lucene.util.TestRuleIcuHack$1.evaluate(TestRuleIcuHack.java:51)
   [junit4]   2> 		at com.carrotsearch.randomizedtesting.rules.SystemPropertiesInvariantRule$1.evaluate(SystemPropertiesInvariantRule.java:55)
   [junit4]   2> 		at org.apache.lucene.util.TestRuleNoInstanceHooksOverrides$1.evaluate(TestRuleNoInstanceHooksOverrides.java:53)
   [junit4]   2> 		at org.apache.lucene.util.TestRuleNoStaticHooksShadowing$1.evaluate(TestRuleNoStaticHooksShadowing.java:52)
   [junit4]   2> 		at org.apache.lucene.util.TestRuleAssertionsRequired$1.evaluate(TestRuleAssertionsRequired.java:36)
   [junit4]   2> 		at org.apache.lucene.util.TestRuleMarkFailure$1.evaluate(TestRuleMarkFailure.java:48)
   [junit4]   2> 		at org.apache.lucene.util.TestRuleIgnoreTestSuites$1.evaluate(TestRuleIgnoreTestSuites.java:56)
   [junit4]   2> 		at com.carrotsearch.randomizedtesting.RandomizedRunner.runSuite(RandomizedRunner.java:605)
   [junit4]   2> 		at com.carrotsearch.randomizedtesting.RandomizedRunner.access$400(RandomizedRunner.java:132)
   [junit4]   2> 		at com.carrotsearch.randomizedtesting.RandomizedRunner$2.run(RandomizedRunner.java:551)
   [junit4]   2> 	
   [junit4]   2> 414 T504 oas.SolrTestCaseJ4.tearDown ###Ending testRebuild
   [junit4]   2> NOTE: reproduce with: ant test  -Dtestcase=SuggesterTest -Dtests.method=testRebuild
-Dtests.seed=D037897784DC2C1C -Dtests.locale=ar_TN -Dtests.timezone=America/Noronha -Dargs="-Dfile.encoding=Cp1252"
   [junit4]   2>
   [junit4]    > (@AfterClass output)
   [junit4]   2> 1447 T504 oas.SolrTestCaseJ4.deleteCore ###deleteCore
   [junit4]   2> 1447 T504 oasc.CoreContainer.shutdown Shutting down CoreContainer instance=1104543644
   [junit4]   2> 1447 T504 oasc.SolrCore.close [collection1]  CLOSING SolrCore org.apache.solr.core.SolrCore@55b088f7
   [junit4]   2> 1447 T504 oasc.SolrCore.closeSearcher [collection1] Closing main searcher
on request.
   [junit4]   2> 1448 T504 oasu.DirectUpdateHandler2.close closing DirectUpdateHandler2{commits=0,autocommits=0,soft
autocommits=0,optimizes=0,rollbacks=0,expungeDeletes=0,docsPending=0,adds=0,deletesById=0,deletesByQuery=0,errors=0,cumulative_adds=0,cumulative_deletesById=0,cumulative_deletesByQuery=0,cumulative_errors=0}
   [junit4]   2> NOTE: test params are: codec=Lucene40: {}, sim=RandomSimilarityProvider(queryNorm=true,coord=false):
{}, locale=ar_TN, timezone=America/Noronha
   [junit4]   2> NOTE: Windows 7 6.1 amd64/Oracle Corporation 1.7.0_04 (64-bit)/cpus=2,threads=1,free=35497152,total=232652800
   [junit4]   2> NOTE: All tests run in this JVM: [SpellPossibilityIteratorTest, TestExtendedDismaxParser,
TestHindiFilters, TestSolrDeletionPolicy1, TestJapaneseTokenizerFactory, DisMaxRequestHandlerTest,
DefaultValueUpdateProcessorTest, StandardRequestHandlerTest, TestSolrCoreProperties, TestConfig,
TestJapaneseBaseFormFilterFactory, TestLatvianStemFilterFactory, FieldAnalysisRequestHandlerTest,
TestTypeTokenFilterFactory, TestReversedWildcardFilterFactory, MoreLikeThisHandlerTest, TestBulgarianStemFilterFactory,
TestUAX29URLEmailTokenizerFactory, DirectUpdateHandlerTest, TestHyphenationCompoundWordTokenFilterFactory,
TestTurkishLowerCaseFilterFactory, RAMDirectoryFactoryTest, BadComponentTest, FullSolrCloudDistribCmdsTest,
DirectUpdateHandlerOptimizeTest, TestGermanMinimalStemFilterFactory, TestPersianNormalizationFilterFactory,
TestDictionaryCompoundWordTokenFilterFactory, SOLR749Test, BasicFunctionalityTest, DOMUtilTest,
CommonGramsFilterFactoryTest, SignatureUpdateProcessorFactoryTest, TestIndexingPerformance,
TestArabicFilters, MinimalSchemaTest, DistanceFunctionTest, ZkSolrClientTest, TestSolrXMLSerializer,
TestGalicianMinimalStemFilterFactory, TestMultiCoreConfBootstrap, TestQuerySenderListener,
RequestHandlersTest, LeaderElectionTest, TestSurroundQueryParser, TestCJKWidthFilterFactory,
TestRemoveDuplicatesTokenFilterFactory, CoreAdminHandlerTest, TestGreekLowerCaseFilterFactory,
EchoParamsTest, TestLMDirichletSimilarityFactory, TestHungarianLightStemFilterFactory, TestCzechStemFilterFactory,
TestIrishLowerCaseFilterFactory, NumericFieldsTest, FileBasedSpellCheckerTest, SearchHandlerTest,
BadIndexSchemaTest, TestPorterStemFilterFactory, MultiTermTest, TestBadConfig, RequiredFieldsTest,
HighlighterConfigTest, BinaryUpdateRequestHandlerTest, CSVRequestHandlerTest, TestHashPartitioner,
SuggesterTest]
   [junit4]   2> 
   [junit4] Completed in 1.48s, 4 tests, 1 error <<< FAILURES!
[...truncated 921 lines...]

[...truncated 11648 lines...]

[...truncated 11648 lines...]

[...truncated 11648 lines...]

[...truncated 11648 lines...]

[...truncated 11648 lines...]



Mime
View raw message