lucene-dev mailing list archives

Site index · List index
Message view « Date » · « Thread »
Top « Date » · « Thread »
From Policeman Jenkins Server <jenk...@sd-datasolutions.de>
Subject [JENKINS] Lucene-Solr-trunk-Linux (64bit/jdk1.8.0-ea-b58) - Build # 1980 - Failure!
Date Thu, 25 Oct 2012 05:27:12 GMT
Build: http://jenkins.sd-datasolutions.de/job/Lucene-Solr-trunk-Linux/1980/
Java: 64bit/jdk1.8.0-ea-b58 -XX:+UseParallelGC

4 tests failed.
FAILED:  junit.framework.TestSuite.org.apache.solr.cloud.SyncSliceTest

Error Message:
ERROR: SolrIndexSearcher opens=8 closes=7

Stack Trace:
java.lang.AssertionError: ERROR: SolrIndexSearcher opens=8 closes=7
	at __randomizedtesting.SeedInfo.seed([665896786033E74F]:0)
	at org.junit.Assert.fail(Assert.java:93)
	at org.apache.solr.SolrTestCaseJ4.endTrackingSearchers(SolrTestCaseJ4.java:242)
	at org.apache.solr.SolrTestCaseJ4.afterClass(SolrTestCaseJ4.java:97)
	at sun.reflect.NativeMethodAccessorImpl.invoke0(Native Method)
	at sun.reflect.NativeMethodAccessorImpl.invoke(NativeMethodAccessorImpl.java:57)
	at sun.reflect.DelegatingMethodAccessorImpl.invoke(DelegatingMethodAccessorImpl.java:43)
	at java.lang.reflect.Method.invoke(Method.java:474)
	at com.carrotsearch.randomizedtesting.RandomizedRunner.invoke(RandomizedRunner.java:1559)
	at com.carrotsearch.randomizedtesting.RandomizedRunner.access$600(RandomizedRunner.java:79)
	at com.carrotsearch.randomizedtesting.RandomizedRunner$5.evaluate(RandomizedRunner.java:700)
	at com.carrotsearch.randomizedtesting.rules.StatementAdapter.evaluate(StatementAdapter.java:36)
	at com.carrotsearch.randomizedtesting.rules.SystemPropertiesRestoreRule$1.evaluate(SystemPropertiesRestoreRule.java:53)
	at org.apache.lucene.util.AbstractBeforeAfterRule$1.evaluate(AbstractBeforeAfterRule.java:45)
	at org.apache.lucene.util.TestRuleStoreClassName$1.evaluate(TestRuleStoreClassName.java:42)
	at com.carrotsearch.randomizedtesting.rules.SystemPropertiesInvariantRule$1.evaluate(SystemPropertiesInvariantRule.java:55)
	at com.carrotsearch.randomizedtesting.rules.NoShadowingOrOverridesOnMethodsRule$1.evaluate(NoShadowingOrOverridesOnMethodsRule.java:39)
	at com.carrotsearch.randomizedtesting.rules.NoShadowingOrOverridesOnMethodsRule$1.evaluate(NoShadowingOrOverridesOnMethodsRule.java:39)
	at com.carrotsearch.randomizedtesting.rules.StatementAdapter.evaluate(StatementAdapter.java:36)
	at org.apache.lucene.util.TestRuleAssertionsRequired$1.evaluate(TestRuleAssertionsRequired.java:43)
	at org.apache.lucene.util.TestRuleMarkFailure$1.evaluate(TestRuleMarkFailure.java:48)
	at org.apache.lucene.util.TestRuleIgnoreAfterMaxFailures$1.evaluate(TestRuleIgnoreAfterMaxFailures.java:70)
	at org.apache.lucene.util.TestRuleIgnoreTestSuites$1.evaluate(TestRuleIgnoreTestSuites.java:55)
	at com.carrotsearch.randomizedtesting.rules.StatementAdapter.evaluate(StatementAdapter.java:36)
	at com.carrotsearch.randomizedtesting.ThreadLeakControl$StatementRunner.run(ThreadLeakControl.java:358)
	at java.lang.Thread.run(Thread.java:722)


FAILED:  junit.framework.TestSuite.org.apache.solr.cloud.SyncSliceTest

Error Message:
1 thread leaked from SUITE scope at org.apache.solr.cloud.SyncSliceTest:     1) Thread[id=74, name=searcherExecutor-32-thread-1, state=WAITING, group=TGRP-SyncSliceTest]         at sun.misc.Unsafe.park(Native Method)         at java.util.concurrent.locks.LockSupport.park(LockSupport.java:186)         at java.util.concurrent.locks.AbstractQueuedSynchronizer$ConditionObject.await(AbstractQueuedSynchronizer.java:2043)         at java.util.concurrent.LinkedBlockingQueue.take(LinkedBlockingQueue.java:442)         at java.util.concurrent.ThreadPoolExecutor.getTask(ThreadPoolExecutor.java:1045)         at java.util.concurrent.ThreadPoolExecutor.runWorker(ThreadPoolExecutor.java:1103)         at java.util.concurrent.ThreadPoolExecutor$Worker.run(ThreadPoolExecutor.java:603)         at java.lang.Thread.run(Thread.java:722)

Stack Trace:
com.carrotsearch.randomizedtesting.ThreadLeakError: 1 thread leaked from SUITE scope at org.apache.solr.cloud.SyncSliceTest: 
   1) Thread[id=74, name=searcherExecutor-32-thread-1, state=WAITING, group=TGRP-SyncSliceTest]
        at sun.misc.Unsafe.park(Native Method)
        at java.util.concurrent.locks.LockSupport.park(LockSupport.java:186)
        at java.util.concurrent.locks.AbstractQueuedSynchronizer$ConditionObject.await(AbstractQueuedSynchronizer.java:2043)
        at java.util.concurrent.LinkedBlockingQueue.take(LinkedBlockingQueue.java:442)
        at java.util.concurrent.ThreadPoolExecutor.getTask(ThreadPoolExecutor.java:1045)
        at java.util.concurrent.ThreadPoolExecutor.runWorker(ThreadPoolExecutor.java:1103)
        at java.util.concurrent.ThreadPoolExecutor$Worker.run(ThreadPoolExecutor.java:603)
        at java.lang.Thread.run(Thread.java:722)
	at __randomizedtesting.SeedInfo.seed([665896786033E74F]:0)


FAILED:  junit.framework.TestSuite.org.apache.solr.cloud.SyncSliceTest

Error Message:
There are still zombie threads that couldn't be terminated:    1) Thread[id=74, name=searcherExecutor-32-thread-1, state=WAITING, group=TGRP-SyncSliceTest]         at sun.misc.Unsafe.park(Native Method)         at java.util.concurrent.locks.LockSupport.park(LockSupport.java:186)         at java.util.concurrent.locks.AbstractQueuedSynchronizer$ConditionObject.await(AbstractQueuedSynchronizer.java:2043)         at java.util.concurrent.LinkedBlockingQueue.take(LinkedBlockingQueue.java:442)         at java.util.concurrent.ThreadPoolExecutor.getTask(ThreadPoolExecutor.java:1045)         at java.util.concurrent.ThreadPoolExecutor.runWorker(ThreadPoolExecutor.java:1103)         at java.util.concurrent.ThreadPoolExecutor$Worker.run(ThreadPoolExecutor.java:603)         at java.lang.Thread.run(Thread.java:722)

Stack Trace:
com.carrotsearch.randomizedtesting.ThreadLeakError: There are still zombie threads that couldn't be terminated:
   1) Thread[id=74, name=searcherExecutor-32-thread-1, state=WAITING, group=TGRP-SyncSliceTest]
        at sun.misc.Unsafe.park(Native Method)
        at java.util.concurrent.locks.LockSupport.park(LockSupport.java:186)
        at java.util.concurrent.locks.AbstractQueuedSynchronizer$ConditionObject.await(AbstractQueuedSynchronizer.java:2043)
        at java.util.concurrent.LinkedBlockingQueue.take(LinkedBlockingQueue.java:442)
        at java.util.concurrent.ThreadPoolExecutor.getTask(ThreadPoolExecutor.java:1045)
        at java.util.concurrent.ThreadPoolExecutor.runWorker(ThreadPoolExecutor.java:1103)
        at java.util.concurrent.ThreadPoolExecutor$Worker.run(ThreadPoolExecutor.java:603)
        at java.lang.Thread.run(Thread.java:722)
	at __randomizedtesting.SeedInfo.seed([665896786033E74F]:0)


REGRESSION:  org.apache.solr.cloud.SyncSliceTest.testDistribSearch

Error Message:
There are still nodes recoverying

Stack Trace:
java.lang.AssertionError: There are still nodes recoverying
	at __randomizedtesting.SeedInfo.seed([665896786033E74F:E7BE1860176C8773]:0)
	at org.junit.Assert.fail(Assert.java:93)
	at org.apache.solr.cloud.AbstractDistribZkTestBase.waitForRecoveriesToFinish(AbstractDistribZkTestBase.java:154)
	at org.apache.solr.cloud.AbstractFullDistribZkTestBase.waitForRecoveriesToFinish(AbstractFullDistribZkTestBase.java:563)
	at org.apache.solr.cloud.AbstractFullDistribZkTestBase.waitForThingsToLevelOut(AbstractFullDistribZkTestBase.java:1138)
	at org.apache.solr.cloud.SyncSliceTest.doTest(SyncSliceTest.java:89)
	at org.apache.solr.BaseDistributedSearchTestCase.testDistribSearch(BaseDistributedSearchTestCase.java:695)
	at sun.reflect.NativeMethodAccessorImpl.invoke0(Native Method)
	at sun.reflect.NativeMethodAccessorImpl.invoke(NativeMethodAccessorImpl.java:57)
	at sun.reflect.DelegatingMethodAccessorImpl.invoke(DelegatingMethodAccessorImpl.java:43)
	at java.lang.reflect.Method.invoke(Method.java:474)
	at com.carrotsearch.randomizedtesting.RandomizedRunner.invoke(RandomizedRunner.java:1559)
	at com.carrotsearch.randomizedtesting.RandomizedRunner.access$600(RandomizedRunner.java:79)
	at com.carrotsearch.randomizedtesting.RandomizedRunner$6.evaluate(RandomizedRunner.java:737)
	at com.carrotsearch.randomizedtesting.RandomizedRunner$7.evaluate(RandomizedRunner.java:773)
	at com.carrotsearch.randomizedtesting.RandomizedRunner$8.evaluate(RandomizedRunner.java:787)
	at com.carrotsearch.randomizedtesting.rules.SystemPropertiesRestoreRule$1.evaluate(SystemPropertiesRestoreRule.java:53)
	at org.apache.lucene.util.TestRuleSetupTeardownChained$1.evaluate(TestRuleSetupTeardownChained.java:50)
	at org.apache.lucene.util.TestRuleFieldCacheSanity$1.evaluate(TestRuleFieldCacheSanity.java:51)
	at org.apache.lucene.util.AbstractBeforeAfterRule$1.evaluate(AbstractBeforeAfterRule.java:45)
	at com.carrotsearch.randomizedtesting.rules.SystemPropertiesInvariantRule$1.evaluate(SystemPropertiesInvariantRule.java:55)
	at org.apache.lucene.util.TestRuleThreadAndTestName$1.evaluate(TestRuleThreadAndTestName.java:48)
	at org.apache.lucene.util.TestRuleIgnoreAfterMaxFailures$1.evaluate(TestRuleIgnoreAfterMaxFailures.java:70)
	at org.apache.lucene.util.TestRuleMarkFailure$1.evaluate(TestRuleMarkFailure.java:48)
	at com.carrotsearch.randomizedtesting.rules.StatementAdapter.evaluate(StatementAdapter.java:36)
	at com.carrotsearch.randomizedtesting.ThreadLeakControl$StatementRunner.run(ThreadLeakControl.java:358)
	at com.carrotsearch.randomizedtesting.ThreadLeakControl.forkTimeoutingTask(ThreadLeakControl.java:782)
	at com.carrotsearch.randomizedtesting.ThreadLeakControl$3.evaluate(ThreadLeakControl.java:442)
	at com.carrotsearch.randomizedtesting.RandomizedRunner.runSingleTest(RandomizedRunner.java:746)
	at com.carrotsearch.randomizedtesting.RandomizedRunner$3.evaluate(RandomizedRunner.java:648)
	at com.carrotsearch.randomizedtesting.RandomizedRunner$4.evaluate(RandomizedRunner.java:682)
	at com.carrotsearch.randomizedtesting.RandomizedRunner$5.evaluate(RandomizedRunner.java:693)
	at com.carrotsearch.randomizedtesting.rules.StatementAdapter.evaluate(StatementAdapter.java:36)
	at com.carrotsearch.randomizedtesting.rules.SystemPropertiesRestoreRule$1.evaluate(SystemPropertiesRestoreRule.java:53)
	at org.apache.lucene.util.AbstractBeforeAfterRule$1.evaluate(AbstractBeforeAfterRule.java:45)
	at org.apache.lucene.util.TestRuleStoreClassName$1.evaluate(TestRuleStoreClassName.java:42)
	at com.carrotsearch.randomizedtesting.rules.SystemPropertiesInvariantRule$1.evaluate(SystemPropertiesInvariantRule.java:55)
	at com.carrotsearch.randomizedtesting.rules.NoShadowingOrOverridesOnMethodsRule$1.evaluate(NoShadowingOrOverridesOnMethodsRule.java:39)
	at com.carrotsearch.randomizedtesting.rules.NoShadowingOrOverridesOnMethodsRule$1.evaluate(NoShadowingOrOverridesOnMethodsRule.java:39)
	at com.carrotsearch.randomizedtesting.rules.StatementAdapter.evaluate(StatementAdapter.java:36)
	at org.apache.lucene.util.TestRuleAssertionsRequired$1.evaluate(TestRuleAssertionsRequired.java:43)
	at org.apache.lucene.util.TestRuleMarkFailure$1.evaluate(TestRuleMarkFailure.java:48)
	at org.apache.lucene.util.TestRuleIgnoreAfterMaxFailures$1.evaluate(TestRuleIgnoreAfterMaxFailures.java:70)
	at org.apache.lucene.util.TestRuleIgnoreTestSuites$1.evaluate(TestRuleIgnoreTestSuites.java:55)
	at com.carrotsearch.randomizedtesting.rules.StatementAdapter.evaluate(StatementAdapter.java:36)
	at com.carrotsearch.randomizedtesting.ThreadLeakControl$StatementRunner.run(ThreadLeakControl.java:358)
	at java.lang.Thread.run(Thread.java:722)




Build Log:
[...truncated 8564 lines...]
[junit4:junit4] Suite: org.apache.solr.cloud.SyncSliceTest
[junit4:junit4]   2> 107 T12 oas.SolrTestCaseJ4.setUp ###Starting testDistribSearch
[junit4:junit4]   2> Creating dataDir: /mnt/ssd/jenkins/workspace/Lucene-Solr-trunk-Linux/solr/build/solr-core/test/J1/./solrtest-SyncSliceTest-1351142564264
[junit4:junit4]   2> 112 T12 oasc.ZkTestServer.run STARTING ZK TEST SERVER
[junit4:junit4]   2> 151 T13 oaz.Environment.logEnv Server environment:zookeeper.version=3.3.6-1366786, built on 07/29/2012 06:22 GMT
[junit4:junit4]   2> 152 T13 oaz.Environment.logEnv Server environment:host.name=serv1
[junit4:junit4]   2> 153 T13 oaz.Environment.logEnv Server environment:java.version=1.8.0-ea
[junit4:junit4]   2> 153 T13 oaz.Environment.logEnv Server environment:java.vendor=Oracle Corporation
[junit4:junit4]   2> 154 T13 oaz.Environment.logEnv Server environment:java.home=/mnt/ssd/jenkins/tools/java/64bit/jdk1.8.0-ea-b58/jre
[junit4:junit4]   2> 154 T13 oaz.Environment.logEnv Server environment:java.class.path=/mnt/ssd/jenkins/workspace/Lucene-Solr-trunk-Linux/solr/build/solr-core/classes/test:/mnt/ssd/jenkins/workspace/Lucene-Solr-trunk-Linux/solr/build/solr-test-framework/classes/java:/mnt/ssd/jenkins/workspace/Lucene-Solr-trunk-Linux/solr/build/solr-core/test-files:/mnt/ssd/jenkins/workspace/Lucene-Solr-trunk-Linux/lucene/build/test-framework/classes/java:/mnt/ssd/jenkins/workspace/Lucene-Solr-trunk-Linux/lucene/build/codecs/classes/java:/mnt/ssd/jenkins/workspace/Lucene-Solr-trunk-Linux/solr/build/solr-solrj/classes/java:/mnt/ssd/jenkins/workspace/Lucene-Solr-trunk-Linux/solr/build/solr-core/classes/java:/mnt/ssd/jenkins/workspace/Lucene-Solr-trunk-Linux/lucene/build/analysis/common/lucene-analyzers-common-5.0-SNAPSHOT.jar:/mnt/ssd/jenkins/workspace/Lucene-Solr-trunk-Linux/lucene/build/analysis/kuromoji/lucene-analyzers-kuromoji-5.0-SNAPSHOT.jar:/mnt/ssd/jenkins/workspace/Lucene-Solr-trunk-Linux/lucene/build/analysis/phonetic/lucene-analyzers-phonetic-5.0-SNAPSHOT.jar:/mnt/ssd/jenkins/workspace/Lucene-Solr-trunk-Linux/lucene/build/highlighter/lucene-highlighter-5.0-SNAPSHOT.jar:/mnt/ssd/jenkins/workspace/Lucene-Solr-trunk-Linux/lucene/build/memory/lucene-memory-5.0-SNAPSHOT.jar:/mnt/ssd/jenkins/workspace/Lucene-Solr-trunk-Linux/lucene/build/misc/lucene-misc-5.0-SNAPSHOT.jar:/mnt/ssd/jenkins/workspace/Lucene-Solr-trunk-Linux/lucene/build/spatial/lucene-spatial-5.0-SNAPSHOT.jar:/mnt/ssd/jenkins/workspace/Lucene-Solr-trunk-Linux/lucene/build/suggest/lucene-suggest-5.0-SNAPSHOT.jar:/mnt/ssd/jenkins/workspace/Lucene-Solr-trunk-Linux/lucene/build/grouping/lucene-grouping-5.0-SNAPSHOT.jar:/mnt/ssd/jenkins/workspace/Lucene-Solr-trunk-Linux/lucene/build/queries/lucene-queries-5.0-SNAPSHOT.jar:/mnt/ssd/jenkins/workspace/Lucene-Solr-trunk-Linux/lucene/build/queryparser/lucene-queryparser-5.0-SNAPSHOT.jar:/mnt/ssd/jenkins/workspace/Lucene-Solr-trunk-Linux/solr/core/lib/commons-cli-1.2.jar:/mnt/ssd/jenkins/workspace/Lucene-Solr-trunk-Linux/solr/core/lib/commons-codec-1.7.jar:/mnt/ssd/jenkins/workspace/Lucene-Solr-trunk-Linux/solr/core/lib/commons-fileupload-1.2.1.jar:/mnt/ssd/jenkins/workspace/Lucene-Solr-trunk-Linux/solr/core/lib/commons-lang-2.6.jar:/mnt/ssd/jenkins/workspace/Lucene-Solr-trunk-Linux/solr/core/lib/easymock-2.2.jar:/mnt/ssd/jenkins/workspace/Lucene-Solr-trunk-Linux/solr/core/lib/guava-r05.jar:/mnt/ssd/jenkins/workspace/Lucene-Solr-trunk-Linux/solr/core/lib/javax.servlet-api-3.0.1.jar:/mnt/ssd/jenkins/workspace/Lucene-Solr-trunk-Linux/solr/core/lib/spatial4j-0.3.jar:/mnt/ssd/jenkins/workspace/Lucene-Solr-trunk-Linux/solr/solrj/lib/commons-io-2.1.jar:/mnt/ssd/jenkins/workspace/Lucene-Solr-trunk-Linux/solr/solrj/lib/httpclient-4.1.3.jar:/mnt/ssd/jenkins/workspace/Lucene-Solr-trunk-Linux/solr/solrj/lib/httpcore-4.1.4.jar:/mnt/ssd/jenkins/workspace/Lucene-Solr-trunk-Linux/solr/solrj/lib/httpmime-4.1.3.jar:/mnt/ssd/jenkins/workspace/Lucene-Solr-trunk-Linux/solr/solrj/lib/jcl-over-slf4j-1.6.4.jar:/mnt/ssd/jenkins/workspace/Lucene-Solr-trunk-Linux/solr/solrj/lib/log4j-over-slf4j-1.6.4.jar:/mnt/ssd/jenkins/workspace/Lucene-Solr-trunk-Linux/solr/solrj/lib/slf4j-api-1.6.4.jar:/mnt/ssd/jenkins/workspace/Lucene-Solr-trunk-Linux/solr/solrj/lib/slf4j-jdk14-1.6.4.jar:/mnt/ssd/jenkins/workspace/Lucene-Solr-trunk-Linux/solr/solrj/lib/wstx-asl-3.2.7.jar:/mnt/ssd/jenkins/workspace/Lucene-Solr-trunk-Linux/solr/solrj/lib/zookeeper-3.3.6.jar:/mnt/ssd/jenkins/workspace/Lucene-Solr-trunk-Linux/solr/example/lib/jetty-continuation-8.1.2.v20120308.jar:/mnt/ssd/jenkins/workspace/Lucene-Solr-trunk-Linux/solr/example/lib/jetty-deploy-8.1.2.v20120308.jar:/mnt/ssd/jenkins/workspace/Lucene-Solr-trunk-Linux/solr/example/lib/jetty-http-8.1.2.v20120308.jar:/mnt/ssd/jenkins/workspace/Lucene-Solr-trunk-Linux/solr/example/lib/jetty-io-8.1.2.v20120308.jar:/mnt/ssd/jenkins/workspace/Lucene-Solr-trunk-Linux/solr/example/lib/jetty-jmx-8.1.2.v20120308.jar:/mnt/ssd/jenkins/workspace/Lucene-Solr-trunk-Linux/solr/example/lib/jetty-security-8.1.2.v20120308.jar:/mnt/ssd/jenkins/workspace/Lucene-Solr-trunk-Linux/solr/example/lib/jetty-server-8.1.2.v20120308.jar:/mnt/ssd/jenkins/workspace/Lucene-Solr-trunk-Linux/solr/example/lib/jetty-servlet-8.1.2.v20120308.jar:/mnt/ssd/jenkins/workspace/Lucene-Solr-trunk-Linux/solr/example/lib/jetty-util-8.1.2.v20120308.jar:/mnt/ssd/jenkins/workspace/Lucene-Solr-trunk-Linux/solr/example/lib/jetty-webapp-8.1.2.v20120308.jar:/mnt/ssd/jenkins/workspace/Lucene-Solr-trunk-Linux/solr/example/lib/jetty-xml-8.1.2.v20120308.jar:/mnt/ssd/jenkins/workspace/Lucene-Solr-trunk-Linux/solr/example/lib/servlet-api-3.0.jar:/mnt/ssd/jenkins/workspace/Lucene-Solr-trunk-Linux/solr/example/example-DIH/solr/db/lib/hsqldb-1.8.0.10.jar:/mnt/ssd/jenkins/workspace/Lucene-Solr-trunk-Linux/lucene/build/core/classes/java:/mnt/ssd/jenkins/workspace/Lucene-Solr-trunk-Linux/lucene/test-framework/lib/junit-4.10.jar:/mnt/ssd/jenkins/workspace/Lucene-Solr-trunk-Linux/lucene/test-framework/lib/randomizedtesting-runner-2.0.3.jar:/var/lib/jenkins/tools/Ant/ANT_1.8.2/lib/ant-launcher.jar:/var/lib/jenkins/.ant/lib/ivy-2.2.0.jar:/var/lib/jenkins/tools/Ant/ANT_1.8.2/lib/ant-jdepend.jar:/var/lib/jenkins/tools/Ant/ANT_1.8.2/lib/ant-netrexx.jar:/var/lib/jenkins/tools/Ant/ANT_1.8.2/lib/ant-antlr.jar:/var/lib/jenkins/tools/Ant/ANT_1.8.2/lib/ant-commons-net.jar:/var/lib/jenkins/tools/Ant/ANT_1.8.2/lib/ant-javamail.jar:/var/lib/jenkins/tools/Ant/ANT_1.8.2/lib/ant-apache-regexp.jar:/var/lib/jenkins/tools/Ant/ANT_1.8.2/lib/ant-jsch.jar:/var/lib/jenkins/tools/Ant/ANT_1.8.2/lib/ant-apache-xalan2.jar:/var/lib/jenkins/tools/Ant/ANT_1.8.2/lib/ant-junit4.jar:/var/lib/jenkins/tools/Ant/ANT_1.8.2/lib/ant-jmf.jar:/var/lib/jenkins/tools/Ant/ANT_1.8.2/lib/ant.jar:/var/lib/jenkins/tools/Ant/ANT_1.8.2/lib/ant-junit.jar:/var/lib/jenkins/tools/Ant/ANT_1.8.2/lib/ant-apache-bcel.jar:/var/lib/jenkins/tools/Ant/ANT_1.8.2/lib/ant-jai.jar:/var/lib/jenkins/tools/Ant/ANT_1.8.2/lib/ant-commons-logging.jar:/var/lib/jenkins/tools/Ant/ANT_1.8.2/lib/ant-apache-resolver.jar:/var/lib/jenkins/tools/Ant/ANT_1.8.2/lib/ant-apache-oro.jar:/var/lib/jenkins/tools/Ant/ANT_1.8.2/lib/ant-swing.jar:/var/lib/jenkins/tools/Ant/ANT_1.8.2/lib/ant-apache-bsf.jar:/var/lib/jenkins/tools/Ant/ANT_1.8.2/lib/ant-apache-log4j.jar:/var/lib/jenkins/tools/Ant/ANT_1.8.2/lib/ant-testutil.jar:/mnt/ssd/jenkins/tools/java/64bit/jdk1.8.0-ea-b58/lib/tools.jar:/var/lib/jenkins/.ivy2/cache/com.carrotsearch.randomizedtesting/junit4-ant/jars/junit4-ant-2.0.3.jar
[junit4:junit4]   2> 155 T13 oaz.Environment.logEnv Server environment:java.library.path=/mnt/ssd/jenkins/tools/java/64bit/jdk1.8.0-ea-b58/jre/lib/amd64/server:/mnt/ssd/jenkins/tools/java/64bit/jdk1.8.0-ea-b58/jre/lib/amd64:/mnt/ssd/jenkins/tools/java/64bit/jdk1.8.0-ea-b58/jre/../lib/amd64:/usr/lib/jvm/j2sdk1.6-sun/jre/lib/amd64/server:/usr/lib/jvm/j2sdk1.6-sun/jre/lib/amd64:/usr/lib/jvm/j2sdk1.6-sun/jre/../lib/amd64:/usr/java/packages/lib/amd64:/usr/lib64:/lib64:/lib:/usr/lib
[junit4:junit4]   2> 156 T13 oaz.Environment.logEnv Server environment:java.io.tmpdir=.
[junit4:junit4]   2> 156 T13 oaz.Environment.logEnv Server environment:java.compiler=<NA>
[junit4:junit4]   2> 157 T13 oaz.Environment.logEnv Server environment:os.name=Linux
[junit4:junit4]   2> 157 T13 oaz.Environment.logEnv Server environment:os.arch=amd64
[junit4:junit4]   2> 157 T13 oaz.Environment.logEnv Server environment:os.version=3.2.0-32-generic
[junit4:junit4]   2> 158 T13 oaz.Environment.logEnv Server environment:user.name=jenkins
[junit4:junit4]   2> 158 T13 oaz.Environment.logEnv Server environment:user.home=/var/lib/jenkins
[junit4:junit4]   2> 158 T13 oaz.Environment.logEnv Server environment:user.dir=/mnt/ssd/jenkins/workspace/Lucene-Solr-trunk-Linux/solr/build/solr-core/test/J1
[junit4:junit4]   2> 173 T13 oazs.ZooKeeperServer.setTickTime tickTime set to 1000
[junit4:junit4]   2> 191 T13 oazs.NIOServerCnxn$Factory.<init> binding to port 0.0.0.0/0.0.0.0:0
[junit4:junit4]   2> 215 T12 oasc.ZkTestServer.run start zk server on port:37667
[junit4:junit4]   2> 224 T13 oazsp.FileTxnSnapLog.save Snapshotting: 0
[junit4:junit4]   2> 243 T12 oaz.Environment.logEnv Client environment:zookeeper.version=3.3.6-1366786, built on 07/29/2012 06:22 GMT
[junit4:junit4]   2> 244 T12 oaz.Environment.logEnv Client environment:host.name=serv1
[junit4:junit4]   2> 244 T12 oaz.Environment.logEnv Client environment:java.version=1.8.0-ea
[junit4:junit4]   2> 245 T12 oaz.Environment.logEnv Client environment:java.vendor=Oracle Corporation
[junit4:junit4]   2> 246 T12 oaz.Environment.logEnv Client environment:java.home=/mnt/ssd/jenkins/tools/java/64bit/jdk1.8.0-ea-b58/jre
[junit4:junit4]   2> 246 T12 oaz.Environment.logEnv Client environment:java.class.path=/mnt/ssd/jenkins/workspace/Lucene-Solr-trunk-Linux/solr/build/solr-core/classes/test:/mnt/ssd/jenkins/workspace/Lucene-Solr-trunk-Linux/solr/build/solr-test-framework/classes/java:/mnt/ssd/jenkins/workspace/Lucene-Solr-trunk-Linux/solr/build/solr-core/test-files:/mnt/ssd/jenkins/workspace/Lucene-Solr-trunk-Linux/lucene/build/test-framework/classes/java:/mnt/ssd/jenkins/workspace/Lucene-Solr-trunk-Linux/lucene/build/codecs/classes/java:/mnt/ssd/jenkins/workspace/Lucene-Solr-trunk-Linux/solr/build/solr-solrj/classes/java:/mnt/ssd/jenkins/workspace/Lucene-Solr-trunk-Linux/solr/build/solr-core/classes/java:/mnt/ssd/jenkins/workspace/Lucene-Solr-trunk-Linux/lucene/build/analysis/common/lucene-analyzers-common-5.0-SNAPSHOT.jar:/mnt/ssd/jenkins/workspace/Lucene-Solr-trunk-Linux/lucene/build/analysis/kuromoji/lucene-analyzers-kuromoji-5.0-SNAPSHOT.jar:/mnt/ssd/jenkins/workspace/Lucene-Solr-trunk-Linux/lucene/build/analysis/phonetic/lucene-analyzers-phonetic-5.0-SNAPSHOT.jar:/mnt/ssd/jenkins/workspace/Lucene-Solr-trunk-Linux/lucene/build/highlighter/lucene-highlighter-5.0-SNAPSHOT.jar:/mnt/ssd/jenkins/workspace/Lucene-Solr-trunk-Linux/lucene/build/memory/lucene-memory-5.0-SNAPSHOT.jar:/mnt/ssd/jenkins/workspace/Lucene-Solr-trunk-Linux/lucene/build/misc/lucene-misc-5.0-SNAPSHOT.jar:/mnt/ssd/jenkins/workspace/Lucene-Solr-trunk-Linux/lucene/build/spatial/lucene-spatial-5.0-SNAPSHOT.jar:/mnt/ssd/jenkins/workspace/Lucene-Solr-trunk-Linux/lucene/build/suggest/lucene-suggest-5.0-SNAPSHOT.jar:/mnt/ssd/jenkins/workspace/Lucene-Solr-trunk-Linux/lucene/build/grouping/lucene-grouping-5.0-SNAPSHOT.jar:/mnt/ssd/jenkins/workspace/Lucene-Solr-trunk-Linux/lucene/build/queries/lucene-queries-5.0-SNAPSHOT.jar:/mnt/ssd/jenkins/workspace/Lucene-Solr-trunk-Linux/lucene/build/queryparser/lucene-queryparser-5.0-SNAPSHOT.jar:/mnt/ssd/jenkins/workspace/Lucene-Solr-trunk-Linux/solr/core/lib/commons-cli-1.2.jar:/mnt/ssd/jenkins/workspace/Lucene-Solr-trunk-Linux/solr/core/lib/commons-codec-1.7.jar:/mnt/ssd/jenkins/workspace/Lucene-Solr-trunk-Linux/solr/core/lib/commons-fileupload-1.2.1.jar:/mnt/ssd/jenkins/workspace/Lucene-Solr-trunk-Linux/solr/core/lib/commons-lang-2.6.jar:/mnt/ssd/jenkins/workspace/Lucene-Solr-trunk-Linux/solr/core/lib/easymock-2.2.jar:/mnt/ssd/jenkins/workspace/Lucene-Solr-trunk-Linux/solr/core/lib/guava-r05.jar:/mnt/ssd/jenkins/workspace/Lucene-Solr-trunk-Linux/solr/core/lib/javax.servlet-api-3.0.1.jar:/mnt/ssd/jenkins/workspace/Lucene-Solr-trunk-Linux/solr/core/lib/spatial4j-0.3.jar:/mnt/ssd/jenkins/workspace/Lucene-Solr-trunk-Linux/solr/solrj/lib/commons-io-2.1.jar:/mnt/ssd/jenkins/workspace/Lucene-Solr-trunk-Linux/solr/solrj/lib/httpclient-4.1.3.jar:/mnt/ssd/jenkins/workspace/Lucene-Solr-trunk-Linux/solr/solrj/lib/httpcore-4.1.4.jar:/mnt/ssd/jenkins/workspace/Lucene-Solr-trunk-Linux/solr/solrj/lib/httpmime-4.1.3.jar:/mnt/ssd/jenkins/workspace/Lucene-Solr-trunk-Linux/solr/solrj/lib/jcl-over-slf4j-1.6.4.jar:/mnt/ssd/jenkins/workspace/Lucene-Solr-trunk-Linux/solr/solrj/lib/log4j-over-slf4j-1.6.4.jar:/mnt/ssd/jenkins/workspace/Lucene-Solr-trunk-Linux/solr/solrj/lib/slf4j-api-1.6.4.jar:/mnt/ssd/jenkins/workspace/Lucene-Solr-trunk-Linux/solr/solrj/lib/slf4j-jdk14-1.6.4.jar:/mnt/ssd/jenkins/workspace/Lucene-Solr-trunk-Linux/solr/solrj/lib/wstx-asl-3.2.7.jar:/mnt/ssd/jenkins/workspace/Lucene-Solr-trunk-Linux/solr/solrj/lib/zookeeper-3.3.6.jar:/mnt/ssd/jenkins/workspace/Lucene-Solr-trunk-Linux/solr/example/lib/jetty-continuation-8.1.2.v20120308.jar:/mnt/ssd/jenkins/workspace/Lucene-Solr-trunk-Linux/solr/example/lib/jetty-deploy-8.1.2.v20120308.jar:/mnt/ssd/jenkins/workspace/Lucene-Solr-trunk-Linux/solr/example/lib/jetty-http-8.1.2.v20120308.jar:/mnt/ssd/jenkins/workspace/Lucene-Solr-trunk-Linux/solr/example/lib/jetty-io-8.1.2.v20120308.jar:/mnt/ssd/jenkins/workspace/Lucene-Solr-trunk-Linux/solr/example/lib/jetty-jmx-8.1.2.v20120308.jar:/mnt/ssd/jenkins/workspace/Lucene-Solr-trunk-Linux/solr/example/lib/jetty-security-8.1.2.v20120308.jar:/mnt/ssd/jenkins/workspace/Lucene-Solr-trunk-Linux/solr/example/lib/jetty-server-8.1.2.v20120308.jar:/mnt/ssd/jenkins/workspace/Lucene-Solr-trunk-Linux/solr/example/lib/jetty-servlet-8.1.2.v20120308.jar:/mnt/ssd/jenkins/workspace/Lucene-Solr-trunk-Linux/solr/example/lib/jetty-util-8.1.2.v20120308.jar:/mnt/ssd/jenkins/workspace/Lucene-Solr-trunk-Linux/solr/example/lib/jetty-webapp-8.1.2.v20120308.jar:/mnt/ssd/jenkins/workspace/Lucene-Solr-trunk-Linux/solr/example/lib/jetty-xml-8.1.2.v20120308.jar:/mnt/ssd/jenkins/workspace/Lucene-Solr-trunk-Linux/solr/example/lib/servlet-api-3.0.jar:/mnt/ssd/jenkins/workspace/Lucene-Solr-trunk-Linux/solr/example/example-DIH/solr/db/lib/hsqldb-1.8.0.10.jar:/mnt/ssd/jenkins/workspace/Lucene-Solr-trunk-Linux/lucene/build/core/classes/java:/mnt/ssd/jenkins/workspace/Lucene-Solr-trunk-Linux/lucene/test-framework/lib/junit-4.10.jar:/mnt/ssd/jenkins/workspace/Lucene-Solr-trunk-Linux/lucene/test-framework/lib/randomizedtesting-runner-2.0.3.jar:/var/lib/jenkins/tools/Ant/ANT_1.8.2/lib/ant-launcher.jar:/var/lib/jenkins/.ant/lib/ivy-2.2.0.jar:/var/lib/jenkins/tools/Ant/ANT_1.8.2/lib/ant-jdepend.jar:/var/lib/jenkins/tools/Ant/ANT_1.8.2/lib/ant-netrexx.jar:/var/lib/jenkins/tools/Ant/ANT_1.8.2/lib/ant-antlr.jar:/var/lib/jenkins/tools/Ant/ANT_1.8.2/lib/ant-commons-net.jar:/var/lib/jenkins/tools/Ant/ANT_1.8.2/lib/ant-javamail.jar:/var/lib/jenkins/tools/Ant/ANT_1.8.2/lib/ant-apache-regexp.jar:/var/lib/jenkins/tools/Ant/ANT_1.8.2/lib/ant-jsch.jar:/var/lib/jenkins/tools/Ant/ANT_1.8.2/lib/ant-apache-xalan2.jar:/var/lib/jenkins/tools/Ant/ANT_1.8.2/lib/ant-junit4.jar:/var/lib/jenkins/tools/Ant/ANT_1.8.2/lib/ant-jmf.jar:/var/lib/jenkins/tools/Ant/ANT_1.8.2/lib/ant.jar:/var/lib/jenkins/tools/Ant/ANT_1.8.2/lib/ant-junit.jar:/var/lib/jenkins/tools/Ant/ANT_1.8.2/lib/ant-apache-bcel.jar:/var/lib/jenkins/tools/Ant/ANT_1.8.2/lib/ant-jai.jar:/var/lib/jenkins/tools/Ant/ANT_1.8.2/lib/ant-commons-logging.jar:/var/lib/jenkins/tools/Ant/ANT_1.8.2/lib/ant-apache-resolver.jar:/var/lib/jenkins/tools/Ant/ANT_1.8.2/lib/ant-apache-oro.jar:/var/lib/jenkins/tools/Ant/ANT_1.8.2/lib/ant-swing.jar:/var/lib/jenkins/tools/Ant/ANT_1.8.2/lib/ant-apache-bsf.jar:/var/lib/jenkins/tools/Ant/ANT_1.8.2/lib/ant-apache-log4j.jar:/var/lib/jenkins/tools/Ant/ANT_1.8.2/lib/ant-testutil.jar:/mnt/ssd/jenkins/tools/java/64bit/jdk1.8.0-ea-b58/lib/tools.jar:/var/lib/jenkins/.ivy2/cache/com.carrotsearch.randomizedtesting/junit4-ant/jars/junit4-ant-2.0.3.jar
[junit4:junit4]   2> 248 T12 oaz.Environment.logEnv Client environment:java.library.path=/mnt/ssd/jenkins/tools/java/64bit/jdk1.8.0-ea-b58/jre/lib/amd64/server:/mnt/ssd/jenkins/tools/java/64bit/jdk1.8.0-ea-b58/jre/lib/amd64:/mnt/ssd/jenkins/tools/java/64bit/jdk1.8.0-ea-b58/jre/../lib/amd64:/usr/lib/jvm/j2sdk1.6-sun/jre/lib/amd64/server:/usr/lib/jvm/j2sdk1.6-sun/jre/lib/amd64:/usr/lib/jvm/j2sdk1.6-sun/jre/../lib/amd64:/usr/java/packages/lib/amd64:/usr/lib64:/lib64:/lib:/usr/lib
[junit4:junit4]   2> 249 T12 oaz.Environment.logEnv Client environment:java.io.tmpdir=.
[junit4:junit4]   2> 250 T12 oaz.Environment.logEnv Client environment:java.compiler=<NA>
[junit4:junit4]   2> 251 T12 oaz.Environment.logEnv Client environment:os.name=Linux
[junit4:junit4]   2> 251 T12 oaz.Environment.logEnv Client environment:os.arch=amd64
[junit4:junit4]   2> 252 T12 oaz.Environment.logEnv Client environment:os.version=3.2.0-32-generic
[junit4:junit4]   2> 253 T12 oaz.Environment.logEnv Client environment:user.name=jenkins
[junit4:junit4]   2> 253 T12 oaz.Environment.logEnv Client environment:user.home=/var/lib/jenkins
[junit4:junit4]   2> 254 T12 oaz.Environment.logEnv Client environment:user.dir=/mnt/ssd/jenkins/workspace/Lucene-Solr-trunk-Linux/solr/build/solr-core/test/J1
[junit4:junit4]   2> 257 T12 oaz.ZooKeeper.<init> Initiating client connection, connectString=127.0.0.1:37667 sessionTimeout=10000 watcher=org.apache.solr.common.cloud.ConnectionManager@90a1f5a
[junit4:junit4]   2> 276 T18 oaz.ClientCnxn$SendThread.startConnect Opening socket connection to server /127.0.0.1:37667
[junit4:junit4]   2> 279 T12 oascc.ConnectionManager.waitForConnected Waiting for client to connect to ZooKeeper
[junit4:junit4]   2> 280 T18 oaz.ClientCnxn$SendThread.primeConnection Socket connection established to localhost.localdomain/127.0.0.1:37667, initiating session
[junit4:junit4]   2> 475 T14 oazs.NIOServerCnxn$Factory.run Accepted socket connection from /127.0.0.1:48155
[junit4:junit4]   2> 482 T14 oazs.NIOServerCnxn.doIO WARNING Exception causing close of session 0x0 due to java.io.IOException: ZooKeeperServer not running
[junit4:junit4]   2> 482 T14 oazs.NIOServerCnxn.closeSock Closed socket connection for client /127.0.0.1:48155 (no session established for client)
[junit4:junit4]   2> 483 T18 oaz.ClientCnxn$SendThread.run Unable to read additional data from server sessionid 0x0, likely server has closed socket, closing socket connection and attempting reconnect
[junit4:junit4]   2> 1749 T18 oaz.ClientCnxn$SendThread.startConnect Opening socket connection to server localhost.localdomain/127.0.0.1:37667
[junit4:junit4]   2> 1750 T18 oaz.ClientCnxn$SendThread.primeConnection Socket connection established to localhost.localdomain/127.0.0.1:37667, initiating session
[junit4:junit4]   2> 1750 T14 oazs.NIOServerCnxn$Factory.run Accepted socket connection from /127.0.0.1:48156
[junit4:junit4]   2> 1751 T14 oazs.NIOServerCnxn.readConnectRequest Client attempting to establish new session at /127.0.0.1:48156
[junit4:junit4]   2> 1755 T16 oazsp.FileTxnLog.append Creating new log file: log.1
[junit4:junit4]   2> 1768 T16 oazs.NIOServerCnxn.finishSessionInit Established session 0x13a965f62290000 with negotiated timeout 10000 for client /127.0.0.1:48156
[junit4:junit4]   2> 1768 T18 oaz.ClientCnxn$SendThread.readConnectResult Session establishment complete on server localhost.localdomain/127.0.0.1:37667, sessionid = 0x13a965f62290000, negotiated timeout = 10000
[junit4:junit4]   2> 1771 T19 oascc.ConnectionManager.process Watcher org.apache.solr.common.cloud.ConnectionManager@90a1f5a name:ZooKeeperConnection Watcher:127.0.0.1:37667 got event WatchedEvent state:SyncConnected type:None path:null path:null type:None
[junit4:junit4]   2> 1771 T12 oascc.ConnectionManager.waitForConnected Client is connected to ZooKeeper
[junit4:junit4]   2> 1773 T12 oascc.SolrZkClient.makePath makePath: /solr
[junit4:junit4]   2> 1799 T17 oazs.PrepRequestProcessor.pRequest Processed session termination for sessionid: 0x13a965f62290000
[junit4:junit4]   2> 1800 T19 oaz.ClientCnxn$EventThread.run EventThread shut down
[junit4:junit4]   2> 1800 T12 oaz.ZooKeeper.close Session: 0x13a965f62290000 closed
[junit4:junit4]   2> 1801 T12 oaz.ZooKeeper.<init> Initiating client connection, connectString=127.0.0.1:37667/solr sessionTimeout=10000 watcher=org.apache.solr.common.cloud.ConnectionManager@2e47eb19
[junit4:junit4]   2> 1801 T14 oazs.NIOServerCnxn.closeSock Closed socket connection for client /127.0.0.1:48156 which had sessionid 0x13a965f62290000
[junit4:junit4]   2> 1803 T20 oaz.ClientCnxn$SendThread.startConnect Opening socket connection to server /127.0.0.1:37667
[junit4:junit4]   2> 1803 T12 oascc.ConnectionManager.waitForConnected Waiting for client to connect to ZooKeeper
[junit4:junit4]   2> 1804 T20 oaz.ClientCnxn$SendThread.primeConnection Socket connection established to localhost.localdomain/127.0.0.1:37667, initiating session
[junit4:junit4]   2> 1804 T14 oazs.NIOServerCnxn$Factory.run Accepted socket connection from /127.0.0.1:48157
[junit4:junit4]   2> 1805 T14 oazs.NIOServerCnxn.readConnectRequest Client attempting to establish new session at /127.0.0.1:48157
[junit4:junit4]   2> 1806 T16 oazs.NIOServerCnxn.finishSessionInit Established session 0x13a965f62290001 with negotiated timeout 10000 for client /127.0.0.1:48157
[junit4:junit4]   2> 1806 T20 oaz.ClientCnxn$SendThread.readConnectResult Session establishment complete on server localhost.localdomain/127.0.0.1:37667, sessionid = 0x13a965f62290001, negotiated timeout = 10000
[junit4:junit4]   2> 1807 T21 oascc.ConnectionManager.process Watcher org.apache.solr.common.cloud.ConnectionManager@2e47eb19 name:ZooKeeperConnection Watcher:127.0.0.1:37667/solr got event WatchedEvent state:SyncConnected type:None path:null path:null type:None
[junit4:junit4]   2> 1808 T12 oascc.ConnectionManager.waitForConnected Client is connected to ZooKeeper
[junit4:junit4]   2> 1814 T12 oascc.SolrZkClient.makePath makePath: /collections/collection1
[junit4:junit4]   2> 1819 T12 oascc.SolrZkClient.makePath makePath: /collections/collection1/shards
[junit4:junit4]   2> 1823 T12 oascc.SolrZkClient.makePath makePath: /collections/control_collection
[junit4:junit4]   2> 1826 T12 oascc.SolrZkClient.makePath makePath: /collections/control_collection/shards
[junit4:junit4]   2> 1829 T12 oasc.AbstractZkTestCase.putConfig put /mnt/ssd/jenkins/workspace/Lucene-Solr-trunk-Linux/solr/build/solr-core/test-files/solr/collection1/conf/solrconfig.xml to /configs/conf1/solrconfig.xml
[junit4:junit4]   2> 1851 T12 oascc.SolrZkClient.makePath makePath: /configs/conf1/solrconfig.xml
[junit4:junit4]   2> 1857 T12 oasc.AbstractZkTestCase.putConfig put /mnt/ssd/jenkins/workspace/Lucene-Solr-trunk-Linux/solr/build/solr-core/test-files/solr/collection1/conf/schema.xml to /configs/conf1/schema.xml
[junit4:junit4]   2> 1860 T12 oascc.SolrZkClient.makePath makePath: /configs/conf1/schema.xml
[junit4:junit4]   2> 1864 T12 oasc.AbstractZkTestCase.putConfig put /mnt/ssd/jenkins/workspace/Lucene-Solr-trunk-Linux/solr/build/solr-core/test-files/solr/collection1/conf/solrconfig.xml to /configs/conf1/solrconfig.xml
[junit4:junit4]   2> 1865 T12 oascc.SolrZkClient.makePath makePath: /configs/conf1/solrconfig.xml
[junit4:junit4]   2> 1871 T12 oasc.AbstractZkTestCase.putConfig put /mnt/ssd/jenkins/workspace/Lucene-Solr-trunk-Linux/solr/build/solr-core/test-files/solr/collection1/conf/stopwords.txt to /configs/conf1/stopwords.txt
[junit4:junit4]   2> 1872 T12 oascc.SolrZkClient.makePath makePath: /configs/conf1/stopwords.txt
[junit4:junit4]   2> 1875 T12 oasc.AbstractZkTestCase.putConfig put /mnt/ssd/jenkins/workspace/Lucene-Solr-trunk-Linux/solr/build/solr-core/test-files/solr/collection1/conf/protwords.txt to /configs/conf1/protwords.txt
[junit4:junit4]   2> 1876 T12 oascc.SolrZkClient.makePath makePath: /configs/conf1/protwords.txt
[junit4:junit4]   2> 1879 T12 oasc.AbstractZkTestCase.putConfig put /mnt/ssd/jenkins/workspace/Lucene-Solr-trunk-Linux/solr/build/solr-core/test-files/solr/collection1/conf/currency.xml to /configs/conf1/currency.xml
[junit4:junit4]   2> 1880 T12 oascc.SolrZkClient.makePath makePath: /configs/conf1/currency.xml
[junit4:junit4]   2> 1883 T12 oasc.AbstractZkTestCase.putConfig put /mnt/ssd/jenkins/workspace/Lucene-Solr-trunk-Linux/solr/build/solr-core/test-files/solr/collection1/conf/open-exchange-rates.json to /configs/conf1/open-exchange-rates.json
[junit4:junit4]   2> 1884 T12 oascc.SolrZkClient.makePath makePath: /configs/conf1/open-exchange-rates.json
[junit4:junit4]   2> 1887 T12 oasc.AbstractZkTestCase.putConfig put /mnt/ssd/jenkins/workspace/Lucene-Solr-trunk-Linux/solr/build/solr-core/test-files/solr/collection1/conf/mapping-ISOLatin1Accent.txt to /configs/conf1/mapping-ISOLatin1Accent.txt
[junit4:junit4]   2> 1888 T12 oascc.SolrZkClient.makePath makePath: /configs/conf1/mapping-ISOLatin1Accent.txt
[junit4:junit4]   2> 1893 T12 oasc.AbstractZkTestCase.putConfig put /mnt/ssd/jenkins/workspace/Lucene-Solr-trunk-Linux/solr/build/solr-core/test-files/solr/collection1/conf/old_synonyms.txt to /configs/conf1/old_synonyms.txt
[junit4:junit4]   2> 1894 T12 oascc.SolrZkClient.makePath makePath: /configs/conf1/old_synonyms.txt
[junit4:junit4]   2> 1897 T12 oasc.AbstractZkTestCase.putConfig put /mnt/ssd/jenkins/workspace/Lucene-Solr-trunk-Linux/solr/build/solr-core/test-files/solr/collection1/conf/synonyms.txt to /configs/conf1/synonyms.txt
[junit4:junit4]   2> 1898 T12 oascc.SolrZkClient.makePath makePath: /configs/conf1/synonyms.txt
[junit4:junit4]   2> 1903 T17 oazs.PrepRequestProcessor.pRequest Processed session termination for sessionid: 0x13a965f62290001
[junit4:junit4]   2> 1906 T14 oazs.NIOServerCnxn.closeSock Closed socket connection for client /127.0.0.1:48157 which had sessionid 0x13a965f62290001
[junit4:junit4]   2> 1906 T21 oaz.ClientCnxn$EventThread.run EventThread shut down
[junit4:junit4]   2> 1906 T12 oaz.ZooKeeper.close Session: 0x13a965f62290001 closed
[junit4:junit4]   2> 2131 T12 oejs.Server.doStart jetty-8.1.2.v20120308
[junit4:junit4]   2> 2256 T12 oejs.AbstractConnector.doStart Started SelectChannelConnector@0.0.0.0:41058
[junit4:junit4]   2> 2317 T12 oasc.SolrResourceLoader.locateSolrHome JNDI not configured for solr (NoInitialContextEx)
[junit4:junit4]   2> 2318 T12 oasc.SolrResourceLoader.locateSolrHome using system property solr.solr.home: /mnt/ssd/jenkins/workspace/Lucene-Solr-trunk-Linux/solr/build/solr-core/test/J1/./org.apache.solr.cloud.SyncSliceTest-controljetty-1351142566061
[junit4:junit4]   2> 2319 T12 oasc.SolrResourceLoader.<init> new SolrResourceLoader for deduced Solr Home: '/mnt/ssd/jenkins/workspace/Lucene-Solr-trunk-Linux/solr/build/solr-core/test/J1/./org.apache.solr.cloud.SyncSliceTest-controljetty-1351142566061/'
[junit4:junit4]   2> 2510 T12 oass.SolrDispatchFilter.init SolrDispatchFilter.init()
[junit4:junit4]   2> 2511 T12 oasc.SolrResourceLoader.locateSolrHome JNDI not configured for solr (NoInitialContextEx)
[junit4:junit4]   2> 2512 T12 oasc.SolrResourceLoader.locateSolrHome using system property solr.solr.home: /mnt/ssd/jenkins/workspace/Lucene-Solr-trunk-Linux/solr/build/solr-core/test/J1/./org.apache.solr.cloud.SyncSliceTest-controljetty-1351142566061
[junit4:junit4]   2> 2522 T12 oasc.CoreContainer$Initializer.initialize looking for solr.xml: /mnt/ssd/jenkins/workspace/Lucene-Solr-trunk-Linux/solr/build/solr-core/test/J1/./org.apache.solr.cloud.SyncSliceTest-controljetty-1351142566061/solr.xml
[junit4:junit4]   2> 2524 T12 oasc.CoreContainer.<init> New CoreContainer 138828459
[junit4:junit4]   2> 2525 T12 oasc.CoreContainer.load Loading CoreContainer using Solr Home: '/mnt/ssd/jenkins/workspace/Lucene-Solr-trunk-Linux/solr/build/solr-core/test/J1/./org.apache.solr.cloud.SyncSliceTest-controljetty-1351142566061/'
[junit4:junit4]   2> 2525 T12 oasc.SolrResourceLoader.<init> new SolrResourceLoader for directory: '/mnt/ssd/jenkins/workspace/Lucene-Solr-trunk-Linux/solr/build/solr-core/test/J1/./org.apache.solr.cloud.SyncSliceTest-controljetty-1351142566061/'
[junit4:junit4]   2> 2576 T12 oasc.CoreContainer.load Registering Log Listener
[junit4:junit4]   2> 2592 T12 oasc.CoreContainer.initZooKeeper Zookeeper client=127.0.0.1:37667/solr
[junit4:junit4]   2> 2608 T12 oaz.ZooKeeper.<init> Initiating client connection, connectString=127.0.0.1:37667/solr sessionTimeout=5000 watcher=org.apache.solr.common.cloud.ConnectionManager@6c5645b
[junit4:junit4]   2> 2610 T32 oaz.ClientCnxn$SendThread.startConnect Opening socket connection to server /127.0.0.1:37667
[junit4:junit4]   2> 2610 T12 oascc.ConnectionManager.waitForConnected Waiting for client to connect to ZooKeeper
[junit4:junit4]   2> 2611 T14 oazs.NIOServerCnxn$Factory.run Accepted socket connection from /127.0.0.1:48158
[junit4:junit4]   2> 2612 T32 oaz.ClientCnxn$SendThread.primeConnection Socket connection established to localhost.localdomain/127.0.0.1:37667, initiating session
[junit4:junit4]   2> 2612 T14 oazs.NIOServerCnxn.readConnectRequest Client attempting to establish new session at /127.0.0.1:48158
[junit4:junit4]   2> 2615 T16 oazs.NIOServerCnxn.finishSessionInit Established session 0x13a965f62290002 with negotiated timeout 5000 for client /127.0.0.1:48158
[junit4:junit4]   2> 2615 T32 oaz.ClientCnxn$SendThread.readConnectResult Session establishment complete on server localhost.localdomain/127.0.0.1:37667, sessionid = 0x13a965f62290002, negotiated timeout = 5000
[junit4:junit4]   2> 2616 T33 oascc.ConnectionManager.process Watcher org.apache.solr.common.cloud.ConnectionManager@6c5645b name:ZooKeeperConnection Watcher:127.0.0.1:37667/solr got event WatchedEvent state:SyncConnected type:None path:null path:null type:None
[junit4:junit4]   2> 2616 T12 oascc.ConnectionManager.waitForConnected Client is connected to ZooKeeper
[junit4:junit4]   2> 2623 T17 oazs.PrepRequestProcessor.pRequest Got user-level KeeperException when processing sessionid:0x13a965f62290002 type:create cxid:0x2 zxid:0xfffffffffffffffe txntype:unknown reqpath:n/a Error Path:/solr/overseer Error:KeeperErrorCode = NodeExists for /solr/overseer
[junit4:junit4]   2> 2627 T12 oascc.SolrZkClient.makePath makePath: /live_nodes
[junit4:junit4]   2> 2629 T12 oasc.ZkController.createEphemeralLiveNode Register node as live in ZooKeeper:/live_nodes/127.0.0.1:41058_solr
[junit4:junit4]   2> 2631 T17 oazs.PrepRequestProcessor.pRequest Got user-level KeeperException when processing sessionid:0x13a965f62290002 type:delete cxid:0x7 zxid:0xfffffffffffffffe txntype:unknown reqpath:n/a Error Path:/solr/live_nodes/127.0.0.1:41058_solr Error:KeeperErrorCode = NoNode for /solr/live_nodes/127.0.0.1:41058_solr
[junit4:junit4]   2> 2632 T12 oascc.SolrZkClient.makePath makePath: /live_nodes/127.0.0.1:41058_solr
[junit4:junit4]   2> 2638 T12 oashc.HttpShardHandlerFactory.getParameter Setting socketTimeout to: 0
[junit4:junit4]   2> 2639 T12 oashc.HttpShardHandlerFactory.getParameter Setting urlScheme to: http://
[junit4:junit4]   2> 2639 T12 oashc.HttpShardHandlerFactory.getParameter Setting connTimeout to: 0
[junit4:junit4]   2> 2640 T12 oashc.HttpShardHandlerFactory.getParameter Setting maxConnectionsPerHost to: 20
[junit4:junit4]   2> 2640 T12 oashc.HttpShardHandlerFactory.getParameter Setting corePoolSize to: 0
[junit4:junit4]   2> 2641 T12 oashc.HttpShardHandlerFactory.getParameter Setting maximumPoolSize to: 2147483647
[junit4:junit4]   2> 2641 T12 oashc.HttpShardHandlerFactory.getParameter Setting maxThreadIdleTime to: 5
[junit4:junit4]   2> 2641 T12 oashc.HttpShardHandlerFactory.getParameter Setting sizeOfQueue to: -1
[junit4:junit4]   2> 2642 T12 oashc.HttpShardHandlerFactory.getParameter Setting fairnessPolicy to: false
[junit4:junit4]   2> 2654 T12 oascsi.HttpClientUtil.createClient Creating new http client, config:maxConnectionsPerHost=20&maxConnections=10000&socketTimeout=0&connTimeout=0&retry=false
[junit4:junit4]   2> 2957 T12 oascc.SolrZkClient.makePath makePath: /overseer_elect/election
[junit4:junit4]   2> 2970 T17 oazs.PrepRequestProcessor.pRequest Got user-level KeeperException when processing sessionid:0x13a965f62290002 type:delete cxid:0x15 zxid:0xfffffffffffffffe txntype:unknown reqpath:n/a Error Path:/solr/overseer_elect/leader Error:KeeperErrorCode = NoNode for /solr/overseer_elect/leader
[junit4:junit4]   2> 2971 T12 oascc.SolrZkClient.makePath makePath: /overseer_elect/leader
[junit4:junit4]   2> 2975 T12 oasc.Overseer.start Overseer (id=88548479100059650-127.0.0.1:41058_solr-n_0000000000) starting
[junit4:junit4]   2> 2976 T17 oazs.PrepRequestProcessor.pRequest Got user-level KeeperException when processing sessionid:0x13a965f62290002 type:create cxid:0x1a zxid:0xfffffffffffffffe txntype:unknown reqpath:n/a Error Path:/solr/overseer Error:KeeperErrorCode = NodeExists for /solr/overseer
[junit4:junit4]   2> 2982 T17 oazs.PrepRequestProcessor.pRequest Got user-level KeeperException when processing sessionid:0x13a965f62290002 type:create cxid:0x1b zxid:0xfffffffffffffffe txntype:unknown reqpath:n/a Error Path:/solr/overseer Error:KeeperErrorCode = NodeExists for /solr/overseer
[junit4:junit4]   2> 2985 T17 oazs.PrepRequestProcessor.pRequest Got user-level KeeperException when processing sessionid:0x13a965f62290002 type:create cxid:0x1c zxid:0xfffffffffffffffe txntype:unknown reqpath:n/a Error Path:/solr/overseer Error:KeeperErrorCode = NodeExists for /solr/overseer
[junit4:junit4]   2> 2990 T17 oazs.PrepRequestProcessor.pRequest Got user-level KeeperException when processing sessionid:0x13a965f62290002 type:create cxid:0x1d zxid:0xfffffffffffffffe txntype:unknown reqpath:n/a Error Path:/solr/overseer Error:KeeperErrorCode = NodeExists for /solr/overseer
[junit4:junit4]   2> 2993 T12 oascc.SolrZkClient.makePath makePath: /clusterstate.json
[junit4:junit4]   2> 2994 T35 oasc.OverseerCollectionProcessor.run Process current queue of collection creations
[junit4:junit4]   2> 3021 T12 oascc.ZkStateReader.createClusterStateWatchersAndUpdate Updating cluster state from ZooKeeper... 
[junit4:junit4]   2> 3034 T34 oasc.Overseer$ClusterStateUpdater.run Starting to work on the main queue
[junit4:junit4]   2> 3069 T12 oasc.CoreContainer.create Creating SolrCore 'collection1' using instanceDir: /mnt/ssd/jenkins/workspace/Lucene-Solr-trunk-Linux/solr/build/solr-core/test/J1/./org.apache.solr.cloud.SyncSliceTest-controljetty-1351142566061/collection1
[junit4:junit4]   2> 3070 T12 oasc.ZkController.createCollectionZkNode Check for collection zkNode:control_collection
[junit4:junit4]   2> 3071 T12 oasc.ZkController.createCollectionZkNode Collection zkNode exists
[junit4:junit4]   2> 3072 T12 oasc.ZkController.readConfigName Load collection config from:/collections/control_collection
[junit4:junit4]   2> 3074 T12 oasc.SolrResourceLoader.<init> new SolrResourceLoader for directory: '/mnt/ssd/jenkins/workspace/Lucene-Solr-trunk-Linux/solr/build/solr-core/test/J1/./org.apache.solr.cloud.SyncSliceTest-controljetty-1351142566061/collection1/'
[junit4:junit4]   2> 3075 T12 oasc.SolrResourceLoader.replaceClassLoader Adding 'file:/mnt/ssd/jenkins/workspace/Lucene-Solr-trunk-Linux/solr/build/solr-core/test/J1/org.apache.solr.cloud.SyncSliceTest-controljetty-1351142566061/collection1/lib/README' to classloader
[junit4:junit4]   2> 3076 T12 oasc.SolrResourceLoader.replaceClassLoader Adding 'file:/mnt/ssd/jenkins/workspace/Lucene-Solr-trunk-Linux/solr/build/solr-core/test/J1/org.apache.solr.cloud.SyncSliceTest-controljetty-1351142566061/collection1/lib/classes/' to classloader
[junit4:junit4]   2> 3204 T12 oasc.SolrConfig.<init> Using Lucene MatchVersion: LUCENE_50
[junit4:junit4]   2> 3383 T12 oasc.SolrConfig.<init> Loaded SolrConfig: solrconfig.xml
[junit4:junit4]   2> 3392 T12 oass.IndexSchema.readSchema Reading Solr Schema
[junit4:junit4]   2> 3449 T12 oass.IndexSchema.readSchema Schema name=test
[junit4:junit4]   2> 4239 T12 oass.OpenExchangeRatesOrgProvider.init Initialized with rates=open-exchange-rates.json, refreshInterval=1440.
[junit4:junit4]   2> 4253 T12 oass.IndexSchema.readSchema default search field in schema is text
[junit4:junit4]   2> 4257 T12 oass.IndexSchema.readSchema unique key field: id
[junit4:junit4]   2> 4378 T12 oass.FileExchangeRateProvider.reload Reloading exchange rates from file currency.xml
[junit4:junit4]   2> 4387 T12 oass.FileExchangeRateProvider.reload Reloading exchange rates from file currency.xml
[junit4:junit4]   2> 4394 T12 oass.OpenExchangeRatesOrgProvider.reload Reloading exchange rates from open-exchange-rates.json
[junit4:junit4]   2> 4399 T12 oass.OpenExchangeRatesOrgProvider.reload Reloading exchange rates from open-exchange-rates.json
[junit4:junit4]   2> 4428 T12 oasc.SolrCore.<init> [collection1] Opening new SolrCore at /mnt/ssd/jenkins/workspace/Lucene-Solr-trunk-Linux/solr/build/solr-core/test/J1/./org.apache.solr.cloud.SyncSliceTest-controljetty-1351142566061/collection1/, dataDir=./org.apache.solr.cloud.SyncSliceTest-1351142564264/control/data/
[junit4:junit4]   2> 4431 T12 oasc.JmxMonitoredMap.<init> JMX monitoring is enabled. Adding Solr mbeans to JMX Server: com.sun.jmx.mbeanserver.JmxMBeanServer@7b7597b6
[junit4:junit4]   2> 4490 T12 oasc.SolrCore.getNewIndexDir New index directory detected: old=null new=./org.apache.solr.cloud.SyncSliceTest-1351142564264/control/data/index/
[junit4:junit4]   2> 4490 T12 oasc.SolrCore.initIndex WARNING [collection1] Solr index directory './org.apache.solr.cloud.SyncSliceTest-1351142564264/control/data/index' doesn't exist. Creating new index...
[junit4:junit4]   2> 4521 T12 oasc.CachingDirectoryFactory.get return new directory for /mnt/ssd/jenkins/workspace/Lucene-Solr-trunk-Linux/solr/build/solr-core/test/J1/./org.apache.solr.cloud.SyncSliceTest-1351142564264/control/data/index forceNew:false
[junit4:junit4]   2> 4709 T12 oasc.SolrDeletionPolicy.onCommit SolrDeletionPolicy.onCommit: commits:num=1
[junit4:junit4]   2> 		commit{dir=/mnt/ssd/jenkins/workspace/Lucene-Solr-trunk-Linux/solr/build/solr-core/test/J1/org.apache.solr.cloud.SyncSliceTest-1351142564264/control/data/index,segFN=segments_1,generation=1,filenames=[segments_1]
[junit4:junit4]   2> 4709 T12 oasc.SolrDeletionPolicy.updateCommits newest commit = 1
[junit4:junit4]   2> 4718 T12 oasc.SolrCore.initWriters created xml: solr.XMLResponseWriter
[junit4:junit4]   2> 4992 T12 oasup.UpdateRequestProcessorChain.init inserting DistributedUpdateProcessorFactory into updateRequestProcessorChain "dedupe"
[junit4:junit4]   2> 4993 T12 oasup.UpdateRequestProcessorChain.init inserting DistributedUpdateProcessorFactory into updateRequestProcessorChain "dedupe-allfields"
[junit4:junit4]   2> 4994 T12 oasup.UpdateRequestProcessorChain.init inserting DistributedUpdateProcessorFactory into updateRequestProcessorChain "stored_sig"
[junit4:junit4]   2> 4997 T12 oasup.UpdateRequestProcessorChain.init inserting DistributedUpdateProcessorFactory into updateRequestProcessorChain "uniq-fields"
[junit4:junit4]   2> 5020 T12 oasup.UpdateRequestProcessorChain.init inserting DistributedUpdateProcessorFactory into updateRequestProcessorChain "distrib-dup-test-chain-implicit"
[junit4:junit4]   2> 5025 T12 oasc.RequestHandlers.initHandlersFromConfig adding lazy requestHandler: solr.ReplicationHandler
[junit4:junit4]   2> 5028 T12 oasc.RequestHandlers.initHandlersFromConfig created /replication: solr.ReplicationHandler
[junit4:junit4]   2> 5039 T12 oasc.RequestHandlers.initHandlersFromConfig created standard: solr.StandardRequestHandler
[junit4:junit4]   2> 5051 T12 oasc.RequestHandlers.initHandlersFromConfig created /get: solr.RealTimeGetHandler
[junit4:junit4]   2> 5072 T12 oasc.RequestHandlers.initHandlersFromConfig created dismax: solr.SearchHandler
[junit4:junit4]   2> 5086 T12 oasc.RequestHandlers.initHandlersFromConfig created mock: org.apache.solr.core.MockQuerySenderListenerReqHandler
[junit4:junit4]   2> 5088 T12 oasc.RequestHandlers.initHandlersFromConfig created /admin/: org.apache.solr.handler.admin.AdminHandlers
[junit4:junit4]   2> 5090 T12 oasc.RequestHandlers.initHandlersFromConfig created defaults: solr.StandardRequestHandler
[junit4:junit4]   2> 5090 T12 oasc.RequestHandlers.initHandlersFromConfig adding lazy requestHandler: solr.StandardRequestHandler
[junit4:junit4]   2> 5091 T12 oasc.RequestHandlers.initHandlersFromConfig created lazy: solr.StandardRequestHandler
[junit4:junit4]   2> 5100 T12 oasc.RequestHandlers.initHandlersFromConfig created /update: solr.UpdateRequestHandler
[junit4:junit4]   2> 5101 T12 oasc.RequestHandlers.initHandlersFromConfig created /terms: org.apache.solr.handler.component.SearchHandler
[junit4:junit4]   2> 5102 T12 oasc.RequestHandlers.initHandlersFromConfig created spellCheckCompRH: org.apache.solr.handler.component.SearchHandler
[junit4:junit4]   2> 5104 T12 oasc.RequestHandlers.initHandlersFromConfig created spellCheckCompRH_Direct: org.apache.solr.handler.component.SearchHandler
[junit4:junit4]   2> 5105 T12 oasc.RequestHandlers.initHandlersFromConfig created spellCheckWithWordbreak: org.apache.solr.handler.component.SearchHandler
[junit4:junit4]   2> 5106 T12 oasc.RequestHandlers.initHandlersFromConfig created spellCheckWithWordbreak_Direct: org.apache.solr.handler.component.SearchHandler
[junit4:junit4]   2> 5107 T12 oasc.RequestHandlers.initHandlersFromConfig created spellCheckCompRH1: org.apache.solr.handler.component.SearchHandler
[junit4:junit4]   2> 5108 T12 oasc.RequestHandlers.initHandlersFromConfig created tvrh: org.apache.solr.handler.component.SearchHandler
[junit4:junit4]   2> 5115 T12 oasc.RequestHandlers.initHandlersFromConfig created /mlt: solr.MoreLikeThisHandler
[junit4:junit4]   2> 5122 T12 oasc.RequestHandlers.initHandlersFromConfig created /debug/dump: solr.DumpRequestHandler
[junit4:junit4]   2> 5168 T12 oashl.XMLLoader.init xsltCacheLifetimeSeconds=60
[junit4:junit4]   2> 5178 T12 oasc.SolrCore.initDeprecatedSupport WARNING solrconfig.xml uses deprecated <admin/gettableFiles>, Please update your config to use the ShowFileRequestHandler.
[junit4:junit4]   2> 5182 T12 oasc.SolrCore.initDeprecatedSupport WARNING adding ShowFileRequestHandler with hidden files: [STOPWORDS.TXT, PROTWORDS.TXT, CURRENCY.XML, OLD_SYNONYMS.TXT, SCHEMA.XML, SYNONYMS.TXT, MAPPING-ISOLATIN1ACCENT.TXT, OPEN-EXCHANGE-RATES.JSON]
[junit4:junit4]   2> 5205 T12 oass.SolrIndexSearcher.<init> Opening Searcher@40f00a98 main
[junit4:junit4]   2> 5241 T12 oasu.CommitTracker.<init> Hard AutoCommit: disabled
[junit4:junit4]   2> 5242 T12 oasu.CommitTracker.<init> Soft AutoCommit: disabled
[junit4:junit4]   2> 5243 T12 oashc.SpellCheckComponent.inform Initializing spell checkers
[junit4:junit4]   2> 5347 T12 oass.DirectSolrSpellChecker.init init: {name=direct,classname=DirectSolrSpellChecker,field=lowerfilt,minQueryLength=3}
[junit4:junit4]   2> 5449 T36 oasc.SolrCore.registerSearcher [collection1] Registered new searcher Searcher@40f00a98 main{StandardDirectoryReader(segments_1:1)}
[junit4:junit4]   2> 5455 T12 oasc.ZkController.publish numShards not found on descriptor - reading it from system property
[junit4:junit4]   2> 5456 T17 oazs.PrepRequestProcessor.pRequest Got user-level KeeperException when processing sessionid:0x13a965f62290002 type:create cxid:0x5c zxid:0xfffffffffffffffe txntype:unknown reqpath:n/a Error Path:/solr/overseer/queue Error:KeeperErrorCode = NoNode for /solr/overseer/queue
[junit4:junit4]   2> 5459 T12 oasc.CoreContainer.register registering core: collection1
[junit4:junit4]   2> 5460 T12 oasc.ZkController.register Register shard - core:collection1 address:http://127.0.0.1:41058/solr shardId:control_shard
[junit4:junit4]   2> 5465 T12 oascsi.HttpClientUtil.createClient Creating new http client, config:maxConnections=10000&maxConnectionsPerHost=20&connTimeout=30000&socketTimeout=30000&retry=false
[junit4:junit4]   2> 5477 T12 oascc.SolrZkClient.makePath makePath: /collections/control_collection/leader_elect/control_shard/election
[junit4:junit4]   2> 5484 T17 oazs.PrepRequestProcessor.pRequest Got user-level KeeperException when processing sessionid:0x13a965f62290002 type:delete cxid:0x6b zxid:0xfffffffffffffffe txntype:unknown reqpath:n/a Error Path:/solr/collections/control_collection/leaders Error:KeeperErrorCode = NoNode for /solr/collections/control_collection/leaders
[junit4:junit4]   2> 5485 T12 oasc.ShardLeaderElectionContext.runLeaderProcess Running the leader process.
[junit4:junit4]   2> 5486 T17 oazs.PrepRequestProcessor.pRequest Got user-level KeeperException when processing sessionid:0x13a965f62290002 type:create cxid:0x6c zxid:0xfffffffffffffffe txntype:unknown reqpath:n/a Error Path:/solr/overseer Error:KeeperErrorCode = NodeExists for /solr/overseer
[junit4:junit4]   2> 5562 T34 oascc.ZkStateReader.updateClusterState Updating cloud state from ZooKeeper... 
[junit4:junit4]   2> 5563 T34 oasc.Overseer$ClusterStateUpdater.updateState Update state numShards=null message={
[junit4:junit4]   2> 	  "state":"down",
[junit4:junit4]   2> 	  "core":"collection1",
[junit4:junit4]   2> 	  "roles":null,
[junit4:junit4]   2> 	  "shard":"control_shard",
[junit4:junit4]   2> 	  "base_url":"http://127.0.0.1:41058/solr",
[junit4:junit4]   2> 	  "operation":"state",
[junit4:junit4]   2> 	  "numShards":null,
[junit4:junit4]   2> 	  "node_name":"127.0.0.1:41058_solr",
[junit4:junit4]   2> 	  "collection":"control_collection"}
[junit4:junit4]   2> 5567 T17 oazs.PrepRequestProcessor.pRequest Got user-level KeeperException when processing sessionid:0x13a965f62290002 type:create cxid:0x73 zxid:0xfffffffffffffffe txntype:unknown reqpath:n/a Error Path:/solr/overseer/queue-work Error:KeeperErrorCode = NoNode for /solr/overseer/queue-work
[junit4:junit4]   2> 5578 T33 oascc.ZkStateReader$2.process A cluster state change has occurred - updating... (1)
[junit4:junit4]   2> 5989 T12 oasc.ShardLeaderElectionContext.waitForReplicasToComeUp Enough replicas found to continue.
[junit4:junit4]   2> 5989 T12 oasc.ShardLeaderElectionContext.runLeaderProcess I may be the new leader - try and sync
[junit4:junit4]   2> 5990 T12 oasc.SyncStrategy.sync Sync replicas to http://127.0.0.1:41058/solr/collection1/
[junit4:junit4]   2> 5990 T12 oasc.SyncStrategy.syncReplicas Sync Success - now sync replicas to me
[junit4:junit4]   2> 5991 T12 oasc.SyncStrategy.syncToMe http://127.0.0.1:41058/solr/collection1/ has no replicas
[junit4:junit4]   2> 5991 T12 oasc.ShardLeaderElectionContext.runLeaderProcess I am the new leader: http://127.0.0.1:41058/solr/collection1/
[junit4:junit4]   2> 5992 T12 oascc.SolrZkClient.makePath makePath: /collections/control_collection/leaders/control_shard
[junit4:junit4]   2> 5996 T17 oazs.PrepRequestProcessor.pRequest Got user-level KeeperException when processing sessionid:0x13a965f62290002 type:create cxid:0x91 zxid:0xfffffffffffffffe txntype:unknown reqpath:n/a Error Path:/solr/overseer Error:KeeperErrorCode = NodeExists for /solr/overseer
[junit4:junit4]   2> 6085 T34 oascc.ZkStateReader.updateClusterState Updating cloud state from ZooKeeper... 
[junit4:junit4]   2> 6182 T33 oascc.ZkStateReader$2.process A cluster state change has occurred - updating... (1)
[junit4:junit4]   2> 6198 T12 oasc.ZkController.register We are http://127.0.0.1:41058/solr/collection1/ and leader is http://127.0.0.1:41058/solr/collection1/
[junit4:junit4]   2> 6201 T12 oasc.ZkController.register No LogReplay needed for core=collection1 baseURL=http://127.0.0.1:41058/solr
[junit4:junit4]   2> 6201 T12 oasc.ZkController.checkRecovery I am the leader, no recovery necessary
[junit4:junit4]   2> 6202 T12 oasc.ZkController.publish numShards not found on descriptor - reading it from system property
[junit4:junit4]   2> 6204 T12 oascc.ZkStateReader.updateClusterState Updating cloud state from ZooKeeper... 
[junit4:junit4]   2> 6206 T12 oass.SolrDispatchFilter.init user.dir=/mnt/ssd/jenkins/workspace/Lucene-Solr-trunk-Linux/solr/build/solr-core/test/J1
[junit4:junit4]   2> 6207 T12 oass.SolrDispatchFilter.init SolrDispatchFilter.init() done
[junit4:junit4]   2> 6236 T12 oascsi.HttpClientUtil.createClient Creating new http client, config:maxConnections=128&maxConnectionsPerHost=32&followRedirects=false
[junit4:junit4]   2> 6306 T12 oejs.Server.doStart jetty-8.1.2.v20120308
[junit4:junit4]   2> 6310 T12 oejs.AbstractConnector.doStart Started SelectChannelConnector@0.0.0.0:39397
[junit4:junit4]   2> 6311 T12 oasc.SolrResourceLoader.locateSolrHome JNDI not configured for solr (NoInitialContextEx)
[junit4:junit4]   2> 6311 T12 oasc.SolrResourceLoader.locateSolrHome using system property solr.solr.home: /mnt/ssd/jenkins/workspace/Lucene-Solr-trunk-Linux/solr/build/solr-core/test/J1/./org.apache.solr.cloud.SyncSliceTest-jetty1-1351142570399
[junit4:junit4]   2> 6312 T12 oasc.SolrResourceLoader.<init> new SolrResourceLoader for deduced Solr Home: '/mnt/ssd/jenkins/workspace/Lucene-Solr-trunk-Linux/solr/build/solr-core/test/J1/./org.apache.solr.cloud.SyncSliceTest-jetty1-1351142570399/'
[junit4:junit4]   2> 6329 T12 oass.SolrDispatchFilter.init SolrDispatchFilter.init()
[junit4:junit4]   2> 6330 T12 oasc.SolrResourceLoader.locateSolrHome JNDI not configured for solr (NoInitialContextEx)
[junit4:junit4]   2> 6331 T12 oasc.SolrResourceLoader.locateSolrHome using system property solr.solr.home: /mnt/ssd/jenkins/workspace/Lucene-Solr-trunk-Linux/solr/build/solr-core/test/J1/./org.apache.solr.cloud.SyncSliceTest-jetty1-1351142570399
[junit4:junit4]   2> 6331 T12 oasc.CoreContainer$Initializer.initialize looking for solr.xml: /mnt/ssd/jenkins/workspace/Lucene-Solr-trunk-Linux/solr/build/solr-core/test/J1/./org.apache.solr.cloud.SyncSliceTest-jetty1-1351142570399/solr.xml
[junit4:junit4]   2> 6332 T12 oasc.CoreContainer.<init> New CoreContainer 1553477431
[junit4:junit4]   2> 6339 T12 oasc.CoreContainer.load Loading CoreContainer using Solr Home: '/mnt/ssd/jenkins/workspace/Lucene-Solr-trunk-Linux/solr/build/solr-core/test/J1/./org.apache.solr.cloud.SyncSliceTest-jetty1-1351142570399/'
[junit4:junit4]   2> 6342 T12 oasc.SolrResourceLoader.<init> new SolrResourceLoader for directory: '/mnt/ssd/jenkins/workspace/Lucene-Solr-trunk-Linux/solr/build/solr-core/test/J1/./org.apache.solr.cloud.SyncSliceTest-jetty1-1351142570399/'
[junit4:junit4]   2> 6368 T12 oasc.CoreContainer.load Registering Log Listener
[junit4:junit4]   2> 6382 T12 oasc.CoreContainer.initZooKeeper Zookeeper client=127.0.0.1:37667/solr
[junit4:junit4]   2> 6383 T12 oaz.ZooKeeper.<init> Initiating client connection, connectString=127.0.0.1:37667/solr sessionTimeout=5000 watcher=org.apache.solr.common.cloud.ConnectionManager@457105b0
[junit4:junit4]   2> 6385 T46 oaz.ClientCnxn$SendThread.startConnect Opening socket connection to server /127.0.0.1:37667
[junit4:junit4]   2> 6385 T12 oascc.ConnectionManager.waitForConnected Waiting for client to connect to ZooKeeper
[junit4:junit4]   2> 6395 T14 oazs.NIOServerCnxn$Factory.run Accepted socket connection from /127.0.0.1:48160
[junit4:junit4]   2> 6396 T46 oaz.ClientCnxn$SendThread.primeConnection Socket connection established to localhost.localdomain/127.0.0.1:37667, initiating session
[junit4:junit4]   2> 6397 T14 oazs.NIOServerCnxn.readConnectRequest Client attempting to establish new session at /127.0.0.1:48160
[junit4:junit4]   2> 6399 T16 oazs.NIOServerCnxn.finishSessionInit Established session 0x13a965f62290003 with negotiated timeout 5000 for client /127.0.0.1:48160
[junit4:junit4]   2> 6399 T46 oaz.ClientCnxn$SendThread.readConnectResult Session establishment complete on server localhost.localdomain/127.0.0.1:37667, sessionid = 0x13a965f62290003, negotiated timeout = 5000
[junit4:junit4]   2> 6400 T47 oascc.ConnectionManager.process Watcher org.apache.solr.common.cloud.ConnectionManager@457105b0 name:ZooKeeperConnection Watcher:127.0.0.1:37667/solr got event WatchedEvent state:SyncConnected type:None path:null path:null type:None
[junit4:junit4]   2> 6400 T12 oascc.ConnectionManager.waitForConnected Client is connected to ZooKeeper
[junit4:junit4]   2> 6401 T17 oazs.PrepRequestProcessor.pRequest Got user-level KeeperException when processing sessionid:0x13a965f62290003 type:create cxid:0x1 zxid:0xfffffffffffffffe txntype:unknown reqpath:n/a Error Path:/solr/overseer Error:KeeperErrorCode = NodeExists for /solr/overseer
[junit4:junit4]   2> 6404 T17 oazs.PrepRequestProcessor.pRequest Got user-level KeeperException when processing sessionid:0x13a965f62290003 type:create cxid:0x2 zxid:0xfffffffffffffffe txntype:unknown reqpath:n/a Error Path:/solr/overseer Error:KeeperErrorCode = NodeExists for /solr/overseer
[junit4:junit4]   2> 6405 T12 oasc.ZkController.createEphemeralLiveNode Register node as live in ZooKeeper:/live_nodes/127.0.0.1:39397_solr
[junit4:junit4]   2> 6406 T17 oazs.PrepRequestProcessor.pRequest Got user-level KeeperException when processing sessionid:0x13a965f62290003 type:delete cxid:0x4 zxid:0xfffffffffffffffe txntype:unknown reqpath:n/a Error Path:/solr/live_nodes/127.0.0.1:39397_solr Error:KeeperErrorCode = NoNode for /solr/live_nodes/127.0.0.1:39397_solr
[junit4:junit4]   2> 6407 T12 oascc.SolrZkClient.makePath makePath: /live_nodes/127.0.0.1:39397_solr
[junit4:junit4]   2> 6409 T33 oascc.ZkStateReader$3.process Updating live nodes... (2)
[junit4:junit4]   2> 6410 T12 oashc.HttpShardHandlerFactory.getParameter Setting socketTimeout to: 0
[junit4:junit4]   2> 6410 T12 oashc.HttpShardHandlerFactory.getParameter Setting urlScheme to: http://
[junit4:junit4]   2> 6411 T12 oashc.HttpShardHandlerFactory.getParameter Setting connTimeout to: 0
[junit4:junit4]   2> 6411 T12 oashc.HttpShardHandlerFactory.getParameter Setting maxConnectionsPerHost to: 20
[junit4:junit4]   2> 6412 T12 oashc.HttpShardHandlerFactory.getParameter Setting corePoolSize to: 0
[junit4:junit4]   2> 6413 T12 oashc.HttpShardHandlerFactory.getParameter Setting maximumPoolSize to: 2147483647
[junit4:junit4]   2> 6413 T12 oashc.HttpShardHandlerFactory.getParameter Setting maxThreadIdleTime to: 5
[junit4:junit4]   2> 6414 T12 oashc.HttpShardHandlerFactory.getParameter Setting sizeOfQueue to: -1
[junit4:junit4]   2> 6414 T12 oashc.HttpShardHandlerFactory.getParameter Setting fairnessPolicy to: false
[junit4:junit4]   2> 6415 T12 oascsi.HttpClientUtil.createClient Creating new http client, config:maxConnectionsPerHost=20&maxConnections=10000&socketTimeout=0&connTimeout=0&retry=false
[junit4:junit4]   2> 6426 T12 oascc.ZkStateReader.createClusterStateWatchersAndUpdate Updating cluster state from ZooKeeper... 
[junit4:junit4]   2> 6433 T12 oasc.CoreContainer.create Creating SolrCore 'collection1' using instanceDir: /mnt/ssd/jenkins/workspace/Lucene-Solr-trunk-Linux/solr/build/solr-core/test/J1/./org.apache.solr.cloud.SyncSliceTest-jetty1-1351142570399/collection1
[junit4:junit4]   2> 6433 T12 oasc.ZkController.createCollectionZkNode Check for collection zkNode:collection1
[junit4:junit4]   2> 6434 T12 oasc.ZkController.createCollectionZkNode Collection zkNode exists
[junit4:junit4]   2> 6435 T12 oasc.ZkController.readConfigName Load collection config from:/collections/collection1
[junit4:junit4]   2> 6436 T12 oasc.SolrResourceLoader.<init> new SolrResourceLoader for directory: '/mnt/ssd/jenkins/workspace/Lucene-Solr-trunk-Linux/solr/build/solr-core/test/J1/./org.apache.solr.cloud.SyncSliceTest-jetty1-1351142570399/collection1/'
[junit4:junit4]   2> 6437 T12 oasc.SolrResourceLoader.replaceClassLoader Adding 'file:/mnt/ssd/jenkins/workspace/Lucene-Solr-trunk-Linux/solr/build/solr-core/test/J1/org.apache.solr.cloud.SyncSliceTest-jetty1-1351142570399/collection1/lib/README' to classloader
[junit4:junit4]   2> 6437 T12 oasc.SolrResourceLoader.replaceClassLoader Adding 'file:/mnt/ssd/jenkins/workspace/Lucene-Solr-trunk-Linux/solr/build/solr-core/test/J1/org.apache.solr.cloud.SyncSliceTest-jetty1-1351142570399/collection1/lib/classes/' to classloader
[junit4:junit4]   2> 6491 T12 oasc.SolrConfig.<init> Using Lucene MatchVersion: LUCENE_50
[junit4:junit4]   2> 6565 T12 oasc.SolrConfig.<init> Loaded SolrConfig: solrconfig.xml
[junit4:junit4]   2> 6567 T12 oass.IndexSchema.readSchema Reading Solr Schema
[junit4:junit4]   2> 6589 T12 oass.IndexSchema.readSchema Schema name=test
[junit4:junit4]   2> 6695 T34 oascc.ZkStateReader.updateClusterState Updating cloud state from ZooKeeper... 
[junit4:junit4]   2> 6698 T34 oasc.Overseer$ClusterStateUpdater.updateState Update state numShards=null message={
[junit4:junit4]   2> 	  "state":"active",
[junit4:junit4]   2> 	  "core":"collection1",
[junit4:junit4]   2> 	  "roles":null,
[junit4:junit4]   2> 	  "shard":"control_shard",
[junit4:junit4]   2> 	  "base_url":"http://127.0.0.1:41058/solr",
[junit4:junit4]   2> 	  "operation":"state",
[junit4:junit4]   2> 	  "numShards":null,
[junit4:junit4]   2> 	  "node_name":"127.0.0.1:41058_solr",
[junit4:junit4]   2> 	  "collection":"control_collection"}
[junit4:junit4]   2> 6702 T33 oascc.ZkStateReader$2.process A cluster state change has occurred - updating... (2)
[junit4:junit4]   2> 6703 T47 oascc.ZkStateReader$2.process A cluster state change has occurred - updating... (2)
[junit4:junit4]   2> 7012 T12 oass.OpenExchangeRatesOrgProvider.init Initialized with rates=open-exchange-rates.json, refreshInterval=1440.
[junit4:junit4]   2> 7023 T12 oass.IndexSchema.readSchema default search field in schema is text
[junit4:junit4]   2> 7027 T12 oass.IndexSchema.readSchema unique key field: id
[junit4:junit4]   2> 7048 T12 oass.FileExchangeRateProvider.reload Reloading exchange rates from file currency.xml
[junit4:junit4]   2> 7053 T12 oass.FileExchangeRateProvider.reload Reloading exchange rates from file currency.xml
[junit4:junit4]   2> 7057 T12 oass.OpenExchangeRatesOrgProvider.reload Reloading exchange rates from open-exchange-rates.json
[junit4:junit4]   2> 7059 T12 oass.OpenExchangeRatesOrgProvider.reload Reloading exchange rates from open-exchange-rates.json
[junit4:junit4]   2> 7061 T12 oasc.SolrCore.<init> [collection1] Opening new SolrCore at /mnt/ssd/jenkins/workspace/Lucene-Solr-trunk-Linux/solr/build/solr-core/test/J1/./org.apache.solr.cloud.SyncSliceTest-jetty1-1351142570399/collection1/, dataDir=./org.apache.solr.cloud.SyncSliceTest-1351142564264/jetty1/
[junit4:junit4]   2> 7062 T12 oasc.JmxMonitoredMap.<init> JMX monitoring is enabled. Adding Solr mbeans to JMX Server: com.sun.jmx.mbeanserver.JmxMBeanServer@7b7597b6
[junit4:junit4]   2> 7063 T12 oasc.SolrCore.getNewIndexDir New index directory detected: old=null new=./org.apache.solr.cloud.SyncSliceTest-1351142564264/jetty1/index/
[junit4:junit4]   2> 7063 T12 oasc.SolrCore.initIndex WARNING [collection1] Solr index directory './org.apache.solr.cloud.SyncSliceTest-1351142564264/jetty1/index' doesn't exist. Creating new index...
[junit4:junit4]   2> 7064 T12 oasc.CachingDirectoryFactory.get return new directory for /mnt/ssd/jenkins/workspace/Lucene-Solr-trunk-Linux/solr/build/solr-core/test/J1/./org.apache.solr.cloud.SyncSliceTest-1351142564264/jetty1/index forceNew:false
[junit4:junit4]   2> 7076 T12 oasc.SolrDeletionPolicy.onCommit SolrDeletionPolicy.onCommit: commits:num=1
[junit4:junit4]   2> 		commit{dir=/mnt/ssd/jenkins/workspace/Lucene-Solr-trunk-Linux/solr/build/solr-core/test/J1/org.apache.solr.cloud.SyncSliceTest-1351142564264/jetty1/index,segFN=segments_1,generation=1,filenames=[segments_1]
[junit4:junit4]   2> 7077 T12 oasc.SolrDeletionPolicy.updateCommits newest commit = 1
[junit4:junit4]   2> 7078 T12 oasc.SolrCore.initWriters created xml: solr.XMLResponseWriter
[junit4:junit4]   2> 7081 T12 oasup.UpdateRequestProcessorChain.init inserting DistributedUpdateProcessorFactory into updateRequestProcessorChain "dedupe"
[junit4:junit4]   2> 7082 T12 oasup.UpdateRequestProcessorChain.init inserting DistributedUpdateProcessorFactory into updateRequestProcessorChain "dedupe-allfields"
[junit4:junit4]   2> 7083 T12 oasup.UpdateRequestProcessorChain.init inserting DistributedUpdateProcessorFactory into updateRequestProcessorChain "stored_sig"
[junit4:junit4]   2> 7083 T12 oasup.UpdateRequestProcessorChain.init inserting DistributedUpdateProcessorFactory into updateRequestProcessorChain "uniq-fields"
[junit4:junit4]   2> 7084 T12 oasup.UpdateRequestProcessorChain.init inserting DistributedUpdateProcessorFactory into updateRequestProcessorChain "distrib-dup-test-chain-implicit"
[junit4:junit4]   2> 7085 T12 oasc.RequestHandlers.initHandlersFromConfig adding lazy requestHandler: solr.ReplicationHandler
[junit4:junit4]   2> 7085 T12 oasc.RequestHandlers.initHandlersFromConfig created /replication: solr.ReplicationHandler
[junit4:junit4]   2> 7086 T12 oasc.RequestHandlers.initHandlersFromConfig created standard: solr.StandardRequestHandler
[junit4:junit4]   2> 7087 T12 oasc.RequestHandlers.initHandlersFromConfig created /get: solr.RealTimeGetHandler
[junit4:junit4]   2> 7087 T12 oasc.RequestHandlers.initHandlersFromConfig created dismax: solr.SearchHandler
[junit4:junit4]   2> 7088 T12 oasc.RequestHandlers.initHandlersFromConfig created mock: org.apache.solr.core.MockQuerySenderListenerReqHandler
[junit4:junit4]   2> 7089 T12 oasc.RequestHandlers.initHandlersFromConfig created /admin/: org.apache.solr.handler.admin.AdminHandlers
[junit4:junit4]   2> 7090 T12 oasc.RequestHandlers.initHandlersFromConfig created defaults: solr.StandardRequestHandler
[junit4:junit4]   2> 7090 T12 oasc.RequestHandlers.initHandlersFromConfig adding lazy requestHandler: solr.StandardRequestHandler
[junit4:junit4]   2> 7091 T12 oasc.RequestHandlers.initHandlersFromConfig created lazy: solr.StandardRequestHandler
[junit4:junit4]   2> 7092 T12 oasc.RequestHandlers.initHandlersFromConfig created /update: solr.UpdateRequestHandler
[junit4:junit4]   2> 7092 T12 oasc.RequestHandlers.initHandlersFromConfig created /terms: org.apache.solr.handler.component.SearchHandler
[junit4:junit4]   2> 7094 T12 oasc.RequestHandlers.initHandlersFromConfig created spellCheckCompRH: org.apache.solr.handler.component.SearchHandler
[junit4:junit4]   2> 7095 T12 oasc.RequestHandlers.initHandlersFromConfig created spellCheckCompRH_Direct: org.apache.solr.handler.component.SearchHandler
[junit4:junit4]   2> 7096 T12 oasc.RequestHandlers.initHandlersFromConfig created spellCheckWithWordbreak: org.apache.solr.handler.component.SearchHandler
[junit4:junit4]   2> 7097 T12 oasc.RequestHandlers.initHandlersFromConfig created spellCheckWithWordbreak_Direct: org.apache.solr.handler.component.SearchHandler
[junit4:junit4]   2> 7098 T12 oasc.RequestHandlers.initHandlersFromConfig created spellCheckCompRH1: org.apache.solr.handler.component.SearchHandler
[junit4:junit4]   2> 7100 T12 oasc.RequestHandlers.initHandlersFromConfig created tvrh: org.apache.solr.handler.component.SearchHandler
[junit4:junit4]   2> 7101 T12 oasc.RequestHandlers.initHandlersFromConfig created /mlt: solr.MoreLikeThisHandler
[junit4:junit4]   2> 7102 T12 oasc.RequestHandlers.initHandlersFromConfig created /debug/dump: solr.DumpRequestHandler
[junit4:junit4]   2> 7106 T12 oashl.XMLLoader.init xsltCacheLifetimeSeconds=60
[junit4:junit4]   2> 7109 T12 oasc.SolrCore.initDeprecatedSupport WARNING solrconfig.xml uses deprecated <admin/gettableFiles>, Please update your config to use the ShowFileRequestHandler.
[junit4:junit4]   2> 7113 T12 oasc.SolrCore.initDeprecatedSupport WARNING adding ShowFileRequestHandler with hidden files: [STOPWORDS.TXT, PROTWORDS.TXT, CURRENCY.XML, OLD_SYNONYMS.TXT, SCHEMA.XML, SYNONYMS.TXT, MAPPING-ISOLATIN1ACCENT.TXT, OPEN-EXCHANGE-RATES.JSON]
[junit4:junit4]   2> 7118 T12 oass.SolrIndexSearcher.<init> Opening Searcher@669f809d main
[junit4:junit4]   2> 7119 T12 oasu.CommitTracker.<init> Hard AutoCommit: disabled
[junit4:junit4]   2> 7120 T12 oasu.CommitTracker.<init> Soft AutoCommit: disabled
[junit4:junit4]   2> 7121 T12 oashc.SpellCheckComponent.inform Initializing spell checkers
[junit4:junit4]   2> 7127 T12 oass.DirectSolrSpellChecker.init init: {name=direct,classname=DirectSolrSpellChecker,field=lowerfilt,minQueryLength=3}
[junit4:junit4]   2> 7158 T48 oasc.SolrCore.registerSearcher [collection1] Registered new searcher Searcher@669f809d main{StandardDirectoryReader(segments_1:1)}
[junit4:junit4]   2> 7166 T12 oasc.ZkController.publish numShards not found on descriptor - reading it from system property
[junit4:junit4]   2> 7210 T34 oascc.ZkStateReader.updateClusterState Updating cloud state from ZooKeeper... 
[junit4:junit4]   2> 7212 T34 oasc.Overseer$ClusterStateUpdater.updateState Update state numShards=1 message={
[junit4:junit4]   2> 	  "state":"down",
[junit4:junit4]   2> 	  "core":"collection1",
[junit4:junit4]   2> 	  "roles":null,
[junit4:junit4]   2> 	  "shard":null,
[junit4:junit4]   2> 	  "base_url":"http://127.0.0.1:39397/solr",
[junit4:junit4]   2> 	  "operation":"state",
[junit4:junit4]   2> 	  "numShards":"1",
[junit4:junit4]   2> 	  "node_name":"127.0.0.1:39397_solr",
[junit4:junit4]   2> 	  "collection":"collection1"}
[junit4:junit4]   2> 7212 T34 oasc.Overseer$ClusterStateUpdater.createCollection Create collection collection1 with numShards 1
[junit4:junit4]   2> 7221 T47 oascc.ZkStateReader$2.process A cluster state change has occurred - updating... (2)
[junit4:junit4]   2> 7221 T33 oascc.ZkStateReader$2.process A cluster state change has occurred - updating... (2)
[junit4:junit4]   2> 7669 T12 oasc.CoreContainer.register registering core: collection1
[junit4:junit4]   2> 7670 T12 oasc.ZkController.register Register shard - core:collection1 address:http://127.0.0.1:39397/solr shardId:shard1
[junit4:junit4]   2> 7671 T12 oascc.SolrZkClient.makePath makePath: /collections/collection1/leader_elect/shard1/election
[junit4:junit4]   2> 7676 T17 oazs.PrepRequestProcessor.pRequest Got user-level KeeperException when processing sessionid:0x13a965f62290003 type:delete cxid:0x43 zxid:0xfffffffffffffffe txntype:unknown reqpath:n/a Error Path:/solr/collections/collection1/leaders Error:KeeperErrorCode = NoNode for /solr/collections/collection1/leaders
[junit4:junit4]   2> 7677 T12 oasc.ShardLeaderElectionContext.runLeaderProcess Running the leader process.
[junit4:junit4]   2> 7678 T17 oazs.PrepRequestProcessor.pRequest Got user-level KeeperException when processing sessionid:0x13a965f62290003 type:create cxid:0x44 zxid:0xfffffffffffffffe txntype:unknown reqpath:n/a Error Path:/solr/overseer Error:KeeperErrorCode = NodeExists for /solr/overseer
[junit4:junit4]   2> 7680 T12 oasc.ShardLeaderElectionContext.waitForReplicasToComeUp Enough replicas found to continue.
[junit4:junit4]   2> 7681 T12 oasc.ShardLeaderElectionContext.runLeaderProcess I may be the new leader - try and sync
[junit4:junit4]   2> 7681 T12 oasc.SyncStrategy.sync Sync replicas to http://127.0.0.1:39397/solr/collection1/
[junit4:junit4]   2> 7682 T12 oasc.SyncStrategy.syncReplicas Sync Success - now sync replicas to me
[junit4:junit4]   2> 7682 T12 oasc.SyncStrategy.syncToMe http://127.0.0.1:39397/solr/collection1/ has no replicas
[junit4:junit4]   2> 7683 T12 oasc.ShardLeaderElectionContext.runLeaderProcess I am the new leader: http://127.0.0.1:39397/solr/collection1/
[junit4:junit4]   2> 7683 T12 oascc.SolrZkClient.makePath makePath: /collections/collection1/leaders/shard1
[junit4:junit4]   2> 7725 T17 oazs.PrepRequestProcessor.pRequest Got user-level KeeperException when processing sessionid:0x13a965f62290003 type:create cxid:0x4e zxid:0xfffffffffffffffe txntype:unknown reqpath:n/a Error Path:/solr/overseer Error:KeeperErrorCode = NodeExists for /solr/overseer
[junit4:junit4]   2> 7745 T34 oascc.ZkStateReader.updateClusterState Updating cloud state from ZooKeeper... 
[junit4:junit4]   2> 7790 T33 oascc.ZkStateReader$2.process A cluster state change has occurred - updating... (2)
[junit4:junit4]   2> 7790 T47 oascc.ZkStateReader$2.process A cluster state change has occurred - updating... (2)
[junit4:junit4]   2> 7815 T12 oasc.ZkController.register We are http://127.0.0.1:39397/solr/collection1/ and leader is http://127.0.0.1:39397/solr/collection1/
[junit4:junit4]   2> 7816 T12 oasc.ZkController.register No LogReplay needed for core=collection1 baseURL=http://127.0.0.1:39397/solr
[junit4:junit4]   2> 7816 T12 oasc.ZkController.checkRecovery I am the leader, no recovery necessary
[junit4:junit4]   2> 7817 T12 oasc.ZkController.publish numShards not found on descriptor - reading it from system property
[junit4:junit4]   2> 7818 T12 oascc.ZkStateReader.updateClusterState Updating cloud state from ZooKeeper... 
[junit4:junit4]   2> 7819 T12 oass.SolrDispatchFilter.init user.dir=/mnt/ssd/jenkins/workspace/Lucene-Solr-trunk-Linux/solr/build/solr-core/test/J1
[junit4:junit4]   2> 7820 T12 oass.SolrDispatchFilter.init SolrDispatchFilter.init() done
[junit4:junit4]   2> 7820 T12 oascsi.HttpClientUtil.createClient Creating new http client, config:maxConnections=128&maxConnectionsPerHost=32&followRedirects=false
[junit4:junit4]   2> 7885 T12 oejs.Server.doStart jetty-8.1.2.v20120308
[junit4:junit4]   2> 7888 T12 oejs.AbstractConnector.doStart Started SelectChannelConnector@0.0.0.0:53058
[junit4:junit4]   2> 7890 T12 oasc.SolrResourceLoader.locateSolrHome JNDI not configured for solr (NoInitialContextEx)
[junit4:junit4]   2> 7890 T12 oasc.SolrResourceLoader.locateSolrHome using system property solr.solr.home: /mnt/ssd/jenkins/workspace/Lucene-Solr-trunk-Linux/solr/build/solr-core/test/J1/./org.apache.solr.cloud.SyncSliceTest-jetty2-1351142571980
[junit4:junit4]   2> 7891 T12 oasc.SolrResourceLoader.<init> new SolrResourceLoader for deduced Solr Home: '/mnt/ssd/jenkins/workspace/Lucene-Solr-trunk-Linux/solr/build/solr-core/test/J1/./org.apache.solr.cloud.SyncSliceTest-jetty2-1351142571980/'
[junit4:junit4]   2> 7905 T12 oass.SolrDispatchFilter.init SolrDispatchFilter.init()
[junit4:junit4]   2> 7906 T12 oasc.SolrResourceLoader.locateSolrHome JNDI not configured for solr (NoInitialContextEx)
[junit4:junit4]   2> 7906 T12 oasc.SolrResourceLoader.locateSolrHome using system property solr.solr.home: /mnt/ssd/jenkins/workspace/Lucene-Solr-trunk-Linux/solr/build/solr-core/test/J1/./org.apache.solr.cloud.SyncSliceTest-jetty2-1351142571980
[junit4:junit4]   2> 7907 T12 oasc.CoreContainer$Initializer.initialize looking for solr.xml: /mnt/ssd/jenkins/workspace/Lucene-Solr-trunk-Linux/solr/build/solr-core/test/J1/./org.apache.solr.cloud.SyncSliceTest-jetty2-1351142571980/solr.xml
[junit4:junit4]   2> 7907 T12 oasc.CoreContainer.<init> New CoreContainer 1743751271
[junit4:junit4]   2> 7908 T12 oasc.CoreContainer.load Loading CoreContainer using Solr Home: '/mnt/ssd/jenkins/workspace/Lucene-Solr-trunk-Linux/solr/build/solr-core/test/J1/./org.apache.solr.cloud.SyncSliceTest-jetty2-1351142571980/'
[junit4:junit4]   2> 7908 T12 oasc.SolrResourceLoader.<init> new SolrResourceLoader for directory: '/mnt/ssd/jenkins/workspace/Lucene-Solr-trunk-Linux/solr/build/solr-core/test/J1/./org.apache.solr.cloud.SyncSliceTest-jetty2-1351142571980/'
[junit4:junit4]   2> 7928 T12 oasc.CoreContainer.load Registering Log Listener
[junit4:junit4]   2> 7937 T12 oasc.CoreContainer.initZooKeeper Zookeeper client=127.0.0.1:37667/solr
[junit4:junit4]   2> 7938 T12 oaz.ZooKeeper.<init> Initiating client connection, connectString=127.0.0.1:37667/solr sessionTimeout=5000 watcher=org.apache.solr.common.cloud.ConnectionManager@5092a298
[junit4:junit4]   2> 7939 T58 oaz.ClientCnxn$SendThread.startConnect Opening socket connection to server /127.0.0.1:37667
[junit4:junit4]   2> 7939 T12 oascc.ConnectionManager.waitForConnected Waiting for client to connect to ZooKeeper
[junit4:junit4]   2> 7940 T58 oaz.ClientCnxn$SendThread.primeConnection Socket connection established to localhost.localdomain/127.0.0.1:37667, initiating session
[junit4:junit4]   2> 7940 T14 oazs.NIOServerCnxn$Factory.run Accepted socket connection from /127.0.0.1:48161
[junit4:junit4]   2> 7941 T14 oazs.NIOServerCnxn.readConnectRequest Client attempting to establish new session at /127.0.0.1:48161
[junit4:junit4]   2> 7943 T16 oazs.NIOServerCnxn.finishSessionInit Established session 0x13a965f62290004 with negotiated timeout 5000 for client /127.0.0.1:48161
[junit4:junit4]   2> 7943 T58 oaz.ClientCnxn$SendThread.readConnectResult Session establishment complete on server localhost.localdomain/127.0.0.1:37667, sessionid = 0x13a965f62290004, negotiated timeout = 5000
[junit4:junit4]   2> 7944 T59 oascc.ConnectionManager.process Watcher org.apache.solr.common.cloud.ConnectionManager@5092a298 name:ZooKeeperConnection Watcher:127.0.0.1:37667/solr got event WatchedEvent state:SyncConnected type:None path:null path:null type:None
[junit4:junit4]   2> 7946 T12 oascc.ConnectionManager.waitForConnected Client is connected to ZooKeeper
[junit4:junit4]   2> 7952 T17 oazs.PrepRequestProcessor.pRequest Got user-level KeeperException when processing sessionid:0x13a965f62290004 type:create cxid:0x1 zxid:0xfffffffffffffffe txntype:unknown reqpath:n/a Error Path:/solr/overseer Error:KeeperErrorCode = NodeExists for /solr/overseer
[junit4:junit4]   2> 7955 T17 oazs.PrepRequestProcessor.pRequest Got user-level KeeperException when processing sessionid:0x13a965f62290004 type:create cxid:0x2 zxid:0xfffffffffffffffe txntype:unknown reqpath:n/a Error Path:/solr/overseer Error:KeeperErrorCode = NodeExists for /solr/overseer
[junit4:junit4]   2> 7959 T12 oasc.ZkController.createEphemeralLiveNode Register node as live in ZooKeeper:/live_nodes/127.0.0.1:53058_solr
[junit4:junit4]   2> 7960 T17 oazs.PrepRequestProcessor.pRequest Got user-level KeeperException when processing sessionid:0x13a965f62290004 type:delete cxid:0x4 zxid:0xfffffffffffffffe txntype:unknown reqpath:n/a Error Path:/solr/live_nodes/127.0.0.1:53058_solr Error:KeeperErrorCode = NoNode for /solr/live_nodes/127.0.0.1:53058_solr
[junit4:junit4]   2> 7961 T12 oascc.SolrZkClient.makePath makePath: /live_nodes/127.0.0.1:53058_solr
[junit4:junit4]   2> 7964 T33 oascc.ZkStateReader$3.process Updating live nodes... (3)
[junit4:junit4]   2> 7965 T12 oashc.HttpShardHandlerFactory.getParameter Setting socketTimeout to: 0
[junit4:junit4]   2> 7965 T12 oashc.HttpShardHandlerFactory.getParameter Setting urlScheme to: http://
[junit4:junit4]   2> 7965 T12 oashc.HttpShardHandlerFactory.getParameter Setting connTimeout to: 0
[junit4:junit4]   2> 7966 T12 oashc.HttpShardHandlerFactory.getParameter Setting maxConnectionsPerHost to: 20
[junit4:junit4]   2> 7966 T12 oashc.HttpShardHandlerFactory.getParameter Setting corePoolSize to: 0
[junit4:junit4]   2> 7966 T12 oashc.HttpShardHandlerFactory.getParameter Setting maximumPoolSize to: 2147483647
[junit4:junit4]   2> 7967 T12 oashc.HttpShardHandlerFactory.getParameter Setting maxThreadIdleTime to: 5
[junit4:junit4]   2> 7967 T12 oashc.HttpShardHandlerFactory.getParameter Setting sizeOfQueue to: -1
[junit4:junit4]   2> 7968 T47 oascc.ZkStateReader$3.process Updating live nodes... (3)
[junit4:junit4]   2> 7968 T12 oashc.HttpShardHandlerFactory.getParameter Setting fairnessPolicy to: false
[junit4:junit4]   2> 7969 T12 oascsi.HttpClientUtil.createClient Creating new http client, config:maxConnectionsPerHost=20&maxConnections=10000&socketTimeout=0&connTimeout=0&retry=false
[junit4:junit4]   2> 7976 T12 oascc.ZkStateReader.createClusterStateWatchersAndUpdate Updating cluster state from ZooKeeper... 
[junit4:junit4]   2> 7981 T12 oasc.CoreContainer.create Creating SolrCore 'collection1' using instanceDir: /mnt/ssd/jenkins/workspace/Lucene-Solr-trunk-Linux/solr/build/solr-core/test/J1/./org.apache.solr.cloud.SyncSliceTest-jetty2-1351142571980/collection1
[junit4:junit4]   2> 7981 T12 oasc.ZkController.createCollectionZkNode Check for collection zkNode:collection1
[junit4:junit4]   2> 7982 T12 oasc.ZkController.createCollectionZkNode Collection zkNode exists
[junit4:junit4]   2> 7983 T12 oasc.ZkController.readConfigName Load collection config from:/collections/collection1
[junit4:junit4]   2> 7985 T12 oasc.SolrResourceLoader.<init> new SolrResourceLoader for directory: '/mnt/ssd/jenkins/workspace/Lucene-Solr-trunk-Linux/solr/build/solr-core/test/J1/./org.apache.solr.cloud.SyncSliceTest-jetty2-1351142571980/collection1/'
[junit4:junit4]   2> 7986 T12 oasc.SolrResourceLoader.replaceClassLoader Adding 'file:/mnt/ssd/jenkins/workspace/Lucene-Solr-trunk-Linux/solr/build/solr-core/test/J1/org.apache.solr.cloud.SyncSliceTest-jetty2-1351142571980/collection1/lib/README' to classloader
[junit4:junit4]   2> 7987 T12 oasc.SolrResourceLoader.replaceClassLoader Adding 'file:/mnt/ssd/jenkins/workspace/Lucene-Solr-trunk-Linux/solr/build/solr-core/test/J1/org.apache.solr.cloud.SyncSliceTest-jetty2-1351142571980/collection1/lib/classes/' to classloader
[junit4:junit4]   2> 8037 T12 oasc.SolrConfig.<init> Using Lucene MatchVersion: LUCENE_50
[junit4:junit4]   2> 8098 T12 oasc.SolrConfig.<init> Loaded SolrConfig: solrconfig.xml
[junit4:junit4]   2> 8100 T12 oass.IndexSchema.readSchema Reading Solr Schema
[junit4:junit4]   2> 8121 T12 oass.IndexSchema.readSchema Schema name=test
[junit4:junit4]   2> 8294 T34 oascc.ZkStateReader.updateClusterState Updating cloud state from ZooKeeper... 
[junit4:junit4]   2> 8295 T34 oasc.Overseer$ClusterStateUpdater.updateState Update state numShards=1 message={
[junit4:junit4]   2> 	  "state":"active",
[junit4:junit4]   2> 	  "core":"collection1",
[junit4:junit4]   2> 	  "roles":null,
[junit4:junit4]   2> 	  "shard":"shard1",
[junit4:junit4]   2> 	  "base_url":"http://127.0.0.1:39397/solr",
[junit4:junit4]   2> 	  "operation":"state",
[junit4:junit4]   2> 	  "numShards":"1",
[junit4:junit4]   2> 	  "node_name":"127.0.0.1:39397_solr",
[junit4:junit4]   2> 	  "collection":"collection1"}
[junit4:junit4]   2> 8299 T59 oascc.ZkStateReader$2.process A cluster state change has occurred - updating... (3)
[junit4:junit4]   2> 8299 T47 oascc.ZkStateReader$2.process A cluster state change has occurred - updating... (3)
[junit4:junit4]   2> 8299 T33 oascc.ZkStateReader$2.process A cluster state change has occurred - updating... (3)
[junit4:junit4]   2> 8479 T12 oass.OpenExchangeRatesOrgProvider.init Initialized with rates=open-exchange-rates.json, refreshInterval=1440.
[junit4:junit4]   2> 8490 T12 oass.IndexSchema.readSchema default search field in schema is text
[junit4:junit4]   2> 8493 T12 oass.IndexSchema.readSchema unique key field: id
[junit4:junit4]   2> 8513 T12 oass.FileExchangeRateProvider.reload Reloading exchange rates from file currency.xml
[junit4:junit4]   2> 8518 T12 oass.FileExchangeRateProvider.reload Reloading exchange rates from file currency.xml
[junit4:junit4]   2> 8586 T12 oass.OpenExchangeRatesOrgProvider.reload Reloading exchange rates from open-exchange-rates.json
[junit4:junit4]   2> 8588 T12 oass.OpenExchangeRatesOrgProvider.reload Reloading exchange rates from open-exchange-rates.json
[junit4:junit4]   2> 8590 T12 oasc.SolrCore.<init> [collection1] Opening new SolrCore at /mnt/ssd/jenkins/workspace/Lucene-Solr-trunk-Linux/solr/build/solr-core/test/J1/./org.apache.solr.cloud.SyncSliceTest-jetty2-1351142571980/collection1/, dataDir=./org.apache.solr.cloud.SyncSliceTest-1351142564264/jetty2/
[junit4:junit4]   2> 8591 T12 oasc.JmxMonitoredMap.<init> JMX monitoring is enabled. Adding Solr mbeans to JMX Server: com.sun.jmx.mbeanserver.JmxMBeanServer@7b7597b6
[junit4:junit4]   2> 8592 T12 oasc.SolrCore.getNewIndexDir New index directory detected: old=null new=./org.apache.solr.cloud.SyncSliceTest-1351142564264/jetty2/index/
[junit4:junit4]   2> 8593 T12 oasc.SolrCore.initIndex WARNING [collection1] Solr index directory './org.apache.solr.cloud.SyncSliceTest-1351142564264/jetty2/index' doesn't exist. Creating new index...
[junit4:junit4]   2> 8593 T12 oasc.CachingDirectoryFactory.get return new directory for /mnt/ssd/jenkins/workspace/Lucene-Solr-trunk-Linux/solr/build/solr-core/test/J1/./org.apache.solr.cloud.SyncSliceTest-1351142564264/jetty2/index forceNew:false
[junit4:junit4]   2> 8598 T12 oasc.SolrDeletionPolicy.onCommit SolrDeletionPolicy.onCommit: commits:num=1
[junit4:junit4]   2> 		commit{dir=/mnt/ssd/jenkins/workspace/Lucene-Solr-trunk-Linux/solr/build/solr-core/test/J1/org.apache.solr.cloud.SyncSliceTest-1351142564264/jetty2/index,segFN=segments_1,generation=1,filenames=[segments_1]
[junit4:junit4]   2> 8599 T12 oasc.SolrDeletionPolicy.updateCommits newest commit = 1
[junit4:junit4]   2> 8600 T12 oasc.SolrCore.initWriters created xml: solr.XMLResponseWriter
[junit4:junit4]   2> 8603 T12 oasup.UpdateRequestProcessorChain.init inserting DistributedUpdateProcessorFactory into updateRequestProcessorChain "dedupe"
[junit4:junit4]   2> 8604 T12 oasup.UpdateRequestProcessorChain.init inserting DistributedUpdateProcessorFactory into updateRequestProcessorChain "dedupe-allfields"
[junit4:junit4]   2> 8604 T12 oasup.UpdateRequestProcessorChain.init inserting DistributedUpdateProcessorFactory into updateRequestProcessorChain "stored_sig"
[junit4:junit4]   2> 8605 T12 oasup.UpdateRequestProcessorChain.init inserting DistributedUpdateProcessorFactory into updateRequestProcessorChain "uniq-fields"
[junit4:junit4]   2> 8606 T12 oasup.UpdateRequestProcessorChain.init inserting DistributedUpdateProcessorFactory into updateRequestProcessorChain "distrib-dup-test-chain-implicit"
[junit4:junit4]   2> 8606 T12 oasc.RequestHandlers.initHandlersFromConfig adding lazy requestHandler: solr.ReplicationHandler
[junit4:junit4]   2> 8607 T12 oasc.RequestHandlers.initHandlersFromConfig created /replication: solr.ReplicationHandler
[junit4:junit4]   2> 8607 T12 oasc.RequestHandlers.initHandlersFromConfig created standard: solr.StandardRequestHandler
[junit4:junit4]   2> 8608 T12 oasc.RequestHandlers.initHandlersFromConfig created /get: solr.RealTimeGetHandler
[junit4:junit4]   2> 8609 T12 oasc.RequestHandlers.initHandlersFromConfig created dismax: solr.SearchHandler
[junit4:junit4]   2> 8609 T12 oasc.RequestHandlers.initHandlersFromConfig created mock: org.apache.solr.core.MockQuerySenderListenerReqHandler
[junit4:junit4]   2> 8610 T12 oasc.RequestHandlers.initHandlersFromConfig created /admin/: org.apache.solr.handler.admin.AdminHandlers
[junit4:junit4]   2> 8611 T12 oasc.RequestHandlers.initHandlersFromConfig created defaults: solr.StandardRequestHandler
[junit4:junit4]   2> 8611 T12 oasc.RequestHandlers.initHandlersFromConfig adding lazy requestHandler: solr.StandardRequestHandler
[junit4:junit4]   2> 8613 T12 oasc.RequestHandlers.initHandlersFromConfig created lazy: solr.StandardRequestHandler
[junit4:junit4]   2> 8614 T12 oasc.RequestHandlers.initHandlersFromConfig created /update: solr.UpdateRequestHandler
[junit4:junit4]   2> 8614 T12 oasc.RequestHandlers.initHandlersFromConfig created /terms: org.apache.solr.handler.component.SearchHandler
[junit4:junit4]   2> 8615 T12 oasc.RequestHandlers.initHandlersFromConfig created spellCheckCompRH: org.apache.solr.handler.component.SearchHandler
[junit4:junit4]   2> 8615 T12 oasc.RequestHandlers.initHandlersFromConfig created spellCheckCompRH_Direct: org.apache.solr.handler.component.SearchHandler
[junit4:junit4]   2> 8616 T12 oasc.RequestHandlers.initHandlersFromConfig created spellCheckWithWordbreak: org.apache.solr.handler.component.SearchHandler
[junit4:junit4]   2> 8617 T12 oasc.RequestHandlers.initHandlersFromConfig created spellCheckWithWordbreak_Direct: org.apache.solr.handler.component.SearchHandler
[junit4:junit4]   2> 8618 T12 oasc.RequestHandlers.initHandlersFromConfig created spellCheckCompRH1: org.apache.solr.handler.component.SearchHandler
[junit4:junit4]   2> 8619 T12 oasc.RequestHandlers.initHandlersFromConfig created tvrh: org.apache.solr.handler.component.SearchHandler
[junit4:junit4]   2> 8619 T12 oasc.RequestHandlers.initHandlersFromConfig created /mlt: solr.MoreLikeThisHandler
[junit4:junit4]   2> 8620 T12 oasc.RequestHandlers.initHandlersFromConfig created /debug/dump: solr.DumpRequestHandler
[junit4:junit4]   2> 8623 T12 oashl.XMLLoader.init xsltCacheLifetimeSeconds=60
[junit4:junit4]   2> 8625 T12 oasc.SolrCore.initDeprecatedSupport WARNING solrconfig.xml uses deprecated <admin/gettableFiles>, Please update your config to use the ShowFileRequestHandler.
[junit4:junit4]   2> 8626 T12 oasc.SolrCore.initDeprecatedSupport WARNING adding ShowFileRequestHandler with hidden files: [STOPWORDS.TXT, PROTWORDS.TXT, CURRENCY.XML, OLD_SYNONYMS.TXT, SCHEMA.XML, SYNONYMS.TXT, MAPPING-ISOLATIN1ACCENT.TXT, OPEN-EXCHANGE-RATES.JSON]
[junit4:junit4]   2> 8629 T12 oass.SolrIndexSearcher.<init> Opening Searcher@27a60925 main
[junit4:junit4]   2> 8630 T12 oasu.CommitTracker.<init> Hard AutoCommit: disabled
[junit4:junit4]   2> 8631 T12 oasu.CommitTracker.<init> Soft AutoCommit: disabled
[junit4:junit4]   2> 8631 T12 oashc.SpellCheckComponent.inform Initializing spell checkers
[junit4:junit4]   2> 8636 T12 oass.DirectSolrSpellChecker.init init: {name=direct,classname=DirectSolrSpellChecker,field=lowerfilt,minQueryLength=3}
[junit4:junit4]   2> 8674 T12 oasc.ZkController.publish numShards not found on descriptor - reading it from system property
[junit4:junit4]   2> 8676 T60 oasc.SolrCore.registerSearcher [collection1] Registered new searcher Searcher@27a60925 main{StandardDirectoryReader(segments_1:1)}
[junit4:junit4]   2> 8807 T34 oascc.ZkStateReader.updateClusterState Updating cloud state from ZooKeeper... 
[junit4:junit4]   2> 8808 T34 oasc.Overseer$ClusterStateUpdater.updateState Update state numShards=1 message={
[junit4:junit4]   2> 	  "state":"down",
[junit4:junit4]   2> 	  "core":"collection1",
[junit4:junit4]   2> 	  "roles":null,
[junit4:junit4]   2> 	  "shard":null,
[junit4:junit4]   2> 	  "base_url":"http://127.0.0.1:53058/solr",
[junit4:junit4]   2> 	  "operation":"state",
[junit4:junit4]   2> 	  "numShards":"1",
[junit4:junit4]   2> 	  "node_name":"127.0.0.1:53058_solr",
[junit4:junit4]   2> 	  "collection":"collection1"}
[junit4:junit4]   2> 8812 T47 oascc.ZkStateReader$2.process A cluster state change has occurred - updating... (3)
[junit4:junit4]   2> 8813 T33 oascc.ZkStateReader$2.process A cluster state change has occurred - updating... (3)
[junit4:junit4]   2> 8812 T59 oascc.ZkStateReader$2.process A cluster state change has occurred - updating... (3)
[junit4:junit4]   2> 9176 T12 oasc.CoreContainer.register registering core: collection1
[junit4:junit4]   2> 9177 T12 oasc.ZkController.register Register shard - core:collection1 address:http://127.0.0.1:53058/solr shardId:shard1
[junit4:junit4]   2> 9180 T12 oasc.ZkController.register We are http://127.0.0.1:53058/solr/collection1/ and leader is http://127.0.0.1:39397/solr/collection1/
[junit4:junit4]   2> 9180 T12 oasc.ZkController.register No LogReplay needed for core=collection1 baseURL=http://127.0.0.1:53058/solr
[junit4:junit4]   2> 9180 T12 oasc.ZkController.checkRecovery Core needs to recover:collection1
[junit4:junit4]   2> 9181 T12 oasu.DefaultSolrCoreState.doRecovery Running recovery - first canceling any ongoing recovery
[junit4:junit4]   2> 9184 T12 oascc.ZkStateReader.updateClusterState Updating cloud state from ZooKeeper... 
[junit4:junit4]   2> 9185 T12 oass.SolrDispatchFilter.init user.dir=/mnt/ssd/jenkins/workspace/Lucene-Solr-trunk-Linux/solr/build/solr-core/test/J1
[junit4:junit4]   2> ASYNC  NEW_CORE C0 name=collection1 org.apache.solr.core.SolrCore@6d3aa183 url=http://127.0.0.1:53058/solr/collection1 node=127.0.0.1:53058_solr
[junit4:junit4]   2> 9186 T61 C0 P53058 oasc.RecoveryStrategy.run Starting recovery process.  core=collection1 recoveringAfterStartup=true
[junit4:junit4]   2> 9186 T12 oass.SolrDispatchFilter.init SolrDispatchFilter.init() done
[junit4:junit4]   2> 9187 T61 C0 P53058 oasc.RecoveryStrategy.doRecovery ###### startupVersions=[]
[junit4:junit4]   2> 9188 T61 C0 P53058 oasc.ZkController.publish numShards not found on descriptor - reading it from system property
[junit4:junit4]   2> 9188 T12 oascsi.HttpClientUtil.createClient Creating new http client, config:maxConnections=128&maxConnectionsPerHost=32&followRedirects=false
[junit4:junit4]   2> 9236 T12 oejs.Server.doStart jetty-8.1.2.v20120308
[junit4:junit4]   2> 9239 T12 oejs.AbstractConnector.doStart Started SelectChannelConnector@0.0.0.0:37651
[junit4:junit4]   2> 9240 T12 oasc.SolrResourceLoader.locateSolrHome JNDI not configured for solr (NoInitialContextEx)
[junit4:junit4]   2> 9240 T12 oasc.SolrResourceLoader.locateSolrHome using system property solr.solr.home: /mnt/ssd/jenkins/workspace/Lucene-Solr-trunk-Linux/solr/build/solr-core/test/J1/./org.apache.solr.cloud.SyncSliceTest-jetty3-1351142573347
[junit4:junit4]   2> 9241 T12 oasc.SolrResourceLoader.<init> new SolrResourceLoader for deduced Solr Home: '/mnt/ssd/jenkins/workspace/Lucene-Solr-trunk-Linux/solr/build/solr-core/test/J1/./org.apache.solr.cloud.SyncSliceTest-jetty3-1351142573347/'
[junit4:junit4]   2> 9256 T12 oass.SolrDispatchFilter.init SolrDispatchFilter.init()
[junit4:junit4]   2> 9256 T12 oasc.SolrResourceLoader.locateSolrHome JNDI not configured for solr (NoInitialContextEx)
[junit4:junit4]   2> 9256 T12 oasc.SolrResourceLoader.locateSolrHome using system property solr.solr.home: /mnt/ssd/jenkins/workspace/Lucene-Solr-trunk-Linux/solr/build/solr-core/test/J1/./org.apache.solr.cloud.SyncSliceTest-jetty3-1351142573347
[junit4:junit4]   2> 9257 T12 oasc.CoreContainer$Initializer.initialize looking for solr.xml: /mnt/ssd/jenkins/workspace/Lucene-Solr-trunk-Linux/solr/build/solr-core/test/J1/./org.apache.solr.cloud.SyncSliceTest-jetty3-1351142573347/solr.xml
[junit4:junit4]   2> 9257 T12 oasc.CoreContainer.<init> New CoreContainer 1712471992
[junit4:junit4]   2> 9257 T12 oasc.CoreContainer.load Loading CoreContainer using Solr Home: '/mnt/ssd/jenkins/workspace/Lucene-Solr-trunk-Linux/solr/build/solr-core/test/J1/./org.apache.solr.cloud.SyncSliceTest-jetty3-1351142573347/'
[junit4:junit4]   2> 9258 T12 oasc.SolrResourceLoader.<init> new SolrResourceLoader for directory: '/mnt/ssd/jenkins/workspace/Lucene-Solr-trunk-Linux/solr/build/solr-core/test/J1/./org.apache.solr.cloud.SyncSliceTest-jetty3-1351142573347/'
[junit4:junit4]   2> 9277 T12 oasc.CoreContainer.load Registering Log Listener
[junit4:junit4]   2> 9287 T12 oasc.CoreContainer.initZooKeeper Zookeeper client=127.0.0.1:37667/solr
[junit4:junit4]   2> 9288 T12 oaz.ZooKeeper.<init> Initiating client connection, connectString=127.0.0.1:37667/solr sessionTimeout=5000 watcher=org.apache.solr.common.cloud.ConnectionManager@1f2966b1
[junit4:junit4]   2> 9289 T71 oaz.ClientCnxn$SendThread.startConnect Opening socket connection to server /127.0.0.1:37667
[junit4:junit4]   2> 9289 T12 oascc.ConnectionManager.waitForConnected Waiting for client to connect to ZooKeeper
[junit4:junit4]   2> 9291 T71 oaz.ClientCnxn$SendThread.primeConnection Socket connection established to localhost.localdomain/127.0.0.1:37667, initiating session
[junit4:junit4]   2> 9291 T14 oazs.NIOServerCnxn$Factory.run Accepted socket connection from /127.0.0.1:48162
[junit4:junit4]   2> 9291 T14 oazs.NIOServerCnxn.readConnectRequest Client attempting to establish new session at /127.0.0.1:48162
[junit4:junit4]   2> 9294 T61 C0 P53058 oasc.RecoveryStrategy.doRecovery Attempting to PeerSync from http://127.0.0.1:39397/solr/collection1/ core=collection1 - recoveringAfterStartup=true
[junit4:junit4]   2> 9297 T61 C0 P53058 oascsi.HttpClientUtil.createClient Creating new http client, config:maxConnectionsPerHost=20&maxConnections=10000&connTimeout=30000&socketTimeout=30000&retry=false
[junit4:junit4]   2> 9297 T16 oazs.NIOServerCnxn.finishSessionInit Established session 0x13a965f62290005 with negotiated timeout 5000 for client /127.0.0.1:48162
[junit4:junit4]   2> 9298 T71 oaz.ClientCnxn$SendThread.readConnectResult Session establishment complete on server localhost.localdomain/127.0.0.1:37667, sessionid = 0x13a965f62290005, negotiated timeout = 5000
[junit4:junit4]   2> 9299 T72 oascc.ConnectionManager.process Watcher org.apache.solr.common.cloud.ConnectionManager@1f2966b1 name:ZooKeeperConnection Watcher:127.0.0.1:37667/solr got event WatchedEvent state:SyncConnected type:None path:null path:null type:None
[junit4:junit4]   2> 9299 T12 oascc.ConnectionManager.waitForConnected Client is connected to ZooKeeper
[junit4:junit4]   2> 9300 T17 oazs.PrepRequestProcessor.pRequest Got user-level KeeperException when processing sessionid:0x13a965f62290005 type:create cxid:0x1 zxid:0xfffffffffffffffe txntype:unknown reqpath:n/a Error Path:/solr/overseer Error:KeeperErrorCode = NodeExists for /solr/overseer
[junit4:junit4]   2> 9300 T17 oazs.PrepRequestProcessor.pRequest Got user-level KeeperException when processing sessionid:0x13a965f62290005 type:create cxid:0x2 zxid:0xfffffffffffffffe txntype:unknown reqpath:n/a Error Path:/solr/overseer Error:KeeperErrorCode = NodeExists for /solr/overseer
[junit4:junit4]   2> 9302 T12 oasc.ZkController.createEphemeralLiveNode Register node as live in ZooKeeper:/live_nodes/127.0.0.1:37651_solr
[junit4:junit4]   2> 9303 T17 oazs.PrepRequestProcessor.pRequest Got user-level KeeperException when processing sessionid:0x13a965f62290005 type:delete cxid:0x4 zxid:0xfffffffffffffffe txntype:unknown reqpath:n/a Error Path:/solr/live_nodes/127.0.0.1:37651_solr Error:KeeperErrorCode = NoNode for /solr/live_nodes/127.0.0.1:37651_solr
[junit4:junit4]   2> 9304 T12 oascc.SolrZkClient.makePath makePath: /live_nodes/127.0.0.1:37651_solr
[junit4:junit4]   2> 9305 T61 C0 P53058 oasu.PeerSync.sync PeerSync: core=collection1 url=http://127.0.0.1:53058/solr START replicas=[http://127.0.0.1:39397/solr/collection1/] nUpdates=100
[junit4:junit4]   2> 9307 T47 oascc.ZkStateReader$3.process Updating live nodes... (4)
[junit4:junit4]   2> 9308 T12 oashc.HttpShardHandlerFactory.getParameter Setting socketTimeout to: 0
[junit4:junit4]   2> 9308 T59 oascc.ZkStateReader$3.process Updating live nodes... (4)
[junit4:junit4]   2> 9308 T61 C0 P53058 oasu.PeerSync.sync WARNING no frame of reference to tell of we've missed updates
[junit4:junit4]   2> 9308 T12 oashc.HttpShardHandlerFactory.getParameter Setting urlScheme to: http://
[junit4:junit4]   2> 9308 T33 oascc.ZkStateReader$3.process Updating live nodes... (4)
[junit4:junit4]   2> 9309 T12 oashc.HttpShardHandlerFactory.getParameter Setting connTimeout to: 0
[junit4:junit4]   2> 9309 T12 oashc.HttpShardHandlerFactory.getParameter Setting maxConnectionsPerHost to: 20
[junit4:junit4]   2> 9310 T12 oashc.HttpShardHandlerFactory.getParameter Setting corePoolSize to: 0
[junit4:junit4]   2> 9310 T12 oashc.HttpShardHandlerFactory.getParameter Setting maximumPoolSize to: 2147483647
[junit4:junit4]   2> 9311 T12 oashc.HttpShardHandlerFactory.getParameter Setting maxThreadIdleTime to: 5
[junit4:junit4]   2> 9311 T12 oashc.HttpShardHandlerFactory.getParameter Setting sizeOfQueue to: -1
[junit4:junit4]   2> 9312 T12 oashc.HttpShardHandlerFactory.getParameter Setting fairnessPolicy to: false
[junit4:junit4]   2> 9312 T12 oascsi.HttpClientUtil.createClient Creating new http client, config:maxConnectionsPerHost=20&maxConnections=10000&socketTimeout=0&connTimeout=0&retry=false
[junit4:junit4]   2> 9315 T61 C0 P53058 oasc.RecoveryStrategy.doRecovery PeerSync Recovery was not successful - trying replication. core=collection1
[junit4:junit4]   2> 9322 T61 C0 P53058 oasc.RecoveryStrategy.doRecovery Starting Replication Recovery. core=collection1
[junit4:junit4]   2> 9322 T61 C0 P53058 oascsi.HttpClientUtil.createClient Creating new http client, config:maxConnections=128&maxConnectionsPerHost=32&followRedirects=false
[junit4:junit4]   2> 9327 T34 oascc.ZkStateReader.updateClusterState Updating cloud state from ZooKeeper... 
[junit4:junit4]   2> 9328 T34 oasc.Overseer$ClusterStateUpdater.updateState Update state numShards=1 message={
[junit4:junit4]   2> 	  "state":"recovering",
[junit4:junit4]   2> 	  "core":"collection1",
[junit4:junit4]   2> 	  "roles":null,
[junit4:junit4]   2> 	  "shard":"shard1",
[junit4:junit4]   2> 	  "base_url":"http://127.0.0.1:53058/solr",
[junit4:junit4]   2> 	  "operation":"state",
[junit4:junit4]   2> 	  "numShards":"1",
[junit4:junit4]   2> 	  "node_name":"127.0.0.1:53058_solr",
[junit4:junit4]   2> 	  "collection":"collection1"}
[junit4:junit4]   2> 9333 T12 oascc.ZkStateReader.createClusterStateWatchersAndUpdate Updating cluster state from ZooKeeper... 
[junit4:junit4]   2> 9336 T47 oascc.ZkStateReader$2.process A cluster state change has occurred - updating... (4)
[junit4:junit4]   2> 9336 T59 oascc.ZkStateReader$2.process A cluster state change has occurred - updating... (4)
[junit4:junit4]   2> 9336 T72 oaz.ClientCnxn$EventThread.processEvent SEVERE Error while calling watcher  java.lang.NullPointerException
[junit4:junit4]   2> 	at org.apache.solr.common.cloud.ZkStateReader$2.process(ZkStateReader.java:189)
[junit4:junit4]   2> 	at org.apache.zookeeper.ClientCnxn$EventThread.processEvent(ClientCnxn.java:526)
[junit4:junit4]   2> 	at org.apache.zookeeper.ClientCnxn$EventThread.run(ClientCnxn.java:502)
[junit4:junit4]   2> 
[junit4:junit4]   2> 9336 T33 oascc.ZkStateReader$2.process A cluster state change has occurred - updating... (4)
[junit4:junit4]   2> 9346 T12 oasc.CoreContainer.create Creating SolrCore 'collection1' using instanceDir: /mnt/ssd/jenkins/workspace/Lucene-Solr-trunk-Linux/solr/build/solr-core/test/J1/./org.apache.solr.cloud.SyncSliceTest-jetty3-1351142573347/collection1
[junit4:junit4]   2> 9346 T12 oasc.ZkController.createCollectionZkNode Check for collection zkNode:collection1
[junit4:junit4]   2> 9347 T12 oasc.ZkController.createCollectionZkNode Collection zkNode exists
[junit4:junit4]   2> 9348 T12 oasc.ZkController.readConfigName Load collection config from:/collections/collection1
[junit4:junit4]   2> 9349 T12 oasc.SolrResourceLoader.<init> new SolrResourceLoader for directory: '/mnt/ssd/jenkins/workspace/Lucene-Solr-trunk-Linux/solr/build/solr-core/test/J1/./org.apache.solr.cloud.SyncSliceTest-jetty3-1351142573347/collection1/'
[junit4:junit4]   2> 9350 T12 oasc.SolrResourceLoader.replaceClassLoader Adding 'file:/mnt/ssd/jenkins/workspace/Lucene-Solr-trunk-Linux/solr/build/solr-core/test/J1/org.apache.solr.cloud.SyncSliceTest-jetty3-1351142573347/collection1/lib/README' to classloader
[junit4:junit4]   2> 9351 T12 oasc.SolrResourceLoader.replaceClassLoader Adding 'file:/mnt/ssd/jenkins/workspace/Lucene-Solr-trunk-Linux/solr/build/solr-core/test/J1/org.apache.solr.cloud.SyncSliceTest-jetty3-1351142573347/collection1/lib/classes/' to classloader
[junit4:junit4]   2> 9435 T12 oasc.SolrConfig.<init> Using Lucene MatchVersion: LUCENE_50
[junit4:junit4]   2> 9485 T12 oasc.SolrConfig.<init> Loaded SolrConfig: solrconfig.xml
[junit4:junit4]   2> 9486 T12 oass.IndexSchema.readSchema Reading Solr Schema
[junit4:junit4]   2> 9506 T12 oass.IndexSchema.readSchema Schema name=test
[junit4:junit4]   2> ASYNC  NEW_CORE C1 name=collection1 org.apache.solr.core.SolrCore@45b2c22c url=http://127.0.0.1:39397/solr/collection1 node=127.0.0.1:39397_solr
[junit4:junit4]   2> 9752 T43 C1 P39397 REQ /get {version=2&qt=/get&getVersions=100&wt=javabin&distrib=false} status=0 QTime=10 
[junit4:junit4]   2> 10038 T12 oass.OpenExchangeRatesOrgProvider.init Initialized with rates=open-exchange-rates.json, refreshInterval=1440.
[junit4:junit4]   2> 10045 T12 oass.IndexSchema.readSchema default search field in schema is text
[junit4:junit4]   2> 10047 T12 oass.IndexSchema.readSchema unique key field: id
[junit4:junit4]   2> 10062 T12 oass.FileExchangeRateProvider.reload Reloading exchange rates from file currency.xml
[junit4:junit4]   2> 10069 T12 oass.FileExchangeRateProvider.reload Reloading exchange rates from file currency.xml
[junit4:junit4]   2> 10072 T12 oass.OpenExchangeRatesOrgProvider.reload Reloading exchange rates from open-exchange-rates.json
[junit4:junit4]   2> 10073 T12 oass.OpenExchangeRatesOrgProvider.reload Reloading exchange rates from open-exchange-rates.json
[junit4:junit4]   2> 10074 T12 oasc.SolrCore.<init> [collection1] Opening new SolrCore at /mnt/ssd/jenkins/workspace/Lucene-Solr-trunk-Linux/solr/build/solr-core/test/J1/./org.apache.solr.cloud.SyncSliceTest-jetty3-1351142573347/collection1/, dataDir=./org.apache.solr.cloud.SyncSliceTest-1351142564264/jetty3/
[junit4:junit4]   2> 10074 T12 oasc.JmxMonitoredMap.<init> JMX monitoring is enabled. Adding Solr mbeans to JMX Server: com.sun.jmx.mbeanserver.JmxMBeanServer@7b7597b6
[junit4:junit4]   2> 10075 T12 oasc.SolrCore.getNewIndexDir New index directory detected: old=null new=./org.apache.solr.cloud.SyncSliceTest-1351142564264/jetty3/index/
[junit4:junit4]   2> 10076 T12 oasc.SolrCore.initIndex WARNING [collection1] Solr index directory './org.apache.solr.cloud.SyncSliceTest-1351142564264/jetty3/index' doesn't exist. Creating new index...
[junit4:junit4]   2> 10076 T12 oasc.CachingDirectoryFactory.get return new directory for /mnt/ssd/jenkins/workspace/Lucene-Solr-trunk-Linux/solr/build/solr-core/test/J1/./org.apache.solr.cloud.SyncSliceTest-1351142564264/jetty3/index forceNew:false
[junit4:junit4]   2> 10168 T12 oasc.SolrDeletionPolicy.onCommit SolrDeletionPolicy.onCommit: commits:num=1
[junit4:junit4]   2> 		commit{dir=/mnt/ssd/jenkins/workspace/Lucene-Solr-trunk-Linux/solr/build/solr-core/test/J1/org.apache.solr.cloud.SyncSliceTest-1351142564264/jetty3/index,segFN=segments_1,generation=1,filenames=[segments_1]
[junit4:junit4]   2> 10168 T12 oasc.SolrDeletionPolicy.updateCommits newest commit = 1
[junit4:junit4]   2> 10169 T12 oasc.SolrCore.initWriters created xml: solr.XMLResponseWriter
[junit4:junit4]   2> 10172 T12 oasup.UpdateRequestProcessorChain.init inserting DistributedUpdateProcessorFactory into updateRequestProcessorChain "dedupe"
[junit4:junit4]   2> 10173 T12 oasup.UpdateRequestProcessorChain.init inserting DistributedUpdateProcessorFactory into updateRequestProcessorChain "dedupe-allfields"
[junit4:junit4]   2> 10173 T12 oasup.UpdateRequestProcessorChain.init inserting DistributedUpdateProcessorFactory into updateRequestProcessorChain "stored_sig"
[junit4:junit4]   2> 10174 T12 oasup.UpdateRequestProcessorChain.init inserting DistributedUpdateProcessorFactory into updateRequestProcessorChain "uniq-fields"
[junit4:junit4]   2> 10175 T12 oasup.UpdateRequestProcessorChain.init inserting DistributedUpdateProcessorFactory into updateRequestProcessorChain "distrib-dup-test-chain-implicit"
[junit4:junit4]   2> 10176 T12 oasc.RequestHandlers.initHandlersFromConfig adding lazy requestHandler: solr.ReplicationHandler
[junit4:junit4]   2> 10176 T12 oasc.RequestHandlers.initHandlersFromConfig created /replication: solr.ReplicationHandler
[junit4:junit4]   2> 10177 T12 oasc.RequestHandlers.initHandlersFromConfig created standard: solr.StandardRequestHandler
[junit4:junit4]   2> 10178 T12 oasc.RequestHandlers.initHandlersFromConfig created /get: solr.RealTimeGetHandler
[junit4:junit4]   2> 10179 T12 oasc.RequestHandlers.initHandlersFromConfig created dismax: solr.SearchHandler
[junit4:junit4]   2> 10180 T12 oasc.RequestHandlers.initHandlersFromConfig created mock: org.apache.solr.core.MockQuerySenderListenerReqHandler
[junit4:junit4]   2> 10180 T12 oasc.RequestHandlers.initHandlersFromConfig created /admin/: org.apache.solr.handler.admin.AdminHandlers
[junit4:junit4]   2> 10181 T12 oasc.RequestHandlers.initHandlersFromConfig created defaults: solr.StandardRequestHandler
[junit4:junit4]   2> 10182 T12 oasc.RequestHandlers.initHandlersFromConfig adding lazy requestHandler: solr.StandardRequestHandler
[junit4:junit4]   2> 10182 T12 oasc.RequestHandlers.initHandlersFromConfig created lazy: solr.StandardRequestHandler
[junit4:junit4]   2> 10183 T12 oasc.RequestHandlers.initHandlersFromConfig created /update: solr.UpdateRequestHandler
[junit4:junit4]   2> 10184 T12 oasc.RequestHandlers.initHandlersFromConfig created /terms: org.apache.solr.handler.component.SearchHandler
[junit4:junit4]   2> 10185 T12 oasc.RequestHandlers.initHandlersFromConfig created spellCheckCompRH: org.apache.solr.handler.component.SearchHandler
[junit4:junit4]   2> 10185 T12 oasc.RequestHandlers.initHandlersFromConfig created spellCheckCompRH_Direct: org.apache.solr.handler.component.SearchHandler
[junit4:junit4]   2> 10186 T12 oasc.RequestHandlers.initHandlersFromConfig created spellCheckWithWordbreak: org.apache.solr.handler.component.SearchHandler
[junit4:junit4]   2> 10187 T12 oasc.RequestHandlers.initHandlersFromConfig created spellCheckWithWordbreak_Direct: org.apache.solr.handler.component.SearchHandler
[junit4:junit4]   2> 10188 T12 oasc.RequestHandlers.initHandlersFromConfig created spellCheckCompRH1: org.apache.solr.handler.component.SearchHandler
[junit4:junit4]   2> 10188 T12 oasc.RequestHandlers.initHandlersFromConfig created tvrh: org.apache.solr.handler.component.SearchHandler
[junit4:junit4]   2> 10189 T12 oasc.RequestHandlers.initHandlersFromConfig created /mlt: solr.MoreLikeThisHandler
[junit4:junit4]   2> 10190 T12 oasc.RequestHandlers.initHandlersFromConfig created /debug/dump: solr.DumpRequestHandler
[junit4:junit4]   2> 10194 T12 oashl.XMLLoader.init xsltCacheLifetimeSeconds=60
[junit4:junit4]   2> 10196 T12 oasc.SolrCore.initDeprecatedSupport WARNING solrconfig.xml uses deprecated <admin/gettableFiles>, Please update your config to use the ShowFileRequestHandler.
[junit4:junit4]   2> 10198 T12 oasc.SolrCore.initDeprecatedSupport WARNING adding ShowFileRequestHandler with hidden files: [STOPWORDS.TXT, PROTWORDS.TXT, CURRENCY.XML, OLD_SYNONYMS.TXT, SCHEMA.XML, SYNONYMS.TXT, MAPPING-ISOLATIN1ACCENT.TXT, OPEN-EXCHANGE-RATES.JSON]
[junit4:junit4]   2> 10201 T12 oass.SolrIndexSearcher.<init> Opening Searcher@1a9bcba1 main
[junit4:junit4]   2> 10202 T12 oasu.CommitTracker.<init> Hard AutoCommit: disabled
[junit4:junit4]   2> 10202 T12 oasu.CommitTracker.<init> Soft AutoCommit: disabled
[junit4:junit4]   2> 10203 T12 oashc.SpellCheckComponent.inform Initializing spell checkers
[junit4:junit4]   2> 10207 T12 oass.DirectSolrSpellChecker.init init: {name=direct,classname=DirectSolrSpellChecker,field=lowerfilt,minQueryLength=3}
[junit4:junit4]   2> 10245 T74 oasc.SolrCore.registerSearcher [collection1] Registered new searcher Searcher@1a9bcba1 main{StandardDirectoryReader(segments_1:1)}
[junit4:junit4]   2> 10255 T12 oasc.ZkController.publish numShards not found on descriptor - reading it from system property
[junit4:junit4]   2> 10345 T34 oascc.ZkStateReader.updateClusterState Updating cloud state from ZooKeeper... 
[junit4:junit4]   2> 10346 T34 oasc.Overseer$ClusterStateUpdater.updateState Update state numShards=1 message={
[junit4:junit4]   2> 	  "state":"down",
[junit4:junit4]   2> 	  "core":"collection1",
[junit4:junit4]   2> 	  "roles":null,
[junit4:junit4]   2> 	  "shard":null,
[junit4:junit4]   2> 	  "base_url":"http://127.0.0.1:37651/solr",
[junit4:junit4]   2> 	  "operation":"state",
[junit4:junit4]   2> 	  "numShards":"1",
[junit4:junit4]   2> 	  "node_name":"127.0.0.1:37651_solr",
[junit4:junit4]   2> 	  "collection":"collection1"}
[junit4:junit4]   2> 10351 T59 oascc.ZkStateReader$2.process A cluster state change has occurred - updating... (4)
[junit4:junit4]   2> 10351 T47 oascc.ZkStateReader$2.process A cluster state change has occurred - updating... (4)
[junit4:junit4]   2> 10351 T33 oascc.ZkStateReader$2.process A cluster state change has occurred - updating... (4)
[junit4:junit4]   2>  C0_STATE=coll:collection1 core:collection1 props:{state=recovering, core=collection1, roles=null, shard=shard1, base_url=http://127.0.0.1:53058/solr, node_name=127.0.0.1:53058_solr, collection=collection1}
[junit4:junit4]   2> 11789 T61 C0 P53058 oasc.RecoveryStrategy.doRecovery Begin buffering updates. core=collection1
[junit4:junit4]   2> 11790 T61 C0 P53058 oasu.UpdateLog.bufferUpdates Starting to buffer updates. FSUpdateLog{state=ACTIVE, tlog=null}
[junit4:junit4]   2> 11790 T61 C0 P53058 oasc.RecoveryStrategy.replicate Attempting to replicate from http://127.0.0.1:39397/solr/collection1/. core=collection1
[junit4:junit4]   2> 11790 T61 C0 P53058 oascsi.HttpClientUtil.createClient Creating new http client, config:maxConnections=128&maxConnectionsPerHost=32&followRedirects=false
[junit4:junit4]   2> 11809 T43 C1 P39397 oascsi.HttpClientUtil.createClient Creating new http client, config:maxConnections=500&maxConnectionsPerHost=16
[junit4:junit4]   2> 11816 T43 C1 P39397 oasu.DirectUpdateHandler2.commit start commit{flags=0,_version_=0,optimize=false,openSearcher=false,waitSearcher=true,expungeDeletes=false,softCommit=false}
[junit4:junit4]   2> 11819 T43 C1 P39397 oasc.SolrDeletionPolicy.onInit SolrDeletionPolicy.onInit: commits:num=1
[junit4:junit4]   2> 		commit{dir=/mnt/ssd/jenkins/workspace/Lucene-Solr-trunk-Linux/solr/build/solr-core/test/J1/org.apache.solr.cloud.SyncSliceTest-1351142564264/jetty1/index,segFN=segments_1,generation=1,filenames=[segments_1]
[junit4:junit4]   2> 11819 T43 C1 P39397 oasc.SolrDeletionPolicy.updateCommits newest commit = 1
[junit4:junit4]   2> 11820 T43 C1 P39397 oass.SolrIndexSearcher.<init> Opening Searcher@6b01af7 realtime
[junit4:junit4]   2> 11821 T43 C1 P39397 oasu.DirectUpdateHandler2.commit end_commit_flush
[junit4:junit4]   2> 11821 T43 C1 P39397 /update {version=2&commit_end_point=true&softCommit=false&openSearcher=false&wt=javabin&commit=true&waitSearcher=true} {commit=} 0 21
[junit4:junit4]   2> 11835 T61 C0 P53058 oash.ReplicationHandler.inform Commits will be reserved for  10000
[junit4:junit4]   2> 11835 T61 C0 P53058 oascsi.HttpClientUtil.createClient Creating new http client, config:connTimeout=5000&socketTimeout=20000&allowCompression=false&maxConnections=10000&maxConnectionsPerHost=10000
[junit4:junit4]   2> 11839 T61 C0 P53058 oash.SnapPuller.<init>  No value set for 'pollInterval'. Timer Task not started.
[junit4:junit4]   2> 11857 T45 C1 P39397 oash.ReplicationHandler.inform Commits will be reserved for  10000
[junit4:junit4]   2> 11858 T45 C1 P39397 REQ /replication {version=2&command=indexversion&qt=/replication&wt=javabin} status=0 QTime=17 
[junit4:junit4]   2> 11876 T61 C0 P53058 oasc.SolrDeletionPolicy.onInit SolrDeletionPolicy.onInit: commits:num=1
[junit4:junit4]   2> 		commit{dir=/mnt/ssd/jenkins/workspace/Lucene-Solr-trunk-Linux/solr/build/solr-core/test/J1/org.apache.solr.cloud.SyncSliceTest-1351142564264/jetty2/index,segFN=segments_1,generation=1,filenames=[segments_1]
[junit4:junit4]   2> 11877 T61 C0 P53058 oasc.SolrDeletionPolicy.updateCommits newest commit = 1
[junit4:junit4]   2> 11878 T61 C0 P53058 oasu.DirectUpdateHandler2.commit start commit{flags=0,_version_=0,optimize=false,openSearcher=true,waitSearcher=true,expungeDeletes=false,softCommit=false}
[junit4:junit4]   2> 11954 T61 C0 P53058 oasc.SolrDeletionPolicy.onCommit SolrDeletionPolicy.onCommit: commits:num=2
[junit4:junit4]   2> 		commit{dir=/mnt/ssd/jenkins/workspace/Lucene-Solr-trunk-Linux/solr/build/solr-core/test/J1/org.apache.solr.cloud.SyncSliceTest-1351142564264/jetty2/index,segFN=segments_1,generation=1,filenames=[segments_1]
[junit4:junit4]   2> 		commit{dir=/mnt/ssd/jenkins/workspace/Lucene-Solr-trunk-Linux/solr/build/solr-core/test/J1/org.apache.solr.cloud.SyncSliceTest-1351142564264/jetty2/index,segFN=segments_2,generation=2,filenames=[segments_2]
[junit4:junit4]   2> 11954 T61 C0 P53058 oasc.SolrDeletionPolicy.updateCommits newest commit = 2
[junit4:junit4]   2> 11958 T61 C0 P53058 oass.SolrIndexSearcher.<init> Opening Searcher@32c6a74b main
[junit4:junit4]   2> 11960 T61 C0 P53058 oasu.DirectUpdateHandler2.commit end_commit_flush
[junit4:junit4]   2> 11963 T60 oasc.SolrCore.registerSearcher [collection1] Registered new searcher Searcher@32c6a74b main{StandardDirectoryReader(segments_2:2)}
[junit4:junit4]   2> 11964 T61 C0 P53058 oasc.RecoveryStrategy.replay No replay needed. core=collection1
[junit4:junit4]   2> 11964 T61 C0 P53058 oasc.RecoveryStrategy.doRecovery Replication Recovery was successful - registering as Active. core=collection1
[junit4:junit4]   2> 11965 T61 C0 P53058 oasc.ZkController.publish numShards not found on descriptor - reading it from system property
[junit4:junit4]   2> 11967 T61 C0 P53058 oasc.RecoveryStrategy.doRecovery Finished recovery process. core=collection1
[junit4:junit4]   2> 12366 T34 oascc.ZkStateReader.updateClusterState Updating cloud state from ZooKeeper... 
[junit4:junit4]   2> 12367 T34 oasc.Overseer$ClusterStateUpdater.updateState Update state numShards=1 message={
[junit4:junit4]   2> 	  "state":"active",
[junit4:junit4]   2> 	  "core":"collection1",
[junit4:junit4]   2> 	  "roles":null,
[junit4:junit4]   2> 	  "shard":"shard1",
[junit4:junit4]   2> 	  "base_url":"http://127.0.0.1:53058/solr",
[junit4:junit4]   2> 	  "operation":"state",
[junit4:junit4]   2> 	  "numShards":"1",
[junit4:junit4]   2> 	  "node_name":"127.0.0.1:53058_solr",
[junit4:junit4]   2> 	  "collection":"collection1"}
[junit4:junit4]   2> 12371 T33 oascc.ZkStateReader$2.process A cluster state change has occurred - updating... (4)
[junit4:junit4]   2> 12371 T59 oascc.ZkStateReader$2.process A cluster state change has occurred - updating... (4)
[junit4:junit4]   2> 12371 T47 oascc.ZkStateReader$2.process A cluster state change has occurred - updating... (4)
[junit4:junit4]   2> 70275 T12 oasc.SolrException.log SEVERE null:org.apache.solr.common.SolrException: Could not get shard_id for core: collection1
[junit4:junit4]   2> 		at org.apache.solr.cloud.ZkController.doGetShardIdProcess(ZkController.java:996)
[junit4:junit4]   2> 		at org.apache.solr.cloud.ZkController.preRegister(ZkController.java:1054)
[junit4:junit4]   2> 		at org.apache.solr.core.CoreContainer.register(CoreContainer.java:662)
[junit4:junit4]   2> 		at org.apache.solr.core.CoreContainer.load(CoreContainer.java:535)
[junit4:junit4]   2> 		at org.apache.solr.core.CoreContainer.load(CoreContainer.java:356)
[junit4:junit4]   2> 		at org.apache.solr.core.CoreContainer$Initializer.initialize(CoreContainer.java:308)
[junit4:junit4]   2> 		at org.apache.solr.servlet.SolrDispatchFilter.init(SolrDispatchFilter.java:107)
[junit4:junit4]   2> 		at org.eclipse.jetty.servlet.FilterHolder.doStart(FilterHolder.java:114)
[junit4:junit4]   2> 		at org.eclipse.jetty.util.component.AbstractLifeCycle.start(AbstractLifeCycle.java:59)
[junit4:junit4]   2> 		at org.eclipse.jetty.servlet.ServletHandler.initialize(ServletHandler.java:754)
[junit4:junit4]   2> 		at org.eclipse.jetty.servlet.ServletHandler.updateMappings(ServletHandler.java:1227)
[junit4:junit4]   2> 		at org.eclipse.jetty.servlet.ServletHandler.setFilterMappings(ServletHandler.java:1263)
[junit4:junit4]   2> 		at org.eclipse.jetty.servlet.ServletHandler.addFilterWithMapping(ServletHandler.java:965)
[junit4:junit4]   2> 		at org.eclipse.jetty.servlet.ServletHandler.addFilterWithMapping(ServletHandler.java:923)
[junit4:junit4]   2> 		at org.eclipse.jetty.servlet.ServletContextHandler.addFilter(ServletContextHandler.java:333)
[junit4:junit4]   2> 		at org.apache.solr.client.solrj.embedded.JettySolrRunner$1.lifeCycleStarted(JettySolrRunner.java:173)
[junit4:junit4]   2> 		at org.eclipse.jetty.util.component.AbstractLifeCycle.setStarted(AbstractLifeCycle.java:169)
[junit4:junit4]   2> 		at org.eclipse.jetty.util.component.AbstractLifeCycle.start(AbstractLifeCycle.java:60)
[junit4:junit4]   2> 		at org.apache.solr.client.solrj.embedded.JettySolrRunner.start(JettySolrRunner.java:225)
[junit4:junit4]   2> 		at org.apache.solr.client.solrj.embedded.JettySolrRunner.start(JettySolrRunner.java:205)
[junit4:junit4]   2> 		at org.apache.solr.BaseDistributedSearchTestCase.createJetty(BaseDistributedSearchTestCase.java:262)
[junit4:junit4]   2> 		at org.apache.solr.cloud.AbstractFullDistribZkTestBase.createJettys(AbstractFullDistribZkTestBase.java:299)
[junit4:junit4]   2> 		at org.apache.solr.cloud.AbstractFullDistribZkTestBase.createServers(AbstractFullDistribZkTestBase.java:273)
[junit4:junit4]   2> 		at org.apache.solr.BaseDistributedSearchTestCase.testDistribSearch(BaseDistributedSearchTestCase.java:693)
[junit4:junit4]   2> 		at sun.reflect.NativeMethodAccessorImpl.invoke0(Native Method)
[junit4:junit4]   2> 		at sun.reflect.NativeMethodAccessorImpl.invoke(NativeMethodAccessorImpl.java:57)
[junit4:junit4]   2> 		at sun.reflect.DelegatingMethodAccessorImpl.invoke(DelegatingMethodAccessorImpl.java:43)
[junit4:junit4]   2> 		at java.lang.reflect.Method.invoke(Method.java:474)
[junit4:junit4]   2> 		at com.carrotsearch.randomizedtesting.RandomizedRunner.invoke(RandomizedRunner.java:1559)
[junit4:junit4]   2> 		at com.carrotsearch.randomizedtesting.RandomizedRunner.access$600(RandomizedRunner.java:79)
[junit4:junit4]   2> 		at com.carrotsearch.randomizedtesting.RandomizedRunner$6.evaluate(RandomizedRunner.java:737)
[junit4:junit4]   2> 		at com.carrotsearch.randomizedtesting.RandomizedRunner$7.evaluate(RandomizedRunner.java:773)
[junit4:junit4]   2> 		at com.carrotsearch.randomizedtesting.RandomizedRunner$8.evaluate(RandomizedRunner.java:787)
[junit4:junit4]   2> 		at com.carrotsearch.randomizedtesting.rules.SystemPropertiesRestoreRule$1.evaluate(SystemPropertiesRestoreRule.java:53)
[junit4:junit4]   2> 		at org.apache.lucene.util.TestRuleSetupTeardownChained$1.evaluate(TestRuleSetupTeardownChained.java:50)
[junit4:junit4]   2> 		at org.apache.lucene.util.TestRuleFieldCacheSanity$1.evaluate(TestRuleFieldCacheSanity.java:51)
[junit4:junit4]   2> 		at org.apache.lucene.util.AbstractBeforeAfterRule$1.evaluate(AbstractBeforeAfterRule.java:45)
[junit4:junit4]   2> 		at com.carrotsearch.randomizedtesting.rules.SystemPropertiesInvariantRule$1.evaluate(SystemPropertiesInvariantRule.java:55)
[junit4:junit4]   2> 		at org.apache.lucene.util.TestRuleThreadAndTestName$1.evaluate(TestRuleThreadAndTestName.java:48)
[junit4:junit4]   2> 		at org.apache.lucene.util.TestRuleIgnoreAfterMaxFailures$1.evaluate(TestRuleIgnoreAfterMaxFailures.java:70)
[junit4:junit4]   2> 		at org.apache.lucene.util.TestRuleMarkFailure$1.evaluate(TestRuleMarkFailure.java:48)
[junit4:junit4]   2> 		at com.carrotsearch.randomizedtesting.rules.StatementAdapter.evaluate(StatementAdapter.java:36)
[junit4:junit4]   2> 		at com.carrotsearch.randomizedtesting.ThreadLeakControl$StatementRunner.run(ThreadLeakControl.java:358)
[junit4:junit4]   2> 		at com.carrotsearch.randomizedtesting.ThreadLeakControl.forkTimeoutingTask(ThreadLeakControl.java:782)
[junit4:junit4]   2> 		at com.carrotsearch.randomizedtesting.ThreadLeakControl$3.evaluate(ThreadLeakControl.java:442)
[junit4:junit4]   2> 		at com.carrotsearch.randomizedtesting.RandomizedRunner.runSingleTest(RandomizedRunner.java:746)
[junit4:junit4]   2> 		at com.carrotsearch.randomizedtesting.RandomizedRunner$3.evaluate(RandomizedRunner.java:648)
[junit4:junit4]   2> 		at com.carrotsearch.randomizedtesting.RandomizedRunner$4.evaluate(RandomizedRunner.java:682)
[junit4:junit4]   2> 		at com.carrotsearch.randomizedtesting.RandomizedRunner$5.evaluate(RandomizedRunner.java:693)
[junit4:junit4]   2> 		at com.carrotsearch.randomizedtesting.rules.StatementAdapter.evaluate(StatementAdapter.java:36)
[junit4:junit4]   2> 		at com.carrotsearch.randomizedtesting.rules.SystemPropertiesRestoreRule$1.evaluate(SystemPropertiesRestoreRule.java:53)
[junit4:junit4]   2> 		at org.apache.lucene.util.AbstractBeforeAfterRule$1.evaluate(AbstractBeforeAfterRule.java:45)
[junit4:junit4]   2> 		at org.apache.lucene.util.TestRuleStoreClassName$1.evaluate(TestRuleStoreClassName.java:42)
[junit4:junit4]   2> 		at com.carrotsearch.randomizedtesting.rules.SystemPropertiesInvariantRule$1.evaluate(SystemPropertiesInvariantRule.java:55)
[junit4:junit4]   2> 		at com.carrotsearch.randomizedtesting.rules.NoShadowingOrOverridesOnMethodsRule$1.evaluate(NoShadowingOrOverridesOnMethodsRule.java:39)
[junit4:junit4]   2> 		at com.carrotsearch.randomizedtesting.rules.NoShadowingOrOverridesOnMethodsRule$1.evaluate(NoShadowingOrOverridesOnMethodsRule.java:39)
[junit4:junit4]   2> 		at com.carrotsearch.randomizedtesting.rules.StatementAdapter.evaluate(StatementAdapter.java:36)
[junit4:junit4]   2> 		at org.apache.lucene.util.TestRuleAssertionsRequired$1.evaluate(TestRuleAssertionsRequired.java:43)
[junit4:junit4]   2> 		at org.apache.lucene.util.TestRuleMarkFailure$1.evaluate(TestRuleMarkFailure.java:48)
[junit4:junit4]   2> 		at org.apache.lucene.util.TestRuleIgnoreAfterMaxFailures$1.evaluate(TestRuleIgnoreAfterMaxFailures.java:70)
[junit4:junit4]   2> 		at org.apache.lucene.util.TestRuleIgnoreTestSuites$1.evaluate(TestRuleIgnoreTestSuites.java:55)
[junit4:junit4]   2> 		at com.carrotsearch.randomizedtesting.rules.StatementAdapter.evaluate(StatementAdapter.java:36)
[junit4:junit4]   2> 		at com.carrotsearch.randomizedtesting.ThreadLeakControl$StatementRunner.run(ThreadLeakControl.java:358)
[junit4:junit4]   2> 		at java.lang.Thread.run(Thread.java:722)
[junit4:junit4]   2> 	
[junit4:junit4]   2> 70276 T12 oass.SolrDispatchFilter.init user.dir=/mnt/ssd/jenkins/workspace/Lucene-Solr-trunk-Linux/solr/build/solr-core/test/J1
[junit4:junit4]   2> 70276 T12 oass.SolrDispatchFilter.init SolrDispatchFilter.init() done
[junit4:junit4]   2> 70276 T12 oascsi.HttpClientUtil.createClient Creating new http client, config:maxConnections=128&maxConnectionsPerHost=32&followRedirects=false
[junit4:junit4]   2> 70322 T12 oejs.Server.doStart jetty-8.1.2.v20120308
[junit4:junit4]   2> 70325 T12 oejs.AbstractConnector.doStart Started SelectChannelConnector@0.0.0.0:49140
[junit4:junit4]   2> 70325 T12 oasc.SolrResourceLoader.locateSolrHome JNDI not configured for solr (NoInitialContextEx)
[junit4:junit4]   2> 70326 T12 oasc.SolrResourceLoader.locateSolrHome using system property solr.solr.home: /mnt/ssd/jenkins/workspace/Lucene-Solr-trunk-Linux/solr/build/solr-core/test/J1/./org.apache.solr.cloud.SyncSliceTest-jetty4-1351142634433
[junit4:junit4]   2> 70326 T12 oasc.SolrResourceLoader.<init> new SolrResourceLoader for deduced Solr Home: '/mnt/ssd/jenkins/workspace/Lucene-Solr-trunk-Linux/solr/build/solr-core/test/J1/./org.apache.solr.cloud.SyncSliceTest-jetty4-1351142634433/'
[junit4:junit4]   2> 70338 T12 oass.SolrDispatchFilter.init SolrDispatchFilter.init()
[junit4:junit4]   2> 70339 T12 oasc.SolrResourceLoader.locateSolrHome JNDI not configured for solr (NoInitialContextEx)
[junit4:junit4]   2> 70339 T12 oasc.SolrResourceLoader.locateSolrHome using system property solr.solr.home: /mnt/ssd/jenkins/workspace/Lucene-Solr-trunk-Linux/solr/build/solr-core/test/J1/./org.apache.solr.cloud.SyncSliceTest-jetty4-1351142634433
[junit4:junit4]   2> 70339 T12 oasc.CoreContainer$Initializer.initialize looking for solr.xml: /mnt/ssd/jenkins/workspace/Lucene-Solr-trunk-Linux/solr/build/solr-core/test/J1/./org.apache.solr.cloud.SyncSliceTest-jetty4-1351142634433/solr.xml
[junit4:junit4]   2> 70340 T12 oasc.CoreContainer.<init> New CoreContainer 1619481279
[junit4:junit4]   2> 70340 T12 oasc.CoreContainer.load Loading CoreContainer using Solr Home: '/mnt/ssd/jenkins/workspace/Lucene-Solr-trunk-Linux/solr/build/solr-core/test/J1/./org.apache.solr.cloud.SyncSliceTest-jetty4-1351142634433/'
[junit4:junit4]   2> 70341 T12 oasc.SolrResourceLoader.<init> new SolrResourceLoader for directory: '/mnt/ssd/jenkins/workspace/Lucene-Solr-trunk-Linux/solr/build/solr-core/test/J1/./org.apache.solr.cloud.SyncSliceTest-jetty4-1351142634433/'
[junit4:junit4]   2> 70357 T12 oasc.CoreContainer.load Registering Log Listener
[junit4:junit4]   2> 70366 T12 oasc.CoreContainer.initZooKeeper Zookeeper client=127.0.0.1:37667/solr
[junit4:junit4]   2> 70367 T12 oaz.ZooKeeper.<init> Initiating client connection, connectString=127.0.0.1:37667/solr sessionTimeout=5000 watcher=org.apache.solr.common.cloud.ConnectionManager@4b6393b3
[junit4:junit4]   2> 70368 T84 oaz.ClientCnxn$SendThread.startConnect Opening socket connection to server /127.0.0.1:37667
[junit4:junit4]   2> 70368 T12 oascc.ConnectionManager.waitForConnected Waiting for client to connect to ZooKeeper
[junit4:junit4]   2> 70369 T84 oaz.ClientCnxn$SendThread.primeConnection Socket connection established to localhost.localdomain/127.0.0.1:37667, initiating session
[junit4:junit4]   2> 70369 T14 oazs.NIOServerCnxn$Factory.run Accepted socket connection from /127.0.0.1:48199
[junit4:junit4]   2> 70369 T14 oazs.NIOServerCnxn.readConnectRequest Client attempting to establish new session at /127.0.0.1:48199
[junit4:junit4]   2> 70371 T16 oazs.NIOServerCnxn.finishSessionInit Established session 0x13a965f62290006 with negotiated timeout 5000 for client /127.0.0.1:48199
[junit4:junit4]   2> 70371 T84 oaz.ClientCnxn$SendThread.readConnectResult Session establishment complete on server localhost.localdomain/127.0.0.1:37667, sessionid = 0x13a965f62290006, negotiated timeout = 5000
[junit4:junit4]   2> 70371 T85 oascc.ConnectionManager.process Watcher org.apache.solr.common.cloud.ConnectionManager@4b6393b3 name:ZooKeeperConnection Watcher:127.0.0.1:37667/solr got event WatchedEvent state:SyncConnected type:None path:null path:null type:None
[junit4:junit4]   2> 70371 T12 oascc.ConnectionManager.waitForConnected Client is connected to ZooKeeper
[junit4:junit4]   2> 70373 T17 oazs.PrepRequestProcessor.pRequest Got user-level KeeperException when processing sessionid:0x13a965f62290006 type:create cxid:0x1 zxid:0xfffffffffffffffe txntype:unknown reqpath:n/a Error Path:/solr/overseer Error:KeeperErrorCode = NodeExists for /solr/overseer
[junit4:junit4]   2> 70373 T17 oazs.PrepRequestProcessor.pRequest Got user-level KeeperException when processing sessionid:0x13a965f62290006 type:create cxid:0x2 zxid:0xfffffffffffffffe txntype:unknown reqpath:n/a Error Path:/solr/overseer Error:KeeperErrorCode = NodeExists for /solr/overseer
[junit4:junit4]   2> 70374 T12 oasc.ZkController.createEphemeralLiveNode Register node as live in ZooKeeper:/live_nodes/127.0.0.1:49140_solr
[junit4:junit4]   2> 70375 T17 oazs.PrepRequestProcessor.pRequest Got user-level KeeperException when processing sessionid:0x13a965f62290006 type:delete cxid:0x4 zxid:0xfffffffffffffffe txntype:unknown reqpath:n/a Error Path:/solr/live_nodes/127.0.0.1:49140_solr Error:KeeperErrorCode = NoNode for /solr/live_nodes/127.0.0.1:49140_solr
[junit4:junit4]   2> 70375 T12 oascc.SolrZkClient.makePath makePath: /live_nodes/127.0.0.1:49140_solr
[junit4:junit4]   2> 70377 T59 oascc.ZkStateReader$3.process Updating live nodes... (5)
[junit4:junit4]   2> 70377 T33 oascc.ZkStateReader$3.process Updating live nodes... (5)
[junit4:junit4]   2> 70377 T72 oascc.ZkStateReader$3.process Updating live nodes... (5)
[junit4:junit4]   2> 70377 T47 oascc.ZkStateReader$3.process Updating live nodes... (5)
[junit4:junit4]   2> 70378 T12 oashc.HttpShardHandlerFactory.getParameter Setting socketTimeout to: 0
[junit4:junit4]   2> 70378 T12 oashc.HttpShardHandlerFactory.getParameter Setting urlScheme to: http://
[junit4:junit4]   2> 70378 T12 oashc.HttpShardHandlerFactory.getParameter Setting connTimeout to: 0
[junit4:junit4]   2> 70378 T12 oashc.HttpShardHandlerFactory.getParameter Setting maxConnectionsPerHost to: 20
[junit4:junit4]   2> 70379 T12 oashc.HttpShardHandlerFactory.getParameter Setting corePoolSize to: 0
[junit4:junit4]   2> 70379 T12 oashc.HttpShardHandlerFactory.getParameter Setting maximumPoolSize to: 2147483647
[junit4:junit4]   2> 70380 T12 oashc.HttpShardHandlerFactory.getParameter Setting maxThreadIdleTime to: 5
[junit4:junit4]   2> 70380 T12 oashc.HttpShardHandlerFactory.getParameter Setting sizeOfQueue to: -1
[junit4:junit4]   2> 70381 T12 oashc.HttpShardHandlerFactory.getParameter Setting fairnessPolicy to: false
[junit4:junit4]   2> 70382 T12 oascsi.HttpClientUtil.createClient Creating new http client, config:maxConnectionsPerHost=20&maxConnections=10000&socketTimeout=0&connTimeout=0&retry=false
[junit4:junit4]   2> 70387 T12 oascc.ZkStateReader.createClusterStateWatchersAndUpdate Updating cluster state from ZooKeeper... 
[junit4:junit4]   2> 70390 T12 oasc.CoreContainer.create Creating SolrCore 'collection1' using instanceDir: /mnt/ssd/jenkins/workspace/Lucene-Solr-trunk-Linux/solr/build/solr-core/test/J1/./org.apache.solr.cloud.SyncSliceTest-jetty4-1351142634433/collection1
[junit4:junit4]   2> 70391 T12 oasc.ZkController.createCollectionZkNode Check for collection zkNode:collection1
[junit4:junit4]   2> 70391 T12 oasc.ZkController.createCollectionZkNode Collection zkNode exists
[junit4:junit4]   2> 70392 T12 oasc.ZkController.readConfigName Load collection config from:/collections/collection1
[junit4:junit4]   2> 70393 T12 oasc.SolrResourceLoader.<init> new SolrResourceLoader for directory: '/mnt/ssd/jenkins/workspace/Lucene-Solr-trunk-Linux/solr/build/solr-core/test/J1/./org.apache.solr.cloud.SyncSliceTest-jetty4-1351142634433/collection1/'
[junit4:junit4]   2> 70394 T12 oasc.SolrResourceLoader.replaceClassLoader Adding 'file:/mnt/ssd/jenkins/workspace/Lucene-Solr-trunk-Linux/solr/build/solr-core/test/J1/org.apache.solr.cloud.SyncSliceTest-jetty4-1351142634433/collection1/lib/README' to classloader
[junit4:junit4]   2> 70394 T12 oasc.SolrResourceLoader.replaceClassLoader Adding 'file:/mnt/ssd/jenkins/workspace/Lucene-Solr-trunk-Linux/solr/build/solr-core/test/J1/org.apache.solr.cloud.SyncSliceTest-jetty4-1351142634433/collection1/lib/classes/' to classloader
[junit4:junit4]   2> 70426 T12 oasc.SolrConfig.<init> Using Lucene MatchVersion: LUCENE_50
[junit4:junit4]   2> 70462 T12 oasc.SolrConfig.<init> Loaded SolrConfig: solrconfig.xml
[junit4:junit4]   2> 70463 T12 oass.IndexSchema.readSchema Reading Solr Schema
[junit4:junit4]   2> 70469 T12 oass.IndexSchema.readSchema Schema name=test
[junit4:junit4]   2> 70832 T12 oass.OpenExchangeRatesOrgProvider.init Initialized with rates=open-exchange-rates.json, refreshInterval=1440.
[junit4:junit4]   2> 70842 T12 oass.IndexSchema.readSchema default search field in schema is text
[junit4:junit4]   2> 70845 T12 oass.IndexSchema.readSchema unique key field: id
[junit4:junit4]   2> 70862 T12 oass.FileExchangeRateProvider.reload Reloading exchange rates from file currency.xml
[junit4:junit4]   2> 70868 T12 oass.FileExchangeRateProvider.reload Reloading exchange rates from file currency.xml
[junit4:junit4]   2> 70873 T12 oass.OpenExchangeRatesOrgProvider.reload Reloading exchange rates from open-exchange-rates.json
[junit4:junit4]   2> 70875 T12 oass.OpenExchangeRatesOrgProvider.reload Reloading exchange rates from open-exchange-rates.json
[junit4:junit4]   2> 70876 T12 oasc.SolrCore.<init> [collection1] Opening new SolrCore at /mnt/ssd/jenkins/workspace/Lucene-Solr-trunk-Linux/solr/build/solr-core/test/J1/./org.apache.solr.cloud.SyncSliceTest-jetty4-1351142634433/collection1/, dataDir=./org.apache.solr.cloud.SyncSliceTest-1351142564264/jetty4/
[junit4:junit4]   2> 70877 T12 oasc.JmxMonitoredMap.<init> JMX monitoring is enabled. Adding Solr mbeans to JMX Server: com.sun.jmx.mbeanserver.JmxMBeanServer@7b7597b6
[junit4:junit4]   2> 70878 T12 oasc.SolrCore.getNewIndexDir New index directory detected: old=null new=./org.apache.solr.cloud.SyncSliceTest-1351142564264/jetty4/index/
[junit4:junit4]   2> 70879 T12 oasc.SolrCore.initIndex WARNING [collection1] Solr index directory './org.apache.solr.cloud.SyncSliceTest-1351142564264/jetty4/index' doesn't exist. Creating new index...
[junit4:junit4]   2> 70879 T12 oasc.CachingDirectoryFactory.get return new directory for /mnt/ssd/jenkins/workspace/Lucene-Solr-trunk-Linux/solr/build/solr-core/test/J1/./org.apache.solr.cloud.SyncSliceTest-1351142564264/jetty4/index forceNew:false
[junit4:junit4]   2> 70884 T12 oasc.SolrDeletionPolicy.onCommit SolrDeletionPolicy.onCommit: commits:num=1
[junit4:junit4]   2> 		commit{dir=/mnt/ssd/jenkins/workspace/Lucene-Solr-trunk-Linux/solr/build/solr-core/test/J1/org.apache.solr.cloud.SyncSliceTest-1351142564264/jetty4/index,segFN=segments_1,generation=1,filenames=[segments_1]
[junit4:junit4]   2> 70885 T12 oasc.SolrDeletionPolicy.updateCommits newest commit = 1
[junit4:junit4]   2> 70886 T12 oasc.SolrCore.initWriters created xml: solr.XMLResponseWriter
[junit4:junit4]   2> 70888 T12 oasup.UpdateRequestProcessorChain.init inserting DistributedUpdateProcessorFactory into updateRequestProcessorChain "dedupe"
[junit4:junit4]   2> 70889 T12 oasup.UpdateRequestProcessorChain.init inserting DistributedUpdateProcessorFactory into updateRequestProcessorChain "dedupe-allfields"
[junit4:junit4]   2> 70890 T12 oasup.UpdateRequestProcessorChain.init inserting DistributedUpdateProcessorFactory into updateRequestProcessorChain "stored_sig"
[junit4:junit4]   2> 70890 T12 oasup.UpdateRequestProcessorChain.init inserting DistributedUpdateProcessorFactory into updateRequestProcessorChain "uniq-fields"
[junit4:junit4]   2> 70891 T12 oasup.UpdateRequestProcessorChain.init inserting DistributedUpdateProcessorFactory into updateRequestProcessorChain "distrib-dup-test-chain-implicit"
[junit4:junit4]   2> 70892 T12 oasc.RequestHandlers.initHandlersFromConfig adding lazy requestHandler: solr.ReplicationHandler
[junit4:junit4]   2> 70893 T12 oasc.RequestHandlers.initHandlersFromConfig created /replication: solr.ReplicationHandler
[junit4:junit4]   2> 70893 T12 oasc.RequestHandlers.initHandlersFromConfig created standard: solr.StandardRequestHandler
[junit4:junit4]   2> 70894 T12 oasc.RequestHandlers.initHandlersFromConfig created /get: solr.RealTimeGetHandler
[junit4:junit4]   2> 70895 T12 oasc.RequestHandlers.initHandlersFromConfig created dismax: solr.SearchHandler
[junit4:junit4]   2> 70896 T12 oasc.RequestHandlers.initHandlersFromConfig created mock: org.apache.solr.core.MockQuerySenderListenerReqHandler
[junit4:junit4]   2> 70897 T12 oasc.RequestHandlers.initHandlersFromConfig created /admin/: org.apache.solr.handler.admin.AdminHandlers
[junit4:junit4]   2> 70898 T12 oasc.RequestHandlers.initHandlersFromConfig created defaults: solr.StandardRequestHandler
[junit4:junit4]   2> 70898 T12 oasc.RequestHandlers.initHandlersFromConfig adding lazy requestHandler: solr.StandardRequestHandler
[junit4:junit4]   2> 70899 T12 oasc.RequestHandlers.initHandlersFromConfig created lazy: solr.StandardRequestHandler
[junit4:junit4]   2> 70900 T12 oasc.RequestHandlers.initHandlersFromConfig created /update: solr.UpdateRequestHandler
[junit4:junit4]   2> 70900 T12 oasc.RequestHandlers.initHandlersFromConfig created /terms: org.apache.solr.handler.component.SearchHandler
[junit4:junit4]   2> 70901 T12 oasc.RequestHandlers.initHandlersFromConfig created spellCheckCompRH: org.apache.solr.handler.component.SearchHandler
[junit4:junit4]   2> 70902 T12 oasc.RequestHandlers.initHandlersFromConfig created spellCheckCompRH_Direct: org.apache.solr.handler.component.SearchHandler
[junit4:junit4]   2> 70903 T12 oasc.RequestHandlers.initHandlersFromConfig created spellCheckWithWordbreak: org.apache.solr.handler.component.SearchHandler
[junit4:junit4]   2> 70904 T12 oasc.RequestHandlers.initHandlersFromConfig created spellCheckWithWordbreak_Direct: org.apache.solr.handler.component.SearchHandler
[junit4:junit4]   2> 70905 T12 oasc.RequestHandlers.initHandlersFromConfig created spellCheckCompRH1: org.apache.solr.handler.component.SearchHandler
[junit4:junit4]   2> 70905 T12 oasc.RequestHandlers.initHandlersFromConfig created tvrh: org.apache.solr.handler.component.SearchHandler
[junit4:junit4]   2> 70906 T12 oasc.RequestHandlers.initHandlersFromConfig created /mlt: solr.MoreLikeThisHandler
[junit4:junit4]   2> 70907 T12 oasc.RequestHandlers.initHandlersFromConfig created /debug/dump: solr.DumpRequestHandler
[junit4:junit4]   2> 70911 T12 oashl.XMLLoader.init xsltCacheLifetimeSeconds=60
[junit4:junit4]   2> 70914 T12 oasc.SolrCore.initDeprecatedSupport WARNING solrconfig.xml uses deprecated <admin/gettableFiles>, Please update your config to use the ShowFileRequestHandler.
[junit4:junit4]   2> 70915 T12 oasc.SolrCore.initDeprecatedSupport WARNING adding ShowFileRequestHandler with hidden files: [STOPWORDS.TXT, PROTWORDS.TXT, CURRENCY.XML, OLD_SYNONYMS.TXT, SCHEMA.XML, SYNONYMS.TXT, MAPPING-ISOLATIN1ACCENT.TXT, OPEN-EXCHANGE-RATES.JSON]
[junit4:junit4]   2> 70919 T12 oass.SolrIndexSearcher.<init> Opening Searcher@e959286 main
[junit4:junit4]   2> 70920 T12 oasu.CommitTracker.<init> Hard AutoCommit: disabled
[junit4:junit4]   2> 70921 T12 oasu.CommitTracker.<init> Soft AutoCommit: disabled
[junit4:junit4]   2> 70922 T12 oashc.SpellCheckComponent.inform Initializing spell checkers
[junit4:junit4]   2> 70928 T12 oass.DirectSolrSpellChecker.init init: {name=direct,classname=DirectSolrSpellChecker,field=lowerfilt,minQueryLength=3}
[junit4:junit4]   2> 70961 T86 oasc.SolrCore.registerSearcher [collection1] Registered new searcher Searcher@e959286 main{StandardDirectoryReader(segments_1:1)}
[junit4:junit4]   2> 70967 T12 oasc.ZkController.publish numShards not found on descriptor - reading it from system property
[junit4:junit4]   2> 71028 T34 oascc.ZkStateReader.updateClusterState Updating cloud state from ZooKeeper... 
[junit4:junit4]   2> 71029 T34 oasc.Overseer$ClusterStateUpdater.updateState Update state numShards=1 message={
[junit4:junit4]   2> 	  "state":"down",
[junit4:junit4]   2> 	  "core":"collection1",
[junit4:junit4]   2> 	  "roles":null,
[junit4:junit4]   2> 	  "shard":null,
[junit4:junit4]   2> 	  "base_url":"http://127.0.0.1:49140/solr",
[junit4:junit4]   2> 	  "operation":"state",
[junit4:junit4]   2> 	  "numShards":"1",
[junit4:junit4]   2> 	  "node_name":"127.0.0.1:49140_solr",
[junit4:junit4]   2> 	  "collection":"collection1"}
[junit4:junit4]   2> 71033 T47 oascc.ZkStateReader$2.process A cluster state change has occurred - updating... (5)
[junit4:junit4]   2> 71033 T85 oascc.ZkStateReader$2.process A cluster state change has occurred - updating... (5)
[junit4:junit4]   2> 71033 T59 oascc.ZkStateReader$2.process A cluster state change has occurred - updating... (5)
[junit4:junit4]   2> 71033 T33 oascc.ZkStateReader$2.process A cluster state change has occurred - updating... (5)
[junit4:junit4]   2> 71470 T12 oasc.CoreContainer.register registering core: collection1
[junit4:junit4]   2> 71470 T12 oasc.ZkController.register Register shard - core:collection1 address:http://127.0.0.1:49140/solr shardId:shard1
[junit4:junit4]   2> 71472 T12 oasc.ZkController.register We are http://127.0.0.1:49140/solr/collection1/ and leader is http://127.0.0.1:39397/solr/collection1/
[junit4:junit4]   2> 71473 T12 oasc.ZkController.register No LogReplay needed for core=collection1 baseURL=http://127.0.0.1:49140/solr
[junit4:junit4]   2> 71473 T12 oasc.ZkController.checkRecovery Core needs to recover:collection1
[junit4:junit4]   2> 71473 T12 oasu.DefaultSolrCoreState.doRecovery Running recovery - first canceling any ongoing recovery
[junit4:junit4]   2> ASYNC  NEW_CORE C2 name=collection1 org.apache.solr.core.SolrCore@56067345 url=http://127.0.0.1:49140/solr/collection1 node=127.0.0.1:49140_solr
[junit4:junit4]   2> 71474 T87 C2 P49140 oasc.RecoveryStrategy.run Starting recovery process.  core=collection1 recoveringAfterStartup=true
[junit4:junit4]   2> 71474 T87 C2 P49140 oasc.RecoveryStrategy.doRecovery ###### startupVersions=[]
[junit4:junit4]   2> 71474 T12 oascc.ZkStateReader.updateClusterState Updating cloud state from ZooKeeper... 
[junit4:junit4]   2> 71475 T87 C2 P49140 oasc.ZkController.publish numShards not found on descriptor - reading it from system property
[junit4:junit4]   2> 71475 T12 oass.SolrDispatchFilter.init user.dir=/mnt/ssd/jenkins/workspace/Lucene-Solr-trunk-Linux/solr/build/solr-core/test/J1
[junit4:junit4]   2> 71475 T87 C2 P49140 oasc.RecoveryStrategy.doRecovery Attempting to PeerSync from http://127.0.0.1:39397/solr/collection1/ core=collection1 - recoveringAfterStartup=true
[junit4:junit4]   2> 71475 T12 oass.SolrDispatchFilter.init SolrDispatchFilter.init() done
[junit4:junit4]   2> 71476 T87 C2 P49140 oasu.PeerSync.sync PeerSync: core=collection1 url=http://127.0.0.1:49140/solr START replicas=[http://127.0.0.1:39397/solr/collection1/] nUpdates=100
[junit4:junit4]   2> 71476 T12 oascsi.HttpClientUtil.createClient Creating new http client, config:maxConnections=128&maxConnectionsPerHost=32&followRedirects=false
[junit4:junit4]   2> 71476 T87 C2 P49140 oasu.PeerSync.sync WARNING no frame of reference to tell of we've missed updates
[junit4:junit4]   2> 71476 T87 C2 P49140 oasc.RecoveryStrategy.doRecovery PeerSync Recovery was not successful - trying replication. core=collection1
[junit4:junit4]   2> 71476 T87 C2 P49140 oasc.RecoveryStrategy.doRecovery Starting Replication Recovery. core=collection1
[junit4:junit4]   2> 71477 T87 C2 P49140 oascsi.HttpClientUtil.createClient Creating new http client, config:maxConnections=128&maxConnectionsPerHost=32&followRedirects=false
[junit4:junit4]   2> 71480 T43 C1 P39397 REQ /get {version=2&qt=/get&getVersions=100&wt=javabin&distrib=false} status=0 QTime=1 
[junit4:junit4]   2> 71482 T12 oaz.ZooKeeper.<init> Initiating client connection, connectString=127.0.0.1:37667/solr sessionTimeout=10000 watcher=org.apache.solr.common.cloud.ConnectionManager@6650af3b
[junit4:junit4]   2> 71484 T89 oaz.ClientCnxn$SendThread.startConnect Opening socket connection to server /127.0.0.1:37667
[junit4:junit4]   2> 71483 T12 oascc.ConnectionManager.waitForConnected Waiting for client to connect to ZooKeeper
[junit4:junit4]   2> 71484 T89 oaz.ClientCnxn$SendThread.primeConnection Socket connection established to localhost.localdomain/127.0.0.1:37667, initiating session
[junit4:junit4]   2> 71484 T14 oazs.NIOServerCnxn$Factory.run Accepted socket connection from /127.0.0.1:48203
[junit4:junit4]   2> 71485 T14 oazs.NIOServerCnxn.readConnectRequest Client attempting to establish new session at /127.0.0.1:48203
[junit4:junit4]   2> 71486 T16 oazs.NIOServerCnxn.finishSessionInit Established session 0x13a965f62290007 with negotiated timeout 10000 for client /127.0.0.1:48203
[junit4:junit4]   2> 71486 T89 oaz.ClientCnxn$SendThread.readConnectResult Session establishment complete on server localhost.localdomain/127.0.0.1:37667, sessionid = 0x13a965f62290007, negotiated timeout = 10000
[junit4:junit4]   2> 71486 T90 oascc.ConnectionManager.process Watcher org.apache.solr.common.cloud.ConnectionManager@6650af3b name:ZooKeeperConnection Watcher:127.0.0.1:37667/solr got event WatchedEvent state:SyncConnected type:None path:null path:null type:None
[junit4:junit4]   2> 71486 T12 oascc.ConnectionManager.waitForConnected Client is connected to ZooKeeper
[junit4:junit4]   2> 71487 T12 oascc.ZkStateReader.createClusterStateWatchersAndUpdate Updating cluster state from ZooKeeper... 
[junit4:junit4]   2> 71489 T12 oasc.ChaosMonkey.monkeyLog monkey: init - expire sessions:true cause connection loss:true
[junit4:junit4]   2> 71490 T12 oascsi.HttpClientUtil.createClient Creating new http client, config:
[junit4:junit4]   2> 71493 T12 oascc.ZkStateReader.updateClusterState Updating cloud state from ZooKeeper... 
[junit4:junit4]   2> 71495 T12 oasc.AbstractFullDistribZkTestBase.waitForThingsToLevelOut Wait for recoveries to finish - wait 15 for each attempt
[junit4:junit4]   2> 71495 T12 oasc.AbstractDistribZkTestBase.waitForRecoveriesToFinish Wait for recoveries to finish - collection: collection1 failOnTimeout:true timeout (sec):15
[junit4:junit4]   2> 71496 T12 oascc.ZkStateReader.updateClusterState Updating cloud state from ZooKeeper... 
[junit4:junit4]   2> 71537 T34 oascc.ZkStateReader.updateClusterState Updating cloud state from ZooKeeper... 
[junit4:junit4]   2> 71538 T34 oasc.Overseer$ClusterStateUpdater.updateState Update state numShards=1 message={
[junit4:junit4]   2> 	  "state":"recovering",
[junit4:junit4]   2> 	  "core":"collection1",
[junit4:junit4]   2> 	  "roles":null,
[junit4:junit4]   2> 	  "shard":"shard1",
[junit4:junit4]   2> 	  "base_url":"http://127.0.0.1:49140/solr",
[junit4:junit4]   2> 	  "operation":"state",
[junit4:junit4]   2> 	  "numShards":"1",
[junit4:junit4]   2> 	  "node_name":"127.0.0.1:49140_solr",
[junit4:junit4]   2> 	  "collection":"collection1"}
[junit4:junit4]   2> 71541 T85 oascc.ZkStateReader$2.process A cluster state change has occurred - updating... (5)
[junit4:junit4]   2> 71541 T47 oascc.ZkStateReader$2.process A cluster state change has occurred - updating... (5)
[junit4:junit4]   2> 71541 T90 oascc.ZkStateReader$2.process A cluster state change has occurred - updating... (5)
[junit4:junit4]   2> 71541 T33 oascc.ZkStateReader$2.process A cluster state change has occurred - updating... (5)
[junit4:junit4]   2> 71541 T59 oascc.ZkStateReader$2.process A cluster state change has occurred - updating... (5)
[junit4:junit4]   2> 72497 T12 oascc.ZkStateReader.updateClusterState Updating cloud state from ZooKeeper... 
[junit4:junit4]   2> 73500 T12 oascc.ZkStateReader.updateClusterState Updating cloud state from ZooKeeper... 
[junit4:junit4]   2>  C2_STATE=coll:collection1 core:collection1 props:{state=recovering, core=collection1, roles=null, shard=shard1, base_url=http://127.0.0.1:49140/solr, node_name=127.0.0.1:49140_solr, collection=collection1}
[junit4:junit4]   2> 74485 T87 C2 P49140 oasc.RecoveryStrategy.doRecovery Begin buffering updates. core=collection1
[junit4:junit4]   2> 74485 T87 C2 P49140 oasu.UpdateLog.bufferUpdates Starting to buffer updates. FSUpdateLog{state=ACTIVE, tlog=null}
[junit4:junit4]   2> 74485 T87 C2 P49140 oasc.RecoveryStrategy.replicate Attempting to replicate from http://127.0.0.1:39397/solr/collection1/. core=collection1
[junit4:junit4]   2> 74485 T87 C2 P49140 oascsi.HttpClientUtil.createClient Creating new http client, config:maxConnections=128&maxConnectionsPerHost=32&followRedirects=false
[junit4:junit4]   2> 74491 T44 C1 P39397 oasu.DirectUpdateHandler2.commit start commit{flags=0,_version_=0,optimize=false,openSearcher=false,waitSearcher=true,expungeDeletes=false,softCommit=false}
[junit4:junit4]   2> 74492 T44 C1 P39397 oasu.DirectUpdateHandler2.commit end_commit_flush
[junit4:junit4]   2> 74493 T44 C1 P39397 /update {version=2&commit_end_point=true&softCommit=false&openSearcher=false&wt=javabin&commit=true&waitSearcher=true} {commit=} 0 2
[junit4:junit4]   2> 74499 T87 C2 P49140 oash.ReplicationHandler.inform Commits will be reserved for  10000
[junit4:junit4]   2> 74499 T87 C2 P49140 oash.SnapPuller.<init>  No value set for 'pollInterval'. Timer Task not started.
[junit4:junit4]   2> 74502 T12 oascc.ZkStateReader.updateClusterState Updating cloud state from ZooKeeper... 
[junit4:junit4]   2> 74504 T43 C1 P39397 REQ /replication {version=2&command=indexversion&qt=/replication&wt=javabin} status=0 QTime=0 
[junit4:junit4]   2> 74508 T87 C2 P49140 oasc.SolrDeletionPolicy.onInit SolrDeletionPolicy.onInit: commits:num=1
[junit4:junit4]   2> 		commit{dir=/mnt/ssd/jenkins/workspace/Lucene-Solr-trunk-Linux/solr/build/solr-core/test/J1/org.apache.solr.cloud.SyncSliceTest-1351142564264/jetty4/index,segFN=segments_1,generation=1,filenames=[segments_1]
[junit4:junit4]   2> 74509 T87 C2 P49140 oasc.SolrDeletionPolicy.updateCommits newest commit = 1
[junit4:junit4]   2> 74509 T87 C2 P49140 oasu.DirectUpdateHandler2.commit start commit{flags=0,_version_=0,optimize=false,openSearcher=true,waitSearcher=true,expungeDeletes=false,softCommit=false}
[junit4:junit4]   2> 74514 T87 C2 P49140 oasc.SolrDeletionPolicy.onCommit SolrDeletionPolicy.onCommit: commits:num=2
[junit4:junit4]   2> 		commit{dir=/mnt/ssd/jenkins/workspace/Lucene-Solr-trunk-Linux/solr/build/solr-core/test/J1/org.apache.solr.cloud.SyncSliceTest-1351142564264/jetty4/index,segFN=segments_1,generation=1,filenames=[segments_1]
[junit4:junit4]   2> 		commit{dir=/mnt/ssd/jenkins/workspace/Lucene-Solr-trunk-Linux/solr/build/solr-core/test/J1/org.apache.solr.cloud.SyncSliceTest-1351142564264/jetty4/index,segFN=segments_2,generation=2,filenames=[segments_2]
[junit4:junit4]   2> 74515 T87 C2 P49140 oasc.SolrDeletionPolicy.updateCommits newest commit = 2
[junit4:junit4]   2> 74517 T87 C2 P49140 oass.SolrIndexSearcher.<init> Opening Searcher@3dd87e5f main
[junit4:junit4]   2> 74517 T87 C2 P49140 oasu.DirectUpdateHandler2.commit end_commit_flush
[junit4:junit4]   2> 74519 T86 oasc.SolrCore.registerSearcher [collection1] Registered new searcher Searcher@3dd87e5f main{StandardDirectoryReader(segments_2:2)}
[junit4:junit4]   2> 74520 T87 C2 P49140 oasc.RecoveryStrategy.replay No replay needed. core=collection1
[junit4:junit4]   2> 74520 T87 C2 P49140 oasc.RecoveryStrategy.doRecovery Replication Recovery was successful - registering as Active. core=collection1
[junit4:junit4]   2> 74520 T87 C2 P49140 oasc.ZkController.publish numShards not found on descriptor - reading it from system property
[junit4:junit4]   2> 74523 T87 C2 P49140 oasc.RecoveryStrategy.doRecovery Finished recovery process. core=collection1
[junit4:junit4]   2> 74553 T34 oascc.ZkStateReader.updateClusterState Updating cloud state from ZooKeeper... 
[junit4:junit4]   2> 74554 T34 oasc.Overseer$ClusterStateUpdater.updateState Update state numShards=1 message={
[junit4:junit4]   2> 	  "state":"active",
[junit4:junit4]   2> 	  "core":"collection1",
[junit4:junit4]   2> 	  "roles":null,
[junit4:junit4]   2> 	  "shard":"shard1",
[junit4:junit4]   2> 	  "base_url":"http://127.0.0.1:49140/solr",
[junit4:junit4]   2> 	  "operation":"state",
[junit4:junit4]   2> 	  "numShards":"1",
[junit4:junit4]   2> 	  "node_name":"127.0.0.1:49140_solr",
[junit4:junit4]   2> 	  "collection":"collection1"}
[junit4:junit4]   2> 74556 T47 oascc.ZkStateReader$2.process A cluster state change has occurred - updating... (5)
[junit4:junit4]   2> 74556 T85 oascc.ZkStateReader$2.process A cluster state change has occurred - updating... (5)
[junit4:junit4]   2> 74556 T33 oascc.ZkStateReader$2.process A cluster state change has occurred - updating... (5)
[junit4:junit4]   2> 74556 T59 oascc.ZkStateReader$2.process A cluster state change has occurred - updating... (5)
[junit4:junit4]   2> 74556 T90 oascc.ZkStateReader$2.process A cluster state change has occurred - updating... (5)
[junit4:junit4]   2> 75504 T12 oascc.ZkStateReader.updateClusterState Updating cloud state from ZooKeeper... 
[junit4:junit4]   2> 76505 T12 oascc.ZkStateReader.updateClusterState Updating cloud state from ZooKeeper... 
[junit4:junit4]   2> 77507 T12 oascc.ZkStateReader.updateClusterState Updating cloud state from ZooKeeper... 
[junit4:junit4]   2> 78509 T12 oascc.ZkStateReader.updateClusterState Updating cloud state from ZooKeeper... 
[junit4:junit4]   2> 79511 T12 oascc.ZkStateReader.updateClusterState Updating cloud state from ZooKeeper... 
[junit4:junit4]   2> 80512 T12 oascc.ZkStateReader.updateClusterState Updating cloud state from ZooKeeper... 
[junit4:junit4]   2> 81514 T12 oascc.ZkStateReader.updateClusterState Updating cloud state from ZooKeeper... 
[junit4:junit4]   2> 82515 T12 oascc.ZkStateReader.updateClusterState Updating cloud state from ZooKeeper... 
[junit4:junit4]   2> 83517 T12 oascc.ZkStateReader.updateClusterState Updating cloud state from ZooKeeper... 
[junit4:junit4]   2> 84518 T12 oascc.ZkStateReader.updateClusterState Updating cloud state from ZooKeeper... 
[junit4:junit4]   2> 85520 T12 oascc.ZkStateReader.updateClusterState Updating cloud state from ZooKeeper... 
[junit4:junit4]   2> 86521 T12 oascc.ZkStateReader.updateClusterState Updating cloud state from ZooKeeper... 
[junit4:junit4]   2> 86523 T17 oazs.PrepRequestProcessor.pRequest Processed session termination for sessionid: 0x13a965f62290007
[junit4:junit4]   2> 86524 T90 oaz.ClientCnxn$EventThread.run EventThread shut down
[junit4:junit4]   2> 86524 T12 oaz.ZooKeeper.close Session: 0x13a965f62290007 closed
[junit4:junit4]   2> 86524 T17 oazs.PrepRequestProcessor.run PrepRequestProcessor exited loop!
[junit4:junit4]   2> 86524 T16 oazs.SyncRequestProcessor.run SyncRequestProcessor exited!
[junit4:junit4]   2> 86524 T14 oazs.NIOServerCnxn.doIO WARNING EndOfStreamException: Unable to read additional data from client sessionid 0x13a965f62290007, likely client has closed socket
[junit4:junit4]   2> 86525 T12 oazs.FinalRequestProcessor.shutdown shutdown of request processor complete
[junit4:junit4]   2> 86525 T14 oazs.NIOServerCnxn.closeSock Closed socket connection for client /127.0.0.1:48203 which had sessionid 0x13a965f62290007
[junit4:junit4]   2> 86528 T12 oazs.NIOServerCnxn.closeSock Closed socket connection for client /127.0.0.1:48162 which had sessionid 0x13a965f62290005
[junit4:junit4]   2> 86528 T71 oaz.ClientCnxn$SendThread.run Unable to read additional data from server sessionid 0x13a965f62290005, likely server has closed socket, closing socket connection and attempting reconnect
[junit4:junit4]   2> 86528 T12 oazs.NIOServerCnxn.closeSock Closed socket connection for client /127.0.0.1:48161 which had sessionid 0x13a965f62290004
[junit4:junit4]   2> 86530 T58 oaz.ClientCnxn$SendThread.run Unable to read additional data from server sessionid 0x13a965f62290004, likely server has closed socket, closing socket connection and attempting reconnect
[junit4:junit4]   2> 86530 T12 oazs.NIOServerCnxn.closeSock Closed socket connection for client /127.0.0.1:48160 which had sessionid 0x13a965f62290003
[junit4:junit4]   2> 86531 T46 oaz.ClientCnxn$SendThread.run Unable to read additional data from server sessionid 0x13a965f62290003, likely server has closed socket, closing socket connection and attempting reconnect
[junit4:junit4]   2> 86531 T12 oazs.NIOServerCnxn.closeSock Closed socket connection for client /127.0.0.1:48158 which had sessionid 0x13a965f62290002
[junit4:junit4]   2> 86531 T32 oaz.ClientCnxn$SendThread.run Unable to read additional data from server sessionid 0x13a965f62290002, likely server has closed socket, closing socket connection and attempting reconnect
[junit4:junit4]   2> 86531 T12 oazs.NIOServerCnxn.closeSock Closed socket connection for client /127.0.0.1:48199 which had sessionid 0x13a965f62290006
[junit4:junit4]   2> 86532 T84 oaz.ClientCnxn$SendThread.run Unable to read additional data from server sessionid 0x13a965f62290006, likely server has closed socket, closing socket connection and attempting reconnect
[junit4:junit4]   2> 86532 T14 oazs.NIOServerCnxn$Factory.run NIOServerCnxn factory exited run method
[junit4:junit4]   2> 86532 T12 oazs.FinalRequestProcessor.shutdown shutdown of request processor complete
[junit4:junit4]   2> 86533 T12 oasc.ChaosMonkey.monkeyLog monkey: stop shard! 41058
[junit4:junit4]   2> 86533 T12 oasc.CoreContainer.shutdown Shutting down CoreContainer instance=138828459
[junit4:junit4]   2> 86533 T12 oasc.SolrCore.close [collection1]  CLOSING SolrCore org.apache.solr.core.SolrCore@181feb71
[junit4:junit4]   2> 86540 T12 oasu.DirectUpdateHandler2.close closing DirectUpdateHandler2{commits=0,autocommits=0,soft autocommits=0,optimizes=0,rollbacks=0,expungeDeletes=0,docsPending=0,adds=0,deletesById=0,deletesByQuery=0,errors=0,cumulative_adds=0,cumulative_deletesById=0,cumulative_deletesByQuery=0,cumulative_errors=0}
[junit4:junit4]   2> 86541 T12 oasc.SolrCore.decrefSolrCoreState Closing SolrCoreState
[junit4:junit4]   2> 86541 T12 oasu.DefaultSolrCoreState.closeIndexWriter SolrCoreState ref count has reached 0 - closing IndexWriter
[junit4:junit4]   2> 86542 T12 oasu.DefaultSolrCoreState.closeIndexWriter closing IndexWriter with IndexWriterCloser
[junit4:junit4]   2> 86542 T12 oasc.SolrCore.closeSearcher [collection1] Closing main searcher on request.
[junit4:junit4]   2> 86545 T34 oasc.Overseer$ClusterStateUpdater.amILeader According to ZK I (id=88548479100059650-127.0.0.1:41058_solr-n_0000000000) am no longer a leader.
[junit4:junit4]   2> 86630 T72 oascc.ConnectionManager.process Watcher org.apache.solr.common.cloud.ConnectionManager@1f2966b1 name:ZooKeeperConnection Watcher:127.0.0.1:37667/solr got event WatchedEvent state:Disconnected type:None path:null path:null type:None
[junit4:junit4]   2> 86630 T72 oascc.ConnectionManager.process zkClient has disconnected
[junit4:junit4]   2> 86630 T59 oascc.ConnectionManager.process Watcher org.apache.solr.common.cloud.ConnectionManager@5092a298 name:ZooKeeperConnection Watcher:127.0.0.1:37667/solr got event WatchedEvent state:Disconnected type:None path:null path:null type:None
[junit4:junit4]   2> 86631 T59 oascc.ConnectionManager.process zkClient has disconnected
[junit4:junit4]   2> 86631 T47 oascc.ConnectionManager.process Watcher org.apache.solr.common.cloud.ConnectionManager@457105b0 name:ZooKeeperConnection Watcher:127.0.0.1:37667/solr got event WatchedEvent state:Disconnected type:None path:null path:null type:None
[junit4:junit4]   2> 86631 T47 oascc.ConnectionManager.process zkClient has disconnected
[junit4:junit4]   2> 86631 T33 oascc.ConnectionManager.process Watcher org.apache.solr.common.cloud.ConnectionManager@6c5645b name:ZooKeeperConnection Watcher:127.0.0.1:37667/solr got event WatchedEvent state:Disconnected type:None path:null path:null type:None
[junit4:junit4]   2> 86631 T12 oaz.ZooKeeper.close Session: 0x13a965f62290002 closed
[junit4:junit4]   2> 86632 T33 oascc.ConnectionManager.process zkClient has disconnected
[junit4:junit4]   2> 86632 T33 oaz.ClientCnxn$EventThread.run EventThread shut down
[junit4:junit4]   2> 86632 T85 oascc.ConnectionManager.process Watcher org.apache.solr.common.cloud.ConnectionManager@4b6393b3 name:ZooKeeperConnection Watcher:127.0.0.1:37667/solr got event WatchedEvent state:Disconnected type:None path:null path:null type:None
[junit4:junit4]   2> 86632 T85 oascc.ConnectionManager.process zkClient has disconnected
[junit4:junit4]   2> 86653 T12 oejsh.ContextHandler.doStop stopped o.e.j.s.ServletContextHandler{/solr,null}
[junit4:junit4]   2> 86705 T12 oasc.ChaosMonkey.monkeyLog monkey: stop shard! 39397
[junit4:junit4]   2> 86706 T12 oasc.CoreContainer.shutdown Shutting down CoreContainer instance=1553477431
[junit4:junit4]   2> 86706 T12 oasc.SolrCore.close [collection1]  CLOSING SolrCore org.apache.solr.core.SolrCore@45b2c22c
[junit4:junit4]   2> 86712 T12 oasu.DirectUpdateHandler2.close closing DirectUpdateHandler2{commits=2,autocommits=0,soft autocommits=0,optimizes=0,rollbacks=0,expungeDeletes=0,docsPending=0,adds=0,deletesById=0,deletesByQuery=0,errors=0,cumulative_adds=0,cumulative_deletesById=0,cumulative_deletesByQuery=0,cumulative_errors=0}
[junit4:junit4]   2> 86713 T12 oasc.SolrCore.decrefSolrCoreState Closing SolrCoreState
[junit4:junit4]   2> 86713 T12 oasu.DefaultSolrCoreState.closeIndexWriter SolrCoreState ref count has reached 0 - closing IndexWriter
[junit4:junit4]   2> 86714 T12 oasu.DefaultSolrCoreState.closeIndexWriter closing IndexWriter with IndexWriterCloser
[junit4:junit4]   2> 86716 T12 oasc.SolrCore.closeSearcher [collection1] Closing main searcher on request.
[junit4:junit4]   2> 86846 T15 oazs.SessionTrackerImpl.run SessionTrackerImpl exited loop!
[junit4:junit4]   2> 87816 T58 oaz.ClientCnxn$SendThread.startConnect Opening socket connection to server localhost.localdomain/127.0.0.1:37667
[junit4:junit4]   2> 87816 T58 oaz.ClientCnxn$SendThread.run WARNING Session 0x13a965f62290004 for server null, unexpected error, closing socket connection and attempting reconnect java.net.ConnectException: Connection refused
[junit4:junit4]   2> 	at sun.nio.ch.SocketChannelImpl.checkConnect(Native Method)
[junit4:junit4]   2> 	at sun.nio.ch.SocketChannelImpl.finishConnect(SocketChannelImpl.java:692)
[junit4:junit4]   2> 	at org.apache.zookeeper.ClientCnxn$SendThread.run(ClientCnxn.java:1143)
[junit4:junit4]   2> 
[junit4:junit4]   2> 87862 T46 oaz.ClientCnxn$SendThread.startConnect Opening socket connection to server localhost.localdomain/127.0.0.1:37667
[junit4:junit4]   2> 87963 T47 oaz.ClientCnxn$EventThread.run EventThread shut down
[junit4:junit4]   2> 87963 T12 oaz.ZooKeeper.close Session: 0x13a965f62290003 closed
[junit4:junit4]   2> 87985 T12 oejsh.ContextHandler.doStop stopped o.e.j.s.ServletContextHandler{/solr,null}
[junit4:junit4]   2> 88038 T12 oasc.ChaosMonkey.monkeyLog monkey: stop shard! 53058
[junit4:junit4]   2> 88038 T12 oasc.CoreContainer.shutdown Shutting down CoreContainer instance=1743751271
[junit4:junit4]   2> 88038 T12 oasc.SolrCore.close [collection1]  CLOSING SolrCore org.apache.solr.core.SolrCore@6d3aa183
[junit4:junit4]   2> 88045 T12 oasu.DirectUpdateHandler2.close closing DirectUpdateHandler2{commits=1,autocommits=0,soft autocommits=0,optimizes=0,rollbacks=0,expungeDeletes=0,docsPending=0,adds=0,deletesById=0,deletesByQuery=0,errors=0,cumulative_adds=0,cumulative_deletesById=0,cumulative_deletesByQuery=0,cumulative_errors=0}
[junit4:junit4]   2> 88046 T12 oasc.SolrCore.decrefSolrCoreState Closing SolrCoreState
[junit4:junit4]   2> 88046 T12 oasu.DefaultSolrCoreState.closeIndexWriter SolrCoreState ref count has reached 0 - closing IndexWriter
[junit4:junit4]   2> 88046 T12 oasu.DefaultSolrCoreState.closeIndexWriter closing IndexWriter with IndexWriterCloser
[junit4:junit4]   2> 88048 T12 oasc.SolrCore.closeSearcher [collection1] Closing main searcher on request.
[junit4:junit4]   2> 88188 T71 oaz.ClientCnxn$SendThread.startConnect Opening socket connection to server localhost.localdomain/127.0.0.1:37667
[junit4:junit4]   2> 88189 T71 oaz.ClientCnxn$SendThread.run WARNING Session 0x13a965f62290005 for server null, unexpected error, closing socket connection and attempting reconnect java.net.ConnectException: Connection refused
[junit4:junit4]   2> 	at sun.nio.ch.SocketChannelImpl.checkConnect(Native Method)
[junit4:junit4]   2> 	at sun.nio.ch.SocketChannelImpl.finishConnect(SocketChannelImpl.java:692)
[junit4:junit4]   2> 	at org.apache.zookeeper.ClientCnxn$SendThread.run(ClientCnxn.java:1143)
[junit4:junit4]   2> 
[junit4:junit4]   2> 88527 T84 oaz.ClientCnxn$SendThread.startConnect Opening socket connection to server localhost.localdomain/127.0.0.1:37667
[junit4:junit4]   2> 88528 T84 oaz.ClientCnxn$SendThread.run WARNING Session 0x13a965f62290006 for server null, unexpected error, closing socket connection and attempting reconnect java.net.ConnectException: Connection refused
[junit4:junit4]   2> 	at sun.nio.ch.SocketChannelImpl.checkConnect(Native Method)
[junit4:junit4]   2> 	at sun.nio.ch.SocketChannelImpl.finishConnect(SocketChannelImpl.java:692)
[junit4:junit4]   2> 	at org.apache.zookeeper.ClientCnxn$SendThread.run(ClientCnxn.java:1143)
[junit4:junit4]   2> 
[junit4:junit4]   2> 89157 T58 oaz.ClientCnxn$SendThread.startConnect Opening socket connection to server localhost.localdomain/127.0.0.1:37667
[junit4:junit4]   2> 89258 T59 oaz.ClientCnxn$EventThread.run EventThread shut down
[junit4:junit4]   2> 89258 T12 oaz.ZooKeeper.close Session: 0x13a965f62290004 closed
[junit4:junit4]   2> 89280 T12 oejsh.ContextHandler.doStop stopped o.e.j.s.ServletContextHandler{/solr,null}
[junit4:junit4]   2> 89331 T12 oasc.ChaosMonkey.monkeyLog monkey: stop shard! 37651
[junit4:junit4]   2> 89332 T12 oasc.CoreContainer.shutdown Shutting down CoreContainer instance=1712471992
[junit4:junit4]   2> 89493 T71 oaz.ClientCnxn$SendThread.startConnect Opening socket connection to server localhost.localdomain/127.0.0.1:37667
[junit4:junit4]   2> 89594 T72 oaz.ClientCnxn$EventThread.run EventThread shut down
[junit4:junit4]   2> 89594 T12 oaz.ZooKeeper.close Session: 0x13a965f62290005 closed
[junit4:junit4]   2> 89616 T12 oejsh.ContextHandler.doStop stopped o.e.j.s.ServletContextHandler{/solr,null}
[junit4:junit4]   2> 89667 T12 oasc.ChaosMonkey.monkeyLog monkey: stop shard! 49140
[junit4:junit4]   2> 89667 T12 oasc.CoreContainer.shutdown Shutting down CoreContainer instance=1619481279
[junit4:junit4]   2> 89667 T12 oasc.SolrCore.close [collection1]  CLOSING SolrCore org.apache.solr.core.SolrCore@56067345
[junit4:junit4]   2> 89675 T12 oasu.DirectUpdateHandler2.close closing DirectUpdateHandler2{commits=1,autocommits=0,soft autocommits=0,optimizes=0,rollbacks=0,expungeDeletes=0,docsPending=0,adds=0,deletesById=0,deletesByQuery=0,errors=0,cumulative_adds=0,cumulative_deletesById=0,cumulative_deletesByQuery=0,cumulative_errors=0}
[junit4:junit4]   2> 89676 T12 oasc.SolrCore.decrefSolrCoreState Closing SolrCoreState
[junit4:junit4]   2> 89676 T12 oasu.DefaultSolrCoreState.closeIndexWriter SolrCoreState ref count has reached 0 - closing IndexWriter
[junit4:junit4]   2> 89677 T12 oasu.DefaultSolrCoreState.closeIndexWriter closing IndexWriter with IndexWriterCloser
[junit4:junit4]   2> 89678 T12 oasc.SolrCore.closeSearcher [collection1] Closing main searcher on request.
[junit4:junit4]   2> 90353 T84 oaz.ClientCnxn$SendThread.startConnect Opening socket connection to server localhost.localdomain/127.0.0.1:37667
[junit4:junit4]   2> 90454 T85 oaz.ClientCnxn$EventThread.run EventThread shut down
[junit4:junit4]   2> 90454 T12 oaz.ZooKeeper.close Session: 0x13a965f62290006 closed
[junit4:junit4]   2> 90476 T12 oejsh.ContextHandler.doStop stopped o.e.j.s.ServletContextHandler{/solr,null}
[junit4:junit4]   2> 90544 T12 oas.SolrTestCaseJ4.tearDown ###Ending testDistribSearch
[junit4:junit4]   2> NOTE: reproduce with: ant test  -Dtestcase=SyncSliceTest -Dtests.method=testDistribSearch -Dtests.seed=665896786033E74F -Dtests.multiplier=3 -Dtests.slow=true -Dtests.locale=sr__#Latn -Dtests.timezone=Australia/Tasmania -Dtests.file.encoding=UTF-8
[junit4:junit4] FAILURE 90.5s J1 | SyncSliceTest.testDistribSearch <<<
[junit4:junit4]    > Throwable #1: java.lang.AssertionError: There are still nodes recoverying
[junit4:junit4]    > 	at __randomizedtesting.SeedInfo.seed([665896786033E74F:E7BE1860176C8773]:0)
[junit4:junit4]    > 	at org.junit.Assert.fail(Assert.java:93)
[junit4:junit4]    > 	at org.apache.solr.cloud.AbstractDistribZkTestBase.waitForRecoveriesToFinish(AbstractDistribZkTestBase.java:154)
[junit4:junit4]    > 	at org.apache.solr.cloud.AbstractFullDistribZkTestBase.waitForRecoveriesToFinish(AbstractFullDistribZkTestBase.java:563)
[junit4:junit4]    > 	at org.apache.solr.cloud.AbstractFullDistribZkTestBase.waitForThingsToLevelOut(AbstractFullDistribZkTestBase.java:1138)
[junit4:junit4]    > 	at org.apache.solr.cloud.SyncSliceTest.doTest(SyncSliceTest.java:89)
[junit4:junit4]    > 	at org.apache.solr.BaseDistributedSearchTestCase.testDistribSearch(BaseDistributedSearchTestCase.java:695)
[junit4:junit4]    > 	at sun.reflect.NativeMethodAccessorImpl.invoke0(Native Method)
[junit4:junit4]    > 	at sun.reflect.NativeMethodAccessorImpl.invoke(NativeMethodAccessorImpl.java:57)
[junit4:junit4]    > 	at sun.reflect.DelegatingMethodAccessorImpl.invoke(DelegatingMethodAccessorImpl.java:43)
[junit4:junit4]    > 	at java.lang.reflect.Method.invoke(Method.java:474)
[junit4:junit4]    > 	at com.carrotsearch.randomizedtesting.RandomizedRunner.invoke(RandomizedRunner.java:1559)
[junit4:junit4]    > 	at com.carrotsearch.randomizedtesting.RandomizedRunner.access$600(RandomizedRunner.java:79)
[junit4:junit4]    > 	at com.carrotsearch.randomizedtesting.RandomizedRunner$6.evaluate(RandomizedRunner.java:737)
[junit4:junit4]    > 	at com.carrotsearch.randomizedtesting.RandomizedRunner$7.evaluate(RandomizedRunner.java:773)
[junit4:junit4]    > 	at com.carrotsearch.randomizedtesting.RandomizedRunner$8.evaluate(RandomizedRunner.java:787)
[junit4:junit4]    > 	at com.carrotsearch.randomizedtesting.rules.SystemPropertiesRestoreRule$1.evaluate(SystemPropertiesRestoreRule.java:53)
[junit4:junit4]    > 	at org.apache.lucene.util.TestRuleSetupTeardownChained$1.evaluate(TestRuleSetupTeardownChained.java:50)
[junit4:junit4]    > 	at org.apache.lucene.util.TestRuleFieldCacheSanity$1.evaluate(TestRuleFieldCacheSanity.java:51)
[junit4:junit4]    > 	at org.apache.lucene.util.AbstractBeforeAfterRule$1.evaluate(AbstractBeforeAfterRule.java:45)
[junit4:junit4]    > 	at com.carrotsearch.randomizedtesting.rules.SystemPropertiesInvariantRule$1.evaluate(SystemPropertiesInvariantRule.java:55)
[junit4:junit4]    > 	at org.apache.lucene.util.TestRuleThreadAndTestName$1.evaluate(TestRuleThreadAndTestName.java:48)
[junit4:junit4]    > 	at org.apache.lucene.util.TestRuleIgnoreAfterMaxFailures$1.evaluate(TestRuleIgnoreAfterMaxFailures.java:70)
[junit4:junit4]    > 	at org.apache.lucene.util.TestRuleMarkFailure$1.evaluate(TestRuleMarkFailure.java:48)
[junit4:junit4]    > 	at com.carrotsearch.randomizedtesting.rules.StatementAdapter.evaluate(StatementAdapter.java:36)
[junit4:junit4]    > 	at com.carrotsearch.randomizedtesting.ThreadLeakControl$StatementRunner.run(ThreadLeakControl.java:358)
[junit4:junit4]    > 	at com.carrotsearch.randomizedtesting.ThreadLeakControl.forkTimeoutingTask(ThreadLeakControl.java:782)
[junit4:junit4]    > 	at com.carrotsearch.randomizedtesting.ThreadLeakControl$3.evaluate(ThreadLeakControl.java:442)
[junit4:junit4]    > 	at com.carrotsearch.randomizedtesting.RandomizedRunner.runSingleTest(RandomizedRunner.java:746)
[junit4:junit4]    > 	at com.carrotsearch.randomizedtesting.RandomizedRunner$3.evaluate(RandomizedRunner.java:648)
[junit4:junit4]    > 	at com.carrotsearch.randomizedtesting.RandomizedRunner$4.evaluate(RandomizedRunner.java:682)
[junit4:junit4]    > 	at com.carrotsearch.randomizedtesting.RandomizedRunner$5.evaluate(RandomizedRunner.java:693)
[junit4:junit4]    > 	at com.carrotsearch.randomizedtesting.rules.StatementAdapter.evaluate(StatementAdapter.java:36)
[junit4:junit4]    > 	at com.carrotsearch.randomizedtesting.rules.SystemPropertiesRestoreRule$1.evaluate(SystemPropertiesRestoreRule.java:53)
[junit4:junit4]    > 	at org.apache.lucene.util.AbstractBeforeAfterRule$1.evaluate(AbstractBeforeAfterRule.java:45)
[junit4:junit4]    > 	at org.apache.lucene.util.TestRuleStoreClassName$1.evaluate(TestRuleStoreClassName.java:42)
[junit4:junit4]    > 	at com.carrotsearch.randomizedtesting.rules.SystemPropertiesInvariantRule$1.evaluate(SystemPropertiesInvariantRule.java:55)
[junit4:junit4]    > 	at com.carrotsearch.randomizedtesting.rules.NoShadowingOrOverridesOnMethodsRule$1.evaluate(NoShadowingOrOverridesOnMethodsRule.java:39)
[junit4:junit4]    > 	at com.carrotsearch.randomizedtesting.rules.NoShadowingOrOverridesOnMethodsRule$1.evaluate(NoShadowingOrOverridesOnMethodsRule.java:39)
[junit4:junit4]    > 	at com.carrotsearch.randomizedtesting.rules.StatementAdapter.evaluate(StatementAdapter.java:36)
[junit4:junit4]    > 	at org.apache.lucene.util.TestRuleAssertionsRequired$1.evaluate(TestRuleAssertionsRequired.java:43)
[junit4:junit4]    > 	at org.apache.lucene.util.TestRuleMarkFailure$1.evaluate(TestRuleMarkFailure.java:48)
[junit4:junit4]    > 	at org.apache.lucene.util.TestRuleIgnoreAfterMaxFailures$1.evaluate(TestRuleIgnoreAfterMaxFailures.java:70)
[junit4:junit4]    > 	at org.apache.lucene.util.TestRuleIgnoreTestSuites$1.evaluate(TestRuleIgnoreTestSuites.java:55)
[junit4:junit4]    > 	at com.carrotsearch.randomizedtesting.rules.StatementAdapter.evaluate(StatementAdapter.java:36)
[junit4:junit4]    > 	at com.carrotsearch.randomizedtesting.ThreadLeakControl$StatementRunner.run(ThreadLeakControl.java:358)
[junit4:junit4]    > 	at java.lang.Thread.run(Thread.java:722)
[junit4:junit4]   2> 90588 T12 oas.SolrTestCaseJ4.deleteCore ###deleteCore
[junit4:junit4]   2> 211602 T12 oas.SolrTestCaseJ4.endTrackingSearchers SEVERE ERROR: SolrIndexSearcher opens=8 closes=7
[junit4:junit4]   2> 211617 T11 ccr.ThreadLeakControl.checkThreadLeaks WARNING Will linger awaiting termination of 1 leaked thread(s).
[junit4:junit4]   2> 231679 T11 ccr.ThreadLeakControl.checkThreadLeaks SEVERE 1 thread leaked from SUITE scope at org.apache.solr.cloud.SyncSliceTest: 
[junit4:junit4]   2> 	   1) Thread[id=74, name=searcherExecutor-32-thread-1, state=WAITING, group=TGRP-SyncSliceTest]
[junit4:junit4]   2> 	        at sun.misc.Unsafe.park(Native Method)
[junit4:junit4]   2> 	        at java.util.concurrent.locks.LockSupport.park(LockSupport.java:186)
[junit4:junit4]   2> 	        at java.util.concurrent.locks.AbstractQueuedSynchronizer$ConditionObject.await(AbstractQueuedSynchronizer.java:2043)
[junit4:junit4]   2> 	        at java.util.concurrent.LinkedBlockingQueue.take(LinkedBlockingQueue.java:442)
[junit4:junit4]   2> 	        at java.util.concurrent.ThreadPoolExecutor.getTask(ThreadPoolExecutor.java:1045)
[junit4:junit4]   2> 	        at java.util.concurrent.ThreadPoolExecutor.runWorker(ThreadPoolExecutor.java:1103)
[junit4:junit4]   2> 	        at java.util.concurrent.ThreadPoolExecutor$Worker.run(ThreadPoolExecutor.java:603)
[junit4:junit4]   2> 	        at java.lang.Thread.run(Thread.java:722)
[junit4:junit4]   2> 231679 T11 ccr.ThreadLeakControl.tryToInterruptAll Starting to interrupt leaked threads:
[junit4:junit4]   2> 	   1) Thread[id=74, name=searcherExecutor-32-thread-1, state=WAITING, group=TGRP-SyncSliceTest]
[junit4:junit4]   2> 234680 T11 ccr.ThreadLeakControl.tryToInterruptAll SEVERE There are still zombie threads that couldn't be terminated:
[junit4:junit4]   2> 	   1) Thread[id=74, name=searcherExecutor-32-thread-1, state=WAITING, group=TGRP-SyncSliceTest]
[junit4:junit4]   2> 	        at sun.misc.Unsafe.park(Native Method)
[junit4:junit4]   2> 	        at java.util.concurrent.locks.LockSupport.park(LockSupport.java:186)
[junit4:junit4]   2> 	        at java.util.concurrent.locks.AbstractQueuedSynchronizer$ConditionObject.await(AbstractQueuedSynchronizer.java:2043)
[junit4:junit4]   2> 	        at java.util.concurrent.LinkedBlockingQueue.take(LinkedBlockingQueue.java:442)
[junit4:junit4]   2> 	        at java.util.concurrent.ThreadPoolExecutor.getTask(ThreadPoolExecutor.java:1045)
[junit4:junit4]   2> 	        at java.util.concurrent.ThreadPoolExecutor.runWorker(ThreadPoolExecutor.java:1103)
[junit4:junit4]   2> 	        at java.util.concurrent.ThreadPoolExecutor$Worker.run(ThreadPoolExecutor.java:603)
[junit4:junit4]   2> 	        at java.lang.Thread.run(Thread.java:722)
[junit4:junit4]   2> NOTE: test params are: codec=Asserting, sim=RandomSimilarityProvider(queryNorm=true,coord=crazy): {}, locale=sr__#Latn, timezone=Australia/Tasmania
[junit4:junit4]   2> NOTE: Linux 3.2.0-32-generic amd64/Oracle Corporation 1.8.0-ea (64-bit)/cpus=8,threads=2,free=56451256,total=226885632
[junit4:junit4]   2> NOTE: All tests run in this JVM: [SyncSliceTest]
[junit4:junit4]   2> NOTE: reproduce with: ant test  -Dtestcase=SyncSliceTest -Dtests.seed=665896786033E74F -Dtests.multiplier=3 -Dtests.slow=true -Dtests.locale=sr__#Latn -Dtests.timezone=Australia/Tasmania -Dtests.file.encoding=UTF-8
[junit4:junit4] ERROR   0.00s J1 | SyncSliceTest (suite) <<<
[junit4:junit4]    > Throwable #1: java.lang.AssertionError: ERROR: SolrIndexSearcher opens=8 closes=7
[junit4:junit4]    > 	at __randomizedtesting.SeedInfo.seed([665896786033E74F]:0)
[junit4:junit4]    > 	at org.junit.Assert.fail(Assert.java:93)
[junit4:junit4]    > 	at org.apache.solr.SolrTestCaseJ4.endTrackingSearchers(SolrTestCaseJ4.java:242)
[junit4:junit4]    > 	at org.apache.solr.SolrTestCaseJ4.afterClass(SolrTestCaseJ4.java:97)
[junit4:junit4]    > 	at sun.reflect.NativeMethodAccessorImpl.invoke0(Native Method)
[junit4:junit4]    > 	at sun.reflect.NativeMethodAccessorImpl.invoke(NativeMethodAccessorImpl.java:57)
[junit4:junit4]    > 	at sun.reflect.DelegatingMethodAccessorImpl.invoke(DelegatingMethodAccessorImpl.java:43)
[junit4:junit4]    > 	at java.lang.reflect.Method.invoke(Method.java:474)
[junit4:junit4]    > 	at com.carrotsearch.randomizedtesting.RandomizedRunner.invoke(RandomizedRunner.java:1559)
[junit4:junit4]    > 	at com.carrotsearch.randomizedtesting.RandomizedRunner.access$600(RandomizedRunner.java:79)
[junit4:junit4]    > 	at com.carrotsearch.randomizedtesting.RandomizedRunner$5.evaluate(RandomizedRunner.java:700)
[junit4:junit4]    > 	at com.carrotsearch.randomizedtesting.rules.StatementAdapter.evaluate(StatementAdapter.java:36)
[junit4:junit4]    > 	at com.carrotsearch.randomizedtesting.rules.SystemPropertiesRestoreRule$1.evaluate(SystemPropertiesRestoreRule.java:53)
[junit4:junit4]    > 	at org.apache.lucene.util.AbstractBeforeAfterRule$1.evaluate(AbstractBeforeAfterRule.java:45)
[junit4:junit4]    > 	at org.apache.lucene.util.TestRuleStoreClassName$1.evaluate(TestRuleStoreClassName.java:42)
[junit4:junit4]    > 	at com.carrotsearch.randomizedtesting.rules.SystemPropertiesInvariantRule$1.evaluate(SystemPropertiesInvariantRule.java:55)
[junit4:junit4]    > 	at com.carrotsearch.randomizedtesting.rules.NoShadowingOrOverridesOnMethodsRule$1.evaluate(NoShadowingOrOverridesOnMethodsRule.java:39)
[junit4:junit4]    > 	at com.carrotsearch.randomizedtesting.rules.NoShadowingOrOverridesOnMethodsRule$1.evaluate(NoShadowingOrOverridesOnMethodsRule.java:39)
[junit4:junit4]    > 	at com.carrotsearch.randomizedtesting.rules.StatementAdapter.evaluate(StatementAdapter.java:36)
[junit4:junit4]    > 	at org.apache.lucene.util.TestRuleAssertionsRequired$1.evaluate(TestRuleAssertionsRequired.java:43)
[junit4:junit4]    > 	at org.apache.lucene.util.TestRuleMarkFailure$1.evaluate(TestRuleMarkFailure.java:48)
[junit4:junit4]    > 	at org.apache.lucene.util.TestRuleIgnoreAfterMaxFailures$1.evaluate(TestRuleIgnoreAfterMaxFailures.java:70)
[junit4:junit4]    > 	at org.apache.lucene.util.TestRuleIgnoreTestSuites$1.evaluate(TestRuleIgnoreTestSuites.java:55)
[junit4:junit4]    > 	at com.carrotsearch.randomizedtesting.rules.StatementAdapter.evaluate(StatementAdapter.java:36)
[junit4:junit4]    > 	at com.carrotsearch.randomizedtesting.ThreadLeakControl$StatementRunner.run(ThreadLeakControl.java:358)
[junit4:junit4]    > 	at java.lang.Thread.run(Thread.java:722)
[junit4:junit4]    > Throwable #2: com.carrotsearch.randomizedtesting.ThreadLeakError: 1 thread leaked from SUITE scope at org.apache.solr.cloud.SyncSliceTest: 
[junit4:junit4]    >    1) Thread[id=74, name=searcherExecutor-32-thread-1, state=WAITING, group=TGRP-SyncSliceTest]
[junit4:junit4]    >         at sun.misc.Unsafe.park(Native Method)
[junit4:junit4]    >         at java.util.concurrent.locks.LockSupport.park(LockSupport.java:186)
[junit4:junit4]    >         at java.util.concurrent.locks.AbstractQueuedSynchronizer$ConditionObject.await(AbstractQueuedSynchronizer.java:2043)
[junit4:junit4]    >         at java.util.concurrent.LinkedBlockingQueue.take(LinkedBlockingQueue.java:442)
[junit4:junit4]    >         at java.util.concurrent.ThreadPoolExecutor.getTask(ThreadPoolExecutor.java:1045)
[junit4:junit4]    >         at java.util.concurrent.ThreadPoolExecutor.runWorker(ThreadPoolExecutor.java:1103)
[junit4:junit4]    >         at java.util.concurrent.ThreadPoolExecutor$Worker.run(ThreadPoolExecutor.java:603)
[junit4:junit4]    >         at java.lang.Thread.run(Thread.java:722)
[junit4:junit4]    > 	at __randomizedtesting.SeedInfo.seed([665896786033E74F]:0)
[junit4:junit4]    > Throwable #3: com.carrotsearch.randomizedtesting.ThreadLeakError: There are still zombie threads that couldn't be terminated:
[junit4:junit4]    >    1) Thread[id=74, name=searcherExecutor-32-thread-1, state=WAITING, group=TGRP-SyncSliceTest]
[junit4:junit4]    >         at sun.misc.Unsafe.park(Native Method)
[junit4:junit4]    >         at java.util.concurrent.locks.LockSupport.park(LockSupport.java:186)
[junit4:junit4]    >         at java.util.concurrent.locks.AbstractQueuedSynchronizer$Con

[...truncated too long message...]

Linux/heapdumps -Dtests.prefix=tests -Dtests.seed=665896786033E74F -Xmx512M -Dtests.iters= -Dtests.verbose=false -Dtests.infostream=false -Dtests.lockdir=/mnt/ssd/jenkins/workspace/Lucene-Solr-trunk-Linux/lucene/build -Dtests.codec=random -Dtests.postingsformat=random -Dtests.locale=random -Dtests.timezone=random -Dtests.directory=random -Dtests.linedocsfile=europarl.lines.txt.gz -Dtests.luceneMatchVersion=5.0 -Dtests.cleanthreads=perClass -Djava.util.logging.config.file=/mnt/ssd/jenkins/workspace/Lucene-Solr-trunk-Linux/solr/testlogging.properties -Dtests.nightly=false -Dtests.weekly=false -Dtests.slow=true -Dtests.asserts.gracious=false -Dtests.multiplier=3 -DtempDir=. -Djava.io.tmpdir=. -Dtests.sandbox.dir=/mnt/ssd/jenkins/workspace/Lucene-Solr-trunk-Linux/solr/build/solr-core -Dclover.db.dir=/mnt/ssd/jenkins/workspace/Lucene-Solr-trunk-Linux/lucene/build/clover/db -Djava.security.manager=org.apache.lucene.util.TestSecurityManager -Djava.security.policy=/mnt/ssd/jenkins/workspace/Lucene-Solr-trunk-Linux/lucene/tools/junit4/tests.policy -Dlucene.version=5.0-SNAPSHOT -Djetty.testMode=1 -Djetty.insecurerandom=1 -Dsolr.directoryFactory=org.apache.solr.core.MockDirectoryFactory -Djava.awt.headless=true -classpath /mnt/ssd/jenkins/workspace/Lucene-Solr-trunk-Linux/solr/build/solr-core/classes/test:/mnt/ssd/jenkins/workspace/Lucene-Solr-trunk-Linux/solr/build/solr-test-framework/classes/java:/mnt/ssd/jenkins/workspace/Lucene-Solr-trunk-Linux/solr/build/solr-core/test-files:/mnt/ssd/jenkins/workspace/Lucene-Solr-trunk-Linux/lucene/build/test-framework/classes/java:/mnt/ssd/jenkins/workspace/Lucene-Solr-trunk-Linux/lucene/build/codecs/classes/java:/mnt/ssd/jenkins/workspace/Lucene-Solr-trunk-Linux/solr/build/solr-solrj/classes/java:/mnt/ssd/jenkins/workspace/Lucene-Solr-trunk-Linux/solr/build/solr-core/classes/java:/mnt/ssd/jenkins/workspace/Lucene-Solr-trunk-Linux/lucene/build/analysis/common/lucene-analyzers-common-5.0-SNAPSHOT.jar:/mnt/ssd/jenkins/workspace/Lucene-Solr-trunk-Linux/lucene/build/analysis/kuromoji/lucene-analyzers-kuromoji-5.0-SNAPSHOT.jar:/mnt/ssd/jenkins/workspace/Lucene-Solr-trunk-Linux/lucene/build/analysis/phonetic/lucene-analyzers-phonetic-5.0-SNAPSHOT.jar:/mnt/ssd/jenkins/workspace/Lucene-Solr-trunk-Linux/lucene/build/highlighter/lucene-highlighter-5.0-SNAPSHOT.jar:/mnt/ssd/jenkins/workspace/Lucene-Solr-trunk-Linux/lucene/build/memory/lucene-memory-5.0-SNAPSHOT.jar:/mnt/ssd/jenkins/workspace/Lucene-Solr-trunk-Linux/lucene/build/misc/lucene-misc-5.0-SNAPSHOT.jar:/mnt/ssd/jenkins/workspace/Lucene-Solr-trunk-Linux/lucene/build/spatial/lucene-spatial-5.0-SNAPSHOT.jar:/mnt/ssd/jenkins/workspace/Lucene-Solr-trunk-Linux/lucene/build/suggest/lucene-suggest-5.0-SNAPSHOT.jar:/mnt/ssd/jenkins/workspace/Lucene-Solr-trunk-Linux/lucene/build/grouping/lucene-grouping-5.0-SNAPSHOT.jar:/mnt/ssd/jenkins/workspace/Lucene-Solr-trunk-Linux/lucene/build/queries/lucene-queries-5.0-SNAPSHOT.jar:/mnt/ssd/jenkins/workspace/Lucene-Solr-trunk-Linux/lucene/build/queryparser/lucene-queryparser-5.0-SNAPSHOT.jar:/mnt/ssd/jenkins/workspace/Lucene-Solr-trunk-Linux/solr/core/lib/commons-cli-1.2.jar:/mnt/ssd/jenkins/workspace/Lucene-Solr-trunk-Linux/solr/core/lib/commons-codec-1.7.jar:/mnt/ssd/jenkins/workspace/Lucene-Solr-trunk-Linux/solr/core/lib/commons-fileupload-1.2.1.jar:/mnt/ssd/jenkins/workspace/Lucene-Solr-trunk-Linux/solr/core/lib/commons-lang-2.6.jar:/mnt/ssd/jenkins/workspace/Lucene-Solr-trunk-Linux/solr/core/lib/easymock-2.2.jar:/mnt/ssd/jenkins/workspace/Lucene-Solr-trunk-Linux/solr/core/lib/guava-r05.jar:/mnt/ssd/jenkins/workspace/Lucene-Solr-trunk-Linux/solr/core/lib/javax.servlet-api-3.0.1.jar:/mnt/ssd/jenkins/workspace/Lucene-Solr-trunk-Linux/solr/core/lib/spatial4j-0.3.jar:/mnt/ssd/jenkins/workspace/Lucene-Solr-trunk-Linux/solr/solrj/lib/commons-io-2.1.jar:/mnt/ssd/jenkins/workspace/Lucene-Solr-trunk-Linux/solr/solrj/lib/httpclient-4.1.3.jar:/mnt/ssd/jenkins/workspace/Lucene-Solr-trunk-Linux/solr/solrj/lib/httpcore-4.1.4.jar:/mnt/ssd/jenkins/workspace/Lucene-Solr-trunk-Linux/solr/solrj/lib/httpmime-4.1.3.jar:/mnt/ssd/jenkins/workspace/Lucene-Solr-trunk-Linux/solr/solrj/lib/jcl-over-slf4j-1.6.4.jar:/mnt/ssd/jenkins/workspace/Lucene-Solr-trunk-Linux/solr/solrj/lib/log4j-over-slf4j-1.6.4.jar:/mnt/ssd/jenkins/workspace/Lucene-Solr-trunk-Linux/solr/solrj/lib/slf4j-api-1.6.4.jar:/mnt/ssd/jenkins/workspace/Lucene-Solr-trunk-Linux/solr/solrj/lib/slf4j-jdk14-1.6.4.jar:/mnt/ssd/jenkins/workspace/Lucene-Solr-trunk-Linux/solr/solrj/lib/wstx-asl-3.2.7.jar:/mnt/ssd/jenkins/workspace/Lucene-Solr-trunk-Linux/solr/solrj/lib/zookeeper-3.3.6.jar:/mnt/ssd/jenkins/workspace/Lucene-Solr-trunk-Linux/solr/example/lib/jetty-continuation-8.1.2.v20120308.jar:/mnt/ssd/jenkins/workspace/Lucene-Solr-trunk-Linux/solr/example/lib/jetty-deploy-8.1.2.v20120308.jar:/mnt/ssd/jenkins/workspace/Lucene-Solr-trunk-Linux/solr/example/lib/jetty-http-8.1.2.v20120308.jar:/mnt/ssd/jenkins/workspace/Lucene-Solr-trunk-Linux/solr/example/lib/jetty-io-8.1.2.v20120308.jar:/mnt/ssd/jenkins/workspace/Lucene-Solr-trunk-Linux/solr/example/lib/jetty-jmx-8.1.2.v20120308.jar:/mnt/ssd/jenkins/workspace/Lucene-Solr-trunk-Linux/solr/example/lib/jetty-security-8.1.2.v20120308.jar:/mnt/ssd/jenkins/workspace/Lucene-Solr-trunk-Linux/solr/example/lib/jetty-server-8.1.2.v20120308.jar:/mnt/ssd/jenkins/workspace/Lucene-Solr-trunk-Linux/solr/example/lib/jetty-servlet-8.1.2.v20120308.jar:/mnt/ssd/jenkins/workspace/Lucene-Solr-trunk-Linux/solr/example/lib/jetty-util-8.1.2.v20120308.jar:/mnt/ssd/jenkins/workspace/Lucene-Solr-trunk-Linux/solr/example/lib/jetty-webapp-8.1.2.v20120308.jar:/mnt/ssd/jenkins/workspace/Lucene-Solr-trunk-Linux/solr/example/lib/jetty-xml-8.1.2.v20120308.jar:/mnt/ssd/jenkins/workspace/Lucene-Solr-trunk-Linux/solr/example/lib/servlet-api-3.0.jar:/mnt/ssd/jenkins/workspace/Lucene-Solr-trunk-Linux/solr/example/example-DIH/solr/db/lib/hsqldb-1.8.0.10.jar:/mnt/ssd/jenkins/workspace/Lucene-Solr-trunk-Linux/lucene/build/core/classes/java:/mnt/ssd/jenkins/workspace/Lucene-Solr-trunk-Linux/lucene/test-framework/lib/junit-4.10.jar:/mnt/ssd/jenkins/workspace/Lucene-Solr-trunk-Linux/lucene/test-framework/lib/randomizedtesting-runner-2.0.3.jar:/var/lib/jenkins/tools/Ant/ANT_1.8.2/lib/ant-launcher.jar:/var/lib/jenkins/.ant/lib/ivy-2.2.0.jar:/var/lib/jenkins/tools/Ant/ANT_1.8.2/lib/ant-jdepend.jar:/var/lib/jenkins/tools/Ant/ANT_1.8.2/lib/ant-netrexx.jar:/var/lib/jenkins/tools/Ant/ANT_1.8.2/lib/ant-antlr.jar:/var/lib/jenkins/tools/Ant/ANT_1.8.2/lib/ant-commons-net.jar:/var/lib/jenkins/tools/Ant/ANT_1.8.2/lib/ant-javamail.jar:/var/lib/jenkins/tools/Ant/ANT_1.8.2/lib/ant-apache-regexp.jar:/var/lib/jenkins/tools/Ant/ANT_1.8.2/lib/ant-jsch.jar:/var/lib/jenkins/tools/Ant/ANT_1.8.2/lib/ant-apache-xalan2.jar:/var/lib/jenkins/tools/Ant/ANT_1.8.2/lib/ant-junit4.jar:/var/lib/jenkins/tools/Ant/ANT_1.8.2/lib/ant-jmf.jar:/var/lib/jenkins/tools/Ant/ANT_1.8.2/lib/ant.jar:/var/lib/jenkins/tools/Ant/ANT_1.8.2/lib/ant-junit.jar:/var/lib/jenkins/tools/Ant/ANT_1.8.2/lib/ant-apache-bcel.jar:/var/lib/jenkins/tools/Ant/ANT_1.8.2/lib/ant-jai.jar:/var/lib/jenkins/tools/Ant/ANT_1.8.2/lib/ant-commons-logging.jar:/var/lib/jenkins/tools/Ant/ANT_1.8.2/lib/ant-apache-resolver.jar:/var/lib/jenkins/tools/Ant/ANT_1.8.2/lib/ant-apache-oro.jar:/var/lib/jenkins/tools/Ant/ANT_1.8.2/lib/ant-swing.jar:/var/lib/jenkins/tools/Ant/ANT_1.8.2/lib/ant-apache-bsf.jar:/var/lib/jenkins/tools/Ant/ANT_1.8.2/lib/ant-apache-log4j.jar:/var/lib/jenkins/tools/Ant/ANT_1.8.2/lib/ant-testutil.jar:/mnt/ssd/jenkins/tools/java/64bit/jdk1.8.0-ea-b58/lib/tools.jar:/var/lib/jenkins/.ivy2/cache/com.carrotsearch.randomizedtesting/junit4-ant/jars/junit4-ant-2.0.3.jar -ea:org.apache.lucene... -ea:org.apache.solr... com.carrotsearch.ant.tasks.junit4.slave.SlaveMainSafe -eventsfile /mnt/ssd/jenkins/workspace/Lucene-Solr-trunk-Linux/solr/build/solr-core/test/junit4-J0-20121025_052242_487.events @/mnt/ssd/jenkins/workspace/Lucene-Solr-trunk-Linux/solr/build/solr-core/test/junit4-J0-20121025_052242_487.suites
[junit4:junit4] ERROR: JVM J0 ended with an exception: Forked process exited with an error code: 134
[junit4:junit4] 	at com.carrotsearch.ant.tasks.junit4.JUnit4.forkProcess(JUnit4.java:1312)
[junit4:junit4] 	at com.carrotsearch.ant.tasks.junit4.JUnit4.executeSlave(JUnit4.java:1178)
[junit4:junit4] 	at com.carrotsearch.ant.tasks.junit4.JUnit4.access$000(JUnit4.java:65)
[junit4:junit4] 	at com.carrotsearch.ant.tasks.junit4.JUnit4$2.call(JUnit4.java:813)
[junit4:junit4] 	at com.carrotsearch.ant.tasks.junit4.JUnit4$2.call(JUnit4.java:810)
[junit4:junit4] 	at java.util.concurrent.FutureTask.run(FutureTask.java:262)
[junit4:junit4] 	at java.util.concurrent.ThreadPoolExecutor.runWorker(ThreadPoolExecutor.java:1110)
[junit4:junit4] 	at java.util.concurrent.ThreadPoolExecutor$Worker.run(ThreadPoolExecutor.java:603)
[junit4:junit4] 	at java.lang.Thread.run(Thread.java:722)

BUILD FAILED
/mnt/ssd/jenkins/workspace/Lucene-Solr-trunk-Linux/build.xml:335: The following error occurred while executing this line:
/mnt/ssd/jenkins/workspace/Lucene-Solr-trunk-Linux/build.xml:39: The following error occurred while executing this line:
/mnt/ssd/jenkins/workspace/Lucene-Solr-trunk-Linux/solr/build.xml:178: The following error occurred while executing this line:
/mnt/ssd/jenkins/workspace/Lucene-Solr-trunk-Linux/lucene/module-build.xml:61: The following error occurred while executing this line:
/mnt/ssd/jenkins/workspace/Lucene-Solr-trunk-Linux/lucene/common-build.xml:1169: The following error occurred while executing this line:
/mnt/ssd/jenkins/workspace/Lucene-Solr-trunk-Linux/lucene/common-build.xml:837: At least one slave process threw an exception, first: Forked process exited with an error code: 134

Total time: 17 minutes 51 seconds
Build step 'Invoke Ant' marked build as failure
Archiving artifacts
Recording test results
Description set: Java: 64bit/jdk1.8.0-ea-b58 -XX:+UseParallelGC
Email was triggered for: Failure
Sending email for trigger: Failure



Mime
View raw message