lucene-dev mailing list archives

Site index · List index
Message view « Date » · « Thread »
Top « Date » · « Thread »
From Policeman Jenkins Server <jenk...@sd-datasolutions.de>
Subject [JENKINS] Lucene-Solr-trunk-Windows (32bit/jdk1.7.0_07) - Build # 1303 - Still Failing!
Date Thu, 25 Oct 2012 20:09:04 GMT
Build: http://jenkins.sd-datasolutions.de/job/Lucene-Solr-trunk-Windows/1303/
Java: 32bit/jdk1.7.0_07 -server -XX:+UseSerialGC

1 tests failed.
REGRESSION:  org.apache.solr.cloud.ZkControllerTest.testUploadToCloud

Error Message:
KeeperErrorCode = Session expired for /configs/config1/lang/stoptags_ja.txt

Stack Trace:
org.apache.zookeeper.KeeperException$SessionExpiredException: KeeperErrorCode = Session expired for /configs/config1/lang/stoptags_ja.txt
	at __randomizedtesting.SeedInfo.seed([1BEA3992F5175C03:3E874F77A0154730]:0)
	at org.apache.zookeeper.KeeperException.create(KeeperException.java:118)
	at org.apache.zookeeper.KeeperException.create(KeeperException.java:42)
	at org.apache.zookeeper.ZooKeeper.create(ZooKeeper.java:643)
	at org.apache.solr.common.cloud.SolrZkClient$10.execute(SolrZkClient.java:399)
	at org.apache.solr.common.cloud.ZkCmdExecutor.retryOperation(ZkCmdExecutor.java:63)
	at org.apache.solr.common.cloud.SolrZkClient.makePath(SolrZkClient.java:396)
	at org.apache.solr.common.cloud.SolrZkClient.makePath(SolrZkClient.java:306)
	at org.apache.solr.cloud.ZkController.uploadToZK(ZkController.java:1008)
	at org.apache.solr.cloud.ZkController.uploadToZK(ZkController.java:1010)
	at org.apache.solr.cloud.ZkController.uploadToZK(ZkController.java:841)
	at org.apache.solr.cloud.ZkControllerTest.testUploadToCloud(ZkControllerTest.java:134)
	at sun.reflect.NativeMethodAccessorImpl.invoke0(Native Method)
	at sun.reflect.NativeMethodAccessorImpl.invoke(NativeMethodAccessorImpl.java:57)
	at sun.reflect.DelegatingMethodAccessorImpl.invoke(DelegatingMethodAccessorImpl.java:43)
	at java.lang.reflect.Method.invoke(Method.java:601)
	at com.carrotsearch.randomizedtesting.RandomizedRunner.invoke(RandomizedRunner.java:1559)
	at com.carrotsearch.randomizedtesting.RandomizedRunner.access$600(RandomizedRunner.java:79)
	at com.carrotsearch.randomizedtesting.RandomizedRunner$6.evaluate(RandomizedRunner.java:737)
	at com.carrotsearch.randomizedtesting.RandomizedRunner$7.evaluate(RandomizedRunner.java:773)
	at com.carrotsearch.randomizedtesting.RandomizedRunner$8.evaluate(RandomizedRunner.java:787)
	at com.carrotsearch.randomizedtesting.rules.SystemPropertiesRestoreRule$1.evaluate(SystemPropertiesRestoreRule.java:53)
	at org.apache.lucene.util.TestRuleSetupTeardownChained$1.evaluate(TestRuleSetupTeardownChained.java:50)
	at org.apache.lucene.util.TestRuleFieldCacheSanity$1.evaluate(TestRuleFieldCacheSanity.java:51)
	at org.apache.lucene.util.AbstractBeforeAfterRule$1.evaluate(AbstractBeforeAfterRule.java:45)
	at com.carrotsearch.randomizedtesting.rules.SystemPropertiesInvariantRule$1.evaluate(SystemPropertiesInvariantRule.java:55)
	at org.apache.lucene.util.TestRuleThreadAndTestName$1.evaluate(TestRuleThreadAndTestName.java:48)
	at org.apache.lucene.util.TestRuleIgnoreAfterMaxFailures$1.evaluate(TestRuleIgnoreAfterMaxFailures.java:70)
	at org.apache.lucene.util.TestRuleMarkFailure$1.evaluate(TestRuleMarkFailure.java:48)
	at com.carrotsearch.randomizedtesting.rules.StatementAdapter.evaluate(StatementAdapter.java:36)
	at com.carrotsearch.randomizedtesting.ThreadLeakControl$StatementRunner.run(ThreadLeakControl.java:358)
	at com.carrotsearch.randomizedtesting.ThreadLeakControl.forkTimeoutingTask(ThreadLeakControl.java:782)
	at com.carrotsearch.randomizedtesting.ThreadLeakControl$3.evaluate(ThreadLeakControl.java:442)
	at com.carrotsearch.randomizedtesting.RandomizedRunner.runSingleTest(RandomizedRunner.java:746)
	at com.carrotsearch.randomizedtesting.RandomizedRunner$3.evaluate(RandomizedRunner.java:648)
	at com.carrotsearch.randomizedtesting.RandomizedRunner$4.evaluate(RandomizedRunner.java:682)
	at com.carrotsearch.randomizedtesting.RandomizedRunner$5.evaluate(RandomizedRunner.java:693)
	at com.carrotsearch.randomizedtesting.rules.StatementAdapter.evaluate(StatementAdapter.java:36)
	at com.carrotsearch.randomizedtesting.rules.SystemPropertiesRestoreRule$1.evaluate(SystemPropertiesRestoreRule.java:53)
	at org.apache.lucene.util.AbstractBeforeAfterRule$1.evaluate(AbstractBeforeAfterRule.java:45)
	at org.apache.lucene.util.TestRuleStoreClassName$1.evaluate(TestRuleStoreClassName.java:42)
	at com.carrotsearch.randomizedtesting.rules.SystemPropertiesInvariantRule$1.evaluate(SystemPropertiesInvariantRule.java:55)
	at com.carrotsearch.randomizedtesting.rules.NoShadowingOrOverridesOnMethodsRule$1.evaluate(NoShadowingOrOverridesOnMethodsRule.java:39)
	at com.carrotsearch.randomizedtesting.rules.NoShadowingOrOverridesOnMethodsRule$1.evaluate(NoShadowingOrOverridesOnMethodsRule.java:39)
	at com.carrotsearch.randomizedtesting.rules.StatementAdapter.evaluate(StatementAdapter.java:36)
	at org.apache.lucene.util.TestRuleAssertionsRequired$1.evaluate(TestRuleAssertionsRequired.java:43)
	at org.apache.lucene.util.TestRuleMarkFailure$1.evaluate(TestRuleMarkFailure.java:48)
	at org.apache.lucene.util.TestRuleIgnoreAfterMaxFailures$1.evaluate(TestRuleIgnoreAfterMaxFailures.java:70)
	at org.apache.lucene.util.TestRuleIgnoreTestSuites$1.evaluate(TestRuleIgnoreTestSuites.java:55)
	at com.carrotsearch.randomizedtesting.rules.StatementAdapter.evaluate(StatementAdapter.java:36)
	at com.carrotsearch.randomizedtesting.ThreadLeakControl$StatementRunner.run(ThreadLeakControl.java:358)
	at java.lang.Thread.run(Thread.java:722)




Build Log:
[...truncated 8469 lines...]
[junit4:junit4] Suite: org.apache.solr.cloud.ZkControllerTest
[junit4:junit4]   2> 0 T81 oas.SolrTestCaseJ4.initCore ####initCore
[junit4:junit4]   2> Creating dataDir: C:\Users\JenkinsSlave\workspace\Lucene-Solr-trunk-Windows\solr\build\solr-core\test\J0\.\solrtest-ZkControllerTest-1351194691264
[junit4:junit4]   2> 2 T81 oas.SolrTestCaseJ4.initCore ####initCore end
[junit4:junit4]   2> 5 T81 oas.SolrTestCaseJ4.setUp ###Starting testReadConfigName
[junit4:junit4]   2> 12 T81 oasc.ZkTestServer.run STARTING ZK TEST SERVER
[junit4:junit4]   2> 131 T82 oaz.Environment.logEnv Server environment:zookeeper.version=3.3.6-1366786, built on 07/29/2012 06:22 GMT
[junit4:junit4]   2> 132 T82 oaz.Environment.logEnv Server environment:host.name=JenkinsSlave-PC
[junit4:junit4]   2> 132 T82 oaz.Environment.logEnv Server environment:java.version=1.7.0_07
[junit4:junit4]   2> 132 T82 oaz.Environment.logEnv Server environment:java.vendor=Oracle Corporation
[junit4:junit4]   2> 132 T82 oaz.Environment.logEnv Server environment:java.home=C:\Users\JenkinsSlave\tools\java\32bit\jdk1.7.0_07\jre
[junit4:junit4]   2> 135 T82 oaz.Environment.logEnv Server environment:java.class.path=C:\Users\JenkinsSlave\workspace\Lucene-Solr-trunk-Windows\solr\build\solr-core\classes\test;C:\Users\JenkinsSlave\workspace\Lucene-Solr-trunk-Windows\solr\build\solr-test-framework\classes\java;C:\Users\JenkinsSlave\workspace\Lucene-Solr-trunk-Windows\solr\build\solr-core\test-files;C:\Users\JenkinsSlave\workspace\Lucene-Solr-trunk-Windows\lucene\build\test-framework\classes\java;C:\Users\JenkinsSlave\workspace\Lucene-Solr-trunk-Windows\lucene\build\codecs\classes\java;C:\Users\JenkinsSlave\workspace\Lucene-Solr-trunk-Windows\solr\build\solr-solrj\classes\java;C:\Users\JenkinsSlave\workspace\Lucene-Solr-trunk-Windows\solr\build\solr-core\classes\java;C:\Users\JenkinsSlave\workspace\Lucene-Solr-trunk-Windows\lucene\build\analysis\common\lucene-analyzers-common-5.0-SNAPSHOT.jar;C:\Users\JenkinsSlave\workspace\Lucene-Solr-trunk-Windows\lucene\build\analysis\kuromoji\lucene-analyzers-kuromoji-5.0-SNAPSHOT.jar;C:\Users\JenkinsSlave\workspace\Lucene-Solr-trunk-Windows\lucene\build\analysis\phonetic\lucene-analyzers-phonetic-5.0-SNAPSHOT.jar;C:\Users\JenkinsSlave\workspace\Lucene-Solr-trunk-Windows\lucene\build\highlighter\lucene-highlighter-5.0-SNAPSHOT.jar;C:\Users\JenkinsSlave\workspace\Lucene-Solr-trunk-Windows\lucene\build\memory\lucene-memory-5.0-SNAPSHOT.jar;C:\Users\JenkinsSlave\workspace\Lucene-Solr-trunk-Windows\lucene\build\misc\lucene-misc-5.0-SNAPSHOT.jar;C:\Users\JenkinsSlave\workspace\Lucene-Solr-trunk-Windows\lucene\build\spatial\lucene-spatial-5.0-SNAPSHOT.jar;C:\Users\JenkinsSlave\workspace\Lucene-Solr-trunk-Windows\lucene\build\suggest\lucene-suggest-5.0-SNAPSHOT.jar;C:\Users\JenkinsSlave\workspace\Lucene-Solr-trunk-Windows\lucene\build\grouping\lucene-grouping-5.0-SNAPSHOT.jar;C:\Users\JenkinsSlave\workspace\Lucene-Solr-trunk-Windows\lucene\build\queries\lucene-queries-5.0-SNAPSHOT.jar;C:\Users\JenkinsSlave\workspace\Lucene-Solr-trunk-Windows\lucene\build\queryparser\lucene-queryparser-5.0-SNAPSHOT.jar;C:\Users\JenkinsSlave\workspace\Lucene-Solr-trunk-Windows\solr\core\lib\commons-cli-1.2.jar;C:\Users\JenkinsSlave\workspace\Lucene-Solr-trunk-Windows\solr\core\lib\commons-codec-1.7.jar;C:\Users\JenkinsSlave\workspace\Lucene-Solr-trunk-Windows\solr\core\lib\commons-fileupload-1.2.1.jar;C:\Users\JenkinsSlave\workspace\Lucene-Solr-trunk-Windows\solr\core\lib\commons-lang-2.6.jar;C:\Users\JenkinsSlave\workspace\Lucene-Solr-trunk-Windows\solr\core\lib\easymock-2.2.jar;C:\Users\JenkinsSlave\workspace\Lucene-Solr-trunk-Windows\solr\core\lib\guava-r05.jar;C:\Users\JenkinsSlave\workspace\Lucene-Solr-trunk-Windows\solr\core\lib\javax.servlet-api-3.0.1.jar;C:\Users\JenkinsSlave\workspace\Lucene-Solr-trunk-Windows\solr\core\lib\spatial4j-0.3.jar;C:\Users\JenkinsSlave\workspace\Lucene-Solr-trunk-Windows\solr\solrj\lib\commons-io-2.1.jar;C:\Users\JenkinsSlave\workspace\Lucene-Solr-trunk-Windows\solr\solrj\lib\httpclient-4.1.3.jar;C:\Users\JenkinsSlave\workspace\Lucene-Solr-trunk-Windows\solr\solrj\lib\httpcore-4.1.4.jar;C:\Users\JenkinsSlave\workspace\Lucene-Solr-trunk-Windows\solr\solrj\lib\httpmime-4.1.3.jar;C:\Users\JenkinsSlave\workspace\Lucene-Solr-trunk-Windows\solr\solrj\lib\jcl-over-slf4j-1.6.4.jar;C:\Users\JenkinsSlave\workspace\Lucene-Solr-trunk-Windows\solr\solrj\lib\log4j-over-slf4j-1.6.4.jar;C:\Users\JenkinsSlave\workspace\Lucene-Solr-trunk-Windows\solr\solrj\lib\slf4j-api-1.6.4.jar;C:\Users\JenkinsSlave\workspace\Lucene-Solr-trunk-Windows\solr\solrj\lib\slf4j-jdk14-1.6.4.jar;C:\Users\JenkinsSlave\workspace\Lucene-Solr-trunk-Windows\solr\solrj\lib\wstx-asl-3.2.7.jar;C:\Users\JenkinsSlave\workspace\Lucene-Solr-trunk-Windows\solr\solrj\lib\zookeeper-3.3.6.jar;C:\Users\JenkinsSlave\workspace\Lucene-Solr-trunk-Windows\solr\example\lib\jetty-continuation-8.1.2.v20120308.jar;C:\Users\JenkinsSlave\workspace\Lucene-Solr-trunk-Windows\solr\example\lib\jetty-deploy-8.1.2.v20120308.jar;C:\Users\JenkinsSlave\workspace\Lucene-Solr-trunk-Windows\solr\example\lib\jetty-http-8.1.2.v20120308.jar;C:\Users\JenkinsSlave\workspace\Lucene-Solr-trunk-Windows\solr\example\lib\jetty-io-8.1.2.v20120308.jar;C:\Users\JenkinsSlave\workspace\Lucene-Solr-trunk-Windows\solr\example\lib\jetty-jmx-8.1.2.v20120308.jar;C:\Users\JenkinsSlave\workspace\Lucene-Solr-trunk-Windows\solr\example\lib\jetty-security-8.1.2.v20120308.jar;C:\Users\JenkinsSlave\workspace\Lucene-Solr-trunk-Windows\solr\example\lib\jetty-server-8.1.2.v20120308.jar;C:\Users\JenkinsSlave\workspace\Lucene-Solr-trunk-Windows\solr\example\lib\jetty-servlet-8.1.2.v20120308.jar;C:\Users\JenkinsSlave\workspace\Lucene-Solr-trunk-Windows\solr\example\lib\jetty-util-8.1.2.v20120308.jar;C:\Users\JenkinsSlave\workspace\Lucene-Solr-trunk-Windows\solr\example\lib\jetty-webapp-8.1.2.v20120308.jar;C:\Users\JenkinsSlave\workspace\Lucene-Solr-trunk-Windows\solr\example\lib\jetty-xml-8.1.2.v20120308.jar;C:\Users\JenkinsSlave\workspace\Lucene-Solr-trunk-Windows\solr\example\lib\servlet-api-3.0.jar;C:\Users\JenkinsSlave\workspace\Lucene-Solr-trunk-Windows\solr\example\example-DIH\solr\db\lib\hsqldb-1.8.0.10.jar;C:\Users\JenkinsSlave\workspace\Lucene-Solr-trunk-Windows\lucene\build\core\classes\java;C:\Users\JenkinsSlave\workspace\Lucene-Solr-trunk-Windows\lucene\test-framework\lib\junit-4.10.jar;C:\Users\JenkinsSlave\workspace\Lucene-Solr-trunk-Windows\lucene\test-framework\lib\randomizedtesting-runner-2.0.3.jar;C:\Users\JenkinsSlave\tools\Ant\ANT_1.8.2\lib\ant-launcher.jar;C:\Users\JenkinsSlave\.ant\lib\ivy-2.2.0.jar;C:\Users\JenkinsSlave\tools\Ant\ANT_1.8.2\lib\ant-antlr.jar;C:\Users\JenkinsSlave\tools\Ant\ANT_1.8.2\lib\ant-apache-bcel.jar;C:\Users\JenkinsSlave\tools\Ant\ANT_1.8.2\lib\ant-apache-bsf.jar;C:\Users\JenkinsSlave\tools\Ant\ANT_1.8.2\lib\ant-apache-log4j.jar;C:\Users\JenkinsSlave\tools\Ant\ANT_1.8.2\lib\ant-apache-oro.jar;C:\Users\JenkinsSlave\tools\Ant\ANT_1.8.2\lib\ant-apache-regexp.jar;C:\Users\JenkinsSlave\tools\Ant\ANT_1.8.2\lib\ant-apache-resolver.jar;C:\Users\JenkinsSlave\tools\Ant\ANT_1.8.2\lib\ant-apache-xalan2.jar;C:\Users\JenkinsSlave\tools\Ant\ANT_1.8.2\lib\ant-commons-logging.jar;C:\Users\JenkinsSlave\tools\Ant\ANT_1.8.2\lib\ant-commons-net.jar;C:\Users\JenkinsSlave\tools\Ant\ANT_1.8.2\lib\ant-jai.jar;C:\Users\JenkinsSlave\tools\Ant\ANT_1.8.2\lib\ant-javamail.jar;C:\Users\JenkinsSlave\tools\Ant\ANT_1.8.2\lib\ant-jdepend.jar;C:\Users\JenkinsSlave\tools\Ant\ANT_1.8.2\lib\ant-jmf.jar;C:\Users\JenkinsSlave\tools\Ant\ANT_1.8.2\lib\ant-jsch.jar;C:\Users\JenkinsSlave\tools\Ant\ANT_1.8.2\lib\ant-junit.jar;C:\Users\JenkinsSlave\tools\Ant\ANT_1.8.2\lib\ant-junit4.jar;C:\Users\JenkinsSlave\tools\Ant\ANT_1.8.2\lib\ant-netrexx.jar;C:\Users\JenkinsSlave\tools\Ant\ANT_1.8.2\lib\ant-swing.jar;C:\Users\JenkinsSlave\tools\Ant\ANT_1.8.2\lib\ant-testutil.jar;C:\Users\JenkinsSlave\tools\Ant\ANT_1.8.2\lib\ant.jar;C:\Users\JenkinsSlave\tools\java\32bit\jdk1.7.0_07\lib\tools.jar;C:\Users\JenkinsSlave\.ivy2\cache\com.carrotsearch.randomizedtesting\junit4-ant\jars\junit4-ant-2.0.3.jar
[junit4:junit4]   2> 137 T82 oaz.Environment.logEnv Server environment:java.library.path=C:\Users\JenkinsSlave\tools\java\32bit\jdk1.7.0_07\jre\bin;C:\Windows\Sun\Java\bin;C:\Windows\system32;C:\Windows;C:\Users\JenkinsSlave\tools\java\32bit\jdk1.7.0_07\bin;C:\Windows\system32;C:\Windows;C:\Windows\System32\Wbem;C:\Windows\System32\WindowsPowerShell\v1.0\;C:\Program Files (x86)\Subversion\bin;.
[junit4:junit4]   2> 137 T82 oaz.Environment.logEnv Server environment:java.io.tmpdir=.
[junit4:junit4]   2> 137 T82 oaz.Environment.logEnv Server environment:java.compiler=<NA>
[junit4:junit4]   2> 137 T82 oaz.Environment.logEnv Server environment:os.name=Windows 7
[junit4:junit4]   2> 137 T82 oaz.Environment.logEnv Server environment:os.arch=x86
[junit4:junit4]   2> 137 T82 oaz.Environment.logEnv Server environment:os.version=6.1
[junit4:junit4]   2> 137 T82 oaz.Environment.logEnv Server environment:user.name=JenkinsSlave
[junit4:junit4]   2> 137 T82 oaz.Environment.logEnv Server environment:user.home=C:\Users\JenkinsSlave
[junit4:junit4]   2> 137 T82 oaz.Environment.logEnv Server environment:user.dir=C:\Users\JenkinsSlave\workspace\Lucene-Solr-trunk-Windows\solr\build\solr-core\test\J0
[junit4:junit4]   2> 174 T82 oazs.ZooKeeperServer.setTickTime tickTime set to 1000
[junit4:junit4]   2> 203 T82 oazs.NIOServerCnxn$Factory.<init> binding to port 0.0.0.0/0.0.0.0:0
[junit4:junit4]   2> 237 T81 oasc.ZkTestServer.run start zk server on port:59622
[junit4:junit4]   2> 270 T82 oazsp.FileTxnSnapLog.save Snapshotting: 0
[junit4:junit4]   2> 365 T81 oaz.Environment.logEnv Client environment:zookeeper.version=3.3.6-1366786, built on 07/29/2012 06:22 GMT
[junit4:junit4]   2> 365 T81 oaz.Environment.logEnv Client environment:host.name=JenkinsSlave-PC
[junit4:junit4]   2> 366 T81 oaz.Environment.logEnv Client environment:java.version=1.7.0_07
[junit4:junit4]   2> 366 T81 oaz.Environment.logEnv Client environment:java.vendor=Oracle Corporation
[junit4:junit4]   2> 367 T81 oaz.Environment.logEnv Client environment:java.home=C:\Users\JenkinsSlave\tools\java\32bit\jdk1.7.0_07\jre
[junit4:junit4]   2> 367 T81 oaz.Environment.logEnv Client environment:java.class.path=C:\Users\JenkinsSlave\workspace\Lucene-Solr-trunk-Windows\solr\build\solr-core\classes\test;C:\Users\JenkinsSlave\workspace\Lucene-Solr-trunk-Windows\solr\build\solr-test-framework\classes\java;C:\Users\JenkinsSlave\workspace\Lucene-Solr-trunk-Windows\solr\build\solr-core\test-files;C:\Users\JenkinsSlave\workspace\Lucene-Solr-trunk-Windows\lucene\build\test-framework\classes\java;C:\Users\JenkinsSlave\workspace\Lucene-Solr-trunk-Windows\lucene\build\codecs\classes\java;C:\Users\JenkinsSlave\workspace\Lucene-Solr-trunk-Windows\solr\build\solr-solrj\classes\java;C:\Users\JenkinsSlave\workspace\Lucene-Solr-trunk-Windows\solr\build\solr-core\classes\java;C:\Users\JenkinsSlave\workspace\Lucene-Solr-trunk-Windows\lucene\build\analysis\common\lucene-analyzers-common-5.0-SNAPSHOT.jar;C:\Users\JenkinsSlave\workspace\Lucene-Solr-trunk-Windows\lucene\build\analysis\kuromoji\lucene-analyzers-kuromoji-5.0-SNAPSHOT.jar;C:\Users\JenkinsSlave\workspace\Lucene-Solr-trunk-Windows\lucene\build\analysis\phonetic\lucene-analyzers-phonetic-5.0-SNAPSHOT.jar;C:\Users\JenkinsSlave\workspace\Lucene-Solr-trunk-Windows\lucene\build\highlighter\lucene-highlighter-5.0-SNAPSHOT.jar;C:\Users\JenkinsSlave\workspace\Lucene-Solr-trunk-Windows\lucene\build\memory\lucene-memory-5.0-SNAPSHOT.jar;C:\Users\JenkinsSlave\workspace\Lucene-Solr-trunk-Windows\lucene\build\misc\lucene-misc-5.0-SNAPSHOT.jar;C:\Users\JenkinsSlave\workspace\Lucene-Solr-trunk-Windows\lucene\build\spatial\lucene-spatial-5.0-SNAPSHOT.jar;C:\Users\JenkinsSlave\workspace\Lucene-Solr-trunk-Windows\lucene\build\suggest\lucene-suggest-5.0-SNAPSHOT.jar;C:\Users\JenkinsSlave\workspace\Lucene-Solr-trunk-Windows\lucene\build\grouping\lucene-grouping-5.0-SNAPSHOT.jar;C:\Users\JenkinsSlave\workspace\Lucene-Solr-trunk-Windows\lucene\build\queries\lucene-queries-5.0-SNAPSHOT.jar;C:\Users\JenkinsSlave\workspace\Lucene-Solr-trunk-Windows\lucene\build\queryparser\lucene-queryparser-5.0-SNAPSHOT.jar;C:\Users\JenkinsSlave\workspace\Lucene-Solr-trunk-Windows\solr\core\lib\commons-cli-1.2.jar;C:\Users\JenkinsSlave\workspace\Lucene-Solr-trunk-Windows\solr\core\lib\commons-codec-1.7.jar;C:\Users\JenkinsSlave\workspace\Lucene-Solr-trunk-Windows\solr\core\lib\commons-fileupload-1.2.1.jar;C:\Users\JenkinsSlave\workspace\Lucene-Solr-trunk-Windows\solr\core\lib\commons-lang-2.6.jar;C:\Users\JenkinsSlave\workspace\Lucene-Solr-trunk-Windows\solr\core\lib\easymock-2.2.jar;C:\Users\JenkinsSlave\workspace\Lucene-Solr-trunk-Windows\solr\core\lib\guava-r05.jar;C:\Users\JenkinsSlave\workspace\Lucene-Solr-trunk-Windows\solr\core\lib\javax.servlet-api-3.0.1.jar;C:\Users\JenkinsSlave\workspace\Lucene-Solr-trunk-Windows\solr\core\lib\spatial4j-0.3.jar;C:\Users\JenkinsSlave\workspace\Lucene-Solr-trunk-Windows\solr\solrj\lib\commons-io-2.1.jar;C:\Users\JenkinsSlave\workspace\Lucene-Solr-trunk-Windows\solr\solrj\lib\httpclient-4.1.3.jar;C:\Users\JenkinsSlave\workspace\Lucene-Solr-trunk-Windows\solr\solrj\lib\httpcore-4.1.4.jar;C:\Users\JenkinsSlave\workspace\Lucene-Solr-trunk-Windows\solr\solrj\lib\httpmime-4.1.3.jar;C:\Users\JenkinsSlave\workspace\Lucene-Solr-trunk-Windows\solr\solrj\lib\jcl-over-slf4j-1.6.4.jar;C:\Users\JenkinsSlave\workspace\Lucene-Solr-trunk-Windows\solr\solrj\lib\log4j-over-slf4j-1.6.4.jar;C:\Users\JenkinsSlave\workspace\Lucene-Solr-trunk-Windows\solr\solrj\lib\slf4j-api-1.6.4.jar;C:\Users\JenkinsSlave\workspace\Lucene-Solr-trunk-Windows\solr\solrj\lib\slf4j-jdk14-1.6.4.jar;C:\Users\JenkinsSlave\workspace\Lucene-Solr-trunk-Windows\solr\solrj\lib\wstx-asl-3.2.7.jar;C:\Users\JenkinsSlave\workspace\Lucene-Solr-trunk-Windows\solr\solrj\lib\zookeeper-3.3.6.jar;C:\Users\JenkinsSlave\workspace\Lucene-Solr-trunk-Windows\solr\example\lib\jetty-continuation-8.1.2.v20120308.jar;C:\Users\JenkinsSlave\workspace\Lucene-Solr-trunk-Windows\solr\example\lib\jetty-deploy-8.1.2.v20120308.jar;C:\Users\JenkinsSlave\workspace\Lucene-Solr-trunk-Windows\solr\example\lib\jetty-http-8.1.2.v20120308.jar;C:\Users\JenkinsSlave\workspace\Lucene-Solr-trunk-Windows\solr\example\lib\jetty-io-8.1.2.v20120308.jar;C:\Users\JenkinsSlave\workspace\Lucene-Solr-trunk-Windows\solr\example\lib\jetty-jmx-8.1.2.v20120308.jar;C:\Users\JenkinsSlave\workspace\Lucene-Solr-trunk-Windows\solr\example\lib\jetty-security-8.1.2.v20120308.jar;C:\Users\JenkinsSlave\workspace\Lucene-Solr-trunk-Windows\solr\example\lib\jetty-server-8.1.2.v20120308.jar;C:\Users\JenkinsSlave\workspace\Lucene-Solr-trunk-Windows\solr\example\lib\jetty-servlet-8.1.2.v20120308.jar;C:\Users\JenkinsSlave\workspace\Lucene-Solr-trunk-Windows\solr\example\lib\jetty-util-8.1.2.v20120308.jar;C:\Users\JenkinsSlave\workspace\Lucene-Solr-trunk-Windows\solr\example\lib\jetty-webapp-8.1.2.v20120308.jar;C:\Users\JenkinsSlave\workspace\Lucene-Solr-trunk-Windows\solr\example\lib\jetty-xml-8.1.2.v20120308.jar;C:\Users\JenkinsSlave\workspace\Lucene-Solr-trunk-Windows\solr\example\lib\servlet-api-3.0.jar;C:\Users\JenkinsSlave\workspace\Lucene-Solr-trunk-Windows\solr\example\example-DIH\solr\db\lib\hsqldb-1.8.0.10.jar;C:\Users\JenkinsSlave\workspace\Lucene-Solr-trunk-Windows\lucene\build\core\classes\java;C:\Users\JenkinsSlave\workspace\Lucene-Solr-trunk-Windows\lucene\test-framework\lib\junit-4.10.jar;C:\Users\JenkinsSlave\workspace\Lucene-Solr-trunk-Windows\lucene\test-framework\lib\randomizedtesting-runner-2.0.3.jar;C:\Users\JenkinsSlave\tools\Ant\ANT_1.8.2\lib\ant-launcher.jar;C:\Users\JenkinsSlave\.ant\lib\ivy-2.2.0.jar;C:\Users\JenkinsSlave\tools\Ant\ANT_1.8.2\lib\ant-antlr.jar;C:\Users\JenkinsSlave\tools\Ant\ANT_1.8.2\lib\ant-apache-bcel.jar;C:\Users\JenkinsSlave\tools\Ant\ANT_1.8.2\lib\ant-apache-bsf.jar;C:\Users\JenkinsSlave\tools\Ant\ANT_1.8.2\lib\ant-apache-log4j.jar;C:\Users\JenkinsSlave\tools\Ant\ANT_1.8.2\lib\ant-apache-oro.jar;C:\Users\JenkinsSlave\tools\Ant\ANT_1.8.2\lib\ant-apache-regexp.jar;C:\Users\JenkinsSlave\tools\Ant\ANT_1.8.2\lib\ant-apache-resolver.jar;C:\Users\JenkinsSlave\tools\Ant\ANT_1.8.2\lib\ant-apache-xalan2.jar;C:\Users\JenkinsSlave\tools\Ant\ANT_1.8.2\lib\ant-commons-logging.jar;C:\Users\JenkinsSlave\tools\Ant\ANT_1.8.2\lib\ant-commons-net.jar;C:\Users\JenkinsSlave\tools\Ant\ANT_1.8.2\lib\ant-jai.jar;C:\Users\JenkinsSlave\tools\Ant\ANT_1.8.2\lib\ant-javamail.jar;C:\Users\JenkinsSlave\tools\Ant\ANT_1.8.2\lib\ant-jdepend.jar;C:\Users\JenkinsSlave\tools\Ant\ANT_1.8.2\lib\ant-jmf.jar;C:\Users\JenkinsSlave\tools\Ant\ANT_1.8.2\lib\ant-jsch.jar;C:\Users\JenkinsSlave\tools\Ant\ANT_1.8.2\lib\ant-junit.jar;C:\Users\JenkinsSlave\tools\Ant\ANT_1.8.2\lib\ant-junit4.jar;C:\Users\JenkinsSlave\tools\Ant\ANT_1.8.2\lib\ant-netrexx.jar;C:\Users\JenkinsSlave\tools\Ant\ANT_1.8.2\lib\ant-swing.jar;C:\Users\JenkinsSlave\tools\Ant\ANT_1.8.2\lib\ant-testutil.jar;C:\Users\JenkinsSlave\tools\Ant\ANT_1.8.2\lib\ant.jar;C:\Users\JenkinsSlave\tools\java\32bit\jdk1.7.0_07\lib\tools.jar;C:\Users\JenkinsSlave\.ivy2\cache\com.carrotsearch.randomizedtesting\junit4-ant\jars\junit4-ant-2.0.3.jar
[junit4:junit4]   2> 368 T81 oaz.Environment.logEnv Client environment:java.library.path=C:\Users\JenkinsSlave\tools\java\32bit\jdk1.7.0_07\jre\bin;C:\Windows\Sun\Java\bin;C:\Windows\system32;C:\Windows;C:\Users\JenkinsSlave\tools\java\32bit\jdk1.7.0_07\bin;C:\Windows\system32;C:\Windows;C:\Windows\System32\Wbem;C:\Windows\System32\WindowsPowerShell\v1.0\;C:\Program Files (x86)\Subversion\bin;.
[junit4:junit4]   2> 370 T81 oaz.Environment.logEnv Client environment:java.io.tmpdir=.
[junit4:junit4]   2> 370 T81 oaz.Environment.logEnv Client environment:java.compiler=<NA>
[junit4:junit4]   2> 370 T81 oaz.Environment.logEnv Client environment:os.name=Windows 7
[junit4:junit4]   2> 371 T81 oaz.Environment.logEnv Client environment:os.arch=x86
[junit4:junit4]   2> 371 T81 oaz.Environment.logEnv Client environment:os.version=6.1
[junit4:junit4]   2> 372 T81 oaz.Environment.logEnv Client environment:user.name=JenkinsSlave
[junit4:junit4]   2> 372 T81 oaz.Environment.logEnv Client environment:user.home=C:\Users\JenkinsSlave
[junit4:junit4]   2> 373 T81 oaz.Environment.logEnv Client environment:user.dir=C:\Users\JenkinsSlave\workspace\Lucene-Solr-trunk-Windows\solr\build\solr-core\test\J0
[junit4:junit4]   2> 380 T81 oaz.ZooKeeper.<init> Initiating client connection, connectString=127.0.0.1:59622 sessionTimeout=10000 watcher=org.apache.solr.common.cloud.ConnectionManager@1f8ced7
[junit4:junit4]   2> 451 T87 oaz.ClientCnxn$SendThread.startConnect Opening socket connection to server /127.0.0.1:59622
[junit4:junit4]   2> 451 T81 oascc.ConnectionManager.waitForConnected Waiting for client to connect to ZooKeeper
[junit4:junit4]   2> 454 T87 oaz.ClientCnxn$SendThread.primeConnection Socket connection established to 127.0.0.1/127.0.0.1:59622, initiating session
[junit4:junit4]   2> 472 T83 oazs.NIOServerCnxn$Factory.run Accepted socket connection from /127.0.0.1:59625
[junit4:junit4]   2> 485 T83 oazs.NIOServerCnxn.readConnectRequest Client attempting to establish new session at /127.0.0.1:59625
[junit4:junit4]   2> 498 T85 oazsp.FileTxnLog.append Creating new log file: log.1
[junit4:junit4]   2> 533 T85 oazs.NIOServerCnxn.finishSessionInit Established session 0x13a997ac8060000 with negotiated timeout 10000 for client /127.0.0.1:59625
[junit4:junit4]   2> 533 T87 oaz.ClientCnxn$SendThread.readConnectResult Session establishment complete on server 127.0.0.1/127.0.0.1:59622, sessionid = 0x13a997ac8060000, negotiated timeout = 10000
[junit4:junit4]   2> 543 T88 oascc.ConnectionManager.process Watcher org.apache.solr.common.cloud.ConnectionManager@1f8ced7 name:ZooKeeperConnection Watcher:127.0.0.1:59622 got event WatchedEvent state:SyncConnected type:None path:null path:null type:None
[junit4:junit4]   2> 543 T81 oascc.ConnectionManager.waitForConnected Client is connected to ZooKeeper
[junit4:junit4]   2> 598 T86 oazs.PrepRequestProcessor.pRequest Processed session termination for sessionid: 0x13a997ac8060000
[junit4:junit4]   2> 600 T88 oaz.ClientCnxn$EventThread.run EventThread shut down
[junit4:junit4]   2> 600 T81 oaz.ZooKeeper.close Session: 0x13a997ac8060000 closed
[junit4:junit4]   2> 601 T83 oazs.NIOServerCnxn.doIO WARNING EndOfStreamException: Unable to read additional data from client sessionid 0x13a997ac8060000, likely client has closed socket
[junit4:junit4]   2> 601 T81 oaz.ZooKeeper.<init> Initiating client connection, connectString=127.0.0.1:59622 sessionTimeout=10000 watcher=org.apache.solr.common.cloud.ConnectionManager@b4e6ca
[junit4:junit4]   2> 603 T83 oazs.NIOServerCnxn.closeSock Closed socket connection for client /127.0.0.1:59625 which had sessionid 0x13a997ac8060000
[junit4:junit4]   2> 603 T89 oaz.ClientCnxn$SendThread.startConnect Opening socket connection to server /127.0.0.1:59622
[junit4:junit4]   2> 603 T81 oascc.ConnectionManager.waitForConnected Waiting for client to connect to ZooKeeper
[junit4:junit4]   2> 605 T89 oaz.ClientCnxn$SendThread.primeConnection Socket connection established to 127.0.0.1/127.0.0.1:59622, initiating session
[junit4:junit4]   2> 606 T83 oazs.NIOServerCnxn$Factory.run Accepted socket connection from /127.0.0.1:59628
[junit4:junit4]   2> 606 T83 oazs.NIOServerCnxn.readConnectRequest Client attempting to establish new session at /127.0.0.1:59628
[junit4:junit4]   2> 608 T85 oazs.NIOServerCnxn.finishSessionInit Established session 0x13a997ac8060001 with negotiated timeout 10000 for client /127.0.0.1:59628
[junit4:junit4]   2> 608 T89 oaz.ClientCnxn$SendThread.readConnectResult Session establishment complete on server 127.0.0.1/127.0.0.1:59622, sessionid = 0x13a997ac8060001, negotiated timeout = 10000
[junit4:junit4]   2> 608 T90 oascc.ConnectionManager.process Watcher org.apache.solr.common.cloud.ConnectionManager@b4e6ca name:ZooKeeperConnection Watcher:127.0.0.1:59622 got event WatchedEvent state:SyncConnected type:None path:null path:null type:None
[junit4:junit4]   2> 609 T81 oascc.ConnectionManager.waitForConnected Client is connected to ZooKeeper
[junit4:junit4]   2> 613 T81 oascc.SolrZkClient.makePath makePath: /solr
[junit4:junit4]   2> 633 T86 oazs.PrepRequestProcessor.pRequest Processed session termination for sessionid: 0x13a997ac8060001
[junit4:junit4]   2> 635 T81 oaz.ZooKeeper.close Session: 0x13a997ac8060001 closed
[junit4:junit4]   2> 635 T83 oazs.NIOServerCnxn.doIO WARNING EndOfStreamException: Unable to read additional data from client sessionid 0x13a997ac8060001, likely client has closed socket
[junit4:junit4]   2> 635 T81 oaz.ZooKeeper.<init> Initiating client connection, connectString=127.0.0.1:59622/solr sessionTimeout=1000 watcher=org.apache.solr.common.cloud.ConnectionManager@1155f97
[junit4:junit4]   2> 635 T90 oaz.ClientCnxn$EventThread.run EventThread shut down
[junit4:junit4]   2> 635 T83 oazs.NIOServerCnxn.closeSock Closed socket connection for client /127.0.0.1:59628 which had sessionid 0x13a997ac8060001
[junit4:junit4]   2> 637 T91 oaz.ClientCnxn$SendThread.startConnect Opening socket connection to server /127.0.0.1:59622
[junit4:junit4]   2> 637 T81 oascc.ConnectionManager.waitForConnected Waiting for client to connect to ZooKeeper
[junit4:junit4]   2> 638 T91 oaz.ClientCnxn$SendThread.primeConnection Socket connection established to 127.0.0.1/127.0.0.1:59622, initiating session
[junit4:junit4]   2> 638 T83 oazs.NIOServerCnxn$Factory.run Accepted socket connection from /127.0.0.1:59631
[junit4:junit4]   2> 639 T83 oazs.NIOServerCnxn.readConnectRequest Client attempting to establish new session at /127.0.0.1:59631
[junit4:junit4]   2> 641 T85 oazs.NIOServerCnxn.finishSessionInit Established session 0x13a997ac8060002 with negotiated timeout 2000 for client /127.0.0.1:59631
[junit4:junit4]   2> 641 T91 oaz.ClientCnxn$SendThread.readConnectResult Session establishment complete on server 127.0.0.1/127.0.0.1:59622, sessionid = 0x13a997ac8060002, negotiated timeout = 2000
[junit4:junit4]   2> 641 T92 oascc.ConnectionManager.process Watcher org.apache.solr.common.cloud.ConnectionManager@1155f97 name:ZooKeeperConnection Watcher:127.0.0.1:59622/solr got event WatchedEvent state:SyncConnected type:None path:null path:null type:None
[junit4:junit4]   2> 641 T81 oascc.ConnectionManager.waitForConnected Client is connected to ZooKeeper
[junit4:junit4]   2> 642 T81 oascc.SolrZkClient.makePath makePath: /configs/firstConfig
[junit4:junit4]   2> 666 T81 oascc.SolrZkClient.makePath makePath: /collections/collection1
[junit4:junit4]   2> 677 T86 oazs.PrepRequestProcessor.pRequest Processed session termination for sessionid: 0x13a997ac8060002
[junit4:junit4]   2> 679 T83 oazs.NIOServerCnxn.closeSock Closed socket connection for client /127.0.0.1:59631 which had sessionid 0x13a997ac8060002
[junit4:junit4]   2> 681 T81 oaz.ZooKeeper.close Session: 0x13a997ac8060002 closed
[junit4:junit4]   2> 681 T81 oasc.CoreContainer.<init> New CoreContainer 24100059
[junit4:junit4]   2> 705 T92 oaz.ClientCnxn$EventThread.run EventThread shut down
[junit4:junit4]   2> 707 T81 oaz.ZooKeeper.<init> Initiating client connection, connectString=127.0.0.1:59622/solr sessionTimeout=1000 watcher=org.apache.solr.common.cloud.ConnectionManager@55ac8e
[junit4:junit4]   2> 708 T93 oaz.ClientCnxn$SendThread.startConnect Opening socket connection to server /127.0.0.1:59622
[junit4:junit4]   2> 708 T81 oascc.ConnectionManager.waitForConnected Waiting for client to connect to ZooKeeper
[junit4:junit4]   2> 710 T93 oaz.ClientCnxn$SendThread.primeConnection Socket connection established to 127.0.0.1/127.0.0.1:59622, initiating session
[junit4:junit4]   2> 710 T83 oazs.NIOServerCnxn$Factory.run Accepted socket connection from /127.0.0.1:59634
[junit4:junit4]   2> 711 T83 oazs.NIOServerCnxn.readConnectRequest Client attempting to establish new session at /127.0.0.1:59634
[junit4:junit4]   2> 713 T85 oazs.NIOServerCnxn.finishSessionInit Established session 0x13a997ac8060003 with negotiated timeout 2000 for client /127.0.0.1:59634
[junit4:junit4]   2> 713 T93 oaz.ClientCnxn$SendThread.readConnectResult Session establishment complete on server 127.0.0.1/127.0.0.1:59622, sessionid = 0x13a997ac8060003, negotiated timeout = 2000
[junit4:junit4]   2> 713 T94 oascc.ConnectionManager.process Watcher org.apache.solr.common.cloud.ConnectionManager@55ac8e name:ZooKeeperConnection Watcher:127.0.0.1:59622/solr got event WatchedEvent state:SyncConnected type:None path:null path:null type:None
[junit4:junit4]   2> 713 T81 oascc.ConnectionManager.waitForConnected Client is connected to ZooKeeper
[junit4:junit4]   2> 729 T86 oazs.PrepRequestProcessor.pRequest Got user-level KeeperException when processing sessionid:0x13a997ac8060003 type:create cxid:0x2 zxid:0xfffffffffffffffe txntype:unknown reqpath:n/a Error Path:/solr/overseer Error:KeeperErrorCode = NodeExists for /solr/overseer
[junit4:junit4]   2> 739 T81 oascc.SolrZkClient.makePath makePath: /live_nodes
[junit4:junit4]   2> 743 T81 oasc.ZkController.createEphemeralLiveNode Register node as live in ZooKeeper:/live_nodes/127.0.0.1:8983_solr
[junit4:junit4]   2> 748 T86 oazs.PrepRequestProcessor.pRequest Got user-level KeeperException when processing sessionid:0x13a997ac8060003 type:delete cxid:0x7 zxid:0xfffffffffffffffe txntype:unknown reqpath:n/a Error Path:/solr/live_nodes/127.0.0.1:8983_solr Error:KeeperErrorCode = NoNode for /solr/live_nodes/127.0.0.1:8983_solr
[junit4:junit4]   2> 750 T81 oascc.SolrZkClient.makePath makePath: /live_nodes/127.0.0.1:8983_solr
[junit4:junit4]   2> 756 T81 oashc.HttpShardHandlerFactory.getParameter Setting socketTimeout to: 0
[junit4:junit4]   2> 756 T81 oashc.HttpShardHandlerFactory.getParameter Setting urlScheme to: http://
[junit4:junit4]   2> 756 T81 oashc.HttpShardHandlerFactory.getParameter Setting connTimeout to: 0
[junit4:junit4]   2> 756 T81 oashc.HttpShardHandlerFactory.getParameter Setting maxConnectionsPerHost to: 20
[junit4:junit4]   2> 757 T81 oashc.HttpShardHandlerFactory.getParameter Setting corePoolSize to: 0
[junit4:junit4]   2> 757 T81 oashc.HttpShardHandlerFactory.getParameter Setting maximumPoolSize to: 2147483647
[junit4:junit4]   2> 757 T81 oashc.HttpShardHandlerFactory.getParameter Setting maxThreadIdleTime to: 5
[junit4:junit4]   2> 757 T81 oashc.HttpShardHandlerFactory.getParameter Setting sizeOfQueue to: -1
[junit4:junit4]   2> 758 T81 oashc.HttpShardHandlerFactory.getParameter Setting fairnessPolicy to: false
[junit4:junit4]   2> 758 T81 oascsi.HttpClientUtil.createClient Creating new http client, config:maxConnectionsPerHost=20&maxConnections=10000&socketTimeout=0&connTimeout=0&retry=false
[junit4:junit4]   2> 771 T81 oascc.SolrZkClient.makePath makePath: /overseer_elect/election
[junit4:junit4]   2> 794 T86 oazs.PrepRequestProcessor.pRequest Got user-level KeeperException when processing sessionid:0x13a997ac8060003 type:delete cxid:0x15 zxid:0xfffffffffffffffe txntype:unknown reqpath:n/a Error Path:/solr/overseer_elect/leader Error:KeeperErrorCode = NoNode for /solr/overseer_elect/leader
[junit4:junit4]   2> 796 T81 oascc.SolrZkClient.makePath makePath: /overseer_elect/leader
[junit4:junit4]   2> 801 T81 oasc.Overseer.start Overseer (id=88551895308042243-127.0.0.1:8983_solr-n_0000000000) starting
[junit4:junit4]   2> 801 T86 oazs.PrepRequestProcessor.pRequest Got user-level KeeperException when processing sessionid:0x13a997ac8060003 type:create cxid:0x1a zxid:0xfffffffffffffffe txntype:unknown reqpath:n/a Error Path:/solr/overseer Error:KeeperErrorCode = NodeExists for /solr/overseer
[junit4:junit4]   2> 814 T86 oazs.PrepRequestProcessor.pRequest Got user-level KeeperException when processing sessionid:0x13a997ac8060003 type:create cxid:0x1b zxid:0xfffffffffffffffe txntype:unknown reqpath:n/a Error Path:/solr/overseer Error:KeeperErrorCode = NodeExists for /solr/overseer
[junit4:junit4]   2> 816 T86 oazs.PrepRequestProcessor.pRequest Got user-level KeeperException when processing sessionid:0x13a997ac8060003 type:create cxid:0x1c zxid:0xfffffffffffffffe txntype:unknown reqpath:n/a Error Path:/solr/overseer Error:KeeperErrorCode = NodeExists for /solr/overseer
[junit4:junit4]   2> 822 T86 oazs.PrepRequestProcessor.pRequest Got user-level KeeperException when processing sessionid:0x13a997ac8060003 type:create cxid:0x1d zxid:0xfffffffffffffffe txntype:unknown reqpath:n/a Error Path:/solr/overseer Error:KeeperErrorCode = NodeExists for /solr/overseer
[junit4:junit4]   2> 825 T96 oasc.OverseerCollectionProcessor.run Process current queue of collection creations
[junit4:junit4]   2> 826 T81 oascc.SolrZkClient.makePath makePath: /clusterstate.json
[junit4:junit4]   2> 829 T81 oascc.ZkStateReader.createClusterStateWatchersAndUpdate Updating cluster state from ZooKeeper... 
[junit4:junit4]   2> 847 T81 oasc.ZkController.readConfigName Load collection config from:/collections/collection1
[junit4:junit4]   2> 848 T95 oasc.Overseer$ClusterStateUpdater.run Starting to work on the main queue
[junit4:junit4]   2> 851 T86 oazs.PrepRequestProcessor.pRequest Processed session termination for sessionid: 0x13a997ac8060003
[junit4:junit4]   2> 857 T83 oazs.NIOServerCnxn.closeSock Closed socket connection for client /127.0.0.1:59634 which had sessionid 0x13a997ac8060003
[junit4:junit4]   2> 857 T81 oaz.ZooKeeper.close Session: 0x13a997ac8060003 closed
[junit4:junit4]   2> 858 T81 oasc.CoreContainer.shutdown Shutting down CoreContainer instance=24100059
[junit4:junit4]   2> 859 T85 oazs.SyncRequestProcessor.run SyncRequestProcessor exited!
[junit4:junit4]   2> 859 T81 oazs.FinalRequestProcessor.shutdown shutdown of request processor complete
[junit4:junit4]   2> 859 T86 oazs.PrepRequestProcessor.run PrepRequestProcessor exited loop!
[junit4:junit4]   2> 1737 T84 oazs.SessionTrackerImpl.run SessionTrackerImpl exited loop!
[junit4:junit4]   2> 863 T94 oascc.ZkStateReader$3.process WARNING ZooKeeper watch triggered, but Solr cannot talk to ZK
[junit4:junit4]   2> 3116 T94 oaz.ClientCnxn$EventThread.run EventThread shut down
[junit4:junit4]   2> 3121 T83 oazs.NIOServerCnxn$Factory.run NIOServerCnxn factory exited run method
[junit4:junit4]   2> 3122 T81 oazs.FinalRequestProcessor.shutdown shutdown of request processor complete
[junit4:junit4]   2> 3123 T81 oas.SolrTestCaseJ4.tearDown ###Ending testReadConfigName
[junit4:junit4]   2> 3127 T81 oas.SolrTestCaseJ4.setUp ###Starting testUploadToCloud
[junit4:junit4]   2> 3128 T81 oasc.ZkTestServer.run STARTING ZK TEST SERVER
[junit4:junit4]   2> 3129 T97 oazs.ZooKeeperServer.setTickTime tickTime set to 1000
[junit4:junit4]   2> 3132 T97 oazs.NIOServerCnxn$Factory.<init> binding to port 0.0.0.0/0.0.0.0:0
[junit4:junit4]   2> 3135 T97 oazsp.FileSnap.deserialize Reading snapshot C:\Users\JenkinsSlave\workspace\Lucene-Solr-trunk-Windows\solr\build\solr-core\test\J0\.\solrtest-ZkControllerTest-1351194691264\zookeeper\server1\data\version-2\snapshot.0
[junit4:junit4]   2> 3137 T97 oazsp.FileTxnSnapLog.save Snapshotting: 1d
[junit4:junit4]   2> 3228 T81 oasc.ZkTestServer.run start zk server on port:59637
[junit4:junit4]   2> 3228 T81 oaz.ZooKeeper.<init> Initiating client connection, connectString=127.0.0.1:59637 sessionTimeout=10000 watcher=org.apache.solr.common.cloud.ConnectionManager@46cb33
[junit4:junit4]   2> 3230 T102 oaz.ClientCnxn$SendThread.startConnect Opening socket connection to server /127.0.0.1:59637
[junit4:junit4]   2> 3230 T81 oascc.ConnectionManager.waitForConnected Waiting for client to connect to ZooKeeper
[junit4:junit4]   2> 3232 T102 oaz.ClientCnxn$SendThread.primeConnection Socket connection established to 127.0.0.1/127.0.0.1:59637, initiating session
[junit4:junit4]   2> 3232 T98 oazs.NIOServerCnxn$Factory.run Accepted socket connection from /127.0.0.1:59640
[junit4:junit4]   2> 3233 T98 oazs.NIOServerCnxn.readConnectRequest Client attempting to establish new session at /127.0.0.1:59640
[junit4:junit4]   2> 3233 T100 oazsp.FileTxnLog.append Creating new log file: log.1e
[junit4:junit4]   2> 3239 T100 oazs.NIOServerCnxn.finishSessionInit Established session 0x13a997ad3010000 with negotiated timeout 10000 for client /127.0.0.1:59640
[junit4:junit4]   2> 3239 T102 oaz.ClientCnxn$SendThread.readConnectResult Session establishment complete on server 127.0.0.1/127.0.0.1:59637, sessionid = 0x13a997ad3010000, negotiated timeout = 10000
[junit4:junit4]   2> 3239 T103 oascc.ConnectionManager.process Watcher org.apache.solr.common.cloud.ConnectionManager@46cb33 name:ZooKeeperConnection Watcher:127.0.0.1:59637 got event WatchedEvent state:SyncConnected type:None path:null path:null type:None
[junit4:junit4]   2> 3240 T81 oascc.ConnectionManager.waitForConnected Client is connected to ZooKeeper
[junit4:junit4]   2> 3240 T81 oascc.SolrZkClient.makePath makePath: /solr
[junit4:junit4]   2> 3255 T101 oazs.PrepRequestProcessor.pRequest Processed session termination for sessionid: 0x13a997ad3010000
[junit4:junit4]   2> 3257 T98 oazs.NIOServerCnxn.closeSock Closed socket connection for client /127.0.0.1:59640 which had sessionid 0x13a997ad3010000
[junit4:junit4]   2> 3257 T81 oaz.ZooKeeper.close Session: 0x13a997ad3010000 closed
[junit4:junit4]   2> 3257 T103 oaz.ClientCnxn$EventThread.run EventThread shut down
[junit4:junit4]   2> 3258 T81 oasc.CoreContainer.<init> New CoreContainer 17521513
[junit4:junit4]   2> 3259 T81 oaz.ZooKeeper.<init> Initiating client connection, connectString=127.0.0.1:59637/solr sessionTimeout=1000 watcher=org.apache.solr.common.cloud.ConnectionManager@fc2759
[junit4:junit4]   2> 3261 T104 oaz.ClientCnxn$SendThread.startConnect Opening socket connection to server /127.0.0.1:59637
[junit4:junit4]   2> 3261 T81 oascc.ConnectionManager.waitForConnected Waiting for client to connect to ZooKeeper
[junit4:junit4]   2> 3262 T104 oaz.ClientCnxn$SendThread.primeConnection Socket connection established to 127.0.0.1/127.0.0.1:59637, initiating session
[junit4:junit4]   2> 3262 T98 oazs.NIOServerCnxn$Factory.run Accepted socket connection from /127.0.0.1:59643
[junit4:junit4]   2> 3262 T98 oazs.NIOServerCnxn.readConnectRequest Client attempting to establish new session at /127.0.0.1:59643
[junit4:junit4]   2> 3265 T100 oazs.NIOServerCnxn.finishSessionInit Established session 0x13a997ad3010001 with negotiated timeout 2000 for client /127.0.0.1:59643
[junit4:junit4]   2> 3266 T104 oaz.ClientCnxn$SendThread.readConnectResult Session establishment complete on server 127.0.0.1/127.0.0.1:59637, sessionid = 0x13a997ad3010001, negotiated timeout = 2000
[junit4:junit4]   2> 3266 T105 oascc.ConnectionManager.process Watcher org.apache.solr.common.cloud.ConnectionManager@fc2759 name:ZooKeeperConnection Watcher:127.0.0.1:59637/solr got event WatchedEvent state:SyncConnected type:None path:null path:null type:None
[junit4:junit4]   2> 3266 T81 oascc.ConnectionManager.waitForConnected Client is connected to ZooKeeper
[junit4:junit4]   2> 3268 T101 oazs.PrepRequestProcessor.pRequest Got user-level KeeperException when processing sessionid:0x13a997ad3010001 type:create cxid:0x1 zxid:0xfffffffffffffffe txntype:unknown reqpath:n/a Error Path:/solr/overseer Error:KeeperErrorCode = NodeExists for /solr/overseer
[junit4:junit4]   2> 3270 T101 oazs.PrepRequestProcessor.pRequest Got user-level KeeperException when processing sessionid:0x13a997ad3010001 type:create cxid:0x2 zxid:0xfffffffffffffffe txntype:unknown reqpath:n/a Error Path:/solr/overseer Error:KeeperErrorCode = NodeExists for /solr/overseer
[junit4:junit4]   2> 3273 T81 oasc.ZkController.createEphemeralLiveNode Register node as live in ZooKeeper:/live_nodes/127.0.0.1:8983_solr
[junit4:junit4]   2> 3274 T101 oazs.PrepRequestProcessor.pRequest Got user-level KeeperException when processing sessionid:0x13a997ad3010001 type:delete cxid:0x4 zxid:0xfffffffffffffffe txntype:unknown reqpath:n/a Error Path:/solr/live_nodes/127.0.0.1:8983_solr Error:KeeperErrorCode = NoNode for /solr/live_nodes/127.0.0.1:8983_solr
[junit4:junit4]   2> 3275 T81 oascc.SolrZkClient.makePath makePath: /live_nodes/127.0.0.1:8983_solr
[junit4:junit4]   2> 3282 T81 oashc.HttpShardHandlerFactory.getParameter Setting socketTimeout to: 0
[junit4:junit4]   2> 3282 T81 oashc.HttpShardHandlerFactory.getParameter Setting urlScheme to: http://
[junit4:junit4]   2> 3282 T81 oashc.HttpShardHandlerFactory.getParameter Setting connTimeout to: 0
[junit4:junit4]   2> 3283 T81 oashc.HttpShardHandlerFactory.getParameter Setting maxConnectionsPerHost to: 20
[junit4:junit4]   2> 3283 T81 oashc.HttpShardHandlerFactory.getParameter Setting corePoolSize to: 0
[junit4:junit4]   2> 3283 T81 oashc.HttpShardHandlerFactory.getParameter Setting maximumPoolSize to: 2147483647
[junit4:junit4]   2> 3283 T81 oashc.HttpShardHandlerFactory.getParameter Setting maxThreadIdleTime to: 5
[junit4:junit4]   2> 3284 T81 oashc.HttpShardHandlerFactory.getParameter Setting sizeOfQueue to: -1
[junit4:junit4]   2> 3284 T81 oashc.HttpShardHandlerFactory.getParameter Setting fairnessPolicy to: false
[junit4:junit4]   2> 3284 T81 oascsi.HttpClientUtil.createClient Creating new http client, config:maxConnectionsPerHost=20&maxConnections=10000&socketTimeout=0&connTimeout=0&retry=false
[junit4:junit4]   2> 3296 T101 oazs.PrepRequestProcessor.pRequest Got user-level KeeperException when processing sessionid:0x13a997ad3010001 type:delete cxid:0xd zxid:0xfffffffffffffffe txntype:unknown reqpath:n/a Error Path:/solr/overseer_elect/leader Error:KeeperErrorCode = NoNode for /solr/overseer_elect/leader
[junit4:junit4]   2> 3299 T81 oascc.SolrZkClient.makePath makePath: /overseer_elect/leader
[junit4:junit4]   2> 3304 T81 oasc.Overseer.start Overseer (id=88551895492263937-127.0.0.1:8983_solr-n_0000000002) starting
[junit4:junit4]   2> 3304 T101 oazs.PrepRequestProcessor.pRequest Got user-level KeeperException when processing sessionid:0x13a997ad3010001 type:create cxid:0x12 zxid:0xfffffffffffffffe txntype:unknown reqpath:n/a Error Path:/solr/overseer Error:KeeperErrorCode = NodeExists for /solr/overseer
[junit4:junit4]   2> 3306 T101 oazs.PrepRequestProcessor.pRequest Got user-level KeeperException when processing sessionid:0x13a997ad3010001 type:create cxid:0x13 zxid:0xfffffffffffffffe txntype:unknown reqpath:n/a Error Path:/solr/overseer Error:KeeperErrorCode = NodeExists for /solr/overseer
[junit4:junit4]   2> 3309 T101 oazs.PrepRequestProcessor.pRequest Got user-level KeeperException when processing sessionid:0x13a997ad3010001 type:create cxid:0x14 zxid:0xfffffffffffffffe txntype:unknown reqpath:n/a Error Path:/solr/overseer Error:KeeperErrorCode = NodeExists for /solr/overseer
[junit4:junit4]   2> 3312 T101 oazs.PrepRequestProcessor.pRequest Got user-level KeeperException when processing sessionid:0x13a997ad3010001 type:create cxid:0x15 zxid:0xfffffffffffffffe txntype:unknown reqpath:n/a Error Path:/solr/overseer Error:KeeperErrorCode = NodeExists for /solr/overseer
[junit4:junit4]   2> 3317 T107 oasc.OverseerCollectionProcessor.run Process current queue of collection creations
[junit4:junit4]   2> 3317 T81 oascc.ZkStateReader.createClusterStateWatchersAndUpdate Updating cluster state from ZooKeeper... 
[junit4:junit4]   2> 3324 T106 oasc.Overseer$ClusterStateUpdater.run Starting to work on the main queue
[junit4:junit4]   2> 3359 T81 oascc.SolrZkClient.makePath makePath: /configs/config1/admin-extra.html
[junit4:junit4]   2> 3370 T81 oascc.SolrZkClient.makePath makePath: /configs/config1/admin-extra.menu-bottom.html
[junit4:junit4]   2> 3377 T81 oascc.SolrZkClient.makePath makePath: /configs/config1/admin-extra.menu-top.html
[junit4:junit4]   2> 3383 T81 oascc.SolrZkClient.makePath makePath: /configs/config1/currency.xml
[junit4:junit4]   2> 3389 T81 oascc.SolrZkClient.makePath makePath: /configs/config1/elevate.xml
[junit4:junit4]   2> 3396 T81 oascc.SolrZkClient.makePath makePath: /configs/config1/lang/contractions_ca.txt
[junit4:junit4]   2> 3406 T81 oascc.SolrZkClient.makePath makePath: /configs/config1/lang/contractions_fr.txt
[junit4:junit4]   2> 3413 T81 oascc.SolrZkClient.makePath makePath: /configs/config1/lang/contractions_ga.txt
[junit4:junit4]   2> 3419 T81 oascc.SolrZkClient.makePath makePath: /configs/config1/lang/contractions_it.txt
[junit4:junit4]   2> 3426 T81 oascc.SolrZkClient.makePath makePath: /configs/config1/lang/hyphenations_ga.txt
[junit4:junit4]   2> 3432 T81 oascc.SolrZkClient.makePath makePath: /configs/config1/lang/stemdict_nl.txt
[junit4:junit4]   2> 3458 T81 oascc.SolrZkClient.makePath makePath: /configs/config1/lang/stoptags_ja.txt
[junit4:junit4]   2> 4797 T104 oaz.ClientCnxn$SendThread.run Client session timed out, have not heard from server in 1334ms for sessionid 0x13a997ad3010001, closing socket connection and attempting reconnect
[junit4:junit4]   2> 4897 T105 oascc.ConnectionManager.process Watcher org.apache.solr.common.cloud.ConnectionManager@fc2759 name:ZooKeeperConnection Watcher:127.0.0.1:59637/solr got event WatchedEvent state:Disconnected type:None path:null path:null type:None
[junit4:junit4]   2> 4897 T105 oascc.ConnectionManager.process zkClient has disconnected
[junit4:junit4]   2> 5737 T99 oazs.ZooKeeperServer.expire Expiring session 0x13a997ad3010001, timeout of 2000ms exceeded
[junit4:junit4]   2> 5738 T101 oazs.PrepRequestProcessor.pRequest Processed session termination for sessionid: 0x13a997ad3010001
[junit4:junit4]   2> 5744 T100 oazs.NIOServerCnxn.closeSock Closed socket connection for client /127.0.0.1:59643 which had sessionid 0x13a997ad3010001
[junit4:junit4]   2> 5746 T98 oazs.NIOServerCnxn.doIO WARNING Exception causing close of session 0x13a997ad3010001 due to java.nio.channels.AsynchronousCloseException
[junit4:junit4]   2> 6266 T104 oaz.ClientCnxn$SendThread.startConnect Opening socket connection to server 127.0.0.1/127.0.0.1:59637
[junit4:junit4]   2> 6267 T104 oaz.ClientCnxn$SendThread.primeConnection Socket connection established to 127.0.0.1/127.0.0.1:59637, initiating session
[junit4:junit4]   2> 6267 T98 oazs.NIOServerCnxn$Factory.run Accepted socket connection from /127.0.0.1:59644
[junit4:junit4]   2> 6275 T98 oazs.NIOServerCnxn.readConnectRequest Client attempting to renew session 0x13a997ad3010001 at /127.0.0.1:59644
[junit4:junit4]   2> 6276 T98 oazs.NIOServerCnxn.finishSessionInit Invalid session 0x13a997ad3010001 for client /127.0.0.1:59644, probably expired
[junit4:junit4]   2> 6277 T98 oazs.NIOServerCnxn.closeSock Closed socket connection for client /127.0.0.1:59644 which had sessionid 0x13a997ad3010001
[junit4:junit4]   2> 6278 T104 oaz.ClientCnxn$SendThread.run Unable to reconnect to ZooKeeper service, session 0x13a997ad3010001 has expired, closing socket connection
[junit4:junit4]   2> 6278 T105 oascc.ConnectionManager.process Watcher org.apache.solr.common.cloud.ConnectionManager@fc2759 name:ZooKeeperConnection Watcher:127.0.0.1:59637/solr got event WatchedEvent state:Expired type:None path:null path:null type:None
[junit4:junit4]   2> 6279 T105 oascc.ConnectionManager.process Our previous ZooKeeper session was expired. Attempting to reconnect to recover relationship with ZooKeeper...
[junit4:junit4]   2> 6279 T105 oascc.DefaultConnectionStrategy.reconnect Connection expired - starting a new one...
[junit4:junit4]   2> 6279 T105 oaz.ZooKeeper.<init> Initiating client connection, connectString=127.0.0.1:59637/solr sessionTimeout=1000 watcher=org.apache.solr.common.cloud.ConnectionManager@fc2759
[junit4:junit4]   2> 6281 T108 oaz.ClientCnxn$SendThread.startConnect Opening socket connection to server /127.0.0.1:59637
[junit4:junit4]   2> 6281 T105 oascc.ConnectionManager.waitForConnected Waiting for client to connect to ZooKeeper
[junit4:junit4]   2> 6283 T108 oaz.ClientCnxn$SendThread.primeConnection Socket connection established to 127.0.0.1/127.0.0.1:59637, initiating session
[junit4:junit4]   2> 6283 T98 oazs.NIOServerCnxn$Factory.run Accepted socket connection from /127.0.0.1:59647
[junit4:junit4]   2> 6284 T98 oazs.NIOServerCnxn.readConnectRequest Client attempting to establish new session at /127.0.0.1:59647
[junit4:junit4]   2> 6287 T100 oazs.NIOServerCnxn.finishSessionInit Established session 0x13a997ad3010002 with negotiated timeout 2000 for client /127.0.0.1:59647
[junit4:junit4]   2> 6288 T108 oaz.ClientCnxn$SendThread.readConnectResult Session establishment complete on server 127.0.0.1/127.0.0.1:59637, sessionid = 0x13a997ad3010002, negotiated timeout = 2000
[junit4:junit4]   2> 6288 T109 oascc.ConnectionManager.process Watcher org.apache.solr.common.cloud.ConnectionManager@fc2759 name:ZooKeeperConnection Watcher:127.0.0.1:59637/solr got event WatchedEvent state:SyncConnected type:None path:null path:null type:None
[junit4:junit4]   2> 6288 T105 oascc.ConnectionManager.waitForConnected Client is connected to ZooKeeper
[junit4:junit4]   2> 6288 T105 oascc.ConnectionManager$1.update Connection with ZooKeeper reestablished.
[junit4:junit4]   2> 6293 T101 oazs.PrepRequestProcessor.pRequest Got user-level KeeperException when processing sessionid:0x13a997ad3010002 type:delete cxid:0x3 zxid:0xfffffffffffffffe txntype:unknown reqpath:n/a Error Path:/solr/overseer_elect/leader Error:KeeperErrorCode = NoNode for /solr/overseer_elect/leader
[junit4:junit4]   2> 6296 T105 oascc.SolrZkClient.makePath makePath: /overseer_elect/leader
[junit4:junit4]   2> 6301 T105 oasc.Overseer.start Overseer (id=88551895492263938-127.0.0.1:8983_solr-n_0000000004) starting
[junit4:junit4]   2> 6301 T101 oazs.PrepRequestProcessor.pRequest Got user-level KeeperException when processing sessionid:0x13a997ad3010002 type:create cxid:0x8 zxid:0xfffffffffffffffe txntype:unknown reqpath:n/a Error Path:/solr/overseer Error:KeeperErrorCode = NodeExists for /solr/overseer
[junit4:junit4]   2> 6303 T101 oazs.PrepRequestProcessor.pRequest Got user-level KeeperException when processing sessionid:0x13a997ad3010002 type:create cxid:0x9 zxid:0xfffffffffffffffe txntype:unknown reqpath:n/a Error Path:/solr/overseer Error:KeeperErrorCode = NodeExists for /solr/overseer
[junit4:junit4]   2> 6304 T101 oazs.PrepRequestProcessor.pRequest Got user-level KeeperException when processing sessionid:0x13a997ad3010002 type:create cxid:0xa zxid:0xfffffffffffffffe txntype:unknown reqpath:n/a Error Path:/solr/overseer Error:KeeperErrorCode = NodeExists for /solr/overseer
[junit4:junit4]   2> 6307 T101 oazs.PrepRequestProcessor.pRequest Got user-level KeeperException when processing sessionid:0x13a997ad3010002 type:create cxid:0xb zxid:0xfffffffffffffffe txntype:unknown reqpath:n/a Error Path:/solr/overseer Error:KeeperErrorCode = NodeExists for /solr/overseer
[junit4:junit4]   2> 6309 T111 oasc.OverseerCollectionProcessor.run Process current queue of collection creations
[junit4:junit4]   2> 6310 T105 oascc.ZkStateReader.createClusterStateWatchersAndUpdate Updating cluster state from ZooKeeper... 
[junit4:junit4]   2> 6313 T105 oasc.ZkController.createEphemeralLiveNode Register node as live in ZooKeeper:/live_nodes/127.0.0.1:8983_solr
[junit4:junit4]   2> 6314 T101 oazs.PrepRequestProcessor.pRequest Got user-level KeeperException when processing sessionid:0x13a997ad3010002 type:delete cxid:0x14 zxid:0xfffffffffffffffe txntype:unknown reqpath:n/a Error Path:/solr/live_nodes/127.0.0.1:8983_solr Error:KeeperErrorCode = NoNode for /solr/live_nodes/127.0.0.1:8983_solr
[junit4:junit4]   2> 6314 T110 oasc.Overseer$ClusterStateUpdater.run Starting to work on the main queue
[junit4:junit4]   2> 6315 T105 oascc.SolrZkClient.makePath makePath: /live_nodes/127.0.0.1:8983_solr
[junit4:junit4]   2> 6320 T109 oascc.ZkStateReader$3.process Updating live nodes... (1)
[junit4:junit4]   2> 6320 T105 oascc.DefaultConnectionStrategy.reconnect Reconnected to ZooKeeper
[junit4:junit4]   2> 6320 T105 oascc.ConnectionManager.process Connected:true
[junit4:junit4]   2> 6320 T105 oaz.ClientCnxn$EventThread.run EventThread shut down
[junit4:junit4]   2> 6380 T106 oasc.Overseer$ClusterStateUpdater.amILeader WARNING  org.apache.zookeeper.KeeperException$SessionExpiredException: KeeperErrorCode = Session expired for /overseer_elect/leader
[junit4:junit4]   2> 	at org.apache.zookeeper.KeeperException.create(KeeperException.java:118)
[junit4:junit4]   2> 	at org.apache.zookeeper.KeeperException.create(KeeperException.java:42)
[junit4:junit4]   2> 	at org.apache.zookeeper.ZooKeeper.getData(ZooKeeper.java:927)
[junit4:junit4]   2> 	at org.apache.solr.common.cloud.SolrZkClient$7.execute(SolrZkClient.java:244)
[junit4:junit4]   2> 	at org.apache.solr.common.cloud.SolrZkClient$7.execute(SolrZkClient.java:241)
[junit4:junit4]   2> 	at org.apache.solr.common.cloud.ZkCmdExecutor.retryOperation(ZkCmdExecutor.java:63)
[junit4:junit4]   2> 	at org.apache.solr.common.cloud.SolrZkClient.getData(SolrZkClient.java:241)
[junit4:junit4]   2> 	at org.apache.solr.cloud.Overseer$ClusterStateUpdater.amILeader(Overseer.java:192)
[junit4:junit4]   2> 	at org.apache.solr.cloud.Overseer$ClusterStateUpdater.run(Overseer.java:116)
[junit4:junit4]   2> 	at java.lang.Thread.run(Thread.java:722)
[junit4:junit4]   2> 
[junit4:junit4]   2> 6380 T106 oasc.Overseer$ClusterStateUpdater.amILeader According to ZK I (id=88551895492263937-127.0.0.1:8983_solr-n_0000000002) am no longer a leader.
[junit4:junit4]   2> 6380 T107 oasc.OverseerCollectionProcessor.run WARNING Overseer cannot talk to ZK
[junit4:junit4]   2> 6421 T110 oasc.Overseer$ClusterStateUpdater.amILeader According to ZK I (id=88551895492263938-127.0.0.1:8983_solr-n_0000000004) am no longer a leader.
[junit4:junit4]   2> 6422 T101 oazs.PrepRequestProcessor.pRequest Processed session termination for sessionid: 0x13a997ad3010002
[junit4:junit4]   2> 6425 T81 oaz.ZooKeeper.close Session: 0x13a997ad3010002 closed
[junit4:junit4]   2> 6425 T98 oazs.NIOServerCnxn.closeSock Closed socket connection for client /127.0.0.1:59647 which had sessionid 0x13a997ad3010002
[junit4:junit4]   2> 6425 T81 oasc.CoreContainer.shutdown Shutting down CoreContainer instance=17521513
[junit4:junit4]   2> 6426 T100 oazs.SyncRequestProcessor.run SyncRequestProcessor exited!
[junit4:junit4]   2> 6426 T101 oazs.PrepRequestProcessor.run PrepRequestProcessor exited loop!
[junit4:junit4]   2> 6427 T81 oazs.FinalRequestProcessor.shutdown shutdown of request processor complete
[junit4:junit4]   2> 6737 T99 oazs.SessionTrackerImpl.run SessionTrackerImpl exited loop!
[junit4:junit4]   2> 7424 T109 oascc.ZkStateReader$3.process WARNING ZooKeeper watch triggered, but Solr cannot talk to ZK
[junit4:junit4]   2> 8679 T98 oazs.NIOServerCnxn$Factory.run NIOServerCnxn factory exited run method
[junit4:junit4]   2> 8679 T109 oaz.ClientCnxn$EventThread.run EventThread shut down
[junit4:junit4]   2> 8679 T81 oazs.FinalRequestProcessor.shutdown shutdown of request processor complete
[junit4:junit4]   2> 8680 T81 oas.SolrTestCaseJ4.tearDown ###Ending testUploadToCloud
[junit4:junit4]   1> / (6)
[junit4:junit4]   1>  /configs (2)
[junit4:junit4]   1>   /configs/config1 (6)
[junit4:junit4]   1>    /configs/config1/admin-extra.menu-top.html (0)
[junit4:junit4]   1>    DATA:
[junit4:junit4]   1>        <!-- admin-extra.menu-top.html -->
[junit4:junit4]   1>        
[junit4:junit4]   1>    /configs/config1/elevate.xml (0)
[junit4:junit4]   1>    DATA: ...supressed...
[junit4:junit4]   1>    /configs/config1/admin-extra.html (0)
[junit4:junit4]   1>    DATA:
[junit4:junit4]   1>        <!--
[junit4:junit4]   1>         Licensed to the Apache Software Foundation (ASF) under one or more
[junit4:junit4]   1>         contributor license agreements.  See the NOTICE file distributed with
[junit4:junit4]   1>         this work for additional information regarding copyright ownership.
[junit4:junit4]   1>         The ASF licenses this file to You under the Apache License, Version 2.0
[junit4:junit4]   1>         (the "License"); you may not use this file except in compliance with
[junit4:junit4]   1>         the License.  You may obtain a copy of the License at
[junit4:junit4]   1>        
[junit4:junit4]   1>             http://www.apache.org/licenses/LICENSE-2.0
[junit4:junit4]   1>        
[junit4:junit4]   1>         Unless required by applicable law or agreed to in writing, software
[junit4:junit4]   1>         distributed under the License is distributed on an "AS IS" BASIS,
[junit4:junit4]   1>         WITHOUT WARRANTIES OR CONDITIONS OF ANY KIND, either express or implied.
[junit4:junit4]   1>         See the License for the specific language governing permissions and
[junit4:junit4]   1>         limitations under the License.
[junit4:junit4]   1>        -->
[junit4:junit4]   1>        
[junit4:junit4]   1>        <!-- The content of this page will be statically included into the top
[junit4:junit4]   1>        of the admin page.  Uncomment this as an example to see there the content
[junit4:junit4]   1>        will show up.
[junit4:junit4]   1>        
[junit4:junit4]   1>        <hr>
[junit4:junit4]   1>        <i>This line will appear before the first table</i>
[junit4:junit4]   1>        <tr>
[junit4:junit4]   1>        <td colspan="2">
[junit4:junit4]   1>        This row will be appended to the end of the first table
[junit4:junit4]   1>        </td>
[junit4:junit4]   1>        </tr>
[junit4:junit4]   1>        <hr>
[junit4:junit4]   1>        
[junit4:junit4]   1>        -->
[junit4:junit4]   1>        
[junit4:junit4]   1>    /configs/config1/currency.xml (0)
[junit4:junit4]   1>    DATA: ...supressed...
[junit4:junit4]   1>    /configs/config1/admin-extra.menu-bottom.html (0)
[junit4:junit4]   1>    DATA:
[junit4:junit4]   1>        <!-- admin-extra.menu-bottom.html -->
[junit4:junit4]   1>        
[junit4:junit4]   1>    /configs/config1/lang (6)
[junit4:junit4]   1>     /configs/config1/lang/contractions_ga.txt (0)
[junit4:junit4]   1>     DATA: ...supressed...
[junit4:junit4]   1>     /configs/config1/lang/contractions_fr.txt (0)
[junit4:junit4]   1>     DATA: ...supressed...
[junit4:junit4]   1>     /configs/config1/lang/hyphenations_ga.txt (0)
[junit4:junit4]   1>     DATA: ...supressed...
[junit4:junit4]   1>     /configs/config1/lang/contractions_it.txt (0)
[junit4:junit4]   1>     DATA: ...supressed...
[junit4:junit4]   1>     /configs/config1/lang/contractions_ca.txt (0)
[junit4:junit4]   1>     DATA: ...supressed...
[junit4:junit4]   1>     /configs/config1/lang/stemdict_nl.txt (0)
[junit4:junit4]   1>     DATA: ...supressed...
[junit4:junit4]   1>   /configs/firstConfig (0)
[junit4:junit4]   1>  /live_nodes (1)
[junit4:junit4]   1>   /live_nodes/127.0.0.1:8983_solr (0)
[junit4:junit4]   1>  /overseer (1)
[junit4:junit4]   1>  DATA:
[junit4:junit4]   1>      
[junit4:junit4]   1>   /overseer/collection-queue-work (0)
[junit4:junit4]   1>   DATA:
[junit4:junit4]   1>       
[junit4:junit4]   1>  /overseer_elect (2)
[junit4:junit4]   1>   /overseer_elect/election (1)
[junit4:junit4]   1>    /overseer_elect/election/88551895492263938-127.0.0.1:8983_solr-n_0000000004 (0)
[junit4:junit4]   1>   /overseer_elect/leader (0)
[junit4:junit4]   1>   DATA:
[junit4:junit4]   1>       {"id":"88551895492263938-127.0.0.1:8983_solr-n_0000000004"}
[junit4:junit4]   1>  /collections (1)
[junit4:junit4]   1>   /collections/collection1 (0)
[junit4:junit4]   1>   DATA:
[junit4:junit4]   1>       {"configName":"firstConfig"}
[junit4:junit4]   1>  /clusterstate.json (0)
[junit4:junit4]   1> 
[junit4:junit4]   2> NOTE: reproduce with: ant test  -Dtestcase=ZkControllerTest -Dtests.method=testUploadToCloud -Dtests.seed=1BEA3992F5175C03 -Dtests.slow=true -Dtests.locale=ar -Dtests.timezone=America/Thule -Dtests.file.encoding=US-ASCII
[junit4:junit4] ERROR   5.57s | ZkControllerTest.testUploadToCloud <<<
[junit4:junit4]    > Throwable #1: org.apache.zookeeper.KeeperException$SessionExpiredException: KeeperErrorCode = Session expired for /configs/config1/lang/stoptags_ja.txt
[junit4:junit4]    > 	at __randomizedtesting.SeedInfo.seed([1BEA3992F5175C03:3E874F77A0154730]:0)
[junit4:junit4]    > 	at org.apache.zookeeper.KeeperException.create(KeeperException.java:118)
[junit4:junit4]    > 	at org.apache.zookeeper.KeeperException.create(KeeperException.java:42)
[junit4:junit4]    > 	at org.apache.zookeeper.ZooKeeper.create(ZooKeeper.java:643)
[junit4:junit4]    > 	at org.apache.solr.common.cloud.SolrZkClient$10.execute(SolrZkClient.java:399)
[junit4:junit4]    > 	at org.apache.solr.common.cloud.ZkCmdExecutor.retryOperation(ZkCmdExecutor.java:63)
[junit4:junit4]    > 	at org.apache.solr.common.cloud.SolrZkClient.makePath(SolrZkClient.java:396)
[junit4:junit4]    > 	at org.apache.solr.common.cloud.SolrZkClient.makePath(SolrZkClient.java:306)
[junit4:junit4]    > 	at org.apache.solr.cloud.ZkController.uploadToZK(ZkController.java:1008)
[junit4:junit4]    > 	at org.apache.solr.cloud.ZkController.uploadToZK(ZkController.java:1010)
[junit4:junit4]    > 	at org.apache.solr.cloud.ZkController.uploadToZK(ZkController.java:841)
[junit4:junit4]    > 	at org.apache.solr.cloud.ZkControllerTest.testUploadToCloud(ZkControllerTest.java:134)
[junit4:junit4]    > 	at sun.reflect.NativeMethodAccessorImpl.invoke0(Native Method)
[junit4:junit4]    > 	at sun.reflect.NativeMethodAccessorImpl.invoke(NativeMethodAccessorImpl.java:57)
[junit4:junit4]    > 	at sun.reflect.DelegatingMethodAccessorImpl.invoke(DelegatingMethodAccessorImpl.java:43)
[junit4:junit4]    > 	at java.lang.reflect.Method.invoke(Method.java:601)
[junit4:junit4]    > 	at com.carrotsearch.randomizedtesting.RandomizedRunner.invoke(RandomizedRunner.java:1559)
[junit4:junit4]    > 	at com.carrotsearch.randomizedtesting.RandomizedRunner.access$600(RandomizedRunner.java:79)
[junit4:junit4]    > 	at com.carrotsearch.randomizedtesting.RandomizedRunner$6.evaluate(RandomizedRunner.java:737)
[junit4:junit4]    > 	at com.carrotsearch.randomizedtesting.RandomizedRunner$7.evaluate(RandomizedRunner.java:773)
[junit4:junit4]    > 	at com.carrotsearch.randomizedtesting.RandomizedRunner$8.evaluate(RandomizedRunner.java:787)
[junit4:junit4]    > 	at com.carrotsearch.randomizedtesting.rules.SystemPropertiesRestoreRule$1.evaluate(SystemPropertiesRestoreRule.java:53)
[junit4:junit4]    > 	at org.apache.lucene.util.TestRuleSetupTeardownChained$1.evaluate(TestRuleSetupTeardownChained.java:50)
[junit4:junit4]    > 	at org.apache.lucene.util.TestRuleFieldCacheSanity$1.evaluate(TestRuleFieldCacheSanity.java:51)
[junit4:junit4]    > 	at org.apache.lucene.util.AbstractBeforeAfterRule$1.evaluate(AbstractBeforeAfterRule.java:45)
[junit4:junit4]    > 	at com.carrotsearch.randomizedtesting.rules.SystemPropertiesInvariantRule$1.evaluate(SystemPropertiesInvariantRule.java:55)
[junit4:junit4]    > 	at org.apache.lucene.util.TestRuleThreadAndTestName$1.evaluate(TestRuleThreadAndTestName.java:48)
[junit4:junit4]    > 	at org.apache.lucene.util.TestRuleIgnoreAfterMaxFailures$1.evaluate(TestRuleIgnoreAfterMaxFailures.java:70)
[junit4:junit4]    > 	at org.apache.lucene.util.TestRuleMarkFailure$1.evaluate(TestRuleMarkFailure.java:48)
[junit4:junit4]    > 	at com.carrotsearch.randomizedtesting.rules.StatementAdapter.evaluate(StatementAdapter.java:36)
[junit4:junit4]    > 	at com.carrotsearch.randomizedtesting.ThreadLeakControl$StatementRunner.run(ThreadLeakControl.java:358)
[junit4:junit4]    > 	at com.carrotsearch.randomizedtesting.ThreadLeakControl.forkTimeoutingTask(ThreadLeakControl.java:782)
[junit4:junit4]    > 	at com.carrotsearch.randomizedtesting.ThreadLeakControl$3.evaluate(ThreadLeakControl.java:442)
[junit4:junit4]    > 	at com.carrotsearch.randomizedtesting.RandomizedRunner.runSingleTest(RandomizedRunner.java:746)
[junit4:junit4]    > 	at com.carrotsearch.randomizedtesting.RandomizedRunner$3.evaluate(RandomizedRunner.java:648)
[junit4:junit4]    > 	at com.carrotsearch.randomizedtesting.RandomizedRunner$4.evaluate(RandomizedRunner.java:682)
[junit4:junit4]    > 	at com.carrotsearch.randomizedtesting.RandomizedRunner$5.evaluate(RandomizedRunner.java:693)
[junit4:junit4]    > 	at com.carrotsearch.randomizedtesting.rules.StatementAdapter.evaluate(StatementAdapter.java:36)
[junit4:junit4]    > 	at com.carrotsearch.randomizedtesting.rules.SystemPropertiesRestoreRule$1.evaluate(SystemPropertiesRestoreRule.java:53)
[junit4:junit4]    > 	at org.apache.lucene.util.AbstractBeforeAfterRule$1.evaluate(AbstractBeforeAfterRule.java:45)
[junit4:junit4]    > 	at org.apache.lucene.util.TestRuleStoreClassName$1.evaluate(TestRuleStoreClassName.java:42)
[junit4:junit4]    > 	at com.carrotsearch.randomizedtesting.rules.SystemPropertiesInvariantRule$1.evaluate(SystemPropertiesInvariantRule.java:55)
[junit4:junit4]    > 	at com.carrotsearch.randomizedtesting.rules.NoShadowingOrOverridesOnMethodsRule$1.evaluate(NoShadowingOrOverridesOnMethodsRule.java:39)
[junit4:junit4]    > 	at com.carrotsearch.randomizedtesting.rules.NoShadowingOrOverridesOnMethodsRule$1.evaluate(NoShadowingOrOverridesOnMethodsRule.java:39)
[junit4:junit4]    > 	at com.carrotsearch.randomizedtesting.rules.StatementAdapter.evaluate(StatementAdapter.java:36)
[junit4:junit4]    > 	at org.apache.lucene.util.TestRuleAssertionsRequired$1.evaluate(TestRuleAssertionsRequired.java:43)
[junit4:junit4]    > 	at org.apache.lucene.util.TestRuleMarkFailure$1.evaluate(TestRuleMarkFailure.java:48)
[junit4:junit4]    > 	at org.apache.lucene.util.TestRuleIgnoreAfterMaxFailures$1.evaluate(TestRuleIgnoreAfterMaxFailures.java:70)
[junit4:junit4]    > 	at org.apache.lucene.util.TestRuleIgnoreTestSuites$1.evaluate(TestRuleIgnoreTestSuites.java:55)
[junit4:junit4]    > 	at com.carrotsearch.randomizedtesting.rules.StatementAdapter.evaluate(StatementAdapter.java:36)
[junit4:junit4]    > 	at com.carrotsearch.randomizedtesting.ThreadLeakControl$StatementRunner.run(ThreadLeakControl.java:358)
[junit4:junit4]    > 	at java.lang.Thread.run(Thread.java:722)
[junit4:junit4]   2> 10694 T81 oas.SolrTestCaseJ4.deleteCore ###deleteCore
[junit4:junit4]   2> NOTE: test params are: codec=Lucene41: {}, sim=DefaultSimilarity, locale=ar, timezone=America/Thule
[junit4:junit4]   2> NOTE: Windows 7 6.1 x86/Oracle Corporation 1.7.0_07 (32-bit)/cpus=2,threads=1,free=12494888,total=32964608
[junit4:junit4]   2> NOTE: All tests run in this JVM: [TestUpdate, LoggingHandlerTest, CurrencyFieldTest, TestWriterPerf, TestDefaultSimilarityFactory, UUIDFieldTest, TestUtils, CSVRequestHandlerTest, SampleTest, TestBadConfig, TestBM25SimilarityFactory, SortByFunctionTest, TestSolrDeletionPolicy1, TestCSVLoader, TestSolrQueryParser, TestQueryUtils, SuggesterFSTTest, TestLuceneMatchVersion, LukeRequestHandlerTest, ZkControllerTest]
[junit4:junit4] Completed in 10.74s, 2 tests, 1 error <<< FAILURES!

[...truncated 657 lines...]
BUILD FAILED
C:\Users\JenkinsSlave\workspace\Lucene-Solr-trunk-Windows\build.xml:335: The following error occurred while executing this line:
C:\Users\JenkinsSlave\workspace\Lucene-Solr-trunk-Windows\build.xml:39: The following error occurred while executing this line:
C:\Users\JenkinsSlave\workspace\Lucene-Solr-trunk-Windows\solr\build.xml:178: The following error occurred while executing this line:
C:\Users\JenkinsSlave\workspace\Lucene-Solr-trunk-Windows\lucene\module-build.xml:61: The following error occurred while executing this line:
C:\Users\JenkinsSlave\workspace\Lucene-Solr-trunk-Windows\lucene\common-build.xml:1171: The following error occurred while executing this line:
C:\Users\JenkinsSlave\workspace\Lucene-Solr-trunk-Windows\lucene\common-build.xml:839: There were test failures: 232 suites, 961 tests, 1 error, 12 ignored (7 assumptions)

Total time: 36 minutes 22 seconds
Build step 'Invoke Ant' marked build as failure
Archiving artifacts
Recording test results
Description set: Java: 32bit/jdk1.7.0_07 -server -XX:+UseSerialGC
Email was triggered for: Failure
Sending email for trigger: Failure



Mime
View raw message