lucene-dev mailing list archives

Site index · List index
Message view « Date » · « Thread »
Top « Date » · « Thread »
From Policeman Jenkins Server <jenk...@sd-datasolutions.de>
Subject [JENKINS] Lucene-Solr-trunk-Windows (64bit/jdk1.7.0_07) - Build # 1305 - Still Failing!
Date Thu, 25 Oct 2012 23:40:13 GMT
Build: http://jenkins.sd-datasolutions.de/job/Lucene-Solr-trunk-Windows/1305/
Java: 64bit/jdk1.7.0_07 -XX:+UseSerialGC

4 tests failed.
REGRESSION:  org.apache.solr.cloud.SyncSliceTest.testDistribSearch

Error Message:
There are still nodes recoverying

Stack Trace:
java.lang.AssertionError: There are still nodes recoverying
	at __randomizedtesting.SeedInfo.seed([79C34F1BF2698ED:867ABAE9C879F8D1]:0)
	at org.junit.Assert.fail(Assert.java:93)
	at org.apache.solr.cloud.AbstractDistribZkTestBase.waitForRecoveriesToFinish(AbstractDistribZkTestBase.java:154)
	at org.apache.solr.cloud.AbstractFullDistribZkTestBase.waitForRecoveriesToFinish(AbstractFullDistribZkTestBase.java:563)
	at org.apache.solr.cloud.AbstractFullDistribZkTestBase.waitForThingsToLevelOut(AbstractFullDistribZkTestBase.java:1138)
	at org.apache.solr.cloud.SyncSliceTest.doTest(SyncSliceTest.java:89)
	at org.apache.solr.BaseDistributedSearchTestCase.testDistribSearch(BaseDistributedSearchTestCase.java:695)
	at sun.reflect.NativeMethodAccessorImpl.invoke0(Native Method)
	at sun.reflect.NativeMethodAccessorImpl.invoke(NativeMethodAccessorImpl.java:57)
	at sun.reflect.DelegatingMethodAccessorImpl.invoke(DelegatingMethodAccessorImpl.java:43)
	at java.lang.reflect.Method.invoke(Method.java:601)
	at com.carrotsearch.randomizedtesting.RandomizedRunner.invoke(RandomizedRunner.java:1559)
	at com.carrotsearch.randomizedtesting.RandomizedRunner.access$600(RandomizedRunner.java:79)
	at com.carrotsearch.randomizedtesting.RandomizedRunner$6.evaluate(RandomizedRunner.java:737)
	at com.carrotsearch.randomizedtesting.RandomizedRunner$7.evaluate(RandomizedRunner.java:773)
	at com.carrotsearch.randomizedtesting.RandomizedRunner$8.evaluate(RandomizedRunner.java:787)
	at com.carrotsearch.randomizedtesting.rules.SystemPropertiesRestoreRule$1.evaluate(SystemPropertiesRestoreRule.java:53)
	at org.apache.lucene.util.TestRuleSetupTeardownChained$1.evaluate(TestRuleSetupTeardownChained.java:50)
	at org.apache.lucene.util.TestRuleFieldCacheSanity$1.evaluate(TestRuleFieldCacheSanity.java:51)
	at org.apache.lucene.util.AbstractBeforeAfterRule$1.evaluate(AbstractBeforeAfterRule.java:45)
	at com.carrotsearch.randomizedtesting.rules.SystemPropertiesInvariantRule$1.evaluate(SystemPropertiesInvariantRule.java:55)
	at org.apache.lucene.util.TestRuleThreadAndTestName$1.evaluate(TestRuleThreadAndTestName.java:48)
	at org.apache.lucene.util.TestRuleIgnoreAfterMaxFailures$1.evaluate(TestRuleIgnoreAfterMaxFailures.java:70)
	at org.apache.lucene.util.TestRuleMarkFailure$1.evaluate(TestRuleMarkFailure.java:48)
	at com.carrotsearch.randomizedtesting.rules.StatementAdapter.evaluate(StatementAdapter.java:36)
	at com.carrotsearch.randomizedtesting.ThreadLeakControl$StatementRunner.run(ThreadLeakControl.java:358)
	at com.carrotsearch.randomizedtesting.ThreadLeakControl.forkTimeoutingTask(ThreadLeakControl.java:782)
	at com.carrotsearch.randomizedtesting.ThreadLeakControl$3.evaluate(ThreadLeakControl.java:442)
	at com.carrotsearch.randomizedtesting.RandomizedRunner.runSingleTest(RandomizedRunner.java:746)
	at com.carrotsearch.randomizedtesting.RandomizedRunner$3.evaluate(RandomizedRunner.java:648)
	at com.carrotsearch.randomizedtesting.RandomizedRunner$4.evaluate(RandomizedRunner.java:682)
	at com.carrotsearch.randomizedtesting.RandomizedRunner$5.evaluate(RandomizedRunner.java:693)
	at com.carrotsearch.randomizedtesting.rules.StatementAdapter.evaluate(StatementAdapter.java:36)
	at com.carrotsearch.randomizedtesting.rules.SystemPropertiesRestoreRule$1.evaluate(SystemPropertiesRestoreRule.java:53)
	at org.apache.lucene.util.AbstractBeforeAfterRule$1.evaluate(AbstractBeforeAfterRule.java:45)
	at org.apache.lucene.util.TestRuleStoreClassName$1.evaluate(TestRuleStoreClassName.java:42)
	at com.carrotsearch.randomizedtesting.rules.SystemPropertiesInvariantRule$1.evaluate(SystemPropertiesInvariantRule.java:55)
	at com.carrotsearch.randomizedtesting.rules.NoShadowingOrOverridesOnMethodsRule$1.evaluate(NoShadowingOrOverridesOnMethodsRule.java:39)
	at com.carrotsearch.randomizedtesting.rules.NoShadowingOrOverridesOnMethodsRule$1.evaluate(NoShadowingOrOverridesOnMethodsRule.java:39)
	at com.carrotsearch.randomizedtesting.rules.StatementAdapter.evaluate(StatementAdapter.java:36)
	at org.apache.lucene.util.TestRuleAssertionsRequired$1.evaluate(TestRuleAssertionsRequired.java:43)
	at org.apache.lucene.util.TestRuleMarkFailure$1.evaluate(TestRuleMarkFailure.java:48)
	at org.apache.lucene.util.TestRuleIgnoreAfterMaxFailures$1.evaluate(TestRuleIgnoreAfterMaxFailures.java:70)
	at org.apache.lucene.util.TestRuleIgnoreTestSuites$1.evaluate(TestRuleIgnoreTestSuites.java:55)
	at com.carrotsearch.randomizedtesting.rules.StatementAdapter.evaluate(StatementAdapter.java:36)
	at com.carrotsearch.randomizedtesting.ThreadLeakControl$StatementRunner.run(ThreadLeakControl.java:358)
	at java.lang.Thread.run(Thread.java:722)


FAILED:  junit.framework.TestSuite.org.apache.solr.cloud.SyncSliceTest

Error Message:
ERROR: SolrIndexSearcher opens=8 closes=7

Stack Trace:
java.lang.AssertionError: ERROR: SolrIndexSearcher opens=8 closes=7
	at __randomizedtesting.SeedInfo.seed([79C34F1BF2698ED]:0)
	at org.junit.Assert.fail(Assert.java:93)
	at org.apache.solr.SolrTestCaseJ4.endTrackingSearchers(SolrTestCaseJ4.java:242)
	at org.apache.solr.SolrTestCaseJ4.afterClass(SolrTestCaseJ4.java:97)
	at sun.reflect.GeneratedMethodAccessor19.invoke(Unknown Source)
	at sun.reflect.DelegatingMethodAccessorImpl.invoke(DelegatingMethodAccessorImpl.java:43)
	at java.lang.reflect.Method.invoke(Method.java:601)
	at com.carrotsearch.randomizedtesting.RandomizedRunner.invoke(RandomizedRunner.java:1559)
	at com.carrotsearch.randomizedtesting.RandomizedRunner.access$600(RandomizedRunner.java:79)
	at com.carrotsearch.randomizedtesting.RandomizedRunner$5.evaluate(RandomizedRunner.java:700)
	at com.carrotsearch.randomizedtesting.rules.StatementAdapter.evaluate(StatementAdapter.java:36)
	at com.carrotsearch.randomizedtesting.rules.SystemPropertiesRestoreRule$1.evaluate(SystemPropertiesRestoreRule.java:53)
	at org.apache.lucene.util.AbstractBeforeAfterRule$1.evaluate(AbstractBeforeAfterRule.java:45)
	at org.apache.lucene.util.TestRuleStoreClassName$1.evaluate(TestRuleStoreClassName.java:42)
	at com.carrotsearch.randomizedtesting.rules.SystemPropertiesInvariantRule$1.evaluate(SystemPropertiesInvariantRule.java:55)
	at com.carrotsearch.randomizedtesting.rules.NoShadowingOrOverridesOnMethodsRule$1.evaluate(NoShadowingOrOverridesOnMethodsRule.java:39)
	at com.carrotsearch.randomizedtesting.rules.NoShadowingOrOverridesOnMethodsRule$1.evaluate(NoShadowingOrOverridesOnMethodsRule.java:39)
	at com.carrotsearch.randomizedtesting.rules.StatementAdapter.evaluate(StatementAdapter.java:36)
	at org.apache.lucene.util.TestRuleAssertionsRequired$1.evaluate(TestRuleAssertionsRequired.java:43)
	at org.apache.lucene.util.TestRuleMarkFailure$1.evaluate(TestRuleMarkFailure.java:48)
	at org.apache.lucene.util.TestRuleIgnoreAfterMaxFailures$1.evaluate(TestRuleIgnoreAfterMaxFailures.java:70)
	at org.apache.lucene.util.TestRuleIgnoreTestSuites$1.evaluate(TestRuleIgnoreTestSuites.java:55)
	at com.carrotsearch.randomizedtesting.rules.StatementAdapter.evaluate(StatementAdapter.java:36)
	at com.carrotsearch.randomizedtesting.ThreadLeakControl$StatementRunner.run(ThreadLeakControl.java:358)
	at java.lang.Thread.run(Thread.java:722)


FAILED:  junit.framework.TestSuite.org.apache.solr.cloud.SyncSliceTest

Error Message:
1 thread leaked from SUITE scope at org.apache.solr.cloud.SyncSliceTest:     1) Thread[id=3368, name=searcherExecutor-2066-thread-1, state=WAITING, group=TGRP-SyncSliceTest]         at sun.misc.Unsafe.park(Native Method)         at java.util.concurrent.locks.LockSupport.park(LockSupport.java:186)         at java.util.concurrent.locks.AbstractQueuedSynchronizer$ConditionObject.await(AbstractQueuedSynchronizer.java:2043)         at java.util.concurrent.LinkedBlockingQueue.take(LinkedBlockingQueue.java:442)         at java.util.concurrent.ThreadPoolExecutor.getTask(ThreadPoolExecutor.java:1043)         at java.util.concurrent.ThreadPoolExecutor.runWorker(ThreadPoolExecutor.java:1103)         at java.util.concurrent.ThreadPoolExecutor$Worker.run(ThreadPoolExecutor.java:603)         at java.lang.Thread.run(Thread.java:722)

Stack Trace:
com.carrotsearch.randomizedtesting.ThreadLeakError: 1 thread leaked from SUITE scope at org.apache.solr.cloud.SyncSliceTest: 
   1) Thread[id=3368, name=searcherExecutor-2066-thread-1, state=WAITING, group=TGRP-SyncSliceTest]
        at sun.misc.Unsafe.park(Native Method)
        at java.util.concurrent.locks.LockSupport.park(LockSupport.java:186)
        at java.util.concurrent.locks.AbstractQueuedSynchronizer$ConditionObject.await(AbstractQueuedSynchronizer.java:2043)
        at java.util.concurrent.LinkedBlockingQueue.take(LinkedBlockingQueue.java:442)
        at java.util.concurrent.ThreadPoolExecutor.getTask(ThreadPoolExecutor.java:1043)
        at java.util.concurrent.ThreadPoolExecutor.runWorker(ThreadPoolExecutor.java:1103)
        at java.util.concurrent.ThreadPoolExecutor$Worker.run(ThreadPoolExecutor.java:603)
        at java.lang.Thread.run(Thread.java:722)
	at __randomizedtesting.SeedInfo.seed([79C34F1BF2698ED]:0)


FAILED:  junit.framework.TestSuite.org.apache.solr.cloud.SyncSliceTest

Error Message:
There are still zombie threads that couldn't be terminated:    1) Thread[id=3368, name=searcherExecutor-2066-thread-1, state=WAITING, group=TGRP-SyncSliceTest]         at sun.misc.Unsafe.park(Native Method)         at java.util.concurrent.locks.LockSupport.park(LockSupport.java:186)         at java.util.concurrent.locks.AbstractQueuedSynchronizer$ConditionObject.await(AbstractQueuedSynchronizer.java:2043)         at java.util.concurrent.LinkedBlockingQueue.take(LinkedBlockingQueue.java:442)         at java.util.concurrent.ThreadPoolExecutor.getTask(ThreadPoolExecutor.java:1043)         at java.util.concurrent.ThreadPoolExecutor.runWorker(ThreadPoolExecutor.java:1103)         at java.util.concurrent.ThreadPoolExecutor$Worker.run(ThreadPoolExecutor.java:603)         at java.lang.Thread.run(Thread.java:722)

Stack Trace:
com.carrotsearch.randomizedtesting.ThreadLeakError: There are still zombie threads that couldn't be terminated:
   1) Thread[id=3368, name=searcherExecutor-2066-thread-1, state=WAITING, group=TGRP-SyncSliceTest]
        at sun.misc.Unsafe.park(Native Method)
        at java.util.concurrent.locks.LockSupport.park(LockSupport.java:186)
        at java.util.concurrent.locks.AbstractQueuedSynchronizer$ConditionObject.await(AbstractQueuedSynchronizer.java:2043)
        at java.util.concurrent.LinkedBlockingQueue.take(LinkedBlockingQueue.java:442)
        at java.util.concurrent.ThreadPoolExecutor.getTask(ThreadPoolExecutor.java:1043)
        at java.util.concurrent.ThreadPoolExecutor.runWorker(ThreadPoolExecutor.java:1103)
        at java.util.concurrent.ThreadPoolExecutor$Worker.run(ThreadPoolExecutor.java:603)
        at java.lang.Thread.run(Thread.java:722)
	at __randomizedtesting.SeedInfo.seed([79C34F1BF2698ED]:0)




Build Log:
[...truncated 9026 lines...]
[junit4:junit4] Suite: org.apache.solr.cloud.SyncSliceTest
[junit4:junit4]   2> 4 T3321 oas.SolrTestCaseJ4.setUp ###Starting testDistribSearch
[junit4:junit4]   2> Creating dataDir: C:\Users\JenkinsSlave\workspace\Lucene-Solr-trunk-Windows\solr\build\solr-core\test\J0\.\solrtest-SyncSliceTest-1351208159238
[junit4:junit4]   2> 9 T3321 oasc.ZkTestServer.run STARTING ZK TEST SERVER
[junit4:junit4]   2> 13 T3322 oazs.ZooKeeperServer.setTickTime tickTime set to 1000
[junit4:junit4]   2> 13 T3322 oazs.NIOServerCnxn$Factory.<init> binding to port 0.0.0.0/0.0.0.0:0
[junit4:junit4]   2> 14 T3322 oazsp.FileTxnSnapLog.save Snapshotting: 0
[junit4:junit4]   2> 102 T3321 oasc.ZkTestServer.run start zk server on port:51321
[junit4:junit4]   2> 102 T3321 oaz.ZooKeeper.<init> Initiating client connection, connectString=127.0.0.1:51321 sessionTimeout=10000 watcher=org.apache.solr.common.cloud.ConnectionManager@68c2fc12
[junit4:junit4]   2> 104 T3327 oaz.ClientCnxn$SendThread.startConnect Opening socket connection to server /127.0.0.1:51321
[junit4:junit4]   2> 104 T3321 oascc.ConnectionManager.waitForConnected Waiting for client to connect to ZooKeeper
[junit4:junit4]   2> 106 T3327 oaz.ClientCnxn$SendThread.primeConnection Socket connection established to 127.0.0.1/127.0.0.1:51321, initiating session
[junit4:junit4]   2> 106 T3323 oazs.NIOServerCnxn$Factory.run Accepted socket connection from /127.0.0.1:51324
[junit4:junit4]   2> 106 T3323 oazs.NIOServerCnxn.readConnectRequest Client attempting to establish new session at /127.0.0.1:51324
[junit4:junit4]   2> 107 T3325 oazsp.FileTxnLog.append Creating new log file: log.1
[junit4:junit4]   2> 113 T3325 oazs.NIOServerCnxn.finishSessionInit Established session 0x13a9a4848100000 with negotiated timeout 10000 for client /127.0.0.1:51324
[junit4:junit4]   2> 113 T3327 oaz.ClientCnxn$SendThread.readConnectResult Session establishment complete on server 127.0.0.1/127.0.0.1:51321, sessionid = 0x13a9a4848100000, negotiated timeout = 10000
[junit4:junit4]   2> 113 T3328 oascc.ConnectionManager.process Watcher org.apache.solr.common.cloud.ConnectionManager@68c2fc12 name:ZooKeeperConnection Watcher:127.0.0.1:51321 got event WatchedEvent state:SyncConnected type:None path:null path:null type:None
[junit4:junit4]   2> 113 T3321 oascc.ConnectionManager.waitForConnected Client is connected to ZooKeeper
[junit4:junit4]   2> 114 T3321 oascc.SolrZkClient.makePath makePath: /solr
[junit4:junit4]   2> 119 T3326 oazs.PrepRequestProcessor.pRequest Processed session termination for sessionid: 0x13a9a4848100000
[junit4:junit4]   2> 120 T3328 oaz.ClientCnxn$EventThread.run EventThread shut down
[junit4:junit4]   2> 120 T3323 oazs.NIOServerCnxn.doIO WARNING EndOfStreamException: Unable to read additional data from client sessionid 0x13a9a4848100000, likely client has closed socket
[junit4:junit4]   2> 120 T3321 oaz.ZooKeeper.close Session: 0x13a9a4848100000 closed
[junit4:junit4]   2> 121 T3323 oazs.NIOServerCnxn.closeSock Closed socket connection for client /127.0.0.1:51324 which had sessionid 0x13a9a4848100000
[junit4:junit4]   2> 121 T3321 oaz.ZooKeeper.<init> Initiating client connection, connectString=127.0.0.1:51321/solr sessionTimeout=10000 watcher=org.apache.solr.common.cloud.ConnectionManager@5df2c370
[junit4:junit4]   2> 122 T3329 oaz.ClientCnxn$SendThread.startConnect Opening socket connection to server /127.0.0.1:51321
[junit4:junit4]   2> 122 T3321 oascc.ConnectionManager.waitForConnected Waiting for client to connect to ZooKeeper
[junit4:junit4]   2> 124 T3323 oazs.NIOServerCnxn$Factory.run Accepted socket connection from /127.0.0.1:51327
[junit4:junit4]   2> 124 T3329 oaz.ClientCnxn$SendThread.primeConnection Socket connection established to 127.0.0.1/127.0.0.1:51321, initiating session
[junit4:junit4]   2> 125 T3323 oazs.NIOServerCnxn.readConnectRequest Client attempting to establish new session at /127.0.0.1:51327
[junit4:junit4]   2> 126 T3325 oazs.NIOServerCnxn.finishSessionInit Established session 0x13a9a4848100001 with negotiated timeout 10000 for client /127.0.0.1:51327
[junit4:junit4]   2> 126 T3329 oaz.ClientCnxn$SendThread.readConnectResult Session establishment complete on server 127.0.0.1/127.0.0.1:51321, sessionid = 0x13a9a4848100001, negotiated timeout = 10000
[junit4:junit4]   2> 127 T3330 oascc.ConnectionManager.process Watcher org.apache.solr.common.cloud.ConnectionManager@5df2c370 name:ZooKeeperConnection Watcher:127.0.0.1:51321/solr got event WatchedEvent state:SyncConnected type:None path:null path:null type:None
[junit4:junit4]   2> 127 T3321 oascc.ConnectionManager.waitForConnected Client is connected to ZooKeeper
[junit4:junit4]   2> 127 T3321 oascc.SolrZkClient.makePath makePath: /collections/collection1
[junit4:junit4]   2> 132 T3321 oascc.SolrZkClient.makePath makePath: /collections/collection1/shards
[junit4:junit4]   2> 136 T3321 oascc.SolrZkClient.makePath makePath: /collections/control_collection
[junit4:junit4]   2> 138 T3321 oascc.SolrZkClient.makePath makePath: /collections/control_collection/shards
[junit4:junit4]   2> 143 T3321 oasc.AbstractZkTestCase.putConfig put C:\Users\JenkinsSlave\workspace\Lucene-Solr-trunk-Windows\solr\build\solr-core\test-files\solr\collection1\conf\solrconfig.xml to /configs/conf1/solrconfig.xml
[junit4:junit4]   2> 144 T3321 oascc.SolrZkClient.makePath makePath: /configs/conf1/solrconfig.xml
[junit4:junit4]   2> 151 T3321 oasc.AbstractZkTestCase.putConfig put C:\Users\JenkinsSlave\workspace\Lucene-Solr-trunk-Windows\solr\build\solr-core\test-files\solr\collection1\conf\schema.xml to /configs/conf1/schema.xml
[junit4:junit4]   2> 152 T3321 oascc.SolrZkClient.makePath makePath: /configs/conf1/schema.xml
[junit4:junit4]   2> 155 T3321 oasc.AbstractZkTestCase.putConfig put C:\Users\JenkinsSlave\workspace\Lucene-Solr-trunk-Windows\solr\build\solr-core\test-files\solr\collection1\conf\solrconfig.xml to /configs/conf1/solrconfig.xml
[junit4:junit4]   2> 156 T3321 oascc.SolrZkClient.makePath makePath: /configs/conf1/solrconfig.xml
[junit4:junit4]   2> 162 T3321 oasc.AbstractZkTestCase.putConfig put C:\Users\JenkinsSlave\workspace\Lucene-Solr-trunk-Windows\solr\build\solr-core\test-files\solr\collection1\conf\stopwords.txt to /configs/conf1/stopwords.txt
[junit4:junit4]   2> 162 T3321 oascc.SolrZkClient.makePath makePath: /configs/conf1/stopwords.txt
[junit4:junit4]   2> 165 T3321 oasc.AbstractZkTestCase.putConfig put C:\Users\JenkinsSlave\workspace\Lucene-Solr-trunk-Windows\solr\build\solr-core\test-files\solr\collection1\conf\protwords.txt to /configs/conf1/protwords.txt
[junit4:junit4]   2> 165 T3321 oascc.SolrZkClient.makePath makePath: /configs/conf1/protwords.txt
[junit4:junit4]   2> 170 T3321 oasc.AbstractZkTestCase.putConfig put C:\Users\JenkinsSlave\workspace\Lucene-Solr-trunk-Windows\solr\build\solr-core\test-files\solr\collection1\conf\currency.xml to /configs/conf1/currency.xml
[junit4:junit4]   2> 170 T3321 oascc.SolrZkClient.makePath makePath: /configs/conf1/currency.xml
[junit4:junit4]   2> 174 T3321 oasc.AbstractZkTestCase.putConfig put C:\Users\JenkinsSlave\workspace\Lucene-Solr-trunk-Windows\solr\build\solr-core\test-files\solr\collection1\conf\open-exchange-rates.json to /configs/conf1/open-exchange-rates.json
[junit4:junit4]   2> 175 T3321 oascc.SolrZkClient.makePath makePath: /configs/conf1/open-exchange-rates.json
[junit4:junit4]   2> 178 T3321 oasc.AbstractZkTestCase.putConfig put C:\Users\JenkinsSlave\workspace\Lucene-Solr-trunk-Windows\solr\build\solr-core\test-files\solr\collection1\conf\mapping-ISOLatin1Accent.txt to /configs/conf1/mapping-ISOLatin1Accent.txt
[junit4:junit4]   2> 179 T3321 oascc.SolrZkClient.makePath makePath: /configs/conf1/mapping-ISOLatin1Accent.txt
[junit4:junit4]   2> 183 T3321 oasc.AbstractZkTestCase.putConfig put C:\Users\JenkinsSlave\workspace\Lucene-Solr-trunk-Windows\solr\build\solr-core\test-files\solr\collection1\conf\old_synonyms.txt to /configs/conf1/old_synonyms.txt
[junit4:junit4]   2> 184 T3321 oascc.SolrZkClient.makePath makePath: /configs/conf1/old_synonyms.txt
[junit4:junit4]   2> 187 T3321 oasc.AbstractZkTestCase.putConfig put C:\Users\JenkinsSlave\workspace\Lucene-Solr-trunk-Windows\solr\build\solr-core\test-files\solr\collection1\conf\synonyms.txt to /configs/conf1/synonyms.txt
[junit4:junit4]   2> 187 T3321 oascc.SolrZkClient.makePath makePath: /configs/conf1/synonyms.txt
[junit4:junit4]   2> 193 T3326 oazs.PrepRequestProcessor.pRequest Processed session termination for sessionid: 0x13a9a4848100001
[junit4:junit4]   2> 195 T3323 oazs.NIOServerCnxn.closeSock Closed socket connection for client /127.0.0.1:51327 which had sessionid 0x13a9a4848100001
[junit4:junit4]   2> 196 T3330 oaz.ClientCnxn$EventThread.run EventThread shut down
[junit4:junit4]   2> 196 T3321 oaz.ZooKeeper.close Session: 0x13a9a4848100001 closed
[junit4:junit4]   2> 484 T3321 oejs.Server.doStart jetty-8.1.2.v20120308
[junit4:junit4]   2> 488 T3321 oejs.AbstractConnector.doStart Started SelectChannelConnector@0.0.0.0:51328
[junit4:junit4]   2> 489 T3321 oasc.SolrResourceLoader.locateSolrHome JNDI not configured for solr (NoInitialContextEx)
[junit4:junit4]   2> 489 T3321 oasc.SolrResourceLoader.locateSolrHome using system property solr.solr.home: C:\Users\JenkinsSlave\workspace\Lucene-Solr-trunk-Windows\solr\build\solr-core\test\J0\.\org.apache.solr.cloud.SyncSliceTest-controljetty-1351208159427
[junit4:junit4]   2> 490 T3321 oasc.SolrResourceLoader.<init> new SolrResourceLoader for deduced Solr Home: 'C:\Users\JenkinsSlave\workspace\Lucene-Solr-trunk-Windows\solr\build\solr-core\test\J0\.\org.apache.solr.cloud.SyncSliceTest-controljetty-1351208159427\'
[junit4:junit4]   2> 519 T3321 oass.SolrDispatchFilter.init SolrDispatchFilter.init()
[junit4:junit4]   2> 520 T3321 oasc.SolrResourceLoader.locateSolrHome JNDI not configured for solr (NoInitialContextEx)
[junit4:junit4]   2> 520 T3321 oasc.SolrResourceLoader.locateSolrHome using system property solr.solr.home: C:\Users\JenkinsSlave\workspace\Lucene-Solr-trunk-Windows\solr\build\solr-core\test\J0\.\org.apache.solr.cloud.SyncSliceTest-controljetty-1351208159427
[junit4:junit4]   2> 521 T3321 oasc.CoreContainer$Initializer.initialize looking for solr.xml: C:\Users\JenkinsSlave\workspace\Lucene-Solr-trunk-Windows\solr\build\solr-core\test\J0\.\org.apache.solr.cloud.SyncSliceTest-controljetty-1351208159427\solr.xml
[junit4:junit4]   2> 521 T3321 oasc.CoreContainer.<init> New CoreContainer 2093393937
[junit4:junit4]   2> 521 T3321 oasc.CoreContainer.load Loading CoreContainer using Solr Home: 'C:\Users\JenkinsSlave\workspace\Lucene-Solr-trunk-Windows\solr\build\solr-core\test\J0\.\org.apache.solr.cloud.SyncSliceTest-controljetty-1351208159427\'
[junit4:junit4]   2> 522 T3321 oasc.SolrResourceLoader.<init> new SolrResourceLoader for directory: 'C:\Users\JenkinsSlave\workspace\Lucene-Solr-trunk-Windows\solr\build\solr-core\test\J0\.\org.apache.solr.cloud.SyncSliceTest-controljetty-1351208159427\'
[junit4:junit4]   2> 546 T3321 oasc.CoreContainer.load Registering Log Listener
[junit4:junit4]   2> 560 T3321 oasc.CoreContainer.initZooKeeper Zookeeper client=127.0.0.1:51321/solr
[junit4:junit4]   2> 561 T3321 oaz.ZooKeeper.<init> Initiating client connection, connectString=127.0.0.1:51321/solr sessionTimeout=5000 watcher=org.apache.solr.common.cloud.ConnectionManager@13e94bbc
[junit4:junit4]   2> 564 T3340 oaz.ClientCnxn$SendThread.startConnect Opening socket connection to server /127.0.0.1:51321
[junit4:junit4]   2> 564 T3321 oascc.ConnectionManager.waitForConnected Waiting for client to connect to ZooKeeper
[junit4:junit4]   2> 566 T3340 oaz.ClientCnxn$SendThread.primeConnection Socket connection established to 127.0.0.1/127.0.0.1:51321, initiating session
[junit4:junit4]   2> 566 T3323 oazs.NIOServerCnxn$Factory.run Accepted socket connection from /127.0.0.1:51333
[junit4:junit4]   2> 567 T3323 oazs.NIOServerCnxn.readConnectRequest Client attempting to establish new session at /127.0.0.1:51333
[junit4:junit4]   2> 575 T3325 oazs.NIOServerCnxn.finishSessionInit Established session 0x13a9a4848100002 with negotiated timeout 5000 for client /127.0.0.1:51333
[junit4:junit4]   2> 575 T3340 oaz.ClientCnxn$SendThread.readConnectResult Session establishment complete on server 127.0.0.1/127.0.0.1:51321, sessionid = 0x13a9a4848100002, negotiated timeout = 5000
[junit4:junit4]   2> 575 T3341 oascc.ConnectionManager.process Watcher org.apache.solr.common.cloud.ConnectionManager@13e94bbc name:ZooKeeperConnection Watcher:127.0.0.1:51321/solr got event WatchedEvent state:SyncConnected type:None path:null path:null type:None
[junit4:junit4]   2> 575 T3321 oascc.ConnectionManager.waitForConnected Client is connected to ZooKeeper
[junit4:junit4]   2> 577 T3326 oazs.PrepRequestProcessor.pRequest Got user-level KeeperException when processing sessionid:0x13a9a4848100002 type:create cxid:0x2 zxid:0xfffffffffffffffe txntype:unknown reqpath:n/a Error Path:/solr/overseer Error:KeeperErrorCode = NodeExists for /solr/overseer
[junit4:junit4]   2> 579 T3321 oascc.SolrZkClient.makePath makePath: /live_nodes
[junit4:junit4]   2> 582 T3321 oasc.ZkController.createEphemeralLiveNode Register node as live in ZooKeeper:/live_nodes/127.0.0.1:51328_solr
[junit4:junit4]   2> 583 T3326 oazs.PrepRequestProcessor.pRequest Got user-level KeeperException when processing sessionid:0x13a9a4848100002 type:delete cxid:0x7 zxid:0xfffffffffffffffe txntype:unknown reqpath:n/a Error Path:/solr/live_nodes/127.0.0.1:51328_solr Error:KeeperErrorCode = NoNode for /solr/live_nodes/127.0.0.1:51328_solr
[junit4:junit4]   2> 583 T3321 oascc.SolrZkClient.makePath makePath: /live_nodes/127.0.0.1:51328_solr
[junit4:junit4]   2> 588 T3321 oashc.HttpShardHandlerFactory.getParameter Setting socketTimeout to: 0
[junit4:junit4]   2> 588 T3321 oashc.HttpShardHandlerFactory.getParameter Setting urlScheme to: http://
[junit4:junit4]   2> 588 T3321 oashc.HttpShardHandlerFactory.getParameter Setting connTimeout to: 0
[junit4:junit4]   2> 589 T3321 oashc.HttpShardHandlerFactory.getParameter Setting maxConnectionsPerHost to: 20
[junit4:junit4]   2> 589 T3321 oashc.HttpShardHandlerFactory.getParameter Setting corePoolSize to: 0
[junit4:junit4]   2> 589 T3321 oashc.HttpShardHandlerFactory.getParameter Setting maximumPoolSize to: 2147483647
[junit4:junit4]   2> 589 T3321 oashc.HttpShardHandlerFactory.getParameter Setting maxThreadIdleTime to: 5
[junit4:junit4]   2> 590 T3321 oashc.HttpShardHandlerFactory.getParameter Setting sizeOfQueue to: -1
[junit4:junit4]   2> 590 T3321 oashc.HttpShardHandlerFactory.getParameter Setting fairnessPolicy to: false
[junit4:junit4]   2> 590 T3321 oascsi.HttpClientUtil.createClient Creating new http client, config:maxConnectionsPerHost=20&maxConnections=10000&socketTimeout=0&connTimeout=0&retry=false
[junit4:junit4]   2> 598 T3321 oascc.SolrZkClient.makePath makePath: /overseer_elect/election
[junit4:junit4]   2> 606 T3326 oazs.PrepRequestProcessor.pRequest Got user-level KeeperException when processing sessionid:0x13a9a4848100002 type:delete cxid:0x15 zxid:0xfffffffffffffffe txntype:unknown reqpath:n/a Error Path:/solr/overseer_elect/leader Error:KeeperErrorCode = NoNode for /solr/overseer_elect/leader
[junit4:junit4]   2> 608 T3321 oascc.SolrZkClient.makePath makePath: /overseer_elect/leader
[junit4:junit4]   2> 611 T3321 oasc.Overseer.start Overseer (id=88552777924476930-127.0.0.1:51328_solr-n_0000000000) starting
[junit4:junit4]   2> 611 T3326 oazs.PrepRequestProcessor.pRequest Got user-level KeeperException when processing sessionid:0x13a9a4848100002 type:create cxid:0x1a zxid:0xfffffffffffffffe txntype:unknown reqpath:n/a Error Path:/solr/overseer Error:KeeperErrorCode = NodeExists for /solr/overseer
[junit4:junit4]   2> 613 T3326 oazs.PrepRequestProcessor.pRequest Got user-level KeeperException when processing sessionid:0x13a9a4848100002 type:create cxid:0x1b zxid:0xfffffffffffffffe txntype:unknown reqpath:n/a Error Path:/solr/overseer Error:KeeperErrorCode = NodeExists for /solr/overseer
[junit4:junit4]   2> 615 T3326 oazs.PrepRequestProcessor.pRequest Got user-level KeeperException when processing sessionid:0x13a9a4848100002 type:create cxid:0x1c zxid:0xfffffffffffffffe txntype:unknown reqpath:n/a Error Path:/solr/overseer Error:KeeperErrorCode = NodeExists for /solr/overseer
[junit4:junit4]   2> 616 T3326 oazs.PrepRequestProcessor.pRequest Got user-level KeeperException when processing sessionid:0x13a9a4848100002 type:create cxid:0x1d zxid:0xfffffffffffffffe txntype:unknown reqpath:n/a Error Path:/solr/overseer Error:KeeperErrorCode = NodeExists for /solr/overseer
[junit4:junit4]   2> 618 T3343 oasc.OverseerCollectionProcessor.run Process current queue of collection creations
[junit4:junit4]   2> 619 T3321 oascc.SolrZkClient.makePath makePath: /clusterstate.json
[junit4:junit4]   2> 624 T3321 oascc.ZkStateReader.createClusterStateWatchersAndUpdate Updating cluster state from ZooKeeper... 
[junit4:junit4]   2> 625 T3342 oasc.Overseer$ClusterStateUpdater.run Starting to work on the main queue
[junit4:junit4]   2> 631 T3321 oasc.CoreContainer.create Creating SolrCore 'collection1' using instanceDir: C:\Users\JenkinsSlave\workspace\Lucene-Solr-trunk-Windows\solr\build\solr-core\test\J0\.\org.apache.solr.cloud.SyncSliceTest-controljetty-1351208159427\collection1
[junit4:junit4]   2> 632 T3321 oasc.ZkController.createCollectionZkNode Check for collection zkNode:control_collection
[junit4:junit4]   2> 633 T3321 oasc.ZkController.createCollectionZkNode Collection zkNode exists
[junit4:junit4]   2> 633 T3321 oasc.ZkController.readConfigName Load collection config from:/collections/control_collection
[junit4:junit4]   2> 634 T3321 oasc.SolrResourceLoader.<init> new SolrResourceLoader for directory: 'C:\Users\JenkinsSlave\workspace\Lucene-Solr-trunk-Windows\solr\build\solr-core\test\J0\.\org.apache.solr.cloud.SyncSliceTest-controljetty-1351208159427\collection1\'
[junit4:junit4]   2> 635 T3321 oasc.SolrResourceLoader.replaceClassLoader Adding 'file:/C:/Users/JenkinsSlave/workspace/Lucene-Solr-trunk-Windows/solr/build/solr-core/test/J0/org.apache.solr.cloud.SyncSliceTest-controljetty-1351208159427/collection1/lib/classes/' to classloader
[junit4:junit4]   2> 637 T3321 oasc.SolrResourceLoader.replaceClassLoader Adding 'file:/C:/Users/JenkinsSlave/workspace/Lucene-Solr-trunk-Windows/solr/build/solr-core/test/J0/org.apache.solr.cloud.SyncSliceTest-controljetty-1351208159427/collection1/lib/README' to classloader
[junit4:junit4]   2> 691 T3321 oasc.SolrConfig.<init> Using Lucene MatchVersion: LUCENE_50
[junit4:junit4]   2> 751 T3321 oasc.SolrConfig.<init> Loaded SolrConfig: solrconfig.xml
[junit4:junit4]   2> 752 T3321 oass.IndexSchema.readSchema Reading Solr Schema
[junit4:junit4]   2> 757 T3321 oass.IndexSchema.readSchema Schema name=test
[junit4:junit4]   2> 1346 T3321 oass.OpenExchangeRatesOrgProvider.init Initialized with rates=open-exchange-rates.json, refreshInterval=1440.
[junit4:junit4]   2> 1355 T3321 oass.IndexSchema.readSchema default search field in schema is text
[junit4:junit4]   2> 1360 T3321 oass.IndexSchema.readSchema unique key field: id
[junit4:junit4]   2> 1374 T3321 oass.FileExchangeRateProvider.reload Reloading exchange rates from file currency.xml
[junit4:junit4]   2> 1378 T3321 oass.FileExchangeRateProvider.reload Reloading exchange rates from file currency.xml
[junit4:junit4]   2> 1383 T3321 oass.OpenExchangeRatesOrgProvider.reload Reloading exchange rates from open-exchange-rates.json
[junit4:junit4]   2> 1385 T3321 oass.OpenExchangeRatesOrgProvider.reload Reloading exchange rates from open-exchange-rates.json
[junit4:junit4]   2> 1386 T3321 oasc.SolrCore.<init> [collection1] Opening new SolrCore at C:\Users\JenkinsSlave\workspace\Lucene-Solr-trunk-Windows\solr\build\solr-core\test\J0\.\org.apache.solr.cloud.SyncSliceTest-controljetty-1351208159427\collection1\, dataDir=.\org.apache.solr.cloud.SyncSliceTest-1351208159236/control/data\
[junit4:junit4]   2> 1387 T3321 oasc.JmxMonitoredMap.<init> JMX monitoring is enabled. Adding Solr mbeans to JMX Server: com.sun.jmx.mbeanserver.JmxMBeanServer@39ce757c
[junit4:junit4]   2> 1388 T3321 oasc.SolrCore.getNewIndexDir New index directory detected: old=null new=.\org.apache.solr.cloud.SyncSliceTest-1351208159236/control/data\index/
[junit4:junit4]   2> 1389 T3321 oasc.SolrCore.initIndex WARNING [collection1] Solr index directory '.\org.apache.solr.cloud.SyncSliceTest-1351208159236\control\data\index' doesn't exist. Creating new index...
[junit4:junit4]   2> 1390 T3321 oasc.CachingDirectoryFactory.get return new directory for C:\Users\JenkinsSlave\workspace\Lucene-Solr-trunk-Windows\solr\build\solr-core\test\J0\.\org.apache.solr.cloud.SyncSliceTest-1351208159236\control\data\index forceNew:false
[junit4:junit4]   2> 1401 T3321 oasc.SolrDeletionPolicy.onCommit SolrDeletionPolicy.onCommit: commits:num=1
[junit4:junit4]   2> 		commit{dir=C:\Users\JenkinsSlave\workspace\Lucene-Solr-trunk-Windows\solr\build\solr-core\test\J0\org.apache.solr.cloud.SyncSliceTest-1351208159236\control\data\index,segFN=segments_1,generation=1,filenames=[segments_1]
[junit4:junit4]   2> 1401 T3321 oasc.SolrDeletionPolicy.updateCommits newest commit = 1
[junit4:junit4]   2> 1402 T3321 oasc.SolrCore.initWriters created xml: solr.XMLResponseWriter
[junit4:junit4]   2> 1403 T3321 oasup.UpdateRequestProcessorChain.init inserting DistributedUpdateProcessorFactory into updateRequestProcessorChain "dedupe"
[junit4:junit4]   2> 1404 T3321 oasup.UpdateRequestProcessorChain.init inserting DistributedUpdateProcessorFactory into updateRequestProcessorChain "dedupe-allfields"
[junit4:junit4]   2> 1404 T3321 oasup.UpdateRequestProcessorChain.init inserting DistributedUpdateProcessorFactory into updateRequestProcessorChain "stored_sig"
[junit4:junit4]   2> 1404 T3321 oasup.UpdateRequestProcessorChain.init inserting DistributedUpdateProcessorFactory into updateRequestProcessorChain "uniq-fields"
[junit4:junit4]   2> 1405 T3321 oasup.UpdateRequestProcessorChain.init inserting DistributedUpdateProcessorFactory into updateRequestProcessorChain "distrib-dup-test-chain-implicit"
[junit4:junit4]   2> 1405 T3321 oasc.RequestHandlers.initHandlersFromConfig adding lazy requestHandler: solr.ReplicationHandler
[junit4:junit4]   2> 1406 T3321 oasc.RequestHandlers.initHandlersFromConfig created /replication: solr.ReplicationHandler
[junit4:junit4]   2> 1406 T3321 oasc.RequestHandlers.initHandlersFromConfig created standard: solr.StandardRequestHandler
[junit4:junit4]   2> 1407 T3321 oasc.RequestHandlers.initHandlersFromConfig created /get: solr.RealTimeGetHandler
[junit4:junit4]   2> 1407 T3321 oasc.RequestHandlers.initHandlersFromConfig created dismax: solr.SearchHandler
[junit4:junit4]   2> 1409 T3321 oasc.RequestHandlers.initHandlersFromConfig created mock: org.apache.solr.core.MockQuerySenderListenerReqHandler
[junit4:junit4]   2> 1409 T3321 oasc.RequestHandlers.initHandlersFromConfig created /admin/: org.apache.solr.handler.admin.AdminHandlers
[junit4:junit4]   2> 1410 T3321 oasc.RequestHandlers.initHandlersFromConfig created defaults: solr.StandardRequestHandler
[junit4:junit4]   2> 1410 T3321 oasc.RequestHandlers.initHandlersFromConfig adding lazy requestHandler: solr.StandardRequestHandler
[junit4:junit4]   2> 1410 T3321 oasc.RequestHandlers.initHandlersFromConfig created lazy: solr.StandardRequestHandler
[junit4:junit4]   2> 1410 T3321 oasc.RequestHandlers.initHandlersFromConfig created /update: solr.UpdateRequestHandler
[junit4:junit4]   2> 1410 T3321 oasc.RequestHandlers.initHandlersFromConfig created /terms: org.apache.solr.handler.component.SearchHandler
[junit4:junit4]   2> 1411 T3321 oasc.RequestHandlers.initHandlersFromConfig created spellCheckCompRH: org.apache.solr.handler.component.SearchHandler
[junit4:junit4]   2> 1411 T3321 oasc.RequestHandlers.initHandlersFromConfig created spellCheckCompRH_Direct: org.apache.solr.handler.component.SearchHandler
[junit4:junit4]   2> 1412 T3321 oasc.RequestHandlers.initHandlersFromConfig created spellCheckWithWordbreak: org.apache.solr.handler.component.SearchHandler
[junit4:junit4]   2> 1412 T3321 oasc.RequestHandlers.initHandlersFromConfig created spellCheckWithWordbreak_Direct: org.apache.solr.handler.component.SearchHandler
[junit4:junit4]   2> 1412 T3321 oasc.RequestHandlers.initHandlersFromConfig created spellCheckCompRH1: org.apache.solr.handler.component.SearchHandler
[junit4:junit4]   2> 1413 T3321 oasc.RequestHandlers.initHandlersFromConfig created tvrh: org.apache.solr.handler.component.SearchHandler
[junit4:junit4]   2> 1413 T3321 oasc.RequestHandlers.initHandlersFromConfig created /mlt: solr.MoreLikeThisHandler
[junit4:junit4]   2> 1414 T3321 oasc.RequestHandlers.initHandlersFromConfig created /debug/dump: solr.DumpRequestHandler
[junit4:junit4]   2> 1423 T3321 oashl.XMLLoader.init xsltCacheLifetimeSeconds=60
[junit4:junit4]   2> 1428 T3321 oasc.SolrCore.initDeprecatedSupport WARNING solrconfig.xml uses deprecated <admin/gettableFiles>, Please update your config to use the ShowFileRequestHandler.
[junit4:junit4]   2> 1429 T3321 oasc.SolrCore.initDeprecatedSupport WARNING adding ShowFileRequestHandler with hidden files: [SCHEMA.XML, OLD_SYNONYMS.TXT, STOPWORDS.TXT, PROTWORDS.TXT, OPEN-EXCHANGE-RATES.JSON, SYNONYMS.TXT, CURRENCY.XML, MAPPING-ISOLATIN1ACCENT.TXT]
[junit4:junit4]   2> 1434 T3321 oass.SolrIndexSearcher.<init> Opening Searcher@3672b96d main
[junit4:junit4]   2> 1436 T3321 oasu.CommitTracker.<init> Hard AutoCommit: disabled
[junit4:junit4]   2> 1436 T3321 oasu.CommitTracker.<init> Soft AutoCommit: disabled
[junit4:junit4]   2> 1437 T3321 oashc.SpellCheckComponent.inform Initializing spell checkers
[junit4:junit4]   2> 1448 T3321 oass.DirectSolrSpellChecker.init init: {name=direct,classname=DirectSolrSpellChecker,field=lowerfilt,minQueryLength=3}
[junit4:junit4]   2> 1501 T3344 oasc.SolrCore.registerSearcher [collection1] Registered new searcher Searcher@3672b96d main{StandardDirectoryReader(segments_1:1)}
[junit4:junit4]   2> 1503 T3321 oasc.ZkController.publish numShards not found on descriptor - reading it from system property
[junit4:junit4]   2> 1504 T3326 oazs.PrepRequestProcessor.pRequest Got user-level KeeperException when processing sessionid:0x13a9a4848100002 type:create cxid:0x53 zxid:0xfffffffffffffffe txntype:unknown reqpath:n/a Error Path:/solr/overseer/queue Error:KeeperErrorCode = NoNode for /solr/overseer/queue
[junit4:junit4]   2> 1509 T3321 oasc.CoreContainer.register registering core: collection1
[junit4:junit4]   2> 1509 T3321 oasc.ZkController.register Register shard - core:collection1 address:http://127.0.0.1:51328/solr shardId:control_shard
[junit4:junit4]   2> 1510 T3321 oascc.SolrZkClient.makePath makePath: /collections/control_collection/leader_elect/control_shard/election
[junit4:junit4]   2> 1520 T3326 oazs.PrepRequestProcessor.pRequest Got user-level KeeperException when processing sessionid:0x13a9a4848100002 type:delete cxid:0x62 zxid:0xfffffffffffffffe txntype:unknown reqpath:n/a Error Path:/solr/collections/control_collection/leaders Error:KeeperErrorCode = NoNode for /solr/collections/control_collection/leaders
[junit4:junit4]   2> 1521 T3321 oasc.ShardLeaderElectionContext.runLeaderProcess Running the leader process.
[junit4:junit4]   2> 1522 T3326 oazs.PrepRequestProcessor.pRequest Got user-level KeeperException when processing sessionid:0x13a9a4848100002 type:create cxid:0x63 zxid:0xfffffffffffffffe txntype:unknown reqpath:n/a Error Path:/solr/overseer Error:KeeperErrorCode = NodeExists for /solr/overseer
[junit4:junit4]   2> 1543 T3342 oascc.ZkStateReader.updateClusterState Updating cloud state from ZooKeeper... 
[junit4:junit4]   2> 1544 T3342 oasc.Overseer$ClusterStateUpdater.updateState Update state numShards=null message={
[junit4:junit4]   2> 	  "operation":"state",
[junit4:junit4]   2> 	  "numShards":null,
[junit4:junit4]   2> 	  "shard":"control_shard",
[junit4:junit4]   2> 	  "roles":null,
[junit4:junit4]   2> 	  "state":"down",
[junit4:junit4]   2> 	  "core":"collection1",
[junit4:junit4]   2> 	  "collection":"control_collection",
[junit4:junit4]   2> 	  "node_name":"127.0.0.1:51328_solr",
[junit4:junit4]   2> 	  "base_url":"http://127.0.0.1:51328/solr"}
[junit4:junit4]   2> 1545 T3326 oazs.PrepRequestProcessor.pRequest Got user-level KeeperException when processing sessionid:0x13a9a4848100002 type:create cxid:0x6a zxid:0xfffffffffffffffe txntype:unknown reqpath:n/a Error Path:/solr/overseer/queue-work Error:KeeperErrorCode = NoNode for /solr/overseer/queue-work
[junit4:junit4]   2> 1557 T3341 oascc.ZkStateReader$2.process A cluster state change has occurred - updating... (1)
[junit4:junit4]   2> 1981 T3321 oasc.ShardLeaderElectionContext.waitForReplicasToComeUp Enough replicas found to continue.
[junit4:junit4]   2> 1982 T3321 oasc.ShardLeaderElectionContext.runLeaderProcess I may be the new leader - try and sync
[junit4:junit4]   2> 1982 T3321 oasc.SyncStrategy.sync Sync replicas to http://127.0.0.1:51328/solr/collection1/
[junit4:junit4]   2> 1982 T3321 oasc.SyncStrategy.syncReplicas Sync Success - now sync replicas to me
[junit4:junit4]   2> 1984 T3321 oasc.SyncStrategy.syncToMe http://127.0.0.1:51328/solr/collection1/ has no replicas
[junit4:junit4]   2> 1984 T3321 oasc.ShardLeaderElectionContext.runLeaderProcess I am the new leader: http://127.0.0.1:51328/solr/collection1/
[junit4:junit4]   2> 1984 T3321 oascc.SolrZkClient.makePath makePath: /collections/control_collection/leaders/control_shard
[junit4:junit4]   2> 1990 T3326 oazs.PrepRequestProcessor.pRequest Got user-level KeeperException when processing sessionid:0x13a9a4848100002 type:create cxid:0x88 zxid:0xfffffffffffffffe txntype:unknown reqpath:n/a Error Path:/solr/overseer Error:KeeperErrorCode = NodeExists for /solr/overseer
[junit4:junit4]   2> 2021 T3342 oascc.ZkStateReader.updateClusterState Updating cloud state from ZooKeeper... 
[junit4:junit4]   2> 2028 T3341 oascc.ZkStateReader$2.process A cluster state change has occurred - updating... (1)
[junit4:junit4]   2> 2041 T3321 oasc.ZkController.register We are http://127.0.0.1:51328/solr/collection1/ and leader is http://127.0.0.1:51328/solr/collection1/
[junit4:junit4]   2> 2041 T3321 oasc.ZkController.register No LogReplay needed for core=collection1 baseURL=http://127.0.0.1:51328/solr
[junit4:junit4]   2> 2042 T3321 oasc.ZkController.checkRecovery I am the leader, no recovery necessary
[junit4:junit4]   2> 2042 T3321 oasc.ZkController.publish numShards not found on descriptor - reading it from system property
[junit4:junit4]   2> 2045 T3321 oascc.ZkStateReader.updateClusterState Updating cloud state from ZooKeeper... 
[junit4:junit4]   2> 2046 T3321 oass.SolrDispatchFilter.init user.dir=C:\Users\JenkinsSlave\workspace\Lucene-Solr-trunk-Windows\solr\build\solr-core\test\J0
[junit4:junit4]   2> 2046 T3321 oass.SolrDispatchFilter.init SolrDispatchFilter.init() done
[junit4:junit4]   2> 2047 T3321 oascsi.HttpClientUtil.createClient Creating new http client, config:maxConnections=128&maxConnectionsPerHost=32&followRedirects=false
[junit4:junit4]   2> 2339 T3321 oejs.Server.doStart jetty-8.1.2.v20120308
[junit4:junit4]   2> 2344 T3321 oejs.AbstractConnector.doStart Started SelectChannelConnector@0.0.0.0:51334
[junit4:junit4]   2> 2344 T3321 oasc.SolrResourceLoader.locateSolrHome JNDI not configured for solr (NoInitialContextEx)
[junit4:junit4]   2> 2345 T3321 oasc.SolrResourceLoader.locateSolrHome using system property solr.solr.home: C:\Users\JenkinsSlave\workspace\Lucene-Solr-trunk-Windows\solr\build\solr-core\test\J0\.\org.apache.solr.cloud.SyncSliceTest-jetty1-1351208161283
[junit4:junit4]   2> 2345 T3321 oasc.SolrResourceLoader.<init> new SolrResourceLoader for deduced Solr Home: 'C:\Users\JenkinsSlave\workspace\Lucene-Solr-trunk-Windows\solr\build\solr-core\test\J0\.\org.apache.solr.cloud.SyncSliceTest-jetty1-1351208161283\'
[junit4:junit4]   2> 2380 T3321 oass.SolrDispatchFilter.init SolrDispatchFilter.init()
[junit4:junit4]   2> 2380 T3321 oasc.SolrResourceLoader.locateSolrHome JNDI not configured for solr (NoInitialContextEx)
[junit4:junit4]   2> 2380 T3321 oasc.SolrResourceLoader.locateSolrHome using system property solr.solr.home: C:\Users\JenkinsSlave\workspace\Lucene-Solr-trunk-Windows\solr\build\solr-core\test\J0\.\org.apache.solr.cloud.SyncSliceTest-jetty1-1351208161283
[junit4:junit4]   2> 2381 T3321 oasc.CoreContainer$Initializer.initialize looking for solr.xml: C:\Users\JenkinsSlave\workspace\Lucene-Solr-trunk-Windows\solr\build\solr-core\test\J0\.\org.apache.solr.cloud.SyncSliceTest-jetty1-1351208161283\solr.xml
[junit4:junit4]   2> 2381 T3321 oasc.CoreContainer.<init> New CoreContainer 1614357116
[junit4:junit4]   2> 2382 T3321 oasc.CoreContainer.load Loading CoreContainer using Solr Home: 'C:\Users\JenkinsSlave\workspace\Lucene-Solr-trunk-Windows\solr\build\solr-core\test\J0\.\org.apache.solr.cloud.SyncSliceTest-jetty1-1351208161283\'
[junit4:junit4]   2> 2382 T3321 oasc.SolrResourceLoader.<init> new SolrResourceLoader for directory: 'C:\Users\JenkinsSlave\workspace\Lucene-Solr-trunk-Windows\solr\build\solr-core\test\J0\.\org.apache.solr.cloud.SyncSliceTest-jetty1-1351208161283\'
[junit4:junit4]   2> 2410 T3321 oasc.CoreContainer.load Registering Log Listener
[junit4:junit4]   2> 2424 T3321 oasc.CoreContainer.initZooKeeper Zookeeper client=127.0.0.1:51321/solr
[junit4:junit4]   2> 2425 T3321 oaz.ZooKeeper.<init> Initiating client connection, connectString=127.0.0.1:51321/solr sessionTimeout=5000 watcher=org.apache.solr.common.cloud.ConnectionManager@3a856180
[junit4:junit4]   2> 2427 T3354 oaz.ClientCnxn$SendThread.startConnect Opening socket connection to server /127.0.0.1:51321
[junit4:junit4]   2> 2427 T3321 oascc.ConnectionManager.waitForConnected Waiting for client to connect to ZooKeeper
[junit4:junit4]   2> 2428 T3354 oaz.ClientCnxn$SendThread.primeConnection Socket connection established to 127.0.0.1/127.0.0.1:51321, initiating session
[junit4:junit4]   2> 2428 T3323 oazs.NIOServerCnxn$Factory.run Accepted socket connection from /127.0.0.1:51339
[junit4:junit4]   2> 2429 T3323 oazs.NIOServerCnxn.readConnectRequest Client attempting to establish new session at /127.0.0.1:51339
[junit4:junit4]   2> 2438 T3325 oazs.NIOServerCnxn.finishSessionInit Established session 0x13a9a4848100003 with negotiated timeout 5000 for client /127.0.0.1:51339
[junit4:junit4]   2> 2438 T3354 oaz.ClientCnxn$SendThread.readConnectResult Session establishment complete on server 127.0.0.1/127.0.0.1:51321, sessionid = 0x13a9a4848100003, negotiated timeout = 5000
[junit4:junit4]   2> 2439 T3355 oascc.ConnectionManager.process Watcher org.apache.solr.common.cloud.ConnectionManager@3a856180 name:ZooKeeperConnection Watcher:127.0.0.1:51321/solr got event WatchedEvent state:SyncConnected type:None path:null path:null type:None
[junit4:junit4]   2> 2439 T3321 oascc.ConnectionManager.waitForConnected Client is connected to ZooKeeper
[junit4:junit4]   2> 2440 T3326 oazs.PrepRequestProcessor.pRequest Got user-level KeeperException when processing sessionid:0x13a9a4848100003 type:create cxid:0x1 zxid:0xfffffffffffffffe txntype:unknown reqpath:n/a Error Path:/solr/overseer Error:KeeperErrorCode = NodeExists for /solr/overseer
[junit4:junit4]   2> 2442 T3326 oazs.PrepRequestProcessor.pRequest Got user-level KeeperException when processing sessionid:0x13a9a4848100003 type:create cxid:0x2 zxid:0xfffffffffffffffe txntype:unknown reqpath:n/a Error Path:/solr/overseer Error:KeeperErrorCode = NodeExists for /solr/overseer
[junit4:junit4]   2> 2444 T3321 oasc.ZkController.createEphemeralLiveNode Register node as live in ZooKeeper:/live_nodes/127.0.0.1:51334_solr
[junit4:junit4]   2> 2444 T3326 oazs.PrepRequestProcessor.pRequest Got user-level KeeperException when processing sessionid:0x13a9a4848100003 type:delete cxid:0x4 zxid:0xfffffffffffffffe txntype:unknown reqpath:n/a Error Path:/solr/live_nodes/127.0.0.1:51334_solr Error:KeeperErrorCode = NoNode for /solr/live_nodes/127.0.0.1:51334_solr
[junit4:junit4]   2> 2445 T3321 oascc.SolrZkClient.makePath makePath: /live_nodes/127.0.0.1:51334_solr
[junit4:junit4]   2> 2449 T3341 oascc.ZkStateReader$3.process Updating live nodes... (2)
[junit4:junit4]   2> 2449 T3321 oashc.HttpShardHandlerFactory.getParameter Setting socketTimeout to: 0
[junit4:junit4]   2> 2449 T3321 oashc.HttpShardHandlerFactory.getParameter Setting urlScheme to: http://
[junit4:junit4]   2> 2449 T3321 oashc.HttpShardHandlerFactory.getParameter Setting connTimeout to: 0
[junit4:junit4]   2> 2450 T3321 oashc.HttpShardHandlerFactory.getParameter Setting maxConnectionsPerHost to: 20
[junit4:junit4]   2> 2450 T3321 oashc.HttpShardHandlerFactory.getParameter Setting corePoolSize to: 0
[junit4:junit4]   2> 2450 T3321 oashc.HttpShardHandlerFactory.getParameter Setting maximumPoolSize to: 2147483647
[junit4:junit4]   2> 2450 T3321 oashc.HttpShardHandlerFactory.getParameter Setting maxThreadIdleTime to: 5
[junit4:junit4]   2> 2451 T3321 oashc.HttpShardHandlerFactory.getParameter Setting sizeOfQueue to: -1
[junit4:junit4]   2> 2451 T3321 oashc.HttpShardHandlerFactory.getParameter Setting fairnessPolicy to: false
[junit4:junit4]   2> 2451 T3321 oascsi.HttpClientUtil.createClient Creating new http client, config:maxConnectionsPerHost=20&maxConnections=10000&socketTimeout=0&connTimeout=0&retry=false
[junit4:junit4]   2> 2461 T3321 oascc.ZkStateReader.createClusterStateWatchersAndUpdate Updating cluster state from ZooKeeper... 
[junit4:junit4]   2> 2468 T3321 oasc.CoreContainer.create Creating SolrCore 'collection1' using instanceDir: C:\Users\JenkinsSlave\workspace\Lucene-Solr-trunk-Windows\solr\build\solr-core\test\J0\.\org.apache.solr.cloud.SyncSliceTest-jetty1-1351208161283\collection1
[junit4:junit4]   2> 2468 T3321 oasc.ZkController.createCollectionZkNode Check for collection zkNode:collection1
[junit4:junit4]   2> 2469 T3321 oasc.ZkController.createCollectionZkNode Collection zkNode exists
[junit4:junit4]   2> 2469 T3321 oasc.ZkController.readConfigName Load collection config from:/collections/collection1
[junit4:junit4]   2> 2471 T3321 oasc.SolrResourceLoader.<init> new SolrResourceLoader for directory: 'C:\Users\JenkinsSlave\workspace\Lucene-Solr-trunk-Windows\solr\build\solr-core\test\J0\.\org.apache.solr.cloud.SyncSliceTest-jetty1-1351208161283\collection1\'
[junit4:junit4]   2> 2474 T3321 oasc.SolrResourceLoader.replaceClassLoader Adding 'file:/C:/Users/JenkinsSlave/workspace/Lucene-Solr-trunk-Windows/solr/build/solr-core/test/J0/org.apache.solr.cloud.SyncSliceTest-jetty1-1351208161283/collection1/lib/classes/' to classloader
[junit4:junit4]   2> 2475 T3321 oasc.SolrResourceLoader.replaceClassLoader Adding 'file:/C:/Users/JenkinsSlave/workspace/Lucene-Solr-trunk-Windows/solr/build/solr-core/test/J0/org.apache.solr.cloud.SyncSliceTest-jetty1-1351208161283/collection1/lib/README' to classloader
[junit4:junit4]   2> 2491 T3342 oascc.ZkStateReader.updateClusterState Updating cloud state from ZooKeeper... 
[junit4:junit4]   2> 2493 T3342 oasc.Overseer$ClusterStateUpdater.updateState Update state numShards=null message={
[junit4:junit4]   2> 	  "operation":"state",
[junit4:junit4]   2> 	  "numShards":null,
[junit4:junit4]   2> 	  "shard":"control_shard",
[junit4:junit4]   2> 	  "roles":null,
[junit4:junit4]   2> 	  "state":"active",
[junit4:junit4]   2> 	  "core":"collection1",
[junit4:junit4]   2> 	  "collection":"control_collection",
[junit4:junit4]   2> 	  "node_name":"127.0.0.1:51328_solr",
[junit4:junit4]   2> 	  "base_url":"http://127.0.0.1:51328/solr"}
[junit4:junit4]   2> 2498 T3341 oascc.ZkStateReader$2.process A cluster state change has occurred - updating... (2)
[junit4:junit4]   2> 2498 T3355 oascc.ZkStateReader$2.process A cluster state change has occurred - updating... (2)
[junit4:junit4]   2> 2534 T3321 oasc.SolrConfig.<init> Using Lucene MatchVersion: LUCENE_50
[junit4:junit4]   2> 2595 T3321 oasc.SolrConfig.<init> Loaded SolrConfig: solrconfig.xml
[junit4:junit4]   2> 2598 T3321 oass.IndexSchema.readSchema Reading Solr Schema
[junit4:junit4]   2> 2603 T3321 oass.IndexSchema.readSchema Schema name=test
[junit4:junit4]   2> 3185 T3321 oass.OpenExchangeRatesOrgProvider.init Initialized with rates=open-exchange-rates.json, refreshInterval=1440.
[junit4:junit4]   2> 3195 T3321 oass.IndexSchema.readSchema default search field in schema is text
[junit4:junit4]   2> 3198 T3321 oass.IndexSchema.readSchema unique key field: id
[junit4:junit4]   2> 3212 T3321 oass.FileExchangeRateProvider.reload Reloading exchange rates from file currency.xml
[junit4:junit4]   2> 3216 T3321 oass.FileExchangeRateProvider.reload Reloading exchange rates from file currency.xml
[junit4:junit4]   2> 3221 T3321 oass.OpenExchangeRatesOrgProvider.reload Reloading exchange rates from open-exchange-rates.json
[junit4:junit4]   2> 3223 T3321 oass.OpenExchangeRatesOrgProvider.reload Reloading exchange rates from open-exchange-rates.json
[junit4:junit4]   2> 3224 T3321 oasc.SolrCore.<init> [collection1] Opening new SolrCore at C:\Users\JenkinsSlave\workspace\Lucene-Solr-trunk-Windows\solr\build\solr-core\test\J0\.\org.apache.solr.cloud.SyncSliceTest-jetty1-1351208161283\collection1\, dataDir=.\org.apache.solr.cloud.SyncSliceTest-1351208159236/jetty1\
[junit4:junit4]   2> 3224 T3321 oasc.JmxMonitoredMap.<init> JMX monitoring is enabled. Adding Solr mbeans to JMX Server: com.sun.jmx.mbeanserver.JmxMBeanServer@39ce757c
[junit4:junit4]   2> 3225 T3321 oasc.SolrCore.getNewIndexDir New index directory detected: old=null new=.\org.apache.solr.cloud.SyncSliceTest-1351208159236/jetty1\index/
[junit4:junit4]   2> 3227 T3321 oasc.SolrCore.initIndex WARNING [collection1] Solr index directory '.\org.apache.solr.cloud.SyncSliceTest-1351208159236\jetty1\index' doesn't exist. Creating new index...
[junit4:junit4]   2> 3228 T3321 oasc.CachingDirectoryFactory.get return new directory for C:\Users\JenkinsSlave\workspace\Lucene-Solr-trunk-Windows\solr\build\solr-core\test\J0\.\org.apache.solr.cloud.SyncSliceTest-1351208159236\jetty1\index forceNew:false
[junit4:junit4]   2> 3239 T3321 oasc.SolrDeletionPolicy.onCommit SolrDeletionPolicy.onCommit: commits:num=1
[junit4:junit4]   2> 		commit{dir=C:\Users\JenkinsSlave\workspace\Lucene-Solr-trunk-Windows\solr\build\solr-core\test\J0\org.apache.solr.cloud.SyncSliceTest-1351208159236\jetty1\index,segFN=segments_1,generation=1,filenames=[segments_1]
[junit4:junit4]   2> 3240 T3321 oasc.SolrDeletionPolicy.updateCommits newest commit = 1
[junit4:junit4]   2> 3241 T3321 oasc.SolrCore.initWriters created xml: solr.XMLResponseWriter
[junit4:junit4]   2> 3243 T3321 oasup.UpdateRequestProcessorChain.init inserting DistributedUpdateProcessorFactory into updateRequestProcessorChain "dedupe"
[junit4:junit4]   2> 3244 T3321 oasup.UpdateRequestProcessorChain.init inserting DistributedUpdateProcessorFactory into updateRequestProcessorChain "dedupe-allfields"
[junit4:junit4]   2> 3244 T3321 oasup.UpdateRequestProcessorChain.init inserting DistributedUpdateProcessorFactory into updateRequestProcessorChain "stored_sig"
[junit4:junit4]   2> 3245 T3321 oasup.UpdateRequestProcessorChain.init inserting DistributedUpdateProcessorFactory into updateRequestProcessorChain "uniq-fields"
[junit4:junit4]   2> 3245 T3321 oasup.UpdateRequestProcessorChain.init inserting DistributedUpdateProcessorFactory into updateRequestProcessorChain "distrib-dup-test-chain-implicit"
[junit4:junit4]   2> 3246 T3321 oasc.RequestHandlers.initHandlersFromConfig adding lazy requestHandler: solr.ReplicationHandler
[junit4:junit4]   2> 3246 T3321 oasc.RequestHandlers.initHandlersFromConfig created /replication: solr.ReplicationHandler
[junit4:junit4]   2> 3246 T3321 oasc.RequestHandlers.initHandlersFromConfig created standard: solr.StandardRequestHandler
[junit4:junit4]   2> 3246 T3321 oasc.RequestHandlers.initHandlersFromConfig created /get: solr.RealTimeGetHandler
[junit4:junit4]   2> 3247 T3321 oasc.RequestHandlers.initHandlersFromConfig created dismax: solr.SearchHandler
[junit4:junit4]   2> 3248 T3321 oasc.RequestHandlers.initHandlersFromConfig created mock: org.apache.solr.core.MockQuerySenderListenerReqHandler
[junit4:junit4]   2> 3248 T3321 oasc.RequestHandlers.initHandlersFromConfig created /admin/: org.apache.solr.handler.admin.AdminHandlers
[junit4:junit4]   2> 3250 T3321 oasc.RequestHandlers.initHandlersFromConfig created defaults: solr.StandardRequestHandler
[junit4:junit4]   2> 3250 T3321 oasc.RequestHandlers.initHandlersFromConfig adding lazy requestHandler: solr.StandardRequestHandler
[junit4:junit4]   2> 3251 T3321 oasc.RequestHandlers.initHandlersFromConfig created lazy: solr.StandardRequestHandler
[junit4:junit4]   2> 3251 T3321 oasc.RequestHandlers.initHandlersFromConfig created /update: solr.UpdateRequestHandler
[junit4:junit4]   2> 3252 T3321 oasc.RequestHandlers.initHandlersFromConfig created /terms: org.apache.solr.handler.component.SearchHandler
[junit4:junit4]   2> 3253 T3321 oasc.RequestHandlers.initHandlersFromConfig created spellCheckCompRH: org.apache.solr.handler.component.SearchHandler
[junit4:junit4]   2> 3253 T3321 oasc.RequestHandlers.initHandlersFromConfig created spellCheckCompRH_Direct: org.apache.solr.handler.component.SearchHandler
[junit4:junit4]   2> 3254 T3321 oasc.RequestHandlers.initHandlersFromConfig created spellCheckWithWordbreak: org.apache.solr.handler.component.SearchHandler
[junit4:junit4]   2> 3254 T3321 oasc.RequestHandlers.initHandlersFromConfig created spellCheckWithWordbreak_Direct: org.apache.solr.handler.component.SearchHandler
[junit4:junit4]   2> 3254 T3321 oasc.RequestHandlers.initHandlersFromConfig created spellCheckCompRH1: org.apache.solr.handler.component.SearchHandler
[junit4:junit4]   2> 3254 T3321 oasc.RequestHandlers.initHandlersFromConfig created tvrh: org.apache.solr.handler.component.SearchHandler
[junit4:junit4]   2> 3255 T3321 oasc.RequestHandlers.initHandlersFromConfig created /mlt: solr.MoreLikeThisHandler
[junit4:junit4]   2> 3255 T3321 oasc.RequestHandlers.initHandlersFromConfig created /debug/dump: solr.DumpRequestHandler
[junit4:junit4]   2> 3264 T3321 oashl.XMLLoader.init xsltCacheLifetimeSeconds=60
[junit4:junit4]   2> 3269 T3321 oasc.SolrCore.initDeprecatedSupport WARNING solrconfig.xml uses deprecated <admin/gettableFiles>, Please update your config to use the ShowFileRequestHandler.
[junit4:junit4]   2> 3270 T3321 oasc.SolrCore.initDeprecatedSupport WARNING adding ShowFileRequestHandler with hidden files: [SCHEMA.XML, OLD_SYNONYMS.TXT, STOPWORDS.TXT, PROTWORDS.TXT, OPEN-EXCHANGE-RATES.JSON, SYNONYMS.TXT, CURRENCY.XML, MAPPING-ISOLATIN1ACCENT.TXT]
[junit4:junit4]   2> 3275 T3321 oass.SolrIndexSearcher.<init> Opening Searcher@4093621b main
[junit4:junit4]   2> 3277 T3321 oasu.CommitTracker.<init> Hard AutoCommit: disabled
[junit4:junit4]   2> 3278 T3321 oasu.CommitTracker.<init> Soft AutoCommit: disabled
[junit4:junit4]   2> 3279 T3321 oashc.SpellCheckComponent.inform Initializing spell checkers
[junit4:junit4]   2> 3288 T3321 oass.DirectSolrSpellChecker.init init: {name=direct,classname=DirectSolrSpellChecker,field=lowerfilt,minQueryLength=3}
[junit4:junit4]   2> 3341 T3356 oasc.SolrCore.registerSearcher [collection1] Registered new searcher Searcher@4093621b main{StandardDirectoryReader(segments_1:1)}
[junit4:junit4]   2> 3345 T3321 oasc.ZkController.publish numShards not found on descriptor - reading it from system property
[junit4:junit4]   2> 3419 T3342 oascc.ZkStateReader.updateClusterState Updating cloud state from ZooKeeper... 
[junit4:junit4]   2> 3419 T3342 oasc.Overseer$ClusterStateUpdater.updateState Update state numShards=1 message={
[junit4:junit4]   2> 	  "operation":"state",
[junit4:junit4]   2> 	  "numShards":"1",
[junit4:junit4]   2> 	  "shard":null,
[junit4:junit4]   2> 	  "roles":null,
[junit4:junit4]   2> 	  "state":"down",
[junit4:junit4]   2> 	  "core":"collection1",
[junit4:junit4]   2> 	  "collection":"collection1",
[junit4:junit4]   2> 	  "node_name":"127.0.0.1:51334_solr",
[junit4:junit4]   2> 	  "base_url":"http://127.0.0.1:51334/solr"}
[junit4:junit4]   2> 3419 T3342 oasc.Overseer$ClusterStateUpdater.createCollection Create collection collection1 with numShards 1
[junit4:junit4]   2> 3427 T3341 oascc.ZkStateReader$2.process A cluster state change has occurred - updating... (2)
[junit4:junit4]   2> 3428 T3355 oascc.ZkStateReader$2.process A cluster state change has occurred - updating... (2)
[junit4:junit4]   2> 3805 T3321 oasc.CoreContainer.register registering core: collection1
[junit4:junit4]   2> 3805 T3321 oasc.ZkController.register Register shard - core:collection1 address:http://127.0.0.1:51334/solr shardId:shard1
[junit4:junit4]   2> 3806 T3321 oascc.SolrZkClient.makePath makePath: /collections/collection1/leader_elect/shard1/election
[junit4:junit4]   2> 3816 T3326 oazs.PrepRequestProcessor.pRequest Got user-level KeeperException when processing sessionid:0x13a9a4848100003 type:delete cxid:0x43 zxid:0xfffffffffffffffe txntype:unknown reqpath:n/a Error Path:/solr/collections/collection1/leaders Error:KeeperErrorCode = NoNode for /solr/collections/collection1/leaders
[junit4:junit4]   2> 3817 T3321 oasc.ShardLeaderElectionContext.runLeaderProcess Running the leader process.
[junit4:junit4]   2> 3817 T3326 oazs.PrepRequestProcessor.pRequest Got user-level KeeperException when processing sessionid:0x13a9a4848100003 type:create cxid:0x44 zxid:0xfffffffffffffffe txntype:unknown reqpath:n/a Error Path:/solr/overseer Error:KeeperErrorCode = NodeExists for /solr/overseer
[junit4:junit4]   2> 3821 T3321 oasc.ShardLeaderElectionContext.waitForReplicasToComeUp Enough replicas found to continue.
[junit4:junit4]   2> 3821 T3321 oasc.ShardLeaderElectionContext.runLeaderProcess I may be the new leader - try and sync
[junit4:junit4]   2> 3822 T3321 oasc.SyncStrategy.sync Sync replicas to http://127.0.0.1:51334/solr/collection1/
[junit4:junit4]   2> 3822 T3321 oasc.SyncStrategy.syncReplicas Sync Success - now sync replicas to me
[junit4:junit4]   2> 3822 T3321 oasc.SyncStrategy.syncToMe http://127.0.0.1:51334/solr/collection1/ has no replicas
[junit4:junit4]   2> 3822 T3321 oasc.ShardLeaderElectionContext.runLeaderProcess I am the new leader: http://127.0.0.1:51334/solr/collection1/
[junit4:junit4]   2> 3823 T3321 oascc.SolrZkClient.makePath makePath: /collections/collection1/leaders/shard1
[junit4:junit4]   2> 3828 T3326 oazs.PrepRequestProcessor.pRequest Got user-level KeeperException when processing sessionid:0x13a9a4848100003 type:create cxid:0x4e zxid:0xfffffffffffffffe txntype:unknown reqpath:n/a Error Path:/solr/overseer Error:KeeperErrorCode = NodeExists for /solr/overseer
[junit4:junit4]   2> 3889 T3342 oascc.ZkStateReader.updateClusterState Updating cloud state from ZooKeeper... 
[junit4:junit4]   2> 3899 T3341 oascc.ZkStateReader$2.process A cluster state change has occurred - updating... (2)
[junit4:junit4]   2> 3899 T3355 oascc.ZkStateReader$2.process A cluster state change has occurred - updating... (2)
[junit4:junit4]   2> 3924 T3321 oasc.ZkController.register We are http://127.0.0.1:51334/solr/collection1/ and leader is http://127.0.0.1:51334/solr/collection1/
[junit4:junit4]   2> 3924 T3321 oasc.ZkController.register No LogReplay needed for core=collection1 baseURL=http://127.0.0.1:51334/solr
[junit4:junit4]   2> 3924 T3321 oasc.ZkController.checkRecovery I am the leader, no recovery necessary
[junit4:junit4]   2> 3924 T3321 oasc.ZkController.publish numShards not found on descriptor - reading it from system property
[junit4:junit4]   2> 3927 T3321 oascc.ZkStateReader.updateClusterState Updating cloud state from ZooKeeper... 
[junit4:junit4]   2> 3928 T3321 oass.SolrDispatchFilter.init user.dir=C:\Users\JenkinsSlave\workspace\Lucene-Solr-trunk-Windows\solr\build\solr-core\test\J0
[junit4:junit4]   2> 3928 T3321 oass.SolrDispatchFilter.init SolrDispatchFilter.init() done
[junit4:junit4]   2> 3929 T3321 oascsi.HttpClientUtil.createClient Creating new http client, config:maxConnections=128&maxConnectionsPerHost=32&followRedirects=false
[junit4:junit4]   2> 4223 T3321 oejs.Server.doStart jetty-8.1.2.v20120308
[junit4:junit4]   2> 4226 T3321 oejs.AbstractConnector.doStart Started SelectChannelConnector@0.0.0.0:51340
[junit4:junit4]   2> 4227 T3321 oasc.SolrResourceLoader.locateSolrHome JNDI not configured for solr (NoInitialContextEx)
[junit4:junit4]   2> 4228 T3321 oasc.SolrResourceLoader.locateSolrHome using system property solr.solr.home: C:\Users\JenkinsSlave\workspace\Lucene-Solr-trunk-Windows\solr\build\solr-core\test\J0\.\org.apache.solr.cloud.SyncSliceTest-jetty2-1351208163167
[junit4:junit4]   2> 4228 T3321 oasc.SolrResourceLoader.<init> new SolrResourceLoader for deduced Solr Home: 'C:\Users\JenkinsSlave\workspace\Lucene-Solr-trunk-Windows\solr\build\solr-core\test\J0\.\org.apache.solr.cloud.SyncSliceTest-jetty2-1351208163167\'
[junit4:junit4]   2> 4260 T3321 oass.SolrDispatchFilter.init SolrDispatchFilter.init()
[junit4:junit4]   2> 4261 T3321 oasc.SolrResourceLoader.locateSolrHome JNDI not configured for solr (NoInitialContextEx)
[junit4:junit4]   2> 4261 T3321 oasc.SolrResourceLoader.locateSolrHome using system property solr.solr.home: C:\Users\JenkinsSlave\workspace\Lucene-Solr-trunk-Windows\solr\build\solr-core\test\J0\.\org.apache.solr.cloud.SyncSliceTest-jetty2-1351208163167
[junit4:junit4]   2> 4261 T3321 oasc.CoreContainer$Initializer.initialize looking for solr.xml: C:\Users\JenkinsSlave\workspace\Lucene-Solr-trunk-Windows\solr\build\solr-core\test\J0\.\org.apache.solr.cloud.SyncSliceTest-jetty2-1351208163167\solr.xml
[junit4:junit4]   2> 4262 T3321 oasc.CoreContainer.<init> New CoreContainer 737238295
[junit4:junit4]   2> 4262 T3321 oasc.CoreContainer.load Loading CoreContainer using Solr Home: 'C:\Users\JenkinsSlave\workspace\Lucene-Solr-trunk-Windows\solr\build\solr-core\test\J0\.\org.apache.solr.cloud.SyncSliceTest-jetty2-1351208163167\'
[junit4:junit4]   2> 4263 T3321 oasc.SolrResourceLoader.<init> new SolrResourceLoader for directory: 'C:\Users\JenkinsSlave\workspace\Lucene-Solr-trunk-Windows\solr\build\solr-core\test\J0\.\org.apache.solr.cloud.SyncSliceTest-jetty2-1351208163167\'
[junit4:junit4]   2> 4287 T3321 oasc.CoreContainer.load Registering Log Listener
[junit4:junit4]   2> 4302 T3321 oasc.CoreContainer.initZooKeeper Zookeeper client=127.0.0.1:51321/solr
[junit4:junit4]   2> 4303 T3321 oaz.ZooKeeper.<init> Initiating client connection, connectString=127.0.0.1:51321/solr sessionTimeout=5000 watcher=org.apache.solr.common.cloud.ConnectionManager@32a28ca4
[junit4:junit4]   2> 4304 T3366 oaz.ClientCnxn$SendThread.startConnect Opening socket connection to server /127.0.0.1:51321
[junit4:junit4]   2> 4304 T3321 oascc.ConnectionManager.waitForConnected Waiting for client to connect to ZooKeeper
[junit4:junit4]   2> 4305 T3366 oaz.ClientCnxn$SendThread.primeConnection Socket connection established to 127.0.0.1/127.0.0.1:51321, initiating session
[junit4:junit4]   2> 4305 T3323 oazs.NIOServerCnxn$Factory.run Accepted socket connection from /127.0.0.1:51345
[junit4:junit4]   2> 4306 T3323 oazs.NIOServerCnxn.readConnectRequest Client attempting to establish new session at /127.0.0.1:51345
[junit4:junit4]   2> 4319 T3325 oazs.NIOServerCnxn.finishSessionInit Established session 0x13a9a4848100004 with negotiated timeout 5000 for client /127.0.0.1:51345
[junit4:junit4]   2> 4319 T3366 oaz.ClientCnxn$SendThread.readConnectResult Session establishment complete on server 127.0.0.1/127.0.0.1:51321, sessionid = 0x13a9a4848100004, negotiated timeout = 5000
[junit4:junit4]   2> 4320 T3367 oascc.ConnectionManager.process Watcher org.apache.solr.common.cloud.ConnectionManager@32a28ca4 name:ZooKeeperConnection Watcher:127.0.0.1:51321/solr got event WatchedEvent state:SyncConnected type:None path:null path:null type:None
[junit4:junit4]   2> 4320 T3321 oascc.ConnectionManager.waitForConnected Client is connected to ZooKeeper
[junit4:junit4]   2> 4320 T3326 oazs.PrepRequestProcessor.pRequest Got user-level KeeperException when processing sessionid:0x13a9a4848100004 type:create cxid:0x1 zxid:0xfffffffffffffffe txntype:unknown reqpath:n/a Error Path:/solr/overseer Error:KeeperErrorCode = NodeExists for /solr/overseer
[junit4:junit4]   2> 4325 T3326 oazs.PrepRequestProcessor.pRequest Got user-level KeeperException when processing sessionid:0x13a9a4848100004 type:create cxid:0x2 zxid:0xfffffffffffffffe txntype:unknown reqpath:n/a Error Path:/solr/overseer Error:KeeperErrorCode = NodeExists for /solr/overseer
[junit4:junit4]   2> 4354 T3321 oasc.ZkController.createEphemeralLiveNode Register node as live in ZooKeeper:/live_nodes/127.0.0.1:51340_solr
[junit4:junit4]   2> 4354 T3326 oazs.PrepRequestProcessor.pRequest Got user-level KeeperException when processing sessionid:0x13a9a4848100004 type:delete cxid:0x4 zxid:0xfffffffffffffffe txntype:unknown reqpath:n/a Error Path:/solr/live_nodes/127.0.0.1:51340_solr Error:KeeperErrorCode = NoNode for /solr/live_nodes/127.0.0.1:51340_solr
[junit4:junit4]   2> 4379 T3321 oascc.SolrZkClient.makePath makePath: /live_nodes/127.0.0.1:51340_solr
[junit4:junit4]   2> 4382 T3342 oascc.ZkStateReader.updateClusterState Updating cloud state from ZooKeeper... 
[junit4:junit4]   2> 4418 T3342 oasc.Overseer$ClusterStateUpdater.updateState Update state numShards=1 message={
[junit4:junit4]   2> 	  "operation":"state",
[junit4:junit4]   2> 	  "numShards":"1",
[junit4:junit4]   2> 	  "shard":"shard1",
[junit4:junit4]   2> 	  "roles":null,
[junit4:junit4]   2> 	  "state":"active",
[junit4:junit4]   2> 	  "core":"collection1",
[junit4:junit4]   2> 	  "collection":"collection1",
[junit4:junit4]   2> 	  "node_name":"127.0.0.1:51334_solr",
[junit4:junit4]   2> 	  "base_url":"http://127.0.0.1:51334/solr"}
[junit4:junit4]   2> 4418 T3355 oascc.ZkStateReader$3.process Updating live nodes... (3)
[junit4:junit4]   2> 4419 T3321 oashc.HttpShardHandlerFactory.getParameter Setting socketTimeout to: 0
[junit4:junit4]   2> 4419 T3321 oashc.HttpShardHandlerFactory.getParameter Setting urlScheme to: http://
[junit4:junit4]   2> 4420 T3321 oashc.HttpShardHandlerFactory.getParameter Setting connTimeout to: 0
[junit4:junit4]   2> 4420 T3321 oashc.HttpShardHandlerFactory.getParameter Setting maxConnectionsPerHost to: 20
[junit4:junit4]   2> 4420 T3321 oashc.HttpShardHandlerFactory.getParameter Setting corePoolSize to: 0
[junit4:junit4]   2> 4420 T3321 oashc.HttpShardHandlerFactory.getParameter Setting maximumPoolSize to: 2147483647
[junit4:junit4]   2> 4420 T3321 oashc.HttpShardHandlerFactory.getParameter Setting maxThreadIdleTime to: 5
[junit4:junit4]   2> 4421 T3321 oashc.HttpShardHandlerFactory.getParameter Setting sizeOfQueue to: -1
[junit4:junit4]   2> 4421 T3321 oashc.HttpShardHandlerFactory.getParameter Setting fairnessPolicy to: false
[junit4:junit4]   2> 4421 T3321 oascsi.HttpClientUtil.createClient Creating new http client, config:maxConnectionsPerHost=20&maxConnections=10000&socketTimeout=0&connTimeout=0&retry=false
[junit4:junit4]   2> 4437 T3321 oascc.ZkStateReader.createClusterStateWatchersAndUpdate Updating cluster state from ZooKeeper... 
[junit4:junit4]   2> 4440 T3367 oaz.ClientCnxn$EventThread.processEvent SEVERE Error while calling watcher  java.lang.NullPointerException
[junit4:junit4]   2> 	at org.apache.solr.common.cloud.ZkStateReader$2.process(ZkStateReader.java:189)
[junit4:junit4]   2> 	at org.apache.zookeeper.ClientCnxn$EventThread.processEvent(ClientCnxn.java:526)
[junit4:junit4]   2> 	at org.apache.zookeeper.ClientCnxn$EventThread.run(ClientCnxn.java:502)
[junit4:junit4]   2> 
[junit4:junit4]   2> 4440 T3355 oascc.ZkStateReader$2.process A cluster state change has occurred - updating... (3)
[junit4:junit4]   2> 4444 T3341 oascc.ZkStateReader$3.process Updating live nodes... (3)
[junit4:junit4]   2> 4444 T3341 oascc.ZkStateReader$2.process A cluster state change has occurred - updating... (3)
[junit4:junit4]   2> 4446 T3321 oasc.CoreContainer.create Creating SolrCore 'collection1' using instanceDir: C:\Users\JenkinsSlave\workspace\Lucene-Solr-trunk-Windows\solr\build\solr-core\test\J0\.\org.apache.solr.cloud.SyncSliceTest-jetty2-1351208163167\collection1
[junit4:junit4]   2> 4446 T3321 oasc.ZkController.createCollectionZkNode Check for collection zkNode:collection1
[junit4:junit4]   2> 4447 T3321 oasc.ZkController.createCollectionZkNode Collection zkNode exists
[junit4:junit4]   2> 4448 T3321 oasc.ZkController.readConfigName Load collection config from:/collections/collection1
[junit4:junit4]   2> 4451 T3321 oasc.SolrResourceLoader.<init> new SolrResourceLoader for directory: 'C:\Users\JenkinsSlave\workspace\Lucene-Solr-trunk-Windows\solr\build\solr-core\test\J0\.\org.apache.solr.cloud.SyncSliceTest-jetty2-1351208163167\collection1\'
[junit4:junit4]   2> 4453 T3321 oasc.SolrResourceLoader.replaceClassLoader Adding 'file:/C:/Users/JenkinsSlave/workspace/Lucene-Solr-trunk-Windows/solr/build/solr-core/test/J0/org.apache.solr.cloud.SyncSliceTest-jetty2-1351208163167/collection1/lib/classes/' to classloader
[junit4:junit4]   2> 4453 T3321 oasc.SolrResourceLoader.replaceClassLoader Adding 'file:/C:/Users/JenkinsSlave/workspace/Lucene-Solr-trunk-Windows/solr/build/solr-core/test/J0/org.apache.solr.cloud.SyncSliceTest-jetty2-1351208163167/collection1/lib/README' to classloader
[junit4:junit4]   2> 4514 T3321 oasc.SolrConfig.<init> Using Lucene MatchVersion: LUCENE_50
[junit4:junit4]   2> 4571 T3321 oasc.SolrConfig.<init> Loaded SolrConfig: solrconfig.xml
[junit4:junit4]   2> 4573 T3321 oass.IndexSchema.readSchema Reading Solr Schema
[junit4:junit4]   2> 4578 T3321 oass.IndexSchema.readSchema Schema name=test
[junit4:junit4]   2> 5138 T3321 oass.OpenExchangeRatesOrgProvider.init Initialized with rates=open-exchange-rates.json, refreshInterval=1440.
[junit4:junit4]   2> 5147 T3321 oass.IndexSchema.readSchema default search field in schema is text
[junit4:junit4]   2> 5149 T3321 oass.IndexSchema.readSchema unique key field: id
[junit4:junit4]   2> 5163 T3321 oass.FileExchangeRateProvider.reload Reloading exchange rates from file currency.xml
[junit4:junit4]   2> 5167 T3321 oass.FileExchangeRateProvider.reload Reloading exchange rates from file currency.xml
[junit4:junit4]   2> 5172 T3321 oass.OpenExchangeRatesOrgProvider.reload Reloading exchange rates from open-exchange-rates.json
[junit4:junit4]   2> 5174 T3321 oass.OpenExchangeRatesOrgProvider.reload Reloading exchange rates from open-exchange-rates.json
[junit4:junit4]   2> 5175 T3321 oasc.SolrCore.<init> [collection1] Opening new SolrCore at C:\Users\JenkinsSlave\workspace\Lucene-Solr-trunk-Windows\solr\build\solr-core\test\J0\.\org.apache.solr.cloud.SyncSliceTest-jetty2-1351208163167\collection1\, dataDir=.\org.apache.solr.cloud.SyncSliceTest-1351208159236/jetty2\
[junit4:junit4]   2> 5175 T3321 oasc.JmxMonitoredMap.<init> JMX monitoring is enabled. Adding Solr mbeans to JMX Server: com.sun.jmx.mbeanserver.JmxMBeanServer@39ce757c
[junit4:junit4]   2> 5176 T3321 oasc.SolrCore.getNewIndexDir New index directory detected: old=null new=.\org.apache.solr.cloud.SyncSliceTest-1351208159236/jetty2\index/
[junit4:junit4]   2> 5178 T3321 oasc.SolrCore.initIndex WARNING [collection1] Solr index directory '.\org.apache.solr.cloud.SyncSliceTest-1351208159236\jetty2\index' doesn't exist. Creating new index...
[junit4:junit4]   2> 5179 T3321 oasc.CachingDirectoryFactory.get return new directory for C:\Users\JenkinsSlave\workspace\Lucene-Solr-trunk-Windows\solr\build\solr-core\test\J0\.\org.apache.solr.cloud.SyncSliceTest-1351208159236\jetty2\index forceNew:false
[junit4:junit4]   2> 5187 T3321 oasc.SolrDeletionPolicy.onCommit SolrDeletionPolicy.onCommit: commits:num=1
[junit4:junit4]   2> 		commit{dir=C:\Users\JenkinsSlave\workspace\Lucene-Solr-trunk-Windows\solr\build\solr-core\test\J0\org.apache.solr.cloud.SyncSliceTest-1351208159236\jetty2\index,segFN=segments_1,generation=1,filenames=[segments_1]
[junit4:junit4]   2> 5188 T3321 oasc.SolrDeletionPolicy.updateCommits newest commit = 1
[junit4:junit4]   2> 5189 T3321 oasc.SolrCore.initWriters created xml: solr.XMLResponseWriter
[junit4:junit4]   2> 5190 T3321 oasup.UpdateRequestProcessorChain.init inserting DistributedUpdateProcessorFactory into updateRequestProcessorChain "dedupe"
[junit4:junit4]   2> 5190 T3321 oasup.UpdateRequestProcessorChain.init inserting DistributedUpdateProcessorFactory into updateRequestProcessorChain "dedupe-allfields"
[junit4:junit4]   2> 5191 T3321 oasup.UpdateRequestProcessorChain.init inserting DistributedUpdateProcessorFactory into updateRequestProcessorChain "stored_sig"
[junit4:junit4]   2> 5191 T3321 oasup.UpdateRequestProcessorChain.init inserting DistributedUpdateProcessorFactory into updateRequestProcessorChain "uniq-fields"
[junit4:junit4]   2> 5192 T3321 oasup.UpdateRequestProcessorChain.init inserting DistributedUpdateProcessorFactory into updateRequestProcessorChain "distrib-dup-test-chain-implicit"
[junit4:junit4]   2> 5192 T3321 oasc.RequestHandlers.initHandlersFromConfig adding lazy requestHandler: solr.ReplicationHandler
[junit4:junit4]   2> 5193 T3321 oasc.RequestHandlers.initHandlersFromConfig created /replication: solr.ReplicationHandler
[junit4:junit4]   2> 5193 T3321 oasc.RequestHandlers.initHandlersFromConfig created standard: solr.StandardRequestHandler
[junit4:junit4]   2> 5194 T3321 oasc.RequestHandlers.initHandlersFromConfig created /get: solr.RealTimeGetHandler
[junit4:junit4]   2> 5194 T3321 oasc.RequestHandlers.initHandlersFromConfig created dismax: solr.SearchHandler
[junit4:junit4]   2> 5195 T3321 oasc.RequestHandlers.initHandlersFromConfig created mock: org.apache.solr.core.MockQuerySenderListenerReqHandler
[junit4:junit4]   2> 5195 T3321 oasc.RequestHandlers.initHandlersFromConfig created /admin/: org.apache.solr.handler.admin.AdminHandlers
[junit4:junit4]   2> 5196 T3321 oasc.RequestHandlers.initHandlersFromConfig created defaults: solr.StandardRequestHandler
[junit4:junit4]   2> 5196 T3321 oasc.RequestHandlers.initHandlersFromConfig adding lazy requestHandler: solr.StandardRequestHandler
[junit4:junit4]   2> 5197 T3321 oasc.RequestHandlers.initHandlersFromConfig created lazy: solr.StandardRequestHandler
[junit4:junit4]   2> 5197 T3321 oasc.RequestHandlers.initHandlersFromConfig created /update: solr.UpdateRequestHandler
[junit4:junit4]   2> 5197 T3321 oasc.RequestHandlers.initHandlersFromConfig created /terms: org.apache.solr.handler.component.SearchHandler
[junit4:junit4]   2> 5197 T3321 oasc.RequestHandlers.initHandlersFromConfig created spellCheckCompRH: org.apache.solr.handler.component.SearchHandler
[junit4:junit4]   2> 5198 T3321 oasc.RequestHandlers.initHandlersFromConfig created spellCheckCompRH_Direct: org.apache.solr.handler.component.SearchHandler
[junit4:junit4]   2> 5198 T3321 oasc.RequestHandlers.initHandlersFromConfig created spellCheckWithWordbreak: org.apache.solr.handler.component.SearchHandler
[junit4:junit4]   2> 5199 T3321 oasc.RequestHandlers.initHandlersFromConfig created spellCheckWithWordbreak_Direct: org.apache.solr.handler.component.SearchHandler
[junit4:junit4]   2> 5199 T3321 oasc.RequestHandlers.initHandlersFromConfig created spellCheckCompRH1: org.apache.solr.handler.component.SearchHandler
[junit4:junit4]   2> 5200 T3321 oasc.RequestHandlers.initHandlersFromConfig created tvrh: org.apache.solr.handler.component.SearchHandler
[junit4:junit4]   2> 5200 T3321 oasc.RequestHandlers.initHandlersFromConfig created /mlt: solr.MoreLikeThisHandler
[junit4:junit4]   2> 5201 T3321 oasc.RequestHandlers.initHandlersFromConfig created /debug/dump: solr.DumpRequestHandler
[junit4:junit4]   2> 5210 T3321 oashl.XMLLoader.init xsltCacheLifetimeSeconds=60
[junit4:junit4]   2> 5214 T3321 oasc.SolrCore.initDeprecatedSupport WARNING solrconfig.xml uses deprecated <admin/gettableFiles>, Please update your config to use the ShowFileRequestHandler.
[junit4:junit4]   2> 5215 T3321 oasc.SolrCore.initDeprecatedSupport WARNING adding ShowFileRequestHandler with hidden files: [SCHEMA.XML, OLD_SYNONYMS.TXT, STOPWORDS.TXT, PROTWORDS.TXT, OPEN-EXCHANGE-RATES.JSON, SYNONYMS.TXT, CURRENCY.XML, MAPPING-ISOLATIN1ACCENT.TXT]
[junit4:junit4]   2> 5220 T3321 oass.SolrIndexSearcher.<init> Opening Searcher@22c3ec7b main
[junit4:junit4]   2> 5222 T3321 oasu.CommitTracker.<init> Hard AutoCommit: disabled
[junit4:junit4]   2> 5222 T3321 oasu.CommitTracker.<init> Soft AutoCommit: disabled
[junit4:junit4]   2> 5223 T3321 oashc.SpellCheckComponent.inform Initializing spell checkers
[junit4:junit4]   2> 5232 T3321 oass.DirectSolrSpellChecker.init init: {name=direct,classname=DirectSolrSpellChecker,field=lowerfilt,minQueryLength=3}
[junit4:junit4]   2> 5284 T3368 oasc.SolrCore.registerSearcher [collection1] Registered new searcher Searcher@22c3ec7b main{StandardDirectoryReader(segments_1:1)}
[junit4:junit4]   2> 5288 T3321 oasc.ZkController.publish numShards not found on descriptor - reading it from system property
[junit4:junit4]   2> 5361 T3342 oascc.ZkStateReader.updateClusterState Updating cloud state from ZooKeeper... 
[junit4:junit4]   2> 5362 T3342 oasc.Overseer$ClusterStateUpdater.updateState Update state numShards=1 message={
[junit4:junit4]   2> 	  "operation":"state",
[junit4:junit4]   2> 	  "numShards":"1",
[junit4:junit4]   2> 	  "shard":null,
[junit4:junit4]   2> 	  "roles":null,
[junit4:junit4]   2> 	  "state":"down",
[junit4:junit4]   2> 	  "core":"collection1",
[junit4:junit4]   2> 	  "collection":"collection1",
[junit4:junit4]   2> 	  "node_name":"127.0.0.1:51340_solr",
[junit4:junit4]   2> 	  "base_url":"http://127.0.0.1:51340/solr"}
[junit4:junit4]   2> 5371 T3341 oascc.ZkStateReader$2.process A cluster state change has occurred - updating... (3)
[junit4:junit4]   2> 5371 T3355 oascc.ZkStateReader$2.process A cluster state change has occurred - updating... (3)
[junit4:junit4]   2> 64795 T3321 oasc.SolrException.log SEVERE null:org.apache.solr.common.SolrException: Could not get shard_id for core: collection1
[junit4:junit4]   2> 		at org.apache.solr.cloud.ZkController.doGetShardIdProcess(ZkController.java:996)
[junit4:junit4]   2> 		at org.apache.solr.cloud.ZkController.preRegister(ZkController.java:1054)
[junit4:junit4]   2> 		at org.apache.solr.core.CoreContainer.register(CoreContainer.java:657)
[junit4:junit4]   2> 		at org.apache.solr.core.CoreContainer.load(CoreContainer.java:530)
[junit4:junit4]   2> 		at org.apache.solr.core.CoreContainer.load(CoreContainer.java:351)
[junit4:junit4]   2> 		at org.apache.solr.core.CoreContainer$Initializer.initialize(CoreContainer.java:303)
[junit4:junit4]   2> 		at org.apache.solr.servlet.SolrDispatchFilter.init(SolrDispatchFilter.java:107)
[junit4:junit4]   2> 		at org.eclipse.jetty.servlet.FilterHolder.doStart(FilterHolder.java:114)
[junit4:junit4]   2> 		at org.eclipse.jetty.util.component.AbstractLifeCycle.start(AbstractLifeCycle.java:59)
[junit4:junit4]   2> 		at org.eclipse.jetty.servlet.ServletHandler.initialize(ServletHandler.java:754)
[junit4:junit4]   2> 		at org.eclipse.jetty.servlet.ServletHandler.updateMappings(ServletHandler.java:1227)
[junit4:junit4]   2> 		at org.eclipse.jetty.servlet.ServletHandler.setFilterMappings(ServletHandler.java:1263)
[junit4:junit4]   2> 		at org.eclipse.jetty.servlet.ServletHandler.addFilterWithMapping(ServletHandler.java:965)
[junit4:junit4]   2> 		at org.eclipse.jetty.servlet.ServletHandler.addFilterWithMapping(ServletHandler.java:923)
[junit4:junit4]   2> 		at org.eclipse.jetty.servlet.ServletContextHandler.addFilter(ServletContextHandler.java:333)
[junit4:junit4]   2> 		at org.apache.solr.client.solrj.embedded.JettySolrRunner$1.lifeCycleStarted(JettySolrRunner.java:173)
[junit4:junit4]   2> 		at org.eclipse.jetty.util.component.AbstractLifeCycle.setStarted(AbstractLifeCycle.java:169)
[junit4:junit4]   2> 		at org.eclipse.jetty.util.component.AbstractLifeCycle.start(AbstractLifeCycle.java:60)
[junit4:junit4]   2> 		at org.apache.solr.client.solrj.embedded.JettySolrRunner.start(JettySolrRunner.java:225)
[junit4:junit4]   2> 		at org.apache.solr.client.solrj.embedded.JettySolrRunner.start(JettySolrRunner.java:205)
[junit4:junit4]   2> 		at org.apache.solr.BaseDistributedSearchTestCase.createJetty(BaseDistributedSearchTestCase.java:262)
[junit4:junit4]   2> 		at org.apache.solr.cloud.AbstractFullDistribZkTestBase.createJettys(AbstractFullDistribZkTestBase.java:299)
[junit4:junit4]   2> 		at org.apache.solr.cloud.AbstractFullDistribZkTestBase.createServers(AbstractFullDistribZkTestBase.java:273)
[junit4:junit4]   2> 		at org.apache.solr.BaseDistributedSearchTestCase.testDistribSearch(BaseDistributedSearchTestCase.java:693)
[junit4:junit4]   2> 		at sun.reflect.NativeMethodAccessorImpl.invoke0(Native Method)
[junit4:junit4]   2> 		at sun.reflect.NativeMethodAccessorImpl.invoke(NativeMethodAccessorImpl.java:57)
[junit4:junit4]   2> 		at sun.reflect.DelegatingMethodAccessorImpl.invoke(DelegatingMethodAccessorImpl.java:43)
[junit4:junit4]   2> 		at java.lang.reflect.Method.invoke(Method.java:601)
[junit4:junit4]   2> 		at com.carrotsearch.randomizedtesting.RandomizedRunner.invoke(RandomizedRunner.java:1559)
[junit4:junit4]   2> 		at com.carrotsearch.randomizedtesting.RandomizedRunner.access$600(RandomizedRunner.java:79)
[junit4:junit4]   2> 		at com.carrotsearch.randomizedtesting.RandomizedRunner$6.evaluate(RandomizedRunner.java:737)
[junit4:junit4]   2> 		at com.carrotsearch.randomizedtesting.RandomizedRunner$7.evaluate(RandomizedRunner.java:773)
[junit4:junit4]   2> 		at com.carrotsearch.randomizedtesting.RandomizedRunner$8.evaluate(RandomizedRunner.java:787)
[junit4:junit4]   2> 		at com.carrotsearch.randomizedtesting.rules.SystemPropertiesRestoreRule$1.evaluate(SystemPropertiesRestoreRule.java:53)
[junit4:junit4]   2> 		at org.apache.lucene.util.TestRuleSetupTeardownChained$1.evaluate(TestRuleSetupTeardownChained.java:50)
[junit4:junit4]   2> 		at org.apache.lucene.util.TestRuleFieldCacheSanity$1.evaluate(TestRuleFieldCacheSanity.java:51)
[junit4:junit4]   2> 		at org.apache.lucene.util.AbstractBeforeAfterRule$1.evaluate(AbstractBeforeAfterRule.java:45)
[junit4:junit4]   2> 		at com.carrotsearch.randomizedtesting.rules.SystemPropertiesInvariantRule$1.evaluate(SystemPropertiesInvariantRule.java:55)
[junit4:junit4]   2> 		at org.apache.lucene.util.TestRuleThreadAndTestName$1.evaluate(TestRuleThreadAndTestName.java:48)
[junit4:junit4]   2> 		at org.apache.lucene.util.TestRuleIgnoreAfterMaxFailures$1.evaluate(TestRuleIgnoreAfterMaxFailures.java:70)
[junit4:junit4]   2> 		at org.apache.lucene.util.TestRuleMarkFailure$1.evaluate(TestRuleMarkFailure.java:48)
[junit4:junit4]   2> 		at com.carrotsearch.randomizedtesting.rules.StatementAdapter.evaluate(StatementAdapter.java:36)
[junit4:junit4]   2> 		at com.carrotsearch.randomizedtesting.ThreadLeakControl$StatementRunner.run(ThreadLeakControl.java:358)
[junit4:junit4]   2> 		at com.carrotsearch.randomizedtesting.ThreadLeakControl.forkTimeoutingTask(ThreadLeakControl.java:782)
[junit4:junit4]   2> 		at com.carrotsearch.randomizedtesting.ThreadLeakControl$3.evaluate(ThreadLeakControl.java:442)
[junit4:junit4]   2> 		at com.carrotsearch.randomizedtesting.RandomizedRunner.runSingleTest(RandomizedRunner.java:746)
[junit4:junit4]   2> 		at com.carrotsearch.randomizedtesting.RandomizedRunner$3.evaluate(RandomizedRunner.java:648)
[junit4:junit4]   2> 		at com.carrotsearch.randomizedtesting.RandomizedRunner$4.evaluate(RandomizedRunner.java:682)
[junit4:junit4]   2> 		at com.carrotsearch.randomizedtesting.RandomizedRunner$5.evaluate(RandomizedRunner.java:693)
[junit4:junit4]   2> 		at com.carrotsearch.randomizedtesting.rules.StatementAdapter.evaluate(StatementAdapter.java:36)
[junit4:junit4]   2> 		at com.carrotsearch.randomizedtesting.rules.SystemPropertiesRestoreRule$1.evaluate(SystemPropertiesRestoreRule.java:53)
[junit4:junit4]   2> 		at org.apache.lucene.util.AbstractBeforeAfterRule$1.evaluate(AbstractBeforeAfterRule.java:45)
[junit4:junit4]   2> 		at org.apache.lucene.util.TestRuleStoreClassName$1.evaluate(TestRuleStoreClassName.java:42)
[junit4:junit4]   2> 		at com.carrotsearch.randomizedtesting.rules.SystemPropertiesInvariantRule$1.evaluate(SystemPropertiesInvariantRule.java:55)
[junit4:junit4]   2> 		at com.carrotsearch.randomizedtesting.rules.NoShadowingOrOverridesOnMethodsRule$1.evaluate(NoShadowingOrOverridesOnMethodsRule.java:39)
[junit4:junit4]   2> 		at com.carrotsearch.randomizedtesting.rules.NoShadowingOrOverridesOnMethodsRule$1.evaluate(NoShadowingOrOverridesOnMethodsRule.java:39)
[junit4:junit4]   2> 		at com.carrotsearch.randomizedtesting.rules.StatementAdapter.evaluate(StatementAdapter.java:36)
[junit4:junit4]   2> 		at org.apache.lucene.util.TestRuleAssertionsRequired$1.evaluate(TestRuleAssertionsRequired.java:43)
[junit4:junit4]   2> 		at org.apache.lucene.util.TestRuleMarkFailure$1.evaluate(TestRuleMarkFailure.java:48)
[junit4:junit4]   2> 		at org.apache.lucene.util.TestRuleIgnoreAfterMaxFailures$1.evaluate(TestRuleIgnoreAfterMaxFailures.java:70)
[junit4:junit4]   2> 		at org.apache.lucene.util.TestRuleIgnoreTestSuites$1.evaluate(TestRuleIgnoreTestSuites.java:55)
[junit4:junit4]   2> 		at com.carrotsearch.randomizedtesting.rules.StatementAdapter.evaluate(StatementAdapter.java:36)
[junit4:junit4]   2> 		at com.carrotsearch.randomizedtesting.ThreadLeakControl$StatementRunner.run(ThreadLeakControl.java:358)
[junit4:junit4]   2> 		at java.lang.Thread.run(Thread.java:722)
[junit4:junit4]   2> 	
[junit4:junit4]   2> 64798 T3321 oass.SolrDispatchFilter.init user.dir=C:\Users\JenkinsSlave\workspace\Lucene-Solr-trunk-Windows\solr\build\solr-core\test\J0
[junit4:junit4]   2> 64798 T3321 oass.SolrDispatchFilter.init SolrDispatchFilter.init() done
[junit4:junit4]   2> 64799 T3321 oascsi.HttpClientUtil.createClient Creating new http client, config:maxConnections=128&maxConnectionsPerHost=32&followRedirects=false
[junit4:junit4]   2> 65086 T3321 oejs.Server.doStart jetty-8.1.2.v20120308
[junit4:junit4]   2> 65089 T3321 oejs.AbstractConnector.doStart Started SelectChannelConnector@0.0.0.0:51346
[junit4:junit4]   2> 65090 T3321 oasc.SolrResourceLoader.locateSolrHome JNDI not configured for solr (NoInitialContextEx)
[junit4:junit4]   2> 65091 T3321 oasc.SolrResourceLoader.locateSolrHome using system property solr.solr.home: C:\Users\JenkinsSlave\workspace\Lucene-Solr-trunk-Windows\solr\build\solr-core\test\J0\.\org.apache.solr.cloud.SyncSliceTest-jetty3-1351208224043
[junit4:junit4]   2> 65091 T3321 oasc.SolrResourceLoader.<init> new SolrResourceLoader for deduced Solr Home: 'C:\Users\JenkinsSlave\workspace\Lucene-Solr-trunk-Windows\solr\build\solr-core\test\J0\.\org.apache.solr.cloud.SyncSliceTest-jetty3-1351208224043\'
[junit4:junit4]   2> 65125 T3321 oass.SolrDispatchFilter.init SolrDispatchFilter.init()
[junit4:junit4]   2> 65125 T3321 oasc.SolrResourceLoader.locateSolrHome JNDI not configured for solr (NoInitialContextEx)
[junit4:junit4]   2> 65125 T3321 oasc.SolrResourceLoader.locateSolrHome using system property solr.solr.home: C:\Users\JenkinsSlave\workspace\Lucene-Solr-trunk-Windows\solr\build\solr-core\test\J0\.\org.apache.solr.cloud.SyncSliceTest-jetty3-1351208224043
[junit4:junit4]   2> 65125 T3321 oasc.CoreContainer$Initializer.initialize looking for solr.xml: C:\Users\JenkinsSlave\workspace\Lucene-Solr-trunk-Windows\solr\build\solr-core\test\J0\.\org.apache.solr.cloud.SyncSliceTest-jetty3-1351208224043\solr.xml
[junit4:junit4]   2> 65126 T3321 oasc.CoreContainer.<init> New CoreContainer 1432003846
[junit4:junit4]   2> 65126 T3321 oasc.CoreContainer.load Loading CoreContainer using Solr Home: 'C:\Users\JenkinsSlave\workspace\Lucene-Solr-trunk-Windows\solr\build\solr-core\test\J0\.\org.apache.solr.cloud.SyncSliceTest-jetty3-1351208224043\'
[junit4:junit4]   2> 65127 T3321 oasc.SolrResourceLoader.<init> new SolrResourceLoader for directory: 'C:\Users\JenkinsSlave\workspace\Lucene-Solr-trunk-Windows\solr\build\solr-core\test\J0\.\org.apache.solr.cloud.SyncSliceTest-jetty3-1351208224043\'
[junit4:junit4]   2> 65152 T3321 oasc.CoreContainer.load Registering Log Listener
[junit4:junit4]   2> 65185 T3321 oasc.CoreContainer.initZooKeeper Zookeeper client=127.0.0.1:51321/solr
[junit4:junit4]   2> 65185 T3321 oaz.ZooKeeper.<init> Initiating client connection, connectString=127.0.0.1:51321/solr sessionTimeout=5000 watcher=org.apache.solr.common.cloud.ConnectionManager@1e9c357d
[junit4:junit4]   2> 65188 T3321 oascc.ConnectionManager.waitForConnected Waiting for client to connect to ZooKeeper
[junit4:junit4]   2> 65195 T3378 oaz.ClientCnxn$SendThread.startConnect Opening socket connection to server /127.0.0.1:51321
[junit4:junit4]   2> 65200 T3378 oaz.ClientCnxn$SendThread.primeConnection Socket connection established to 127.0.0.1/127.0.0.1:51321, initiating session
[junit4:junit4]   2> 65201 T3323 oazs.NIOServerCnxn$Factory.run Accepted socket connection from /127.0.0.1:51351
[junit4:junit4]   2> 65201 T3323 oazs.NIOServerCnxn.readConnectRequest Client attempting to establish new session at /127.0.0.1:51351
[junit4:junit4]   2> 65215 T3325 oazs.NIOServerCnxn.finishSessionInit Established session 0x13a9a4848100005 with negotiated timeout 5000 for client /127.0.0.1:51351
[junit4:junit4]   2> 65215 T3378 oaz.ClientCnxn$SendThread.readConnectResult Session establishment complete on server 127.0.0.1/127.0.0.1:51321, sessionid = 0x13a9a4848100005, negotiated timeout = 5000
[junit4:junit4]   2> 65215 T3379 oascc.ConnectionManager.process Watcher org.apache.solr.common.cloud.ConnectionManager@1e9c357d name:ZooKeeperConnection Watcher:127.0.0.1:51321/solr got event WatchedEvent state:SyncConnected type:None path:null path:null type:None
[junit4:junit4]   2> 65216 T3321 oascc.ConnectionManager.waitForConnected Client is connected to ZooKeeper
[junit4:junit4]   2> 65217 T3326 oazs.PrepRequestProcessor.pRequest Got user-level KeeperException when processing sessionid:0x13a9a4848100005 type:create cxid:0x1 zxid:0xfffffffffffffffe txntype:unknown reqpath:n/a Error Path:/solr/overseer Error:KeeperErrorCode = NodeExists for /solr/overseer
[junit4:junit4]   2> 65217 T3326 oazs.PrepRequestProcessor.pRequest Got user-level KeeperException when processing sessionid:0x13a9a4848100005 type:create cxid:0x2 zxid:0xfffffffffffffffe txntype:unknown reqpath:n/a Error Path:/solr/overseer Error:KeeperErrorCode = NodeExists for /solr/overseer
[junit4:junit4]   2> 65219 T3321 oasc.ZkController.createEphemeralLiveNode Register node as live in ZooKeeper:/live_nodes/127.0.0.1:51346_solr
[junit4:junit4]   2> 65219 T3326 oazs.PrepRequestProcessor.pRequest Got user-level KeeperException when processing sessionid:0x13a9a4848100005 type:delete cxid:0x4 zxid:0xfffffffffffffffe txntype:unknown reqpath:n/a Error Path:/solr/live_nodes/127.0.0.1:51346_solr Error:KeeperErrorCode = NoNode for /solr/live_nodes/127.0.0.1:51346_solr
[junit4:junit4]   2> 65221 T3321 oascc.SolrZkClient.makePath makePath: /live_nodes/127.0.0.1:51346_solr
[junit4:junit4]   2> 65225 T3367 oascc.ZkStateReader$3.process Updating live nodes... (4)
[junit4:junit4]   2> 65225 T3341 oascc.ZkStateReader$3.process Updating live nodes... (4)
[junit4:junit4]   2> 65225 T3355 oascc.ZkStateReader$3.process Updating live nodes... (4)
[junit4:junit4]   2> 65226 T3321 oashc.HttpShardHandlerFactory.getParameter Setting socketTimeout to: 0
[junit4:junit4]   2> 65226 T3321 oashc.HttpShardHandlerFactory.getParameter Setting urlScheme to: http://
[junit4:junit4]   2> 65227 T3321 oashc.HttpShardHandlerFactory.getParameter Setting connTimeout to: 0
[junit4:junit4]   2> 65227 T3321 oashc.HttpShardHandlerFactory.getParameter Setting maxConnectionsPerHost to: 20
[junit4:junit4]   2> 65227 T3321 oashc.HttpShardHandlerFactory.getParameter Setting corePoolSize to: 0
[junit4:junit4]   2> 65228 T3321 oashc.HttpShardHandlerFactory.getParameter Setting maximumPoolSize to: 2147483647
[junit4:junit4]   2> 65228 T3321 oashc.HttpShardHandlerFactory.getParameter Setting maxThreadIdleTime to: 5
[junit4:junit4]   2> 65228 T3321 oashc.HttpShardHandlerFactory.getParameter Setting sizeOfQueue to: -1
[junit4:junit4]   2> 65228 T3321 oashc.HttpShardHandlerFactory.getParameter Setting fairnessPolicy to: false
[junit4:junit4]   2> 65230 T3321 oascsi.HttpClientUtil.createClient Creating new http client, config:maxConnectionsPerHost=20&maxConnections=10000&socketTimeout=0&connTimeout=0&retry=false
[junit4:junit4]   2> 65241 T3321 oascc.ZkStateReader.createClusterStateWatchersAndUpdate Updating cluster state from ZooKeeper... 
[junit4:junit4]   2> 65247 T3321 oasc.CoreContainer.create Creating SolrCore 'collection1' using instanceDir: C:\Users\JenkinsSlave\workspace\Lucene-Solr-trunk-Windows\solr\build\solr-core\test\J0\.\org.apache.solr.cloud.SyncSliceTest-jetty3-1351208224043\collection1
[junit4:junit4]   2> 65248 T3321 oasc.ZkController.createCollectionZkNode Check for collection zkNode:collection1
[junit4:junit4]   2> 65250 T3321 oasc.ZkController.createCollectionZkNode Collection zkNode exists
[junit4:junit4]   2> 65250 T3321 oasc.ZkController.readConfigName Load collection config from:/collections/collection1
[junit4:junit4]   2> 65252 T3321 oasc.SolrResourceLoader.<init> new SolrResourceLoader for directory: 'C:\Users\JenkinsSlave\workspace\Lucene-Solr-trunk-Windows\solr\build\solr-core\test\J0\.\org.apache.solr.cloud.SyncSliceTest-jetty3-1351208224043\collection1\'
[junit4:junit4]   2> 65254 T3321 oasc.SolrResourceLoader.replaceClassLoader Adding 'file:/C:/Users/JenkinsSlave/workspace/Lucene-Solr-trunk-Windows/solr/build/solr-core/test/J0/org.apache.solr.cloud.SyncSliceTest-jetty3-1351208224043/collection1/lib/classes/' to classloader
[junit4:junit4]   2> 65255 T3321 oasc.SolrResourceLoader.replaceClassLoader Adding 'file:/C:/Users/JenkinsSlave/workspace/Lucene-Solr-trunk-Windows/solr/build/solr-core/test/J0/org.apache.solr.cloud.SyncSliceTest-jetty3-1351208224043/collection1/lib/README' to classloader
[junit4:junit4]   2> 65319 T3321 oasc.SolrConfig.<init> Using Lucene MatchVersion: LUCENE_50
[junit4:junit4]   2> 65416 T3321 oasc.SolrConfig.<init> Loaded SolrConfig: solrconfig.xml
[junit4:junit4]   2> 65418 T3321 oass.IndexSchema.readSchema Reading Solr Schema
[junit4:junit4]   2> 65424 T3321 oass.IndexSchema.readSchema Schema name=test
[junit4:junit4]   2> 66153 T3321 oass.OpenExchangeRatesOrgProvider.init Initialized with rates=open-exchange-rates.json, refreshInterval=1440.
[junit4:junit4]   2> 66167 T3321 oass.IndexSchema.readSchema default search field in schema is text
[junit4:junit4]   2> 66172 T3321 oass.IndexSchema.readSchema unique key field: id
[junit4:junit4]   2> 66189 T3321 oass.FileExchangeRateProvider.reload Reloading exchange rates from file currency.xml
[junit4:junit4]   2> 66195 T3321 oass.FileExchangeRateProvider.reload Reloading exchange rates from file currency.xml
[junit4:junit4]   2> 66200 T3321 oass.OpenExchangeRatesOrgProvider.reload Reloading exchange rates from open-exchange-rates.json
[junit4:junit4]   2> 66202 T3321 oass.OpenExchangeRatesOrgProvider.reload Reloading exchange rates from open-exchange-rates.json
[junit4:junit4]   2> 66204 T3321 oasc.SolrCore.<init> [collection1] Opening new SolrCore at C:\Users\JenkinsSlave\workspace\Lucene-Solr-trunk-Windows\solr\build\solr-core\test\J0\.\org.apache.solr.cloud.SyncSliceTest-jetty3-1351208224043\collection1\, dataDir=.\org.apache.solr.cloud.SyncSliceTest-1351208159236/jetty3\
[junit4:junit4]   2> 66204 T3321 oasc.JmxMonitoredMap.<init> JMX monitoring is enabled. Adding Solr mbeans to JMX Server: com.sun.jmx.mbeanserver.JmxMBeanServer@39ce757c
[junit4:junit4]   2> 66206 T3321 oasc.SolrCore.getNewIndexDir New index directory detected: old=null new=.\org.apache.solr.cloud.SyncSliceTest-1351208159236/jetty3\index/
[junit4:junit4]   2> 66208 T3321 oasc.SolrCore.initIndex WARNING [collection1] Solr index directory '.\org.apache.solr.cloud.SyncSliceTest-1351208159236\jetty3\index' doesn't exist. Creating new index...
[junit4:junit4]   2> 66209 T3321 oasc.CachingDirectoryFactory.get return new directory for C:\Users\JenkinsSlave\workspace\Lucene-Solr-trunk-Windows\solr\build\solr-core\test\J0\.\org.apache.solr.cloud.SyncSliceTest-1351208159236\jetty3\index forceNew:false
[junit4:junit4]   2> 66221 T3321 oasc.SolrDeletionPolicy.onCommit SolrDeletionPolicy.onCommit: commits:num=1
[junit4:junit4]   2> 		commit{dir=C:\Users\JenkinsSlave\workspace\Lucene-Solr-trunk-Windows\solr\build\solr-core\test\J0\org.apache.solr.cloud.SyncSliceTest-1351208159236\jetty3\index,segFN=segments_1,generation=1,filenames=[segments_1]
[junit4:junit4]   2> 66222 T3321 oasc.SolrDeletionPolicy.updateCommits newest commit = 1
[junit4:junit4]   2> 66223 T3321 oasc.SolrCore.initWriters created xml: solr.XMLResponseWriter
[junit4:junit4]   2> 66227 T3321 oasup.UpdateRequestProcessorChain.init inserting DistributedUpdateProcessorFactory into updateRequestProcessorChain "dedupe"
[junit4:junit4]   2> 66228 T3321 oasup.UpdateRequestProcessorChain.init inserting DistributedUpdateProcessorFactory into updateRequestProcessorChain "dedupe-allfields"
[junit4:junit4]   2> 66228 T3321 oasup.UpdateRequestProcessorChain.init inserting DistributedUpdateProcessorFactory into updateRequestProcessorChain "stored_sig"
[junit4:junit4]   2> 66228 T3321 oasup.UpdateRequestProcessorChain.init inserting DistributedUpdateProcessorFactory into updateRequestProcessorChain "uniq-fields"
[junit4:junit4]   2> 66229 T3321 oasup.UpdateRequestProcessorChain.init inserting DistributedUpdateProcessorFactory into updateRequestProcessorChain "distrib-dup-test-chain-implicit"
[junit4:junit4]   2> 66229 T3321 oasc.RequestHandlers.initHandlersFromConfig adding lazy requestHandler: solr.ReplicationHandler
[junit4:junit4]   2> 66230 T3321 oasc.RequestHandlers.initHandlersFromConfig created /replication: solr.ReplicationHandler
[junit4:junit4]   2> 66231 T3321 oasc.RequestHandlers.initHandlersFromConfig created standard: solr.StandardRequestHandler
[junit4:junit4]   2> 66231 T3321 oasc.RequestHandlers.initHandlersFromConfig created /get: solr.RealTimeGetHandler
[junit4:junit4]   2> 66232 T3321 oasc.RequestHandlers.initHandlersFromConfig created dismax: solr.SearchHandler
[junit4:junit4]   2> 66232 T3321 oasc.RequestHandlers.initHandlersFromConfig created mock: org.apache.solr.core.MockQuerySenderListenerReqHandler
[junit4:junit4]   2> 66233 T3321 oasc.RequestHandlers.initHandlersFromConfig created /admin/: org.apache.solr.handler.admin.AdminHandlers
[junit4:junit4]   2> 66233 T3321 oasc.RequestHandlers.initHandlersFromConfig created defaults: solr.StandardRequestHandler
[junit4:junit4]   2> 66234 T3321 oasc.RequestHandlers.initHandlersFromConfig adding lazy requestHandler: solr.StandardRequestHandler
[junit4:junit4]   2> 66234 T3321 oasc.RequestHandlers.initHandlersFromConfig created lazy: solr.StandardRequestHandler
[junit4:junit4]   2> 66235 T3321 oasc.RequestHandlers.initHandlersFromConfig created /update: solr.UpdateRequestHandler
[junit4:junit4]   2> 66235 T3321 oasc.RequestHandlers.initHandlersFromConfig created /terms: org.apache.solr.handler.component.SearchHandler
[junit4:junit4]   2> 66236 T3321 oasc.RequestHandlers.initHandlersFromConfig created spellCheckCompRH: org.apache.solr.handler.component.SearchHandler
[junit4:junit4]   2> 66236 T3321 oasc.RequestHandlers.initHandlersFromConfig created spellCheckCompRH_Direct: org.apache.solr.handler.component.SearchHandler
[junit4:junit4]   2> 66237 T3321 oasc.RequestHandlers.initHandlersFromConfig created spellCheckWithWordbreak: org.apache.solr.handler.component.SearchHandler
[junit4:junit4]   2> 66237 T3321 oasc.RequestHandlers.initHandlersFromConfig created spellCheckWithWordbreak_Direct: org.apache.solr.handler.component.SearchHandler
[junit4:junit4]   2> 66238 T3321 oasc.RequestHandlers.initHandlersFromConfig created spellCheckCompRH1: org.apache.solr.handler.component.SearchHandler
[junit4:junit4]   2> 66238 T3321 oasc.RequestHandlers.initHandlersFromConfig created tvrh: org.apache.solr.handler.component.SearchHandler
[junit4:junit4]   2> 66239 T3321 oasc.RequestHandlers.initHandlersFromConfig created /mlt: solr.MoreLikeThisHandler
[junit4:junit4]   2> 66239 T3321 oasc.RequestHandlers.initHandlersFromConfig created /debug/dump: solr.DumpRequestHandler
[junit4:junit4]   2> 66251 T3321 oashl.XMLLoader.init xsltCacheLifetimeSeconds=60
[junit4:junit4]   2> 66257 T3321 oasc.SolrCore.initDeprecatedSupport WARNING solrconfig.xml uses deprecated <admin/gettableFiles>, Please update your config to use the ShowFileRequestHandler.
[junit4:junit4]   2> 66258 T3321 oasc.SolrCore.initDeprecatedSupport WARNING adding ShowFileRequestHandler with hidden files: [SCHEMA.XML, OLD_SYNONYMS.TXT, STOPWORDS.TXT, PROTWORDS.TXT, OPEN-EXCHANGE-RATES.JSON, SYNONYMS.TXT, CURRENCY.XML, MAPPING-ISOLATIN1ACCENT.TXT]
[junit4:junit4]   2> 66265 T3321 oass.SolrIndexSearcher.<init> Opening Searcher@5ff3d767 main
[junit4:junit4]   2> 66267 T3321 oasu.CommitTracker.<init> Hard AutoCommit: disabled
[junit4:junit4]   2> 66267 T3321 oasu.CommitTracker.<init> Soft AutoCommit: disabled
[junit4:junit4]   2> 66268 T3321 oashc.SpellCheckComponent.inform Initializing spell checkers
[junit4:junit4]   2> 66284 T3321 oass.DirectSolrSpellChecker.init init: {name=direct,classname=DirectSolrSpellChecker,field=lowerfilt,minQueryLength=3}
[junit4:junit4]   2> 66338 T3380 oasc.SolrCore.registerSearcher [collection1] Registered new searcher Searcher@5ff3d767 main{StandardDirectoryReader(segments_1:1)}
[junit4:junit4]   2> 66342 T3321 oasc.ZkController.publish numShards not found on descriptor - reading it from system property
[junit4:junit4]   2> 66703 T3342 oascc.ZkStateReader.updateClusterState Updating cloud state from ZooKeeper... 
[junit4:junit4]   2> 66704 T3342 oasc.Overseer$ClusterStateUpdater.updateState Update state numShards=1 message={
[junit4:junit4]   2> 	  "operation":"state",
[junit4:junit4]   2> 	  "numShards":"1",
[junit4:junit4]   2> 	  "shard":null,
[junit4:junit4]   2> 	  "roles":null,
[junit4:junit4]   2> 	  "state":"down",
[junit4:junit4]   2> 	  "core":"collection1",
[junit4:junit4]   2> 	  "collection":"collection1",
[junit4:junit4]   2> 	  "node_name":"127.0.0.1:51346_solr",
[junit4:junit4]   2> 	  "base_url":"http://127.0.0.1:51346/solr"}
[junit4:junit4]   2> 66714 T3341 oascc.ZkStateReader$2.process A cluster state change has occurred - updating... (4)
[junit4:junit4]   2> 66715 T3379 oascc.ZkStateReader$2.process A cluster state change has occurred - updating... (4)
[junit4:junit4]   2> 66715 T3355 oascc.ZkStateReader$2.process A cluster state change has occurred - updating... (4)
[junit4:junit4]   2> 66879 T3321 oasc.CoreContainer.register registering core: collection1
[junit4:junit4]   2> 66880 T3321 oasc.ZkController.register Register shard - core:collection1 address:http://127.0.0.1:51346/solr shardId:shard1
[junit4:junit4]   2> 66885 T3321 oasc.ZkController.register We are http://127.0.0.1:51346/solr/collection1/ and leader is http://127.0.0.1:51334/solr/collection1/
[junit4:junit4]   2> 66885 T3321 oasc.ZkController.register No LogReplay needed for core=collection1 baseURL=http://127.0.0.1:51346/solr
[junit4:junit4]   2> 66886 T3321 oasc.ZkController.checkRecovery Core needs to recover:collection1
[junit4:junit4]   2> 66886 T3321 oasu.DefaultSolrCoreState.doRecovery Running recovery - first canceling any ongoing recovery
[junit4:junit4]   2> ASYNC  NEW_CORE C254 name=collection1 org.apache.solr.core.SolrCore@4118f567 url=http://127.0.0.1:51346/solr/collection1 node=127.0.0.1:51346_solr
[junit4:junit4]   2> 66888 T3381 C254 P51346 oasc.RecoveryStrategy.run Starting recovery process.  core=collection1 recoveringAfterStartup=true
[junit4:junit4]   2> 66889 T3321 oascc.ZkStateReader.updateClusterState Updating cloud state from ZooKeeper... 
[junit4:junit4]   2> 66890 T3381 C254 P51346 oasc.RecoveryStrategy.doRecovery ###### startupVersions=[]
[junit4:junit4]   2> 66890 T3381 C254 P51346 oasc.ZkController.publish numShards not found on descriptor - reading it from system property
[junit4:junit4]   2> 66891 T3321 oass.SolrDispatchFilter.init user.dir=C:\Users\JenkinsSlave\workspace\Lucene-Solr-trunk-Windows\solr\build\solr-core\test\J0
[junit4:junit4]   2> 66891 T3321 oass.SolrDispatchFilter.init SolrDispatchFilter.init() done
[junit4:junit4]   2> 66892 T3321 oascsi.HttpClientUtil.createClient Creating new http client, config:maxConnections=128&maxConnectionsPerHost=32&followRedirects=false
[junit4:junit4]   2> 66895 T3381 C254 P51346 oasc.RecoveryStrategy.doRecovery Attempting to PeerSync from http://127.0.0.1:51334/solr/collection1/ core=collection1 - recoveringAfterStartup=true
[junit4:junit4]   2> 66895 T3381 C254 P51346 oasu.PeerSync.sync PeerSync: core=collection1 url=http://127.0.0.1:51346/solr START replicas=[http://127.0.0.1:51334/solr/collection1/] nUpdates=100
[junit4:junit4]   2> 66896 T3381 C254 P51346 oasu.PeerSync.sync WARNING no frame of reference to tell of we've missed updates
[junit4:junit4]   2> 66896 T3381 C254 P51346 oasc.RecoveryStrategy.doRecovery PeerSync Recovery was not successful - trying replication. core=collection1
[junit4:junit4]   2> 66896 T3381 C254 P51346 oasc.RecoveryStrategy.doRecovery Starting Replication Recovery. core=collection1
[junit4:junit4]   2> 66896 T3381 C254 P51346 oascsi.HttpClientUtil.createClient Creating new http client, config:maxConnections=128&maxConnectionsPerHost=32&followRedirects=false
[junit4:junit4]   2> ASYNC  NEW_CORE C255 name=collection1 org.apache.solr.core.SolrCore@1bb301fe url=http://127.0.0.1:51334/solr/collection1 node=127.0.0.1:51334_solr
[junit4:junit4]   2> 66926 T3353 C255 P51334 REQ /get {distrib=false&qt=/get&wt=javabin&version=2&getVersions=100} status=0 QTime=0 
[junit4:junit4]   2> 67261 T3342 oascc.ZkStateReader.updateClusterState Updating cloud state from ZooKeeper... 
[junit4:junit4]   2> 67262 T3342 oasc.Overseer$ClusterStateUpdater.updateState Update state numShards=1 message={
[junit4:junit4]   2> 	  "operation":"state",
[junit4:junit4]   2> 	  "numShards":"1",
[junit4:junit4]   2> 	  "shard":"shard1",
[junit4:junit4]   2> 	  "roles":null,
[junit4:junit4]   2> 	  "state":"recovering",
[junit4:junit4]   2> 	  "core":"collection1",
[junit4:junit4]   2> 	  "collection":"collection1",
[junit4:junit4]   2> 	  "node_name":"127.0.0.1:51346_solr",
[junit4:junit4]   2> 	  "base_url":"http://127.0.0.1:51346/solr"}
[junit4:junit4]   2> 67335 T3341 oascc.ZkStateReader$2.process A cluster state change has occurred - updating... (4)
[junit4:junit4]   2> 67335 T3355 oascc.ZkStateReader$2.process A cluster state change has occurred - updating... (4)
[junit4:junit4]   2> 67335 T3379 oascc.ZkStateReader$2.process A cluster state change has occurred - updating... (4)
[junit4:junit4]   2> 67416 T3321 oejs.Server.doStart jetty-8.1.2.v20120308
[junit4:junit4]   2> 67421 T3321 oejs.AbstractConnector.doStart Started SelectChannelConnector@0.0.0.0:51354
[junit4:junit4]   2> 67424 T3321 oasc.SolrResourceLoader.locateSolrHome JNDI not configured for solr (NoInitialContextEx)
[junit4:junit4]   2> 67424 T3321 oasc.SolrResourceLoader.locateSolrHome using system property solr.solr.home: C:\Users\JenkinsSlave\workspace\Lucene-Solr-trunk-Windows\solr\build\solr-core\test\J0\.\org.apache.solr.cloud.SyncSliceTest-jetty4-1351208226140
[junit4:junit4]   2> 67425 T3321 oasc.SolrResourceLoader.<init> new SolrResourceLoader for deduced Solr Home: 'C:\Users\JenkinsSlave\workspace\Lucene-Solr-trunk-Windows\solr\build\solr-core\test\J0\.\org.apache.solr.cloud.SyncSliceTest-jetty4-1351208226140\'
[junit4:junit4]   2> 67483 T3321 oass.SolrDispatchFilter.init SolrDispatchFilter.init()
[junit4:junit4]   2> 67484 T3321 oasc.SolrResourceLoader.locateSolrHome JNDI not configured for solr (NoInitialContextEx)
[junit4:junit4]   2> 67485 T3321 oasc.SolrResourceLoader.locateSolrHome using system property solr.solr.home: C:\Users\JenkinsSlave\workspace\Lucene-Solr-trunk-Windows\solr\build\solr-core\test\J0\.\org.apache.solr.cloud.SyncSliceTest-jetty4-1351208226140
[junit4:junit4]   2> 67486 T3321 oasc.CoreContainer$Initializer.initialize looking for solr.xml: C:\Users\JenkinsSlave\workspace\Lucene-Solr-trunk-Windows\solr\build\solr-core\test\J0\.\org.apache.solr.cloud.SyncSliceTest-jetty4-1351208226140\solr.xml
[junit4:junit4]   2> 67486 T3321 oasc.CoreContainer.<init> New CoreContainer 992886765
[junit4:junit4]   2> 67487 T3321 oasc.CoreContainer.load Loading CoreContainer using Solr Home: 'C:\Users\JenkinsSlave\workspace\Lucene-Solr-trunk-Windows\solr\build\solr-core\test\J0\.\org.apache.solr.cloud.SyncSliceTest-jetty4-1351208226140\'
[junit4:junit4]   2> 67488 T3321 oasc.SolrResourceLoader.<init> new SolrResourceLoader for directory: 'C:\Users\JenkinsSlave\workspace\Lucene-Solr-trunk-Windows\solr\build\solr-core\test\J0\.\org.apache.solr.cloud.SyncSliceTest-jetty4-1351208226140\'
[junit4:junit4]   2> 67555 T3321 oasc.CoreContainer.load Registering Log Listener
[junit4:junit4]   2> 67583 T3321 oasc.CoreContainer.initZooKeeper Zookeeper client=127.0.0.1:51321/solr
[junit4:junit4]   2> 67584 T3321 oaz.ZooKeeper.<init> Initiating client connection, connectString=127.0.0.1:51321/solr sessionTimeout=5000 watcher=org.apache.solr.common.cloud.ConnectionManager@64e397f7
[junit4:junit4]   2> 67587 T3392 oaz.ClientCnxn$SendThread.startConnect Opening socket connection to server /127.0.0.1:51321
[junit4:junit4]   2> 67587 T3321 oascc.ConnectionManager.waitForConnected Waiting for client to connect to ZooKeeper
[junit4:junit4]   2> 67591 T3392 oaz.ClientCnxn$SendThread.primeConnection Socket connection established to 127.0.0.1/127.0.0.1:51321, initiating session
[junit4:junit4]   2> 67591 T3323 oazs.NIOServerCnxn$Factory.run Accepted socket connection from /127.0.0.1:51359
[junit4:junit4]   2> 67591 T3323 oazs.NIOServerCnxn.readConnectRequest Client attempting to establish new session at /127.0.0.1:51359
[junit4:junit4]   2> 67596 T3325 oazs.NIOServerCnxn.finishSessionInit Established session 0x13a9a4848100006 with negotiated timeout 5000 for client /127.0.0.1:51359
[junit4:junit4]   2> 67596 T3392 oaz.ClientCnxn$SendThread.readConnectResult Session establishment complete on server 127.0.0.1/127.0.0.1:51321, sessionid = 0x13a9a4848100006, negotiated timeout = 5000
[junit4:junit4]   2> 67596 T3393 oascc.ConnectionManager.process Watcher org.apache.solr.common.cloud.ConnectionManager@64e397f7 name:ZooKeeperConnection Watcher:127.0.0.1:51321/solr got event WatchedEvent state:SyncConnected type:None path:null path:null type:None
[junit4:junit4]   2> 67597 T3321 oascc.ConnectionManager.waitForConnected Client is connected to ZooKeeper
[junit4:junit4]   2> 67598 T3326 oazs.PrepRequestProcessor.pRequest Got user-level KeeperException when processing sessionid:0x13a9a4848100006 type:create cxid:0x1 zxid:0xfffffffffffffffe txntype:unknown reqpath:n/a Error Path:/solr/overseer Error:KeeperErrorCode = NodeExists for /solr/overseer
[junit4:junit4]   2> 67600 T3326 oazs.PrepRequestProcessor.pRequest Got user-level KeeperException when processing sessionid:0x13a9a4848100006 type:create cxid:0x2 zxid:0xfffffffffffffffe txntype:unknown reqpath:n/a Error Path:/solr/overseer Error:KeeperErrorCode = NodeExists for /solr/overseer
[junit4:junit4]   2> 67603 T3321 oasc.ZkController.createEphemeralLiveNode Register node as live in ZooKeeper:/live_nodes/127.0.0.1:51354_solr
[junit4:junit4]   2> 67605 T3326 oazs.PrepRequestProcessor.pRequest Got user-level KeeperException when processing sessionid:0x13a9a4848100006 type:delete cxid:0x4 zxid:0xfffffffffffffffe txntype:unknown reqpath:n/a Error Path:/solr/live_nodes/127.0.0.1:51354_solr Error:KeeperErrorCode = NoNode for /solr/live_nodes/127.0.0.1:51354_solr
[junit4:junit4]   2> 67607 T3321 oascc.SolrZkClient.makePath makePath: /live_nodes/127.0.0.1:51354_solr
[junit4:junit4]   2> 67613 T3367 oascc.ZkStateReader$3.process Updating live nodes... (5)
[junit4:junit4]   2> 67615 T3341 oascc.ZkStateReader$3.process Updating live nodes... (5)
[junit4:junit4]   2> 67615 T3379 oascc.ZkStateReader$3.process Updating live nodes... (5)
[junit4:junit4]   2> 67615 T3355 oascc.ZkStateReader$3.process Updating live nodes... (5)
[junit4:junit4]   2> 67616 T3321 oashc.HttpShardHandlerFactory.getParameter Setting socketTimeout to: 0
[junit4:junit4]   2> 67616 T3321 oashc.HttpShardHandlerFactory.getParameter Setting urlScheme to: http://
[junit4:junit4]   2> 67617 T3321 oashc.HttpShardHandlerFactory.getParameter Setting connTimeout to: 0
[junit4:junit4]   2> 67617 T3321 oashc.HttpShardHandlerFactory.getParameter Setting maxConnectionsPerHost to: 20
[junit4:junit4]   2> 67618 T3321 oashc.HttpShardHandlerFactory.getParameter Setting corePoolSize to: 0
[junit4:junit4]   2> 67618 T3321 oashc.HttpShardHandlerFactory.getParameter Setting maximumPoolSize to: 2147483647
[junit4:junit4]   2> 67619 T3321 oashc.HttpShardHandlerFactory.getParameter Setting maxThreadIdleTime to: 5
[junit4:junit4]   2> 67620 T3321 oashc.HttpShardHandlerFactory.getParameter Setting sizeOfQueue to: -1
[junit4:junit4]   2> 67621 T3321 oashc.HttpShardHandlerFactory.getParameter Setting fairnessPolicy to: false
[junit4:junit4]   2> 67621 T3321 oascsi.HttpClientUtil.createClient Creating new http client, config:maxConnectionsPerHost=20&maxConnections=10000&socketTimeout=0&connTimeout=0&retry=false
[junit4:junit4]   2> 67642 T3321 oascc.ZkStateReader.createClusterStateWatchersAndUpdate Updating cluster state from ZooKeeper... 
[junit4:junit4]   2> 67651 T3321 oasc.CoreContainer.create Creating SolrCore 'collection1' using instanceDir: C:\Users\JenkinsSlave\workspace\Lucene-Solr-trunk-Windows\solr\build\solr-core\test\J0\.\org.apache.solr.cloud.SyncSliceTest-jetty4-1351208226140\collection1
[junit4:junit4]   2> 67652 T3321 oasc.ZkController.createCollectionZkNode Check for collection zkNode:collection1
[junit4:junit4]   2> 67654 T3321 oasc.ZkController.createCollectionZkNode Collection zkNode exists
[junit4:junit4]   2> 67655 T3321 oasc.ZkController.readConfigName Load collection config from:/collections/collection1
[junit4:junit4]   2> 67657 T3321 oasc.SolrResourceLoader.<init> new SolrResourceLoader for directory: 'C:\Users\JenkinsSlave\workspace\Lucene-Solr-trunk-Windows\solr\build\solr-core\test\J0\.\org.apache.solr.cloud.SyncSliceTest-jetty4-1351208226140\collection1\'
[junit4:junit4]   2> 67659 T3321 oasc.SolrResourceLoader.replaceClassLoader Adding 'file:/C:/Users/JenkinsSlave/workspace/Lucene-Solr-trunk-Windows/solr/build/solr-core/test/J0/org.apache.solr.cloud.SyncSliceTest-jetty4-1351208226140/collection1/lib/classes/' to classloader
[junit4:junit4]   2> 67660 T3321 oasc.SolrResourceLoader.replaceClassLoader Adding 'file:/C:/Users/JenkinsSlave/workspace/Lucene-Solr-trunk-Windows/solr/build/solr-core/test/J0/org.apache.solr.cloud.SyncSliceTest-jetty4-1351208226140/collection1/lib/README' to classloader
[junit4:junit4]   2> 67715 T3321 oasc.SolrConfig.<init> Using Lucene MatchVersion: LUCENE_50
[junit4:junit4]   2> 67787 T3321 oasc.SolrConfig.<init> Loaded SolrConfig: solrconfig.xml
[junit4:junit4]   2> 67789 T3321 oass.IndexSchema.readSchema Reading Solr Schema
[junit4:junit4]   2> 67796 T3321 oass.IndexSchema.readSchema Schema name=test
[junit4:junit4]   2> 68498 T3321 oass.OpenExchangeRatesOrgProvider.init Initialized with rates=open-exchange-rates.json, refreshInterval=1440.
[junit4:junit4]   2> 68510 T3321 oass.IndexSchema.readSchema default search field in schema is text
[junit4:junit4]   2> 68515 T3321 oass.IndexSchema.readSchema unique key field: id
[junit4:junit4]   2> 68535 T3321 oass.FileExchangeRateProvider.reload Reloading exchange rates from file currency.xml
[junit4:junit4]   2> 68539 T3321 oass.FileExchangeRateProvider.reload Reloading exchange rates from file currency.xml
[junit4:junit4]   2> 68546 T3321 oass.OpenExchangeRatesOrgProvider.reload Reloading exchange rates from open-exchange-rates.json
[junit4:junit4]   2> 68550 T3321 oass.OpenExchangeRatesOrgProvider.reload Reloading exchange rates from open-exchange-rates.json
[junit4:junit4]   2> 68552 T3321 oasc.SolrCore.<init> [collection1] Opening new SolrCore at C:\Users\JenkinsSlave\workspace\Lucene-Solr-trunk-Windows\solr\build\solr-core\test\J0\.\org.apache.solr.cloud.SyncSliceTest-jetty4-1351208226140\collection1\, dataDir=.\org.apache.solr.cloud.SyncSliceTest-1351208159236/jetty4\
[junit4:junit4]   2> 68552 T3321 oasc.JmxMonitoredMap.<init> JMX monitoring is enabled. Adding Solr mbeans to JMX Server: com.sun.jmx.mbeanserver.JmxMBeanServer@39ce757c
[junit4:junit4]   2> 68553 T3321 oasc.SolrCore.getNewIndexDir New index directory detected: old=null new=.\org.apache.solr.cloud.SyncSliceTest-1351208159236/jetty4\index/
[junit4:junit4]   2> 68554 T3321 oasc.SolrCore.initIndex WARNING [collection1] Solr index directory '.\org.apache.solr.cloud.SyncSliceTest-1351208159236\jetty4\index' doesn't exist. Creating new index...
[junit4:junit4]   2> 68555 T3321 oasc.CachingDirectoryFactory.get return new directory for C:\Users\JenkinsSlave\workspace\Lucene-Solr-trunk-Windows\solr\build\solr-core\test\J0\.\org.apache.solr.cloud.SyncSliceTest-1351208159236\jetty4\index forceNew:false
[junit4:junit4]   2> 68569 T3321 oasc.SolrDeletionPolicy.onCommit SolrDeletionPolicy.onCommit: commits:num=1
[junit4:junit4]   2> 		commit{dir=C:\Users\JenkinsSlave\workspace\Lucene-Solr-trunk-Windows\solr\build\solr-core\test\J0\org.apache.solr.cloud.SyncSliceTest-1351208159236\jetty4\index,segFN=segments_1,generation=1,filenames=[segments_1]
[junit4:junit4]   2> 68570 T3321 oasc.SolrDeletionPolicy.updateCommits newest commit = 1
[junit4:junit4]   2> 68571 T3321 oasc.SolrCore.initWriters created xml: solr.XMLResponseWriter
[junit4:junit4]   2> 68573 T3321 oasup.UpdateRequestProcessorChain.init inserting DistributedUpdateProcessorFactory into updateRequestProcessorChain "dedupe"
[junit4:junit4]   2> 68574 T3321 oasup.UpdateRequestProcessorChain.init inserting DistributedUpdateProcessorFactory into updateRequestProcessorChain "dedupe-allfields"
[junit4:junit4]   2> 68574 T3321 oasup.UpdateRequestProcessorChain.init inserting DistributedUpdateProcessorFactory into updateRequestProcessorChain "stored_sig"
[junit4:junit4]   2> 68575 T3321 oasup.UpdateRequestProcessorChain.init inserting DistributedUpdateProcessorFactory into updateRequestProcessorChain "uniq-fields"
[junit4:junit4]   2> 68576 T3321 oasup.UpdateRequestProcessorChain.init inserting DistributedUpdateProcessorFactory into updateRequestProcessorChain "distrib-dup-test-chain-implicit"
[junit4:junit4]   2> 68576 T3321 oasc.RequestHandlers.initHandlersFromConfig adding lazy requestHandler: solr.ReplicationHandler
[junit4:junit4]   2> 68576 T3321 oasc.RequestHandlers.initHandlersFromConfig created /replication: solr.ReplicationHandler
[junit4:junit4]   2> 68577 T3321 oasc.RequestHandlers.initHandlersFromConfig created standard: solr.StandardRequestHandler
[junit4:junit4]   2> 68578 T3321 oasc.RequestHandlers.initHandlersFromConfig created /get: solr.RealTimeGetHandler
[junit4:junit4]   2> 68578 T3321 oasc.RequestHandlers.initHandlersFromConfig created dismax: solr.SearchHandler
[junit4:junit4]   2> 68579 T3321 oasc.RequestHandlers.initHandlersFromConfig created mock: org.apache.solr.core.MockQuerySenderListenerReqHandler
[junit4:junit4]   2> 68580 T3321 oasc.RequestHandlers.initHandlersFromConfig created /admin/: org.apache.solr.handler.admin.AdminHandlers
[junit4:junit4]   2> 68580 T3321 oasc.RequestHandlers.initHandlersFromConfig created defaults: solr.StandardRequestHandler
[junit4:junit4]   2> 68580 T3321 oasc.RequestHandlers.initHandlersFromConfig adding lazy requestHandler: solr.StandardRequestHandler
[junit4:junit4]   2> 68581 T3321 oasc.RequestHandlers.initHandlersFromConfig created lazy: solr.StandardRequestHandler
[junit4:junit4]   2> 68582 T3321 oasc.RequestHandlers.initHandlersFromConfig created /update: solr.UpdateRequestHandler
[junit4:junit4]   2> 68582 T3321 oasc.RequestHandlers.initHandlersFromConfig created /terms: org.apache.solr.handler.component.SearchHandler
[junit4:junit4]   2> 68583 T3321 oasc.RequestHandlers.initHandlersFromConfig created spellCheckCompRH: org.apache.solr.handler.component.SearchHandler
[junit4:junit4]   2> 68583 T3321 oasc.RequestHandlers.initHandlersFromConfig created spellCheckCompRH_Direct: org.apache.solr.handler.component.SearchHandler
[junit4:junit4]   2> 68584 T3321 oasc.RequestHandlers.initHandlersFromConfig created spellCheckWithWordbreak: org.apache.solr.handler.component.SearchHandler
[junit4:junit4]   2> 68584 T3321 oasc.RequestHandlers.initHandlersFromConfig created spellCheckWithWordbreak_Direct: org.apache.solr.handler.component.SearchHandler
[junit4:junit4]   2> 68585 T3321 oasc.RequestHandlers.initHandlersFromConfig created spellCheckCompRH1: org.apache.solr.handler.component.SearchHandler
[junit4:junit4]   2> 68586 T3321 oasc.RequestHandlers.initHandlersFromConfig created tvrh: org.apache.solr.handler.component.SearchHandler
[junit4:junit4]   2> 68586 T3321 oasc.RequestHandlers.initHandlersFromConfig created /mlt: solr.MoreLikeThisHandler
[junit4:junit4]   2> 68588 T3321 oasc.RequestHandlers.initHandlersFromConfig created /debug/dump: solr.DumpRequestHandler
[junit4:junit4]   2> 68598 T3321 oashl.XMLLoader.init xsltCacheLifetimeSeconds=60
[junit4:junit4]   2> 68604 T3321 oasc.SolrCore.initDeprecatedSupport WARNING solrconfig.xml uses deprecated <admin/gettableFiles>, Please update your config to use the ShowFileRequestHandler.
[junit4:junit4]   2> 68606 T3321 oasc.SolrCore.initDeprecatedSupport WARNING adding ShowFileRequestHandler with hidden files: [SCHEMA.XML, OLD_SYNONYMS.TXT, STOPWORDS.TXT, PROTWORDS.TXT, OPEN-EXCHANGE-RATES.JSON, SYNONYMS.TXT, CURRENCY.XML, MAPPING-ISOLATIN1ACCENT.TXT]
[junit4:junit4]   2> 68612 T3321 oass.SolrIndexSearcher.<init> Opening Searcher@2426b1a5 main
[junit4:junit4]   2> 68615 T3321 oasu.CommitTracker.<init> Hard AutoCommit: disabled
[junit4:junit4]   2> 68616 T3321 oasu.CommitTracker.<init> Soft AutoCommit: disabled
[junit4:junit4]   2> 68616 T3321 oashc.SpellCheckComponent.inform Initializing spell checkers
[junit4:junit4]   2> 68629 T3321 oass.DirectSolrSpellChecker.init init: {name=direct,classname=DirectSolrSpellChecker,field=lowerfilt,minQueryLength=3}
[junit4:junit4]   2> 68697 T3394 oasc.SolrCore.registerSearcher [collection1] Registered new searcher Searcher@2426b1a5 main{StandardDirectoryReader(segments_1:1)}
[junit4:junit4]   2> 68702 T3321 oasc.ZkController.publish numShards not found on descriptor - reading it from system property
[junit4:junit4]   2> 68978 T3342 oascc.ZkStateReader.updateClusterState Updating cloud state from ZooKeeper... 
[junit4:junit4]   2> 68979 T3342 oasc.Overseer$ClusterStateUpdater.updateState Update state numShards=1 message={
[junit4:junit4]   2> 	  "operation":"state",
[junit4:junit4]   2> 	  "numShards":"1",
[junit4:junit4]   2> 	  "shard":null,
[junit4:junit4]   2> 	  "roles":null,
[junit4:junit4]   2> 	  "state":"down",
[junit4:junit4]   2> 	  "core":"collection1",
[junit4:junit4]   2> 	  "collection":"collection1",
[junit4:junit4]   2> 	  "node_name":"127.0.0.1:51354_solr",
[junit4:junit4]   2> 	  "base_url":"http://127.0.0.1:51354/solr"}
[junit4:junit4]   2> 68990 T3393 oascc.ZkStateReader$2.process A cluster state change has occurred - updating... (5)
[junit4:junit4]   2> 68990 T3341 oascc.ZkStateReader$2.process A cluster state change has occurred - updating... (5)
[junit4:junit4]   2> 68991 T3355 oascc.ZkStateReader$2.process A cluster state change has occurred - updating... (5)
[junit4:junit4]   2> 68991 T3379 oascc.ZkStateReader$2.process A cluster state change has occurred - updating... (5)
[junit4:junit4]   2> 69244 T3321 oasc.CoreContainer.register registering core: collection1
[junit4:junit4]   2> 69246 T3321 oasc.ZkController.register Register shard - core:collection1 address:http://127.0.0.1:51354/solr shardId:shard1
[junit4:junit4]   2> 69251 T3321 oasc.ZkController.register We are http://127.0.0.1:51354/solr/collection1/ and leader is http://127.0.0.1:51334/solr/collection1/
[junit4:junit4]   2> 69252 T3321 oasc.ZkController.register No LogReplay needed for core=collection1 baseURL=http://127.0.0.1:51354/solr
[junit4:junit4]   2> 69252 T3321 oasc.ZkController.checkRecovery Core needs to recover:collection1
[junit4:junit4]   2> 69252 T3321 oasu.DefaultSolrCoreState.doRecovery Running recovery - first canceling any ongoing recovery
[junit4:junit4]   2> ASYNC  NEW_CORE C256 name=collection1 org.apache.solr.core.SolrCore@328b521d url=http://127.0.0.1:51354/solr/collection1 node=127.0.0.1:51354_solr
[junit4:junit4]   2> 69256 T3395 C256 P51354 oasc.RecoveryStrategy.run Starting recovery process.  core=collection1 recoveringAfterStartup=true
[junit4:junit4]   2> 69256 T3321 oascc.ZkStateReader.updateClusterState Updating cloud state from ZooKeeper... 
[junit4:junit4]   2> 69257 T3395 C256 P51354 oasc.RecoveryStrategy.doRecovery ###### startupVersions=[]
[junit4:junit4]   2> 69257 T3395 C256 P51354 oasc.ZkController.publish numShards not found on descriptor - reading it from system property
[junit4:junit4]   2> 69258 T3321 oass.SolrDispatchFilter.init user.dir=C:\Users\JenkinsSlave\workspace\Lucene-Solr-trunk-Windows\solr\build\solr-core\test\J0
[junit4:junit4]   2> 69259 T3321 oass.SolrDispatchFilter.init SolrDispatchFilter.init() done
[junit4:junit4]   2> 69259 T3321 oascsi.HttpClientUtil.createClient Creating new http client, config:maxConnections=128&maxConnectionsPerHost=32&followRedirects=false
[junit4:junit4]   2> 69260 T3395 C256 P51354 oasc.RecoveryStrategy.doRecovery Attempting to PeerSync from http://127.0.0.1:51334/solr/collection1/ core=collection1 - recoveringAfterStartup=true
[junit4:junit4]   2> 69260 T3395 C256 P51354 oasu.PeerSync.sync PeerSync: core=collection1 url=http://127.0.0.1:51354/solr START replicas=[http://127.0.0.1:51334/solr/collection1/] nUpdates=100
[junit4:junit4]   2> 69261 T3395 C256 P51354 oasu.PeerSync.sync WARNING no frame of reference to tell of we've missed updates
[junit4:junit4]   2> 69261 T3395 C256 P51354 oasc.RecoveryStrategy.doRecovery PeerSync Recovery was not successful - trying replication. core=collection1
[junit4:junit4]   2> 69261 T3395 C256 P51354 oasc.RecoveryStrategy.doRecovery Starting Replication Recovery. core=collection1
[junit4:junit4]   2> 69261 T3395 C256 P51354 oascsi.HttpClientUtil.createClient Creating new http client, config:maxConnections=128&maxConnectionsPerHost=32&followRedirects=false
[junit4:junit4]   2> 69272 T3349 C255 P51334 REQ /get {distrib=false&qt=/get&wt=javabin&version=2&getVersions=100} status=0 QTime=0 
[junit4:junit4]   2> 69274 T3321 oaz.ZooKeeper.<init> Initiating client connection, connectString=127.0.0.1:51321/solr sessionTimeout=10000 watcher=org.apache.solr.common.cloud.ConnectionManager@37bf8d78
[junit4:junit4]   2> 69276 T3397 oaz.ClientCnxn$SendThread.startConnect Opening socket connection to server /127.0.0.1:51321
[junit4:junit4]   2> 69276 T3321 oascc.ConnectionManager.waitForConnected Waiting for client to connect to ZooKeeper
[junit4:junit4]   2> 69278 T3397 oaz.ClientCnxn$SendThread.primeConnection Socket connection established to 127.0.0.1/127.0.0.1:51321, initiating session
[junit4:junit4]   2> 69278 T3323 oazs.NIOServerCnxn$Factory.run Accepted socket connection from /127.0.0.1:51363
[junit4:junit4]   2> 69278 T3323 oazs.NIOServerCnxn.readConnectRequest Client attempting to establish new session at /127.0.0.1:51363
[junit4:junit4]   2> 69282 T3325 oazs.NIOServerCnxn.finishSessionInit Established session 0x13a9a4848100007 with negotiated timeout 10000 for client /127.0.0.1:51363
[junit4:junit4]   2> 69282 T3397 oaz.ClientCnxn$SendThread.readConnectResult Session establishment complete on server 127.0.0.1/127.0.0.1:51321, sessionid = 0x13a9a4848100007, negotiated timeout = 10000
[junit4:junit4]   2> 69282 T3398 oascc.ConnectionManager.process Watcher org.apache.solr.common.cloud.ConnectionManager@37bf8d78 name:ZooKeeperConnection Watcher:127.0.0.1:51321/solr got event WatchedEvent state:SyncConnected type:None path:null path:null type:None
[junit4:junit4]   2> 69283 T3321 oascc.ConnectionManager.waitForConnected Client is connected to ZooKeeper
[junit4:junit4]   2> 69284 T3321 oascc.ZkStateReader.createClusterStateWatchersAndUpdate Updating cluster state from ZooKeeper... 
[junit4:junit4]   2> 69288 T3321 oasc.ChaosMonkey.monkeyLog monkey: init - expire sessions:true cause connection loss:true
[junit4:junit4]   2> 69288 T3321 oascsi.HttpClientUtil.createClient Creating new http client, config:
[junit4:junit4]   2> 69297 T3321 oascc.ZkStateReader.updateClusterState Updating cloud state from ZooKeeper... 
[junit4:junit4]   2> 69299 T3321 oasc.AbstractFullDistribZkTestBase.waitForThingsToLevelOut Wait for recoveries to finish - wait 15 for each attempt
[junit4:junit4]   2> 69299 T3321 oasc.AbstractDistribZkTestBase.waitForRecoveriesToFinish Wait for recoveries to finish - collection: collection1 failOnTimeout:true timeout (sec):15
[junit4:junit4]   2> 69301 T3321 oascc.ZkStateReader.updateClusterState Updating cloud state from ZooKeeper... 
[junit4:junit4]   2> 69537 T3342 oascc.ZkStateReader.updateClusterState Updating cloud state from ZooKeeper... 
[junit4:junit4]   2> 69538 T3342 oasc.Overseer$ClusterStateUpdater.updateState Update state numShards=1 message={
[junit4:junit4]   2> 	  "operation":"state",
[junit4:junit4]   2> 	  "numShards":"1",
[junit4:junit4]   2> 	  "shard":"shard1",
[junit4:junit4]   2> 	  "roles":null,
[junit4:junit4]   2> 	  "state":"recovering",
[junit4:junit4]   2> 	  "core":"collection1",
[junit4:junit4]   2> 	  "collection":"collection1",
[junit4:junit4]   2> 	  "node_name":"127.0.0.1:51354_solr",
[junit4:junit4]   2> 	  "base_url":"http://127.0.0.1:51354/solr"}
[junit4:junit4]   2> 69547 T3393 oascc.ZkStateReader$2.process A cluster state change has occurred - updating... (5)
[junit4:junit4]   2> 69547 T3341 oascc.ZkStateReader$2.process A cluster state change has occurred - updating... (5)
[junit4:junit4]   2> 69547 T3398 oascc.ZkStateReader$2.process A cluster state change has occurred - updating... (5)
[junit4:junit4]   2> 69548 T3355 oascc.ZkStateReader$2.process A cluster state change has occurred - updating... (5)
[junit4:junit4]   2> 69548 T3379 oascc.ZkStateReader$2.process A cluster state change has occurred - updating... (5)
[junit4:junit4]   2>  C254_STATE=coll:collection1 core:collection1 props:{shard=shard1, roles=null, state=recovering, core=collection1, collection=collection1, node_name=127.0.0.1:51346_solr, base_url=http://127.0.0.1:51346/solr}
[junit4:junit4]   2> 70148 T3381 C254 P51346 oasc.RecoveryStrategy.doRecovery Begin buffering updates. core=collection1
[junit4:junit4]   2> 70148 T3381 C254 P51346 oasu.UpdateLog.bufferUpdates Starting to buffer updates. FSUpdateLog{state=ACTIVE, tlog=null}
[junit4:junit4]   2> 70149 T3381 C254 P51346 oasc.RecoveryStrategy.replicate Attempting to replicate from http://127.0.0.1:51334/solr/collection1/. core=collection1
[junit4:junit4]   2> 70149 T3381 C254 P51346 oascsi.HttpClientUtil.createClient Creating new http client, config:maxConnections=128&maxConnectionsPerHost=32&followRedirects=false
[junit4:junit4]   2> 70171 T3353 C255 P51334 oasu.DirectUpdateHandler2.commit start commit{flags=0,_version_=0,optimize=false,openSearcher=false,waitSearcher=true,expungeDeletes=false,softCommit=false}
[junit4:junit4]   2> 70181 T3353 C255 P51334 oasc.SolrDeletionPolicy.onInit SolrDeletionPolicy.onInit: commits:num=1
[junit4:junit4]   2> 		commit{dir=C:\Users\JenkinsSlave\workspace\Lucene-Solr-trunk-Windows\solr\build\solr-core\test\J0\org.apache.solr.cloud.SyncSliceTest-1351208159236\jetty1\index,segFN=segments_1,generation=1,filenames=[segments_1]
[junit4:junit4]   2> 70184 T3353 C255 P51334 oasc.SolrDeletionPolicy.updateCommits newest commit = 1
[junit4:junit4]   2> 70184 T3353 C255 P51334 oass.SolrIndexSearcher.<init> Opening Searcher@7cdca8c realtime
[junit4:junit4]   2> 70185 T3353 C255 P51334 oasu.DirectUpdateHandler2.commit end_commit_flush
[junit4:junit4]   2> 70185 T3353 C255 P51334 /update {waitSearcher=true&openSearcher=false&commit=true&commit_end_point=true&wt=javabin&softCommit=false&version=2} {commit=} 0 14
[junit4:junit4]   2> 70186 T3381 C254 P51346 oash.ReplicationHandler.inform Commits will be reserved for  10000
[junit4:junit4]   2> 70186 T3381 C254 P51346 oash.SnapPuller.<init>  No value set for 'pollInterval'. Timer Task not started.
[junit4:junit4]   2> 70189 T3350 C255 P51334 oash.ReplicationHandler.inform Commits will be reserved for  10000
[junit4:junit4]   2> 70189 T3350 C255 P51334 REQ /replication {command=indexversion&wt=javabin&qt=/replication&version=2} status=0 QTime=1 
[junit4:junit4]   2> 70195 T3381 C254 P51346 oasc.SolrDeletionPolicy.onInit SolrDeletionPolicy.onInit: commits:num=1
[junit4:junit4]   2> 		commit{dir=C:\Users\JenkinsSlave\workspace\Lucene-Solr-trunk-Windows\solr\build\solr-core\test\J0\org.apache.solr.cloud.SyncSliceTest-1351208159236\jetty3\index,segFN=segments_1,generation=1,filenames=[segments_1]
[junit4:junit4]   2> 70196 T3381 C254 P51346 oasc.SolrDeletionPolicy.updateCommits newest commit = 1
[junit4:junit4]   2> 70196 T3381 C254 P51346 oasu.DirectUpdateHandler2.commit start commit{flags=0,_version_=0,optimize=false,openSearcher=true,waitSearcher=true,expungeDeletes=false,softCommit=false}
[junit4:junit4]   2> 70205 T3381 C254 P51346 oasc.SolrDeletionPolicy.onCommit SolrDeletionPolicy.onCommit: commits:num=2
[junit4:junit4]   2> 		commit{dir=C:\Users\JenkinsSlave\workspace\Lucene-Solr-trunk-Windows\solr\build\solr-core\test\J0\org.apache.solr.cloud.SyncSliceTest-1351208159236\jetty3\index,segFN=segments_1,generation=1,filenames=[segments_1]
[junit4:junit4]   2> 		commit{dir=C:\Users\JenkinsSlave\workspace\Lucene-Solr-trunk-Windows\solr\build\solr-core\test\J0\org.apache.solr.cloud.SyncSliceTest-1351208159236\jetty3\index,segFN=segments_2,generation=2,filenames=[segments_2]
[junit4:junit4]   2> 70206 T3381 C254 P51346 oasc.SolrDeletionPolicy.updateCommits newest commit = 2
[junit4:junit4]   2> 70214 T3381 C254 P51346 oass.SolrIndexSearcher.<init> Opening Searcher@36d61dc6 main
[junit4:junit4]   2> 70215 T3381 C254 P51346 oasu.DirectUpdateHandler2.commit end_commit_flush
[junit4:junit4]   2> 70216 T3380 oasc.SolrCore.registerSearcher [collection1] Registered new searcher Searcher@36d61dc6 main{StandardDirectoryReader(segments_2:2)}
[junit4:junit4]   2> 70216 T3381 C254 P51346 oasc.RecoveryStrategy.replay No replay needed. core=collection1
[junit4:junit4]   2> 70216 T3381 C254 P51346 oasc.RecoveryStrategy.doRecovery Replication Recovery was successful - registering as Active. core=collection1
[junit4:junit4]   2> 70216 T3381 C254 P51346 oasc.ZkController.publish numShards not found on descriptor - reading it from system property
[junit4:junit4]   2> 70219 T3381 C254 P51346 oasc.RecoveryStrategy.doRecovery Finished recovery process. core=collection1
[junit4:junit4]   2> 70380 T3321 oascc.ZkStateReader.updateClusterState Updating cloud state from ZooKeeper... 
[junit4:junit4]   2> 70635 T3342 oascc.ZkStateReader.updateClusterState Updating cloud state from ZooKeeper... 
[junit4:junit4]   2> 70636 T3342 oasc.Overseer$ClusterStateUpdater.updateState Update state numShards=1 message={
[junit4:junit4]   2> 	  "operation":"state",
[junit4:junit4]   2> 	  "numShards":"1",
[junit4:junit4]   2> 	  "shard":"shard1",
[junit4:junit4]   2> 	  "roles":null,
[junit4:junit4]   2> 	  "state":"active",
[junit4:junit4]   2> 	  "core":"collection1",
[junit4:junit4]   2> 	  "collection":"collection1",
[junit4:junit4]   2> 	  "node_name":"127.0.0.1:51346_solr",
[junit4:junit4]   2> 	  "base_url":"http://127.0.0.1:51346/solr"}
[junit4:junit4]   2> 70647 T3393 oascc.ZkStateReader$2.process A cluster state change has occurred - updating... (5)
[junit4:junit4]   2> 70647 T3341 oascc.ZkStateReader$2.process A cluster state change has occurred - updating... (5)
[junit4:junit4]   2> 70648 T3398 oascc.ZkStateReader$2.process A cluster state change has occurred - updating... (5)
[junit4:junit4]   2> 70648 T3355 oascc.ZkStateReader$2.process A cluster state change has occurred - updating... (5)
[junit4:junit4]   2> 70648 T3379 oascc.ZkStateReader$2.process A cluster state change has occurred - updating... (5)
[junit4:junit4]   2> 71463 T3321 oascc.ZkStateReader.updateClusterState Updating cloud state from ZooKeeper... 
[junit4:junit4]   2>  C256_STATE=coll:collection1 core:collection1 props:{shard=shard1, roles=null, state=recovering, core=collection1, collection=collection1, node_name=127.0.0.1:51354_solr, base_url=http://127.0.0.1:51354/solr}
[junit4:junit4]   2> 72509 T3395 C256 P51354 oasc.RecoveryStrategy.doRecovery Begin buffering updates. core=collection1
[junit4:junit4]   2> 72509 T3395 C256 P51354 oasu.UpdateLog.bufferUpdates Starting to buffer updates. FSUpdateLog{state=ACTIVE, tlog=null}
[junit4:junit4]   2> 72509 T3395 C256 P51354 oasc.RecoveryStrategy.replicate Attempting to replicate from http://127.0.0.1:51334/solr/collection1/. core=collection1
[junit4:junit4]   2> 72510 T3395 C256 P51354 oascsi.HttpClientUtil.createClient Creating new http client, config:maxConnections=128&maxConnectionsPerHost=32&followRedirects=false
[junit4:junit4]   2> 72526 T3351 C255 P51334 oasu.DirectUpdateHandler2.commit start commit{flags=0,_version_=0,optimize=false,openSearcher=false,waitSearcher=true,expungeDeletes=false,softCommit=false}
[junit4:junit4]   2> 72531 T3351 C255 P51334 oasu.DirectUpdateHandler2.commit end_commit_flush
[junit4:junit4]   2> 72532 T3351 C255 P51334 /update {waitSearcher=true&openSearcher=false&commit=true&commit_end_point=true&wt=javabin&softCommit=false&version=2} {commit=} 0 6
[junit4:junit4]   2> 72533 T3395 C256 P51354 oash.ReplicationHandler.inform Commits will be reserved for  10000
[junit4:junit4]   2> 72533 T3395 C256 P51354 oash.SnapPuller.<init>  No value set for 'pollInterval'. Timer Task not started.
[junit4:junit4]   2> 72536 T3353 C255 P51334 REQ /replication {command=indexversion&wt=javabin&qt=/replication&version=2} status=0 QTime=0 
[junit4:junit4]   2> 72543 T3321 oascc.ZkStateReader.updateClusterState Updating cloud state from ZooKeeper... 
[junit4:junit4]   2> 72546 T3395 C256 P51354 oasc.SolrDeletionPolicy.onInit SolrDeletionPolicy.onInit: commits:num=1
[junit4:junit4]   2> 		commit{dir=C:\Users\JenkinsSlave\workspace\Lucene-Solr-trunk-Windows\solr\build\solr-core\test\J0\org.apache.solr.cloud.SyncSliceTest-1351208159236\jetty4\index,segFN=segments_1,generation=1,filenames=[segments_1]
[junit4:junit4]   2> 72548 T3395 C256 P51354 oasc.SolrDeletionPolicy.updateCommits newest commit = 1
[junit4:junit4]   2> 72548 T3395 C256 P51354 oasu.DirectUpdateHandler2.commit start commit{flags=0,_version_=0,optimize=false,openSearcher=true,waitSearcher=true,expungeDeletes=false,softCommit=false}
[junit4:junit4]   2> 72561 T3395 C256 P51354 oasc.SolrDeletionPolicy.onCommit SolrDeletionPolicy.onCommit: commits:num=2
[junit4:junit4]   2> 		commit{dir=C:\Users\JenkinsSlave\workspace\Lucene-Solr-trunk-Windows\solr\build\solr-core\test\J0\org.apache.solr.cloud.SyncSliceTest-1351208159236\jetty4\index,segFN=segments_1,generation=1,filenames=[segments_1]
[junit4:junit4]   2> 		commit{dir=C:\Users\JenkinsSlave\workspace\Lucene-Solr-trunk-Windows\solr\build\solr-core\test\J0\org.apache.solr.cloud.SyncSliceTest-1351208159236\jetty4\index,segFN=segments_2,generation=2,filenames=[segments_2]
[junit4:junit4]   2> 72561 T3395 C256 P51354 oasc.SolrDeletionPolicy.updateCommits newest commit = 2
[junit4:junit4]   2> 72570 T3395 C256 P51354 oass.SolrIndexSearcher.<init> Opening Searcher@3debfe96 main
[junit4:junit4]   2> 72571 T3395 C256 P51354 oasu.DirectUpdateHandler2.commit end_commit_flush
[junit4:junit4]   2> 72573 T3394 oasc.SolrCore.registerSearcher [collection1] Registered new searcher Searcher@3debfe96 main{StandardDirectoryReader(segments_2:2)}
[junit4:junit4]   2> 72573 T3395 C256 P51354 oasc.RecoveryStrategy.replay No replay needed. core=collection1
[junit4:junit4]   2> 72574 T3395 C256 P51354 oasc.RecoveryStrategy.doRecovery Replication Recovery was successful - registering as Active. core=collection1
[junit4:junit4]   2> 72574 T3395 C256 P51354 oasc.ZkController.publish numShards not found on descriptor - reading it from system property
[junit4:junit4]   2> 72578 T3395 C256 P51354 oasc.RecoveryStrategy.doRecovery Finished recovery process. core=collection1
[junit4:junit4]   2> 72819 T3342 oascc.ZkStateReader.updateClusterState Updating cloud state from ZooKeeper... 
[junit4:junit4]   2> 72820 T3342 oasc.Overseer$ClusterStateUpdater.updateState Update state numShards=1 message={
[junit4:junit4]   2> 	  "operation":"state",
[junit4:junit4]   2> 	  "numShards":"1",
[junit4:junit4]   2> 	  "shard":"shard1",
[junit4:junit4]   2> 	  "roles":null,
[junit4:junit4]   2> 	  "state":"active",
[junit4:junit4]   2> 	  "core":"collection1",
[junit4:junit4]   2> 	  "collection":"collection1",
[junit4:junit4]   2> 	  "node_name":"127.0.0.1:51354_solr",
[junit4:junit4]   2> 	  "base_url":"http://127.0.0.1:51354/solr"}
[junit4:junit4]   2> 72827 T3398 oascc.ZkStateReader$2.process A cluster state change has occurred - updating... (5)
[junit4:junit4]   2> 72828 T3341 oascc.ZkStateReader$2.process A cluster state change has occurred - updating... (5)
[junit4:junit4]   2> 72828 T3379 oascc.ZkStateReader$2.process A cluster state change has occurred - updating... (5)
[junit4:junit4]   2> 72828 T3355 oascc.ZkStateReader$2.process A cluster state change has occurred - updating... (5)
[junit4:junit4]   2> 72827 T3393 oascc.ZkStateReader$2.process A cluster state change has occurred - updating... (5)
[junit4:junit4]   2> 73623 T3321 oascc.ZkStateReader.updateClusterState Updating cloud state from ZooKeeper... 
[junit4:junit4]   2> 74703 T3321 oascc.ZkStateReader.updateClusterState Updating cloud state from ZooKeeper... 
[junit4:junit4]   2> 75783 T3321 oascc.ZkStateReader.updateClusterState Updating cloud state from ZooKeeper... 
[junit4:junit4]   2> 76864 T3321 oascc.ZkStateReader.updateClusterState Updating cloud state from ZooKeeper... 
[junit4:junit4]   2> 78020 T3321 oascc.ZkStateReader.updateClusterState Updating cloud state from ZooKeeper... 
[junit4:junit4]   2> 79209 T3321 oascc.ZkStateReader.updateClusterState Updating cloud state from ZooKeeper... 
[junit4:junit4]   2> 80396 T3321 oascc.ZkStateReader.updateClusterState Updating cloud state from ZooKeeper... 
[junit4:junit4]   2> 81584 T3321 oascc.ZkStateReader.updateClusterState Updating cloud state from ZooKeeper... 
[junit4:junit4]   2> 82771 T3321 oascc.ZkStateReader.updateClusterState Updating cloud state from ZooKeeper... 
[junit4:junit4]   2> 83959 T3321 oascc.ZkStateReader.updateClusterState Updating cloud state from ZooKeeper... 
[junit4:junit4]   2> 85146 T3321 oascc.ZkStateReader.updateClusterState Updating cloud state from ZooKeeper... 
[junit4:junit4]   2> 86336 T3321 oascc.ZkStateReader.updateClusterState Updating cloud state from ZooKeeper... 
[junit4:junit4]   2> 86337 T3326 oazs.PrepRequestProcessor.pRequest Processed session termination for sessionid: 0x13a9a4848100007
[junit4:junit4]   2> 86347 T3323 oazs.NIOServerCnxn.doIO WARNING EndOfStreamException: Unable to read additional data from client sessionid 0x13a9a4848100007, likely client has closed socket
[junit4:junit4]   2> 86347 T3398 oaz.ClientCnxn$EventThread.run EventThread shut down
[junit4:junit4]   2> 86348 T3323 oazs.NIOServerCnxn.closeSock Closed socket connection for client /127.0.0.1:51363 which had sessionid 0x13a9a4848100007
[junit4:junit4]   2> 86347 T3321 oaz.ZooKeeper.close Session: 0x13a9a4848100007 closed
[junit4:junit4]   2> 86349 T3326 oazs.PrepRequestProcessor.run PrepRequestProcessor exited loop!
[junit4:junit4]   2> 86351 T3325 oazs.SyncRequestProcessor.run SyncRequestProcessor exited!
[junit4:junit4]   2> 86351 T3321 oazs.FinalRequestProcessor.shutdown shutdown of request processor complete
[junit4:junit4]   2> 86926 T3324 oazs.SessionTrackerImpl.run SessionTrackerImpl exited loop!
[junit4:junit4]   2> 88023 T3366 oaz.ClientCnxn$SendThread.run Client session timed out, have not heard from server in 3586ms for sessionid 0x13a9a4848100004, closing socket connection and attempting reconnect
[junit4:junit4]   2> 89022 T3321 oazs.NIOServerCnxn.closeSock Closed socket connection for client /127.0.0.1:51345 which had sessionid 0x13a9a4848100004
[junit4:junit4]   2> 89024 T3321 oazs.NIOServerCnxn.closeSock Closed socket connection for client /127.0.0.1:51359 which had sessionid 0x13a9a4848100006
[junit4:junit4]   2> 89024 T3392 oaz.ClientCnxn$SendThread.run Unable to read additional data from server sessionid 0x13a9a4848100006, likely server has closed socket, closing socket connection and attempting reconnect
[junit4:junit4]   2> 89024 T3321 oazs.NIOServerCnxn.closeSock Closed socket connection for client /127.0.0.1:51333 which had sessionid 0x13a9a4848100002
[junit4:junit4]   2> 89025 T3340 oaz.ClientCnxn$SendThread.run Unable to read additional data from server sessionid 0x13a9a4848100002, likely server has closed socket, closing socket connection and attempting reconnect
[junit4:junit4]   2> 89025 T3321 oazs.NIOServerCnxn.closeSock Closed socket connection for client /127.0.0.1:51339 which had sessionid 0x13a9a4848100003
[junit4:junit4]   2> 89025 T3354 oaz.ClientCnxn$SendThread.run Unable to read additional data from server sessionid 0x13a9a4848100003, likely server has closed socket, closing socket connection and attempting reconnect
[junit4:junit4]   2> 89025 T3321 oazs.NIOServerCnxn.closeSock Closed socket connection for client /127.0.0.1:51351 which had sessionid 0x13a9a4848100005
[junit4:junit4]   2> 89026 T3323 oazs.NIOServerCnxn$Factory.run NIOServerCnxn factory exited run method
[junit4:junit4]   2> 89026 T3378 oaz.ClientCnxn$SendThread.run Unable to read additional data from server sessionid 0x13a9a4848100005, likely server has closed socket, closing socket connection and attempting reconnect
[junit4:junit4]   2> 89027 T3321 oazs.FinalRequestProcessor.shutdown shutdown of request processor complete
[junit4:junit4]   2> 89027 T3321 oasc.ChaosMonkey.monkeyLog monkey: stop shard! 51328
[junit4:junit4]   2> 89027 T3321 oasc.CoreContainer.shutdown Shutting down CoreContainer instance=2093393937
[junit4:junit4]   2> 89028 T3321 oasc.SolrCore.close [collection1]  CLOSING SolrCore org.apache.solr.core.SolrCore@2fc2061d
[junit4:junit4]   2> 89033 T3321 oasu.DirectUpdateHandler2.close closing DirectUpdateHandler2{commits=0,autocommits=0,soft autocommits=0,optimizes=0,rollbacks=0,expungeDeletes=0,docsPending=0,adds=0,deletesById=0,deletesByQuery=0,errors=0,cumulative_adds=0,cumulative_deletesById=0,cumulative_deletesByQuery=0,cumulative_errors=0}
[junit4:junit4]   2> 89035 T3321 oasc.SolrCore.decrefSolrCoreState Closing SolrCoreState
[junit4:junit4]   2> 89035 T3321 oasu.DefaultSolrCoreState.closeIndexWriter SolrCoreState ref count has reached 0 - closing IndexWriter
[junit4:junit4]   2> 89035 T3321 oasu.DefaultSolrCoreState.closeIndexWriter closing IndexWriter with IndexWriterCloser
[junit4:junit4]   2> 89036 T3321 oasc.SolrCore.closeSearcher [collection1] Closing main searcher on request.
[junit4:junit4]   2> 89036 T3342 oasc.Overseer$ClusterStateUpdater.amILeader According to ZK I (id=88552777924476930-127.0.0.1:51328_solr-n_0000000000) am no longer a leader.
[junit4:junit4]   2> 89131 T3367 oascc.ConnectionManager.process Watcher org.apache.solr.common.cloud.ConnectionManager@32a28ca4 name:ZooKeeperConnection Watcher:127.0.0.1:51321/solr got event WatchedEvent state:Disconnected type:None path:null path:null type:None
[junit4:junit4]   2> 89131 T3367 oascc.ConnectionManager.process zkClient has disconnected
[junit4:junit4]   2> 89132 T3393 oascc.ConnectionManager.process Watcher org.apache.solr.common.cloud.ConnectionManager@64e397f7 name:ZooKeeperConnection Watcher:127.0.0.1:51321/solr got event WatchedEvent state:Disconnected type:None path:null path:null type:None
[junit4:junit4]   2> 89132 T3393 oascc.ConnectionManager.process zkClient has disconnected
[junit4:junit4]   2> 89133 T3341 oascc.ConnectionManager.process Watcher org.apache.solr.common.cloud.ConnectionManager@13e94bbc name:ZooKeeperConnection Watcher:127.0.0.1:51321/solr got event WatchedEvent state:Disconnected type:None path:null path:null type:None
[junit4:junit4]   2> 89133 T3341 oascc.ConnectionManager.process zkClient has disconnected
[junit4:junit4]   2> 89133 T3321 oaz.ZooKeeper.close Session: 0x13a9a4848100002 closed
[junit4:junit4]   2> 89133 T3355 oascc.ConnectionManager.process Watcher org.apache.solr.common.cloud.ConnectionManager@3a856180 name:ZooKeeperConnection Watcher:127.0.0.1:51321/solr got event WatchedEvent state:Disconnected type:None path:null path:null type:None
[junit4:junit4]   2> 89133 T3355 oascc.ConnectionManager.process zkClient has disconnected
[junit4:junit4]   2> 89133 T3341 oaz.ClientCnxn$EventThread.run EventThread shut down
[junit4:junit4]   2> 89134 T3379 oascc.ConnectionManager.process Watcher org.apache.solr.common.cloud.ConnectionManager@1e9c357d name:ZooKeeperConnection Watcher:127.0.0.1:51321/solr got event WatchedEvent state:Disconnected type:None path:null path:null type:None
[junit4:junit4]   2> 89134 T3379 oascc.ConnectionManager.process zkClient has disconnected
[junit4:junit4]   2> 89148 T3321 oejsh.ContextHandler.doStop stopped o.e.j.s.ServletContextHandler{/solr,null}
[junit4:junit4]   2> 89201 T3321 oasc.ChaosMonkey.monkeyLog monkey: stop shard! 51334
[junit4:junit4]   2> 89201 T3321 oasc.CoreContainer.shutdown Shutting down CoreContainer instance=1614357116
[junit4:junit4]   2> 89201 T3321 oasc.SolrCore.close [collection1]  CLOSING SolrCore org.apache.solr.core.SolrCore@1bb301fe
[junit4:junit4]   2> 89206 T3321 oasu.DirectUpdateHandler2.close closing DirectUpdateHandler2{commits=2,autocommits=0,soft autocommits=0,optimizes=0,rollbacks=0,expungeDeletes=0,docsPending=0,adds=0,deletesById=0,deletesByQuery=0,errors=0,cumulative_adds=0,cumulative_deletesById=0,cumulative_deletesByQuery=0,cumulative_errors=0}
[junit4:junit4]   2> 89206 T3321 oasc.SolrCore.decrefSolrCoreState Closing SolrCoreState
[junit4:junit4]   2> 89206 T3321 oasu.DefaultSolrCoreState.closeIndexWriter SolrCoreState ref count has reached 0 - closing IndexWriter
[junit4:junit4]   2> 89207 T3321 oasu.DefaultSolrCoreState.closeIndexWriter closing IndexWriter with IndexWriterCloser
[junit4:junit4]   2> 89210 T3321 oasc.SolrCore.closeSearcher [collection1] Closing main searcher on request.
[junit4:junit4]   2> 90256 T3354 oaz.ClientCnxn$SendThread.startConnect Opening socket connection to server 127.0.0.1/127.0.0.1:51321
[junit4:junit4]   2> 90420 T3392 oaz.ClientCnxn$SendThread.startConnect Opening socket connection to server 127.0.0.1/127.0.0.1:51321
[junit4:junit4]   2> 90633 T3378 oaz.ClientCnxn$SendThread.startConnect Opening socket connection to server 127.0.0.1/127.0.0.1:51321
[junit4:junit4]   2> 91208 T3366 oaz.ClientCnxn$SendThread.startConnect Opening socket connection to server 127.0.0.1/127.0.0.1:51321
[junit4:junit4]   2> 91423 T3321 oaz.ZooKeeper.close Session: 0x13a9a4848100003 closed
[junit4:junit4]   2> 91423 T3355 oaz.ClientCnxn$EventThread.run EventThread shut down
[junit4:junit4]   2> 91438 T3321 oejsh.ContextHandler.doStop stopped o.e.j.s.ServletContextHandler{/solr,null}
[junit4:junit4]   2> 91490 T3321 oasc.ChaosMonkey.monkeyLog monkey: stop shard! 51340
[junit4:junit4]   2> 91490 T3321 oasc.CoreContainer.shutdown Shutting down CoreContainer instance=737238295
[junit4:junit4]   2> 91491 T3392 oaz.ClientCnxn$SendThread.run WARNING Session 0x13a9a4848100006 for server null, unexpected error, closing socket connection and attempting reconnect java.net.ConnectException: Connection refused: no further information
[junit4:junit4]   2> 	at sun.nio.ch.SocketChannelImpl.checkConnect(Native Method)
[junit4:junit4]   2> 	at sun.nio.ch.SocketChannelImpl.finishConnect(SocketChannelImpl.java:692)
[junit4:junit4]   2> 	at org.apache.zookeeper.ClientCnxn$SendThread.run(ClientCnxn.java:1143)
[junit4:junit4]   2> 
[junit4:junit4]   2> 91694 T3378 oaz.ClientCnxn$SendThread.run WARNING Session 0x13a9a4848100005 for server null, unexpected error, closing socket connection and attempting reconnect java.net.ConnectException: Connection refused: no further information
[junit4:junit4]   2> 	at sun.nio.ch.SocketChannelImpl.checkConnect(Native Method)
[junit4:junit4]   2> 	at sun.nio.ch.SocketChannelImpl.finishConnect(SocketChannelImpl.java:692)
[junit4:junit4]   2> 	at org.apache.zookeeper.ClientCnxn$SendThread.run(ClientCnxn.java:1143)
[junit4:junit4]   2> 
[junit4:junit4]   2> 92385 T3321 oaz.ZooKeeper.close Session: 0x13a9a4848100004 closed
[junit4:junit4]   2> 92385 T3367 oaz.ClientCnxn$EventThread.run EventThread shut down
[junit4:junit4]   2> 92401 T3321 oejsh.ContextHandler.doStop stopped o.e.j.s.ServletContextHandler{/solr,null}
[junit4:junit4]   2> 92454 T3321 oasc.ChaosMonkey.monkeyLog monkey: stop shard! 51346
[junit4:junit4]   2> 92454 T3321 oasc.CoreContainer.shutdown Shutting down CoreContainer instance=1432003846
[junit4:junit4]   2> 92454 T3321 oasc.SolrCore.close [collection1]  CLOSING SolrCore org.apache.solr.core.SolrCore@4118f567
[junit4:junit4]   2> 92462 T3321 oasu.DirectUpdateHandler2.close closing DirectUpdateHandler2{commits=1,autocommits=0,soft autocommits=0,optimizes=0,rollbacks=0,expungeDeletes=0,docsPending=0,adds=0,deletesById=0,deletesByQuery=0,errors=0,cumulative_adds=0,cumulative_deletesById=0,cumulative_deletesByQuery=0,cumulative_errors=0}
[junit4:junit4]   2> 92464 T3321 oasc.SolrCore.decrefSolrCoreState Closing SolrCoreState
[junit4:junit4]   2> 92465 T3321 oasu.DefaultSolrCoreState.closeIndexWriter SolrCoreState ref count has reached 0 - closing IndexWriter
[junit4:junit4]   2> 92465 T3321 oasu.DefaultSolrCoreState.closeIndexWriter closing IndexWriter with IndexWriterCloser
[junit4:junit4]   2> 92471 T3321 oasc.SolrCore.closeSearcher [collection1] Closing main searcher on request.
[junit4:junit4]   2> 92926 T3378 oaz.ClientCnxn$SendThread.startConnect Opening socket connection to server 127.0.0.1/127.0.0.1:51321
[junit4:junit4]   2> 93321 T3392 oaz.ClientCnxn$SendThread.startConnect Opening socket connection to server 127.0.0.1/127.0.0.1:51321
[junit4:junit4]   2> 94103 T3321 oaz.ZooKeeper.close Session: 0x13a9a4848100005 closed
[junit4:junit4]   2> 94103 T3379 oaz.ClientCnxn$EventThread.run EventThread shut down
[junit4:junit4]   2> 94116 T3321 oejsh.ContextHandler.doStop stopped o.e.j.s.ServletContextHandler{/solr,null}
[junit4:junit4]   2> 94170 T3321 oasc.ChaosMonkey.monkeyLog monkey: stop shard! 51354
[junit4:junit4]   2> 94170 T3321 oasc.CoreContainer.shutdown Shutting down CoreContainer instance=992886765
[junit4:junit4]   2> 94171 T3321 oasc.SolrCore.close [collection1]  CLOSING SolrCore org.apache.solr.core.SolrCore@328b521d
[junit4:junit4]   2> 94185 T3321 oasu.DirectUpdateHandler2.close closing DirectUpdateHandler2{commits=1,autocommits=0,soft autocommits=0,optimizes=0,rollbacks=0,expungeDeletes=0,docsPending=0,adds=0,deletesById=0,deletesByQuery=0,errors=0,cumulative_adds=0,cumulative_deletesById=0,cumulative_deletesByQuery=0,cumulative_errors=0}
[junit4:junit4]   2> 94186 T3321 oasc.SolrCore.decrefSolrCoreState Closing SolrCoreState
[junit4:junit4]   2> 94186 T3321 oasu.DefaultSolrCoreState.closeIndexWriter SolrCoreState ref count has reached 0 - closing IndexWriter
[junit4:junit4]   2> 94186 T3321 oasu.DefaultSolrCoreState.closeIndexWriter closing IndexWriter with IndexWriterCloser
[junit4:junit4]   2> 94190 T3321 oasc.SolrCore.closeSearcher [collection1] Closing main searcher on request.
[junit4:junit4]   2> 94498 T3393 oaz.ClientCnxn$EventThread.run EventThread shut down
[junit4:junit4]   2> 94498 T3321 oaz.ZooKeeper.close Session: 0x13a9a4848100006 closed
[junit4:junit4]   2> 94511 T3321 oejsh.ContextHandler.doStop stopped o.e.j.s.ServletContextHandler{/solr,null}
[junit4:junit4]   2> 94832 T3321 oas.SolrTestCaseJ4.tearDown ###Ending testDistribSearch
[junit4:junit4]   2> NOTE: reproduce with: ant test  -Dtestcase=SyncSliceTest -Dtests.method=testDistribSearch -Dtests.seed=79C34F1BF2698ED -Dtests.slow=true -Dtests.locale=es_GT -Dtests.timezone=Etc/GMT-3 -Dtests.file.encoding=Cp1252
[junit4:junit4] FAILURE 94.9s | SyncSliceTest.testDistribSearch <<<
[junit4:junit4]    > Throwable #1: java.lang.AssertionError: There are still nodes recoverying
[junit4:junit4]    > 	at __randomizedtesting.SeedInfo.seed([79C34F1BF2698ED:867ABAE9C879F8D1]:0)
[junit4:junit4]    > 	at org.junit.Assert.fail(Assert.java:93)
[junit4:junit4]    > 	at org.apache.solr.cloud.AbstractDistribZkTestBase.waitForRecoveriesToFinish(AbstractDistribZkTestBase.java:154)
[junit4:junit4]    > 	at org.apache.solr.cloud.AbstractFullDistribZkTestBase.waitForRecoveriesToFinish(AbstractFullDistribZkTestBase.java:563)
[junit4:junit4]    > 	at org.apache.solr.cloud.AbstractFullDistribZkTestBase.waitForThingsToLevelOut(AbstractFullDistribZkTestBase.java:1138)
[junit4:junit4]    > 	at org.apache.solr.cloud.SyncSliceTest.doTest(SyncSliceTest.java:89)
[junit4:junit4]    > 	at org.apache.solr.BaseDistributedSearchTestCase.testDistribSearch(BaseDistributedSearchTestCase.java:695)
[junit4:junit4]    > 	at sun.reflect.NativeMethodAccessorImpl.invoke0(Native Method)
[junit4:junit4]    > 	at sun.reflect.NativeMethodAccessorImpl.invoke(NativeMethodAccessorImpl.java:57)
[junit4:junit4]    > 	at sun.reflect.DelegatingMethodAccessorImpl.invoke(DelegatingMethodAccessorImpl.java:43)
[junit4:junit4]    > 	at java.lang.reflect.Method.invoke(Method.java:601)
[junit4:junit4]    > 	at com.carrotsearch.randomizedtesting.RandomizedRunner.invoke(RandomizedRunner.java:1559)
[junit4:junit4]    > 	at com.carrotsearch.randomizedtesting.RandomizedRunner.access$600(RandomizedRunner.java:79)
[junit4:junit4]    > 	at com.carrotsearch.randomizedtesting.RandomizedRunner$6.evaluate(RandomizedRunner.java:737)
[junit4:junit4]    > 	at com.carrotsearch.randomizedtesting.RandomizedRunner$7.evaluate(RandomizedRunner.java:773)
[junit4:junit4]    > 	at com.carrotsearch.randomizedtesting.RandomizedRunner$8.evaluate(RandomizedRunner.java:787)
[junit4:junit4]    > 	at com.carrotsearch.randomizedtesting.rules.SystemPropertiesRestoreRule$1.evaluate(SystemPropertiesRestoreRule.java:53)
[junit4:junit4]    > 	at org.apache.lucene.util.TestRuleSetupTeardownChained$1.evaluate(TestRuleSetupTeardownChained.java:50)
[junit4:junit4]    > 	at org.apache.lucene.util.TestRuleFieldCacheSanity$1.evaluate(TestRuleFieldCacheSanity.java:51)
[junit4:junit4]    > 	at org.apache.lucene.util.AbstractBeforeAfterRule$1.evaluate(AbstractBeforeAfterRule.java:45)
[junit4:junit4]    > 	at com.carrotsearch.randomizedtesting.rules.SystemPropertiesInvariantRule$1.evaluate(SystemPropertiesInvariantRule.java:55)
[junit4:junit4]    > 	at org.apache.lucene.util.TestRuleThreadAndTestName$1.evaluate(TestRuleThreadAndTestName.java:48)
[junit4:junit4]    > 	at org.apache.lucene.util.TestRuleIgnoreAfterMaxFailures$1.evaluate(TestRuleIgnoreAfterMaxFailures.java:70)
[junit4:junit4]    > 	at org.apache.lucene.util.TestRuleMarkFailure$1.evaluate(TestRuleMarkFailure.java:48)
[junit4:junit4]    > 	at com.carrotsearch.randomizedtesting.rules.StatementAdapter.evaluate(StatementAdapter.java:36)
[junit4:junit4]    > 	at com.carrotsearch.randomizedtesting.ThreadLeakControl$StatementRunner.run(ThreadLeakControl.java:358)
[junit4:junit4]    > 	at com.carrotsearch.randomizedtesting.ThreadLeakControl.forkTimeoutingTask(ThreadLeakControl.java:782)
[junit4:junit4]    > 	at com.carrotsearch.randomizedtesting.ThreadLeakControl$3.evaluate(ThreadLeakControl.java:442)
[junit4:junit4]    > 	at com.carrotsearch.randomizedtesting.RandomizedRunner.runSingleTest(RandomizedRunner.java:746)
[junit4:junit4]    > 	at com.carrotsearch.randomizedtesting.RandomizedRunner$3.evaluate(RandomizedRunner.java:648)
[junit4:junit4]    > 	at com.carrotsearch.randomizedtesting.RandomizedRunner$4.evaluate(RandomizedRunner.java:682)
[junit4:junit4]    > 	at com.carrotsearch.randomizedtesting.RandomizedRunner$5.evaluate(RandomizedRunner.java:693)
[junit4:junit4]    > 	at com.carrotsearch.randomizedtesting.rules.StatementAdapter.evaluate(StatementAdapter.java:36)
[junit4:junit4]    > 	at com.carrotsearch.randomizedtesting.rules.SystemPropertiesRestoreRule$1.evaluate(SystemPropertiesRestoreRule.java:53)
[junit4:junit4]    > 	at org.apache.lucene.util.AbstractBeforeAfterRule$1.evaluate(AbstractBeforeAfterRule.java:45)
[junit4:junit4]    > 	at org.apache.lucene.util.TestRuleStoreClassName$1.evaluate(TestRuleStoreClassName.java:42)
[junit4:junit4]    > 	at com.carrotsearch.randomizedtesting.rules.SystemPropertiesInvariantRule$1.evaluate(SystemPropertiesInvariantRule.java:55)
[junit4:junit4]    > 	at com.carrotsearch.randomizedtesting.rules.NoShadowingOrOverridesOnMethodsRule$1.evaluate(NoShadowingOrOverridesOnMethodsRule.java:39)
[junit4:junit4]    > 	at com.carrotsearch.randomizedtesting.rules.NoShadowingOrOverridesOnMethodsRule$1.evaluate(NoShadowingOrOverridesOnMethodsRule.java:39)
[junit4:junit4]    > 	at com.carrotsearch.randomizedtesting.rules.StatementAdapter.evaluate(StatementAdapter.java:36)
[junit4:junit4]    > 	at org.apache.lucene.util.TestRuleAssertionsRequired$1.evaluate(TestRuleAssertionsRequired.java:43)
[junit4:junit4]    > 	at org.apache.lucene.util.TestRuleMarkFailure$1.evaluate(TestRuleMarkFailure.java:48)
[junit4:junit4]    > 	at org.apache.lucene.util.TestRuleIgnoreAfterMaxFailures$1.evaluate(TestRuleIgnoreAfterMaxFailures.java:70)
[junit4:junit4]    > 	at org.apache.lucene.util.TestRuleIgnoreTestSuites$1.evaluate(TestRuleIgnoreTestSuites.java:55)
[junit4:junit4]    > 	at com.carrotsearch.randomizedtesting.rules.StatementAdapter.evaluate(StatementAdapter.java:36)
[junit4:junit4]    > 	at com.carrotsearch.randomizedtesting.ThreadLeakControl$StatementRunner.run(ThreadLeakControl.java:358)
[junit4:junit4]    > 	at java.lang.Thread.run(Thread.java:722)
[junit4:junit4]   2> 94860 T3321 oas.SolrTestCaseJ4.deleteCore ###deleteCore
[junit4:junit4]   2> 214453 T3321 oas.SolrTestCaseJ4.endTrackingSearchers SEVERE ERROR: SolrIndexSearcher opens=8 closes=7
[junit4:junit4]   2> 214457 T3320 ccr.ThreadLeakControl.checkThreadLeaks WARNING Will linger awaiting termination of 1 leaked thread(s).
[junit4:junit4]   2> 234493 T3320 ccr.ThreadLeakControl.checkThreadLeaks SEVERE 1 thread leaked from SUITE scope at org.apache.solr.cloud.SyncSliceTest: 
[junit4:junit4]   2> 	   1) Thread[id=3368, name=searcherExecutor-2066-thread-1, state=WAITING, group=TGRP-SyncSliceTest]
[junit4:junit4]   2> 	        at sun.misc.Unsafe.park(Native Method)
[junit4:junit4]   2> 	        at java.util.concurrent.locks.LockSupport.park(LockSupport.java:186)
[junit4:junit4]   2> 	        at java.util.concurrent.locks.AbstractQueuedSynchronizer$ConditionObject.await(AbstractQueuedSynchronizer.java:2043)
[junit4:junit4]   2> 	        at java.util.concurrent.LinkedBlockingQueue.take(LinkedBlockingQueue.java:442)
[junit4:junit4]   2> 	        at java.util.concurrent.ThreadPoolExecutor.getTask(ThreadPoolExecutor.java:1043)
[junit4:junit4]   2> 	        at java.util.concurrent.ThreadPoolExecutor.runWorker(ThreadPoolExecutor.java:1103)
[junit4:junit4]   2> 	        at java.util.concurrent.ThreadPoolExecutor$Worker.run(ThreadPoolExecutor.java:603)
[junit4:junit4]   2> 	        at java.lang.Thread.run(Thread.java:722)
[junit4:junit4]   2> 234494 T3320 ccr.ThreadLeakControl.tryToInterruptAll Starting to interrupt leaked threads:
[junit4:junit4]   2> 	   1) Thread[id=3368, name=searcherExecutor-2066-thread-1, state=WAITING, group=TGRP-SyncSliceTest]
[junit4:junit4]   2> 237499 T3320 ccr.ThreadLeakControl.tryToInterruptAll SEVERE There are still zombie threads that couldn't be terminated:
[junit4:junit4]   2> 	   1) Thread[id=3368, name=searcherExecutor-2066-thread-1, state=WAITING, group=TGRP-SyncSliceTest]
[junit4:junit4]   2> 	        at sun.misc.Unsafe.park(Native Method)
[junit4:junit4]   2> 	        at java.util.concurrent.locks.LockSupport.park(LockSupport.java:186)
[junit4:junit4]   2> 	        at java.util.concurrent.locks.AbstractQueuedSynchronizer$ConditionObject.await(AbstractQueuedSynchronizer.java:2043)
[junit4:junit4]   2> 	        at java.util.concurrent.LinkedBlockingQueue.take(LinkedBlockingQueue.java:442)
[junit4:junit4]   2> 	        at java.util.concurrent.ThreadPoolExecutor.getTask(ThreadPoolExecutor.java:1043)
[junit4:junit4]   2> 	        at java.util.concurrent.ThreadPoolExecutor.runWorker(ThreadPoolExecutor.java:1103)
[junit4:junit4]   2> 	        at java.util.concurrent.ThreadPoolExecutor$Worker.run(ThreadPoolExecutor.java:603)
[junit4:junit4]   2> 	        at java.lang.Thread.run(Thread.java:722)
[junit4:junit4]   2> NOTE: test params are: codec=Compressing(storedFieldsFormat=CompressingStoredFieldsFormat(compressionMode=FAST_UNCOMPRESSION, chunkSize=192, storedFieldsIndex=MEMORY_CHUNK)), sim=DefaultSimilarity, locale=es_GT, timezone=Etc/GMT-3
[junit4:junit4]   2> NOTE: Windows 7 6.1 amd64/Oracle Corporation 1.7.0_07 (64-bit)/cpus=2,threads=2,free=125511456,total=206495744
[junit4:junit4]   2> NOTE: All tests run in this JVM: [TestLMJelinekMercerSimilarityFactory, DistributedQueryElevationComponentTest, TestLRUCache, DisMaxRequestHandlerTest, DirectUpdateHandlerOptimizeTest, CopyFieldTest, TestPseudoReturnFields, TestPhraseSuggestions, JSONWriterTest, TestStressReorder, ZkNodePropsTest, TestValueSourceCache, TestJmxIntegration, PrimitiveFieldTypeTest, CurrencyFieldTest, RequestHandlersTest, ConvertedLegacyTest, LegacyHTMLStripCharFilterTest, PluginInfoTest, SearchHandlerTest, AnalysisAfterCoreReloadTest, IndexSchemaRuntimeFieldTest, TestSolrJ, TestDFRSimilarityFactory, TestXIncludeConfig, MBeansHandlerTest, IndexBasedSpellCheckerTest, TestCharFilters, TestIndexingPerformance, TestSolrDeletionPolicy1, HighlighterConfigTest, TestExtendedDismaxParser, JsonLoaderTest, IndexSchemaTest, SoftAutoCommitTest, DocumentAnalysisRequestHandlerTest, BinaryUpdateRequestHandlerTest, TestIndexSearcher, TestAnalyzedSuggestions, TestFastWriter, AlternateDirectoryTest, DirectSolrConnectionTest, TestPluginEnable, FileUtilsTest, StatsComponentTest, LeaderElectionIntegrationTest, TestJmxMonitoredMap, LoggingHandlerTest, SpellCheckCollatorTest, TestReload, TestSystemIdResolver, TestSolrIndexConfig, EchoParamsTest, ShowFileRequestHandlerTest, SOLR749Test, TestQuerySenderListener, SuggesterWFSTTest, SuggesterTSTTest, ZkControllerTest, BadIndexSchemaTest, TestFoldingMultitermQuery, TestDocSet, TestPropInjectDefaults, DistributedSpellCheckComponentTest, PolyFieldTest, ResponseLogComponentTest, TestOmitPositions, SuggesterTest, ClusterStateUpdateTest, TestPHPSerializedResponseWriter, TestHashPartitioner, XmlUpdateRequestHandlerTest, URLClassifyProcessorTest, OutputWriterTest, CacheHeaderTest, TestBM25SimilarityFactory, AutoCommitTest, DateFieldTest, DebugComponentTest, TestMultiCoreConfBootstrap, TestSolrDeletionPolicy2, SpatialFilterTest, SpellingQueryConverterTest, WordBreakSolrSpellCheckerTest, TestSuggestSpellingConverter, FieldAnalysisRequestHandlerTest, TestReversedWildcardFilterFactory, TestBinaryField, SpellCheckComponentTest, FieldMutatingUpdateProcessorTest, TestSearchPerf, TestIBSimilarityFactory, TestMergePolicyConfig, StatelessScriptUpdateProcessorFactoryTest, TestQuerySenderNoQuery, BasicDistributedZk2Test, NumericFieldsTest, TestWordDelimiterFilterFactory, TestUtils, TestDefaultSimilarityFactory, SimplePostToolTest, TestCoreContainer, MoreLikeThisHandlerTest, PrimUtilsTest, UniqFieldsUpdateProcessorFactoryTest, SolrPluginUtilsTest, CSVRequestHandlerTest, SignatureUpdateProcessorFactoryTest, BasicDistributedZkTest, OverseerTest, RecoveryZkTest, FullSolrCloudDistribCmdsTest, TestReplicationHandler, LeaderElectionTest, TestRealTimeGet, TestDistributedGrouping, TestRandomFaceting, TestDistributedSearch, BasicZkTest, ZkSolrClientTest, TestFaceting, DistributedTermsComponentTest, TestRecovery, TestJoin, SolrCoreTest, TestRangeQuery, DirectUpdateHandlerTest, SimpleFacetsTest, LukeRequestHandlerTest, TestSort, TestGroupingSearch, DirectSolrSpellCheckerTest, TestFiltering, FileBasedSpellCheckerTest, PeerSyncTest, QueryElevationComponentTest, SortByFunctionTest, BasicFunctionalityTest, TestBinaryResponseWriter, SampleTest, HighlighterTest, CoreAdminHandlerTest, TestFunctionQuery, TestTrie, SolrRequestParserTest, TestRemoteStreaming, QueryEqualityTest, TestCSVLoader, TestCSVResponseWriter, DocumentBuilderTest, QueryParsingTest, TermsComponentTest, DistanceFunctionTest, SolrInfoMBeanTest, XsltUpdateRequestHandlerTest, MinimalSchemaTest, StandardRequestHandlerTest, TestQueryTypes, PingRequestHandlerTest, TermVectorComponentTest, TestSurroundQueryParser, TestSolrQueryParser, FastVectorHighlighterTest, ReturnFieldsTest, RequiredFieldsTest, SuggesterFSTTest, TestArbitraryIndexDir, TestQueryUtils, SolrCmdDistributorTest, UpdateParamsTest, NotRequiredUniqueKeyTest, SolrCoreCheckLockOnStartupTest, TestLuceneMatchVersion, UpdateRequestProcessorFactoryTest, TestPropInject, TestWriterPerf, NoCacheHeaderTest, BadComponentTest, TestUpdate, DefaultValueUpdateProcessorTest, TestLFUCache, TestCollationField, SolrIndexConfigTest, IndexReaderFactoryTest, TestNumberUtils, MultiTermTest, TestSolrCoreProperties, TestConfig, SpellPossibilityIteratorTest, TestLMDirichletSimilarityFactory, TestPerFieldSimilarity, TestCodecSupport, TimeZoneUtilsTest, TestFastLRUCache, DateMathParserTest, OpenExchangeRatesOrgProviderTest, ResourceLoaderTest, TestSolrXMLSerializer, TestBadConfig, DOMUtilTest, UUIDFieldTest, RAMDirectoryFactoryTest, SystemInfoHandlerTest, PreAnalyzedFieldTest, CircularListTest, TestDocumentBuilder, PathHierarchyTokenizerFactoryTest, ClusterStateTest, SyncSliceTest]
[junit4:junit4]   2> NOTE: reproduce with: ant test  -Dtestcase=SyncSliceTest -Dtests.seed=79C34F1BF2698ED -Dtests.slow=true -Dtests.locale=es_GT -Dtests.timezone=Etc/GMT-3 -Dtests.file.encoding=Cp1252
[junit4:junit4] ERROR   0.00s | SyncSliceTest (suite) <<<
[junit4:junit4]    > Throwable #1: java.lang.AssertionError: ERROR: SolrIndexSearcher opens=8 closes=7
[junit4:junit4]    > 	at __randomizedtesting.SeedInfo.seed([79C34F1BF2698ED]:0)
[junit4:junit4]    > 	at org.junit.Assert.fail(Assert.java:93)
[junit4:junit4]    > 	at org.apache.solr.SolrTestCaseJ4.endTrackingSearchers(SolrTestCaseJ4.java:242)
[junit4:junit4]    > 	at org.apache.solr.SolrTestCaseJ4.afterClass(SolrTestCaseJ4.java:97)
[junit4:junit4]    > 	at sun.reflect.GeneratedMethodAccessor19.invoke(Unknown Source)
[junit4:junit4]    > 	at sun.reflect.DelegatingMethodAccessorImpl.invoke(DelegatingMethodAccessorImpl.java:43)
[junit4:junit4]    > 	at java.lang.reflect.Method.invoke(Method.java:601)
[junit4:junit4]    > 	at com.carrotsearch.randomizedtesting.RandomizedRunner.invoke(RandomizedRunner.java:1559)
[junit4:junit4]    > 	at com.carrotsearch.randomizedtesting.RandomizedRunner.access$600(RandomizedRunner.java:79)
[junit4:junit4]    > 	at com.carrotsearch.randomizedtesting.RandomizedRunner$5.evaluate(RandomizedRunner.java:700)
[junit4:junit4]    > 	at com.carrotsearch.randomizedtesting.rules.StatementAdapter.evaluate(StatementAdapter.java:36)
[junit4:junit4]    > 	at com.carrotsearch.randomizedtesting.rules.SystemPropertiesRestoreRule$1.evaluate(SystemPropertiesRestoreRule.java:53)
[junit4:junit4]    > 	at org.apache.lucene.util.AbstractBeforeAfterRule$1.evaluate(AbstractBeforeAfterRule.java:45)
[junit4:junit4]    > 	at org.apache.lucene.util.TestRuleStoreClassName$1.evaluate(TestRuleStoreClassName.java:42)
[junit4:junit4]    > 	at com.carrotsearch.randomizedtesting.rules.SystemPropertiesInvariantRule$1.evaluate(SystemPropertiesInvariantRule.java:55)
[junit4:junit4]    > 	at com.carrotsearch.randomizedtesting.rules.NoShadowingOrOverridesOnMethodsRule$1.evaluate(NoShadowingOrOverridesOnMethodsRule.java:39)
[junit4:junit4]    > 	at com.carrotsearch.randomizedtesting.rules.NoShadowingOrOverridesOnMethodsRule$1.evaluate(NoShadowingOrOverridesOnMethodsRule.java:39)
[junit4:junit4]    > 	at com.carrotsearch.randomizedtesting.rules.StatementAdapter.evaluate(StatementAdapter.java:36)
[junit4:junit4]    > 	at org.apache.lucene.util.TestRuleAssertionsRequired$1.evaluate(TestRuleAssertionsRequired.java:43)
[junit4:junit4]    > 	at org.apache.lucene.util.TestRuleMarkFailure$1.evaluate(TestRuleMarkFailure.java:48)
[junit4:junit4]    > 	at org.apache.lucene.util.TestRuleIgnoreAfterMaxFailures$1.evaluate(TestRuleIgnoreAfterMaxFailures.java:70)
[junit4:junit4]    > 	at org.apache.lucene.util.TestRuleIgnoreTestSuites$1.evaluate(TestRuleIgnoreTestSuites.java:55)
[junit4:junit4]    > 	at com.carrotsearch.randomizedtesting.rules.StatementAdapter.evaluate(StatementAdapter.java:36)
[junit4:junit4]    > 	at com.carrotsearch.randomizedtesting.ThreadLeakControl$StatementRunner.run(ThreadLeakControl.java:358)
[junit4:junit4]    > 	at java.lang.Thread.run(Thread.java:722)
[junit4:junit4]    > Throwable #2: com.carrotsearch.randomizedtesting.ThreadLeakError: 1 thread leaked from SUITE scope at org.apache.solr.cloud.SyncSliceTest: 
[junit4:junit4]    >    1) Thread[id=3368, name=searcherExecutor-2066-thread-1, state=WAITING, group=TGRP-SyncSliceTest]
[junit4:junit4]    >         at sun.misc.Unsafe.park(Native Method)
[junit4:junit4]    >         at java.util.concurrent.locks.LockSupport.park(LockSupport.java:186)
[junit4:junit4]    >         at java.util.concurrent.locks.AbstractQueuedSynchronizer$ConditionObject.await(AbstractQueuedSynchronizer.java:2043)
[junit4:junit4]    >         at java.util.concurrent.LinkedBlockingQueue.take(LinkedBlockingQueue.java:442)
[junit4:junit4]    >         at java.util.concurrent.ThreadPoolExecutor.getTask(ThreadPoolExecutor.java:1043)
[junit4:junit4]    >         at java.util.concurrent.ThreadPoolExecutor.runWorker(ThreadPoolExecutor.java:1103)
[junit4:junit4]    >         at java.util.concurrent.ThreadPoolExecutor$Worker.run(ThreadPoolExecutor.java:603)
[junit4:junit4]    >         at java.lang.Thread.run(Thread.java:722)
[junit4:junit4]    > 	at __randomizedtesting.SeedInfo.seed([79C34F1BF2698ED]:0)
[junit4:junit4]    > Throwable #3: com.carrotsearch.randomizedtesting.ThreadLeakError: There are still zombie threads that couldn't be terminated:
[junit4:junit4]    >    1) Thread[id=3368, name=searcherExecutor-2066-thread-1, state=WAITING, group=TGRP-SyncSliceTest]
[junit4:junit4]    >         at sun.misc.Unsafe.park(Native Method)
[junit4:junit4]    >         at java.util.concurrent.locks.LockSupport.park(LockSupport.java:186)
[junit4:junit4]    >         at java.util.concurrent.locks.AbstractQueuedSynchronizer$ConditionObject.await(AbstractQueuedSynchronizer.java:2043)
[junit4:junit4]    >         at java.util.concurrent.LinkedBlockingQueue.take(LinkedBlockingQueue.java:442)
[junit4:junit4]    >         at java.util.concurrent.ThreadPoolExecutor.getTask(ThreadPoolExecutor.java:1043)
[junit4:junit4]    >         at java.util.concurrent.ThreadPoolExecutor.runWorker(ThreadPoolExecutor.java:1103)
[junit4:junit4]    >         at java.util.concurrent.ThreadPoolExecutor$Worker.run(ThreadPoolExecutor.java:603)
[junit4:junit4]    >         at java.lang.Thread.run(Thread.java:722)
[junit4:junit4]    > 	at __randomizedtesting.SeedInfo.seed([79C34F1BF2698ED]:0)
[junit4:junit4] Completed in 237.56s, 1 test, 2 failures, 2 errors <<< FAILURES!

[...truncated 43 lines...]
BUILD FAILED
C:\Users\JenkinsSlave\workspace\Lucene-Solr-trunk-Windows\build.xml:335: The following error occurred while executing this line:
C:\Users\JenkinsSlave\workspace\Lucene-Solr-trunk-Windows\build.xml:39: The following error occurred while executing this line:
C:\Users\JenkinsSlave\workspace\Lucene-Solr-trunk-Windows\solr\build.xml:178: The following error occurred while executing this line:
C:\Users\JenkinsSlave\workspace\Lucene-Solr-trunk-Windows\lucene\module-build.xml:61: The following error occurred while executing this line:
C:\Users\JenkinsSlave\workspace\Lucene-Solr-trunk-Windows\lucene\common-build.xml:1171: The following error occurred while executing this line:
C:\Users\JenkinsSlave\workspace\Lucene-Solr-trunk-Windows\lucene\common-build.xml:839: There were test failures: 232 suites, 961 tests, 3 suite-level errors, 1 failure, 50 ignored (4 assumptions)

Total time: 40 minutes 8 seconds
Build step 'Invoke Ant' marked build as failure
Archiving artifacts
Recording test results
Description set: Java: 64bit/jdk1.7.0_07 -XX:+UseSerialGC
Email was triggered for: Failure
Sending email for trigger: Failure



Mime
View raw message