lucene-dev mailing list archives

Site index · List index
Message view « Date » · « Thread »
Top « Date » · « Thread »
From Michael McCandless <luc...@mikemccandless.com>
Subject Re: [JENKINS] Lucene-Solr-NightlyTests-4.x - Build # 68 - Failure
Date Thu, 18 Oct 2012 21:59:08 GMT
SimpleText + SerialMergeScheduler + tons of docs ... a slow combination ...

I'll fix.

Mike McCandless

http://blog.mikemccandless.com

On Thu, Oct 18, 2012 at 4:45 PM, Apache Jenkins Server
<jenkins@builds.apache.org> wrote:
> Build: https://builds.apache.org/job/Lucene-Solr-NightlyTests-4.x/68/
>
> 2 tests failed.
> REGRESSION:  org.apache.lucene.index.TestBagOfPostings.test
>
> Error Message:
> Test abandoned because suite timeout was reached.
>
> Stack Trace:
> java.lang.Exception: Test abandoned because suite timeout was reached.
>         at __randomizedtesting.SeedInfo.seed([4AC526EDF7FD2F71]:0)
>
>
> FAILED:  junit.framework.TestSuite.org.apache.lucene.index.TestBagOfPostings
>
> Error Message:
> Suite timeout exceeded (>= 7200000 msec).
>
> Stack Trace:
> java.lang.Exception: Suite timeout exceeded (>= 7200000 msec).
>         at __randomizedtesting.SeedInfo.seed([4AC526EDF7FD2F71]:0)
>
>
>
>
> Build Log:
> [...truncated 1475 lines...]
> [junit4:junit4] Suite: org.apache.lucene.index.TestBagOfPostings
> [junit4:junit4]   2> 18.10.2012 23:44:53 com.carrotsearch.randomizedtesting.ThreadLeakControl$2
evaluate
> [junit4:junit4]   2> WARNING: Suite execution timed out: org.apache.lucene.index.TestBagOfPostings
> [junit4:junit4]   2> ==== jstack at approximately timeout time ====
> [junit4:junit4]   2> "Thread-552" ID=733 BLOCKED on org.apache.lucene.index.SerialMergeScheduler@56866088
owned by "Thread-548" ID=729
> [junit4:junit4]   2>    at org.apache.lucene.index.SerialMergeScheduler.merge(SerialMergeScheduler.java:37)
> [junit4:junit4]   2>    - blocked on org.apache.lucene.index.SerialMergeScheduler@56866088
> [junit4:junit4]   2>    at org.apache.lucene.index.IndexWriter.maybeMerge(IndexWriter.java:1814)
> [junit4:junit4]   2>    at org.apache.lucene.index.IndexWriter.maybeMerge(IndexWriter.java:1808)
> [junit4:junit4]   2>    at org.apache.lucene.index.IndexWriter.updateDocuments(IndexWriter.java:1232)
> [junit4:junit4]   2>    at org.apache.lucene.index.IndexWriter.addDocuments(IndexWriter.java:1182)
> [junit4:junit4]   2>    at org.apache.lucene.index.RandomIndexWriter.addDocument(RandomIndexWriter.java:172)
> [junit4:junit4]   2>    at org.apache.lucene.index.RandomIndexWriter.addDocument(RandomIndexWriter.java:160)
> [junit4:junit4]   2>    at org.apache.lucene.index.TestBagOfPostings$1.run(TestBagOfPostings.java:99)
> [junit4:junit4]   2>
> [junit4:junit4]   2> "Thread-551" ID=732 BLOCKED on org.apache.lucene.index.SerialMergeScheduler@56866088
owned by "Thread-548" ID=729
> [junit4:junit4]   2>    at org.apache.lucene.index.SerialMergeScheduler.merge(SerialMergeScheduler.java:37)
> [junit4:junit4]   2>    - blocked on org.apache.lucene.index.SerialMergeScheduler@56866088
> [junit4:junit4]   2>    at org.apache.lucene.index.IndexWriter.maybeMerge(IndexWriter.java:1814)
> [junit4:junit4]   2>    at org.apache.lucene.index.IndexWriter.maybeMerge(IndexWriter.java:1808)
> [junit4:junit4]   2>    at org.apache.lucene.index.IndexWriter.updateDocument(IndexWriter.java:1454)
> [junit4:junit4]   2>    at org.apache.lucene.index.IndexWriter.addDocument(IndexWriter.java:1122)
> [junit4:junit4]   2>    at org.apache.lucene.index.RandomIndexWriter.addDocument(RandomIndexWriter.java:201)
> [junit4:junit4]   2>    at org.apache.lucene.index.RandomIndexWriter.addDocument(RandomIndexWriter.java:160)
> [junit4:junit4]   2>    at org.apache.lucene.index.TestBagOfPostings$1.run(TestBagOfPostings.java:99)
> [junit4:junit4]   2>
> [junit4:junit4]   2> "Thread-550" ID=731 BLOCKED on org.apache.lucene.index.SerialMergeScheduler@56866088
owned by "Thread-548" ID=729
> [junit4:junit4]   2>    at org.apache.lucene.index.SerialMergeScheduler.merge(SerialMergeScheduler.java:37)
> [junit4:junit4]   2>    - blocked on org.apache.lucene.index.SerialMergeScheduler@56866088
> [junit4:junit4]   2>    at org.apache.lucene.index.IndexWriter.maybeMerge(IndexWriter.java:1814)
> [junit4:junit4]   2>    at org.apache.lucene.index.IndexWriter.maybeMerge(IndexWriter.java:1808)
> [junit4:junit4]   2>    at org.apache.lucene.index.IndexWriter.updateDocument(IndexWriter.java:1454)
> [junit4:junit4]   2>    at org.apache.lucene.index.IndexWriter.addDocument(IndexWriter.java:1122)
> [junit4:junit4]   2>    at org.apache.lucene.index.RandomIndexWriter.addDocument(RandomIndexWriter.java:201)
> [junit4:junit4]   2>    at org.apache.lucene.index.RandomIndexWriter.addDocument(RandomIndexWriter.java:160)
> [junit4:junit4]   2>    at org.apache.lucene.index.TestBagOfPostings$1.run(TestBagOfPostings.java:99)
> [junit4:junit4]   2>
> [junit4:junit4]   2> "Thread-549" ID=730 BLOCKED on org.apache.lucene.index.SerialMergeScheduler@56866088
owned by "Thread-548" ID=729
> [junit4:junit4]   2>    at org.apache.lucene.index.SerialMergeScheduler.merge(SerialMergeScheduler.java:37)
> [junit4:junit4]   2>    - blocked on org.apache.lucene.index.SerialMergeScheduler@56866088
> [junit4:junit4]   2>    at org.apache.lucene.index.IndexWriter.maybeMerge(IndexWriter.java:1814)
> [junit4:junit4]   2>    at org.apache.lucene.index.IndexWriter.maybeMerge(IndexWriter.java:1808)
> [junit4:junit4]   2>    at org.apache.lucene.index.IndexWriter.updateDocuments(IndexWriter.java:1232)
> [junit4:junit4]   2>    at org.apache.lucene.index.IndexWriter.addDocuments(IndexWriter.java:1182)
> [junit4:junit4]   2>    at org.apache.lucene.index.RandomIndexWriter.addDocument(RandomIndexWriter.java:172)
> [junit4:junit4]   2>    at org.apache.lucene.index.RandomIndexWriter.addDocument(RandomIndexWriter.java:160)
> [junit4:junit4]   2>    at org.apache.lucene.index.TestBagOfPostings$1.run(TestBagOfPostings.java:99)
> [junit4:junit4]   2>
> [junit4:junit4]   2> "Thread-548" ID=729 RUNNABLE
> [junit4:junit4]   2>    at org.apache.lucene.codecs.simpletext.SimpleTextFieldsReader$SimpleTextDocsAndPositionsEnum.freq(SimpleTextFieldsReader.java:360)
> [junit4:junit4]   2>    at org.apache.lucene.codecs.MappingMultiDocsAndPositionsEnum.freq(MappingMultiDocsAndPositionsEnum.java:76)
> [junit4:junit4]   2>    at org.apache.lucene.codecs.PostingsConsumer.merge(PostingsConsumer.java:115)
> [junit4:junit4]   2>    at org.apache.lucene.codecs.TermsConsumer.merge(TermsConsumer.java:164)
> [junit4:junit4]   2>    at org.apache.lucene.codecs.FieldsConsumer.merge(FieldsConsumer.java:71)
> [junit4:junit4]   2>    at org.apache.lucene.index.SegmentMerger.mergeTerms(SegmentMerger.java:314)
> [junit4:junit4]   2>    at org.apache.lucene.index.SegmentMerger.merge(SegmentMerger.java:107)
> [junit4:junit4]   2>    at org.apache.lucene.index.IndexWriter.mergeMiddle(IndexWriter.java:3661)
> [junit4:junit4]   2>    at org.apache.lucene.index.IndexWriter.merge(IndexWriter.java:3267)
> [junit4:junit4]   2>    at org.apache.lucene.index.SerialMergeScheduler.merge(SerialMergeScheduler.java:40)
> [junit4:junit4]   2>    - locked org.apache.lucene.index.SerialMergeScheduler@56866088
> [junit4:junit4]   2>    at org.apache.lucene.index.IndexWriter.maybeMerge(IndexWriter.java:1814)
> [junit4:junit4]   2>    at org.apache.lucene.index.IndexWriter.maybeMerge(IndexWriter.java:1808)
> [junit4:junit4]   2>    at org.apache.lucene.index.IndexWriter.updateDocument(IndexWriter.java:1454)
> [junit4:junit4]   2>    at org.apache.lucene.index.IndexWriter.addDocument(IndexWriter.java:1122)
> [junit4:junit4]   2>    at org.apache.lucene.index.RandomIndexWriter.addDocument(RandomIndexWriter.java:201)
> [junit4:junit4]   2>    at org.apache.lucene.index.RandomIndexWriter.addDocument(RandomIndexWriter.java:160)
> [junit4:junit4]   2>    at org.apache.lucene.index.TestBagOfPostings$1.run(TestBagOfPostings.java:99)
> [junit4:junit4]   2>
> [junit4:junit4]   2> "TEST-TestBagOfPostings.test-seed#[4AC526EDF7FD2F71]" ID=728
WAITING on org.apache.lucene.index.TestBagOfPostings$1@3accedbc
> [junit4:junit4]   2>    at java.lang.Object.wait(Native Method)
> [junit4:junit4]   2>    - waiting on org.apache.lucene.index.TestBagOfPostings$1@3accedbc
> [junit4:junit4]   2>    at java.lang.Thread.join(Thread.java:1203)
> [junit4:junit4]   2>    at java.lang.Thread.join(Thread.java:1256)
> [junit4:junit4]   2>    at org.apache.lucene.index.TestBagOfPostings.test(TestBagOfPostings.java:110)
> [junit4:junit4]   2>    at sun.reflect.NativeMethodAccessorImpl.invoke0(Native Method)
> [junit4:junit4]   2>    at sun.reflect.NativeMethodAccessorImpl.invoke(NativeMethodAccessorImpl.java:57)
> [junit4:junit4]   2>    at sun.reflect.DelegatingMethodAccessorImpl.invoke(DelegatingMethodAccessorImpl.java:43)
> [junit4:junit4]   2>    at java.lang.reflect.Method.invoke(Method.java:616)
> [junit4:junit4]   2>    at com.carrotsearch.randomizedtesting.RandomizedRunner.invoke(RandomizedRunner.java:1559)
> [junit4:junit4]   2>    at com.carrotsearch.randomizedtesting.RandomizedRunner.access$600(RandomizedRunner.java:79)
> [junit4:junit4]   2>    at com.carrotsearch.randomizedtesting.RandomizedRunner$6.evaluate(RandomizedRunner.java:737)
> [junit4:junit4]   2>    at com.carrotsearch.randomizedtesting.RandomizedRunner$7.evaluate(RandomizedRunner.java:773)
> [junit4:junit4]   2>    at com.carrotsearch.randomizedtesting.RandomizedRunner$8.evaluate(RandomizedRunner.java:787)
> [junit4:junit4]   2>    at org.apache.lucene.util.TestRuleSetupTeardownChained$1.evaluate(TestRuleSetupTeardownChained.java:50)
> [junit4:junit4]   2>    at org.apache.lucene.util.TestRuleFieldCacheSanity$1.evaluate(TestRuleFieldCacheSanity.java:51)
> [junit4:junit4]   2>    at org.apache.lucene.util.AbstractBeforeAfterRule$1.evaluate(AbstractBeforeAfterRule.java:45)
> [junit4:junit4]   2>    at com.carrotsearch.randomizedtesting.rules.SystemPropertiesInvariantRule$1.evaluate(SystemPropertiesInvariantRule.java:55)
> [junit4:junit4]   2>    at org.apache.lucene.util.TestRuleThreadAndTestName$1.evaluate(TestRuleThreadAndTestName.java:48)
> [junit4:junit4]   2>    at org.apache.lucene.util.TestRuleIgnoreAfterMaxFailures$1.evaluate(TestRuleIgnoreAfterMaxFailures.java:70)
> [junit4:junit4]   2>    at org.apache.lucene.util.TestRuleMarkFailure$1.evaluate(TestRuleMarkFailure.java:48)
> [junit4:junit4]   2>    at com.carrotsearch.randomizedtesting.rules.StatementAdapter.evaluate(StatementAdapter.java:36)
> [junit4:junit4]   2>    at com.carrotsearch.randomizedtesting.ThreadLeakControl$StatementRunner.run(ThreadLeakControl.java:358)
> [junit4:junit4]   2>    at com.carrotsearch.randomizedtesting.ThreadLeakControl.forkTimeoutingTask(ThreadLeakControl.java:782)
> [junit4:junit4]   2>    at com.carrotsearch.randomizedtesting.ThreadLeakControl$3.evaluate(ThreadLeakControl.java:442)
> [junit4:junit4]   2>    at com.carrotsearch.randomizedtesting.RandomizedRunner.runSingleTest(RandomizedRunner.java:746)
> [junit4:junit4]   2>    at com.carrotsearch.randomizedtesting.RandomizedRunner$3.evaluate(RandomizedRunner.java:648)
> [junit4:junit4]   2>    at com.carrotsearch.randomizedtesting.RandomizedRunner$4.evaluate(RandomizedRunner.java:682)
> [junit4:junit4]   2>    at com.carrotsearch.randomizedtesting.RandomizedRunner$5.evaluate(RandomizedRunner.java:693)
> [junit4:junit4]   2>    at org.apache.lucene.util.AbstractBeforeAfterRule$1.evaluate(AbstractBeforeAfterRule.java:45)
> [junit4:junit4]   2>    at org.apache.lucene.util.TestRuleStoreClassName$1.evaluate(TestRuleStoreClassName.java:42)
> [junit4:junit4]   2>    at com.carrotsearch.randomizedtesting.rules.SystemPropertiesInvariantRule$1.evaluate(SystemPropertiesInvariantRule.java:55)
> [junit4:junit4]   2>    at com.carrotsearch.randomizedtesting.rules.NoShadowingOrOverridesOnMethodsRule$1.evaluate(NoShadowingOrOverridesOnMethodsRule.java:39)
> [junit4:junit4]   2>    at com.carrotsearch.randomizedtesting.rules.NoShadowingOrOverridesOnMethodsRule$1.evaluate(NoShadowingOrOverridesOnMethodsRule.java:39)
> [junit4:junit4]   2>    at com.carrotsearch.randomizedtesting.rules.StatementAdapter.evaluate(StatementAdapter.java:36)
> [junit4:junit4]   2>    at org.apache.lucene.util.TestRuleAssertionsRequired$1.evaluate(TestRuleAssertionsRequired.java:43)
> [junit4:junit4]   2>    at org.apache.lucene.util.TestRuleMarkFailure$1.evaluate(TestRuleMarkFailure.java:48)
> [junit4:junit4]   2>    at org.apache.lucene.util.TestRuleIgnoreAfterMaxFailures$1.evaluate(TestRuleIgnoreAfterMaxFailures.java:70)
> [junit4:junit4]   2>    at org.apache.lucene.util.TestRuleIgnoreTestSuites$1.evaluate(TestRuleIgnoreTestSuites.java:55)
> [junit4:junit4]   2>    at com.carrotsearch.randomizedtesting.rules.StatementAdapter.evaluate(StatementAdapter.java:36)
> [junit4:junit4]   2>    at com.carrotsearch.randomizedtesting.ThreadLeakControl$StatementRunner.run(ThreadLeakControl.java:358)
> [junit4:junit4]   2>    at java.lang.Thread.run(Thread.java:679)
> [junit4:junit4]   2>
> [junit4:junit4]   2> "SUITE-TestBagOfPostings-seed#[4AC526EDF7FD2F71]" ID=727 RUNNABLE
> [junit4:junit4]   2>    at sun.management.ThreadImpl.dumpThreads0(Native Method)
> [junit4:junit4]   2>    at sun.management.ThreadImpl.dumpAllThreads(ThreadImpl.java:392)
> [junit4:junit4]   2>    at com.carrotsearch.randomizedtesting.ThreadLeakControl.formatThreadStacksFull(ThreadLeakControl.java:655)
> [junit4:junit4]   2>    at com.carrotsearch.randomizedtesting.ThreadLeakControl.access$800(ThreadLeakControl.java:60)
> [junit4:junit4]   2>    at com.carrotsearch.randomizedtesting.ThreadLeakControl$2.evaluate(ThreadLeakControl.java:396)
> [junit4:junit4]   2>    - locked java.lang.Object@102bad19
> [junit4:junit4]   2>    at com.carrotsearch.randomizedtesting.RandomizedRunner.runSuite(RandomizedRunner.java:556)
> [junit4:junit4]   2>    at com.carrotsearch.randomizedtesting.RandomizedRunner.access$200(RandomizedRunner.java:79)
> [junit4:junit4]   2>    at com.carrotsearch.randomizedtesting.RandomizedRunner$1.run(RandomizedRunner.java:492)
> [junit4:junit4]   2>
> [junit4:junit4]   2> "Signal Dispatcher" ID=4 RUNNABLE
> [junit4:junit4]   2>
> [junit4:junit4]   2> "Finalizer" ID=3 WAITING on java.lang.ref.ReferenceQueue$Lock@23714c9a
> [junit4:junit4]   2>    at java.lang.Object.wait(Native Method)
> [junit4:junit4]   2>    - waiting on java.lang.ref.ReferenceQueue$Lock@23714c9a
> [junit4:junit4]   2>    at java.lang.ref.ReferenceQueue.remove(ReferenceQueue.java:133)
> [junit4:junit4]   2>    at java.lang.ref.ReferenceQueue.remove(ReferenceQueue.java:149)
> [junit4:junit4]   2>    at java.lang.ref.Finalizer$FinalizerThread.run(Finalizer.java:177)
> [junit4:junit4]   2>
> [junit4:junit4]   2> "Reference Handler" ID=2 WAITING on java.lang.ref.Reference$Lock@635c24a3
> [junit4:junit4]   2>    at java.lang.Object.wait(Native Method)
> [junit4:junit4]   2>    - waiting on java.lang.ref.Reference$Lock@635c24a3
> [junit4:junit4]   2>    at java.lang.Object.wait(Object.java:502)
> [junit4:junit4]   2>    at java.lang.ref.Reference$ReferenceHandler.run(Reference.java:133)
> [junit4:junit4]   2>
> [junit4:junit4]   2> "main" ID=1 WAITING on com.carrotsearch.randomizedtesting.RandomizedRunner$1@43bffa5e
> [junit4:junit4]   2>    at java.lang.Object.wait(Native Method)
> [junit4:junit4]   2>    - waiting on com.carrotsearch.randomizedtesting.RandomizedRunner$1@43bffa5e
> [junit4:junit4]   2>    at java.lang.Thread.join(Thread.java:1203)
> [junit4:junit4]   2>    at java.lang.Thread.join(Thread.java:1256)
> [junit4:junit4]   2>    at com.carrotsearch.randomizedtesting.RandomizedRunner.runSuite(RandomizedRunner.java:502)
> [junit4:junit4]   2>    at com.carrotsearch.randomizedtesting.RandomizedRunner.run(RandomizedRunner.java:399)
> [junit4:junit4]   2>    at com.carrotsearch.ant.tasks.junit4.slave.SlaveMain.execute(SlaveMain.java:161)
> [junit4:junit4]   2>    at com.carrotsearch.ant.tasks.junit4.slave.SlaveMain.main(SlaveMain.java:255)
> [junit4:junit4]   2>    at com.carrotsearch.ant.tasks.junit4.slave.SlaveMainSafe.main(SlaveMainSafe.java:12)
> [junit4:junit4]   2>
> [junit4:junit4]   2> ^^==============================================
> [junit4:junit4]   2>
> [junit4:junit4]   2> NOTE: download the large Jenkins line-docs file by running 'ant
get-jenkins-line-docs' in the lucene directory.
> [junit4:junit4]   2> NOTE: reproduce with: ant test  -Dtestcase=TestBagOfPostings
-Dtests.method=test -Dtests.seed=4AC526EDF7FD2F71 -Dtests.multiplier=3 -Dtests.nightly=true
-Dtests.slow=true -Dtests.linedocsfile=/home/hudson/lucene-data/enwiki.random.lines.txt -Dtests.locale=sk
-Dtests.timezone=Africa/Addis_Ababa -Dtests.file.encoding=UTF-8
> [junit4:junit4] ERROR   7200s J1 | TestBagOfPostings.test <<<
> [junit4:junit4]    > Throwable #1: java.lang.Exception: Test abandoned because suite
timeout was reached.
> [junit4:junit4]    >    at __randomizedtesting.SeedInfo.seed([4AC526EDF7FD2F71]:0)
> [junit4:junit4]   2> 18.10.2012 23:44:53 com.carrotsearch.randomizedtesting.ThreadLeakControl
checkThreadLeaks
> [junit4:junit4]   2> WARNING: Will linger awaiting termination of 6 leaked thread(s).
> [junit4:junit4]   2> 18.10.2012 23:45:13 com.carrotsearch.randomizedtesting.ThreadLeakControl
checkThreadLeaks
> [junit4:junit4]   2> SEVERE: 6 threads leaked from SUITE scope at org.apache.lucene.index.TestBagOfPostings:
> [junit4:junit4]   2>    1) Thread[id=729, name=Thread-548, state=BLOCKED, group=TGRP-TestBagOfPostings]
> [junit4:junit4]   2>         at org.apache.lucene.index.SerialMergeScheduler.merge(SerialMergeScheduler.java:37)
> [junit4:junit4]   2>         at org.apache.lucene.index.IndexWriter.maybeMerge(IndexWriter.java:1814)
> [junit4:junit4]   2>         at org.apache.lucene.index.IndexWriter.maybeMerge(IndexWriter.java:1808)
> [junit4:junit4]   2>         at org.apache.lucene.index.IndexWriter.updateDocument(IndexWriter.java:1454)
> [junit4:junit4]   2>         at org.apache.lucene.index.IndexWriter.addDocument(IndexWriter.java:1122)
> [junit4:junit4]   2>         at org.apache.lucene.index.RandomIndexWriter.addDocument(RandomIndexWriter.java:201)
> [junit4:junit4]   2>         at org.apache.lucene.index.RandomIndexWriter.addDocument(RandomIndexWriter.java:160)
> [junit4:junit4]   2>         at org.apache.lucene.index.TestBagOfPostings$1.run(TestBagOfPostings.java:99)
> [junit4:junit4]   2>    2) Thread[id=730, name=Thread-549, state=BLOCKED, group=TGRP-TestBagOfPostings]
> [junit4:junit4]   2>         at org.apache.lucene.index.SerialMergeScheduler.merge(SerialMergeScheduler.java:37)
> [junit4:junit4]   2>         at org.apache.lucene.index.IndexWriter.maybeMerge(IndexWriter.java:1814)
> [junit4:junit4]   2>         at org.apache.lucene.index.IndexWriter.maybeMerge(IndexWriter.java:1808)
> [junit4:junit4]   2>         at org.apache.lucene.index.IndexWriter.updateDocument(IndexWriter.java:1454)
> [junit4:junit4]   2>         at org.apache.lucene.index.IndexWriter.addDocument(IndexWriter.java:1122)
> [junit4:junit4]   2>         at org.apache.lucene.index.RandomIndexWriter.addDocument(RandomIndexWriter.java:201)
> [junit4:junit4]   2>         at org.apache.lucene.index.RandomIndexWriter.addDocument(RandomIndexWriter.java:160)
> [junit4:junit4]   2>         at org.apache.lucene.index.TestBagOfPostings$1.run(TestBagOfPostings.java:99)
> [junit4:junit4]   2>    3) Thread[id=728, name=TEST-TestBagOfPostings.test-seed#[4AC526EDF7FD2F71],
state=WAITING, group=TGRP-TestBagOfPostings]
> [junit4:junit4]   2>         at java.lang.Object.wait(Native Method)
> [junit4:junit4]   2>         at java.lang.Thread.join(Thread.java:1203)
> [junit4:junit4]   2>         at java.lang.Thread.join(Thread.java:1256)
> [junit4:junit4]   2>         at org.apache.lucene.index.TestBagOfPostings.test(TestBagOfPostings.java:110)
> [junit4:junit4]   2>         at sun.reflect.NativeMethodAccessorImpl.invoke0(Native
Method)
> [junit4:junit4]   2>         at sun.reflect.NativeMethodAccessorImpl.invoke(NativeMethodAccessorImpl.java:57)
> [junit4:junit4]   2>         at sun.reflect.DelegatingMethodAccessorImpl.invoke(DelegatingMethodAccessorImpl.java:43)
> [junit4:junit4]   2>         at java.lang.reflect.Method.invoke(Method.java:616)
> [junit4:junit4]   2>         at com.carrotsearch.randomizedtesting.RandomizedRunner.invoke(RandomizedRunner.java:1559)
> [junit4:junit4]   2>         at com.carrotsearch.randomizedtesting.RandomizedRunner.access$600(RandomizedRunner.java:79)
> [junit4:junit4]   2>         at com.carrotsearch.randomizedtesting.RandomizedRunner$6.evaluate(RandomizedRunner.java:737)
> [junit4:junit4]   2>         at com.carrotsearch.randomizedtesting.RandomizedRunner$7.evaluate(RandomizedRunner.java:773)
> [junit4:junit4]   2>         at com.carrotsearch.randomizedtesting.RandomizedRunner$8.evaluate(RandomizedRunner.java:787)
> [junit4:junit4]   2>         at org.apache.lucene.util.TestRuleSetupTeardownChained$1.evaluate(TestRuleSetupTeardownChained.java:50)
> [junit4:junit4]   2>         at org.apache.lucene.util.TestRuleFieldCacheSanity$1.evaluate(TestRuleFieldCacheSanity.java:51)
> [junit4:junit4]   2>         at org.apache.lucene.util.AbstractBeforeAfterRule$1.evaluate(AbstractBeforeAfterRule.java:45)
> [junit4:junit4]   2>         at com.carrotsearch.randomizedtesting.rules.SystemPropertiesInvariantRule$1.evaluate(SystemPropertiesInvariantRule.java:55)
> [junit4:junit4]   2>         at org.apache.lucene.util.TestRuleThreadAndTestName$1.evaluate(TestRuleThreadAndTestName.java:48)
> [junit4:junit4]   2>         at org.apache.lucene.util.TestRuleIgnoreAfterMaxFailures$1.evaluate(TestRuleIgnoreAfterMaxFailures.java:70)
> [junit4:junit4]   2>         at org.apache.lucene.util.TestRuleMarkFailure$1.evaluate(TestRuleMarkFailure.java:48)
> [junit4:junit4]   2>         at com.carrotsearch.randomizedtesting.rules.StatementAdapter.evaluate(StatementAdapter.java:36)
> [junit4:junit4]   2>         at com.carrotsearch.randomizedtesting.ThreadLeakControl$StatementRunner.run(ThreadLeakControl.java:358)
> [junit4:junit4]   2>         at com.carrotsearch.randomizedtesting.ThreadLeakControl.forkTimeoutingTask(ThreadLeakControl.java:782)
> [junit4:junit4]   2>         at com.carrotsearch.randomizedtesting.ThreadLeakControl$3.evaluate(ThreadLeakControl.java:442)
> [junit4:junit4]   2>         at com.carrotsearch.randomizedtesting.RandomizedRunner.runSingleTest(RandomizedRunner.java:746)
> [junit4:junit4]   2>         at com.carrotsearch.randomizedtesting.RandomizedRunner$3.evaluate(RandomizedRunner.java:648)
> [junit4:junit4]   2>         at com.carrotsearch.randomizedtesting.RandomizedRunner$4.evaluate(RandomizedRunner.java:682)
> [junit4:junit4]   2>         at com.carrotsearch.randomizedtesting.RandomizedRunner$5.evaluate(RandomizedRunner.java:693)
> [junit4:junit4]   2>         at org.apache.lucene.util.AbstractBeforeAfterRule$1.evaluate(AbstractBeforeAfterRule.java:45)
> [junit4:junit4]   2>         at org.apache.lucene.util.TestRuleStoreClassName$1.evaluate(TestRuleStoreClassName.java:42)
> [junit4:junit4]   2>         at com.carrotsearch.randomizedtesting.rules.SystemPropertiesInvariantRule$1.evaluate(SystemPropertiesInvariantRule.java:55)
> [junit4:junit4]   2>         at com.carrotsearch.randomizedtesting.rules.NoShadowingOrOverridesOnMethodsRule$1.evaluate(NoShadowingOrOverridesOnMethodsRule.java:39)
> [junit4:junit4]   2>         at com.carrotsearch.randomizedtesting.rules.NoShadowingOrOverridesOnMethodsRule$1.evaluate(NoShadowingOrOverridesOnMethodsRule.java:39)
> [junit4:junit4]   2>         at com.carrotsearch.randomizedtesting.rules.StatementAdapter.evaluate(StatementAdapter.java:36)
> [junit4:junit4]   2>         at org.apache.lucene.util.TestRuleAssertionsRequired$1.evaluate(TestRuleAssertionsRequired.java:43)
> [junit4:junit4]   2>         at org.apache.lucene.util.TestRuleMarkFailure$1.evaluate(TestRuleMarkFailure.java:48)
> [junit4:junit4]   2>         at org.apache.lucene.util.TestRuleIgnoreAfterMaxFailures$1.evaluate(TestRuleIgnoreAfterMaxFailures.java:70)
> [junit4:junit4]   2>         at org.apache.lucene.util.TestRuleIgnoreTestSuites$1.evaluate(TestRuleIgnoreTestSuites.java:55)
> [junit4:junit4]   2>         at com.carrotsearch.randomizedtesting.rules.StatementAdapter.evaluate(StatementAdapter.java:36)
> [junit4:junit4]   2>         at com.carrotsearch.randomizedtesting.ThreadLeakControl$StatementRunner.run(ThreadLeakControl.java:358)
> [junit4:junit4]   2>         at java.lang.Thread.run(Thread.java:679)
> [junit4:junit4]   2>    4) Thread[id=731, name=Thread-550, state=RUNNABLE, group=TGRP-TestBagOfPostings]
> [junit4:junit4]   2>         at org.apache.lucene.store.MockIndexInputWrapper.readByte(MockIndexInputWrapper.java:112)
> [junit4:junit4]   2>         at org.apache.lucene.codecs.simpletext.SimpleTextUtil.readLine(SimpleTextUtil.java:53)
> [junit4:junit4]   2>         at org.apache.lucene.codecs.simpletext.SimpleTextFieldsReader$SimpleTextTerms.loadTerms(SimpleTextFieldsReader.java:512)
> [junit4:junit4]   2>         at org.apache.lucene.codecs.simpletext.SimpleTextFieldsReader$SimpleTextTerms.<init>(SimpleTextFieldsReader.java:493)
> [junit4:junit4]   2>         at org.apache.lucene.codecs.simpletext.SimpleTextFieldsReader.terms(SimpleTextFieldsReader.java:624)
> [junit4:junit4]   2>         at org.apache.lucene.index.MultiFields.terms(MultiFields.java:222)
> [junit4:junit4]   2>         at org.apache.lucene.codecs.FieldsConsumer.merge(FieldsConsumer.java:68)
> [junit4:junit4]   2>         at org.apache.lucene.index.SegmentMerger.mergeTerms(SegmentMerger.java:314)
> [junit4:junit4]   2>         at org.apache.lucene.index.SegmentMerger.merge(SegmentMerger.java:107)
> [junit4:junit4]   2>         at org.apache.lucene.index.IndexWriter.mergeMiddle(IndexWriter.java:3661)
> [junit4:junit4]   2>         at org.apache.lucene.index.IndexWriter.merge(IndexWriter.java:3267)
> [junit4:junit4]   2>         at org.apache.lucene.index.SerialMergeScheduler.merge(SerialMergeScheduler.java:40)
> [junit4:junit4]   2>         at org.apache.lucene.index.IndexWriter.maybeMerge(IndexWriter.java:1814)
> [junit4:junit4]   2>         at org.apache.lucene.index.IndexWriter.maybeMerge(IndexWriter.java:1808)
> [junit4:junit4]   2>         at org.apache.lucene.index.IndexWriter.updateDocument(IndexWriter.java:1454)
> [junit4:junit4]   2>         at org.apache.lucene.index.IndexWriter.addDocument(IndexWriter.java:1122)
> [junit4:junit4]   2>         at org.apache.lucene.index.RandomIndexWriter.addDocument(RandomIndexWriter.java:201)
> [junit4:junit4]   2>         at org.apache.lucene.index.RandomIndexWriter.addDocument(RandomIndexWriter.java:160)
> [junit4:junit4]   2>         at org.apache.lucene.index.TestBagOfPostings$1.run(TestBagOfPostings.java:99)
> [junit4:junit4]   2>    5) Thread[id=732, name=Thread-551, state=BLOCKED, group=TGRP-TestBagOfPostings]
> [junit4:junit4]   2>         at org.apache.lucene.index.SerialMergeScheduler.merge(SerialMergeScheduler.java:37)
> [junit4:junit4]   2>         at org.apache.lucene.index.IndexWriter.maybeMerge(IndexWriter.java:1814)
> [junit4:junit4]   2>         at org.apache.lucene.index.IndexWriter.maybeMerge(IndexWriter.java:1808)
> [junit4:junit4]   2>         at org.apache.lucene.index.IndexWriter.updateDocument(IndexWriter.java:1454)
> [junit4:junit4]   2>         at org.apache.lucene.index.IndexWriter.addDocument(IndexWriter.java:1122)
> [junit4:junit4]   2>         at org.apache.lucene.index.RandomIndexWriter.addDocument(RandomIndexWriter.java:201)
> [junit4:junit4]   2>         at org.apache.lucene.index.RandomIndexWriter.addDocument(RandomIndexWriter.java:160)
> [junit4:junit4]   2>         at org.apache.lucene.index.TestBagOfPostings$1.run(TestBagOfPostings.java:99)
> [junit4:junit4]   2>    6) Thread[id=733, name=Thread-552, state=BLOCKED, group=TGRP-TestBagOfPostings]
> [junit4:junit4]   2>         at org.apache.lucene.index.SerialMergeScheduler.merge(SerialMergeScheduler.java:37)
> [junit4:junit4]   2>         at org.apache.lucene.index.IndexWriter.maybeMerge(IndexWriter.java:1814)
> [junit4:junit4]   2>         at org.apache.lucene.index.IndexWriter.maybeMerge(IndexWriter.java:1808)
> [junit4:junit4]   2>         at org.apache.lucene.index.IndexWriter.updateDocuments(IndexWriter.java:1232)
> [junit4:junit4]   2>         at org.apache.lucene.index.IndexWriter.addDocuments(IndexWriter.java:1182)
> [junit4:junit4]   2>         at org.apache.lucene.index.RandomIndexWriter.addDocument(RandomIndexWriter.java:172)
> [junit4:junit4]   2>         at org.apache.lucene.index.RandomIndexWriter.addDocument(RandomIndexWriter.java:160)
> [junit4:junit4]   2>         at org.apache.lucene.index.TestBagOfPostings$1.run(TestBagOfPostings.java:99)
> [junit4:junit4]   2> 18.10.2012 23:45:13 com.carrotsearch.randomizedtesting.ThreadLeakControl
tryToInterruptAll
> [junit4:junit4]   2> INFO: Starting to interrupt leaked threads:
> [junit4:junit4]   2>    1) Thread[id=729, name=Thread-548, state=BLOCKED, group=TGRP-TestBagOfPostings]
> [junit4:junit4]   2>    2) Thread[id=730, name=Thread-549, state=BLOCKED, group=TGRP-TestBagOfPostings]
> [junit4:junit4]   2>    3) Thread[id=728, name=TEST-TestBagOfPostings.test-seed#[4AC526EDF7FD2F71],
state=WAITING, group=TGRP-TestBagOfPostings]
> [junit4:junit4]   2>    4) Thread[id=731, name=Thread-550, state=RUNNABLE, group=TGRP-TestBagOfPostings]
> [junit4:junit4]   2>    5) Thread[id=732, name=Thread-551, state=BLOCKED, group=TGRP-TestBagOfPostings]
> [junit4:junit4]   2>    6) Thread[id=733, name=Thread-552, state=BLOCKED, group=TGRP-TestBagOfPostings]
> [junit4:junit4]   2> 18.10.2012 23:45:16 com.carrotsearch.randomizedtesting.ThreadLeakControl
tryToInterruptAll
> [junit4:junit4]   2> SEVERE: There are still zombie threads that couldn't be terminated:
> [junit4:junit4]   2>    1) Thread[id=729, name=Thread-548, state=BLOCKED, group=TGRP-TestBagOfPostings]
> [junit4:junit4]   2>         at org.apache.lucene.index.SerialMergeScheduler.merge(SerialMergeScheduler.java:37)
> [junit4:junit4]   2>         at org.apache.lucene.index.IndexWriter.maybeMerge(IndexWriter.java:1814)
> [junit4:junit4]   2>         at org.apache.lucene.index.IndexWriter.maybeMerge(IndexWriter.java:1808)
> [junit4:junit4]   2>         at org.apache.lucene.index.IndexWriter.updateDocument(IndexWriter.java:1454)
> [junit4:junit4]   2>         at org.apache.lucene.index.IndexWriter.addDocument(IndexWriter.java:1122)
> [junit4:junit4]   2>         at org.apache.lucene.index.RandomIndexWriter.addDocument(RandomIndexWriter.java:201)
> [junit4:junit4]   2>         at org.apache.lucene.index.RandomIndexWriter.addDocument(RandomIndexWriter.java:160)
> [junit4:junit4]   2>         at org.apache.lucene.index.TestBagOfPostings$1.run(TestBagOfPostings.java:99)
> [junit4:junit4]   2>    2) Thread[id=730, name=Thread-549, state=BLOCKED, group=TGRP-TestBagOfPostings]
> [junit4:junit4]   2>         at org.apache.lucene.index.SerialMergeScheduler.merge(SerialMergeScheduler.java:37)
> [junit4:junit4]   2>         at org.apache.lucene.index.IndexWriter.maybeMerge(IndexWriter.java:1814)
> [junit4:junit4]   2>         at org.apache.lucene.index.IndexWriter.maybeMerge(IndexWriter.java:1808)
> [junit4:junit4]   2>         at org.apache.lucene.index.IndexWriter.updateDocument(IndexWriter.java:1454)
> [junit4:junit4]   2>         at org.apache.lucene.index.IndexWriter.addDocument(IndexWriter.java:1122)
> [junit4:junit4]   2>         at org.apache.lucene.index.RandomIndexWriter.addDocument(RandomIndexWriter.java:201)
> [junit4:junit4]   2>         at org.apache.lucene.index.RandomIndexWriter.addDocument(RandomIndexWriter.java:160)
> [junit4:junit4]   2>         at org.apache.lucene.index.TestBagOfPostings$1.run(TestBagOfPostings.java:99)
> [junit4:junit4]   2>    3) Thread[id=731, name=Thread-550, state=RUNNABLE, group=TGRP-TestBagOfPostings]
> [junit4:junit4]   2>         at java.lang.Thread.yield(Native Method)
> [junit4:junit4]   2>         at org.apache.lucene.store.MockIndexOutputWrapper.writeBytes(MockIndexOutputWrapper.java:120)
> [junit4:junit4]   2>         at org.apache.lucene.store.MockIndexOutputWrapper.writeByte(MockIndexOutputWrapper.java:73)
> [junit4:junit4]   2>         at org.apache.lucene.codecs.simpletext.SimpleTextUtil.write(SimpleTextUtil.java:42)
> [junit4:junit4]   2>         at org.apache.lucene.codecs.simpletext.SimpleTextUtil.write(SimpleTextUtil.java:33)
> [junit4:junit4]   2>         at org.apache.lucene.codecs.simpletext.SimpleTextFieldsWriter.write(SimpleTextFieldsWriter.java:54)
> [junit4:junit4]   2>         at org.apache.lucene.codecs.simpletext.SimpleTextFieldsWriter.access$200(SimpleTextFieldsWriter.java:33)
> [junit4:junit4]   2>         at org.apache.lucene.codecs.simpletext.SimpleTextFieldsWriter$SimpleTextPostingsWriter.addPosition(SimpleTextFieldsWriter.java:149)
> [junit4:junit4]   2>         at org.apache.lucene.codecs.PostingsConsumer.merge(PostingsConsumer.java:121)
> [junit4:junit4]   2>         at org.apache.lucene.codecs.TermsConsumer.merge(TermsConsumer.java:164)
> [junit4:junit4]   2>         at org.apache.lucene.codecs.FieldsConsumer.merge(FieldsConsumer.java:71)
> [junit4:junit4]   2>         at org.apache.lucene.index.SegmentMerger.mergeTerms(SegmentMerger.java:314)
> [junit4:junit4]   2>         at org.apache.lucene.index.SegmentMerger.merge(SegmentMerger.java:107)
> [junit4:junit4]   2>         at org.apache.lucene.index.IndexWriter.mergeMiddle(IndexWriter.java:3661)
> [junit4:junit4]   2>         at org.apache.lucene.index.IndexWriter.merge(IndexWriter.java:3267)
> [junit4:junit4]   2>         at org.apache.lucene.index.SerialMergeScheduler.merge(SerialMergeScheduler.java:40)
> [junit4:junit4]   2>         at org.apache.lucene.index.IndexWriter.maybeMerge(IndexWriter.java:1814)
> [junit4:junit4]   2>         at org.apache.lucene.index.IndexWriter.maybeMerge(IndexWriter.java:1808)
> [junit4:junit4]   2>         at org.apache.lucene.index.IndexWriter.updateDocument(IndexWriter.java:1454)
> [junit4:junit4]   2>         at org.apache.lucene.index.IndexWriter.addDocument(IndexWriter.java:1122)
> [junit4:junit4]   2>         at org.apache.lucene.index.RandomIndexWriter.addDocument(RandomIndexWriter.java:201)
> [junit4:junit4]   2>         at org.apache.lucene.index.RandomIndexWriter.addDocument(RandomIndexWriter.java:160)
> [junit4:junit4]   2>         at org.apache.lucene.index.TestBagOfPostings$1.run(TestBagOfPostings.java:99)
> [junit4:junit4]   2>    4) Thread[id=732, name=Thread-551, state=BLOCKED, group=TGRP-TestBagOfPostings]
> [junit4:junit4]   2>         at org.apache.lucene.index.SerialMergeScheduler.merge(SerialMergeScheduler.java:37)
> [junit4:junit4]   2>         at org.apache.lucene.index.IndexWriter.maybeMerge(IndexWriter.java:1814)
> [junit4:junit4]   2>         at org.apache.lucene.index.IndexWriter.maybeMerge(IndexWriter.java:1808)
> [junit4:junit4]   2>         at org.apache.lucene.index.IndexWriter.updateDocument(IndexWriter.java:1454)
> [junit4:junit4]   2>         at org.apache.lucene.index.IndexWriter.addDocument(IndexWriter.java:1122)
> [junit4:junit4]   2>         at org.apache.lucene.index.RandomIndexWriter.addDocument(RandomIndexWriter.java:201)
> [junit4:junit4]   2>         at org.apache.lucene.index.RandomIndexWriter.addDocument(RandomIndexWriter.java:160)
> [junit4:junit4]   2>         at org.apache.lucene.index.TestBagOfPostings$1.run(TestBagOfPostings.java:99)
> [junit4:junit4]   2>    5) Thread[id=733, name=Thread-552, state=BLOCKED, group=TGRP-TestBagOfPostings]
> [junit4:junit4]   2>         at org.apache.lucene.index.SerialMergeScheduler.merge(SerialMergeScheduler.java:37)
> [junit4:junit4]   2>         at org.apache.lucene.index.IndexWriter.maybeMerge(IndexWriter.java:1814)
> [junit4:junit4]   2>         at org.apache.lucene.index.IndexWriter.maybeMerge(IndexWriter.java:1808)
> [junit4:junit4]   2>         at org.apache.lucene.index.IndexWriter.updateDocuments(IndexWriter.java:1232)
> [junit4:junit4]   2>         at org.apache.lucene.index.IndexWriter.addDocuments(IndexWriter.java:1182)
> [junit4:junit4]   2>         at org.apache.lucene.index.RandomIndexWriter.addDocument(RandomIndexWriter.java:172)
> [junit4:junit4]   2>         at org.apache.lucene.index.RandomIndexWriter.addDocument(RandomIndexWriter.java:160)
> [junit4:junit4]   2>         at org.apache.lucene.index.TestBagOfPostings$1.run(TestBagOfPostings.java:99)
> [junit4:junit4]   2> NOTE: test params are: codec=SimpleText, sim=DefaultSimilarity,
locale=sk, timezone=Africa/Addis_Ababa
> [junit4:junit4]   2> NOTE: FreeBSD 9.0-RELEASE amd64/Sun Microsystems Inc. 1.6.0_32
(64-bit)/cpus=16,threads=6,free=65106816,total=186384384
> [junit4:junit4]   2> NOTE: All tests run in this JVM: [TestReuseDocsEnum, TestFieldsReader,
TestCompiledAutomaton, TestDocValues, TestSpansAdvanced, TestFieldCacheSanityChecker, TestRandomStoredFields,
TestFileSwitchDirectory, TestFieldMaskingSpanQuery, TestSimpleExplanationsOfNonMatches, TestPayloadTermQuery,
TestLucene3xPostingsFormat, TestTerm, TestFieldCacheTermsFilter, TestCharFilter, TestPositionIncrement,
TestFilterAtomicReader, TestQueryWrapperFilter, TestBinaryDocument, TestAddIndexes, TestSetOnce,
Test2BPostingsBytes, TestSpanSearchEquivalence, TestDocTermOrds, TestCachingCollector, TestNeverDelete,
TestTermsEnum2, TestTermVectorsWriter, TestVirtualMethod, TestRegexpQuery, Test2BPositions,
TestDocsAndPositions, TestSimilarityProvider, TestLucene40PostingsReader, TestIndexWriterConfig,
TestSloppyPhraseQuery2, TestFieldInfos, TestTopDocsMerge, TestDirectory, TestRegexpRandom,
TestIdentityHashSet, TestLock, TestPerFieldPostingsFormat, TestDateTools, TestForTooMuchCloning,
TestCloseableThreadLocal, TestForUtil, TestNumericRangeQuery64, TestPrefixInBooleanQuery,
TestIntsRef, TestDuelingCodecs, TestParallelAtomicReader, TestSegmentMerger, TestCachingWrapperFilter,
TestDocumentsWriterDeleteQueue, TestImpersonation, TestMockAnalyzer, TestIndexWriterMerging,
TestOmitTf, TestByteArrayDataInput, TestTermScorer, TestPositiveScoresOnlyCollector, TestPostingsFormat,
TestNRTCachingDirectory, TestForceMergeForever, TestPrefixRandom, TestCharsRef, TestDirectoryReader,
TestConjunctions, TestNumericTokenStream, TestMixedCodecs, TestBitUtil, TestPostingsOffsets,
TestBagOfPostings]
> [junit4:junit4]   2> NOTE: download the large Jenkins line-docs file by running 'ant
get-jenkins-line-docs' in the lucene directory.
> [junit4:junit4]   2> NOTE: reproduce with: ant test  -Dtestcase=TestBagOfPostings
-Dtests.seed=4AC526EDF7FD2F71 -Dtests.multiplier=3 -Dtests.nightly=true -Dtests.slow=true
-Dtests.linedocsfile=/home/hudson/lucene-data/enwiki.random.lines.txt -Dtests.locale=sk -Dtests.timezone=Africa/Addis_Ababa
-Dtests.file.encoding=UTF-8
> [junit4:junit4] ERROR   0.00s J1 | TestBagOfPostings (suite) <<<
> [junit4:junit4]    > Throwable #1: java.lang.Exception: Suite timeout exceeded (>=
7200000 msec).
> [junit4:junit4]    >    at __randomizedtesting.SeedInfo.seed([4AC526EDF7FD2F71]:0)
> [junit4:junit4] Completed on J1 in 7223.25s, 1 test, 2 errors <<< FAILURES!
>
> [...truncated 32 lines...]
> BUILD FAILED
> /usr/home/hudson/hudson-slave/workspace/Lucene-Solr-NightlyTests-4.x/build.xml:38: The
following error occurred while executing this line:
> /usr/home/hudson/hudson-slave/workspace/Lucene-Solr-NightlyTests-4.x/lucene/build.xml:50:
The following error occurred while executing this line:
> /usr/home/hudson/hudson-slave/workspace/Lucene-Solr-NightlyTests-4.x/lucene/common-build.xml:1148:
The following error occurred while executing this line:
> /usr/home/hudson/hudson-slave/workspace/Lucene-Solr-NightlyTests-4.x/lucene/common-build.xml:817:
There were test failures: 323 suites, 1852 tests, 1 suite-level error, 1 error, 52 ignored
(4 assumptions)
>
> Total time: 129 minutes 34 seconds
> Build step 'Invoke Ant' marked build as failure
> Archiving artifacts
> Recording test results
> Email was triggered for: Failure
> Sending email for trigger: Failure
>
>
>
>
> ---------------------------------------------------------------------
> To unsubscribe, e-mail: dev-unsubscribe@lucene.apache.org
> For additional commands, e-mail: dev-help@lucene.apache.org

---------------------------------------------------------------------
To unsubscribe, e-mail: dev-unsubscribe@lucene.apache.org
For additional commands, e-mail: dev-help@lucene.apache.org


Mime
View raw message