lucene-dev mailing list archives

Site index · List index
Message view « Date » · « Thread »
Top « Date » · « Thread »
From Robert Muir <rcm...@gmail.com>
Subject Re: [JENKINS] Lucene-Solr-Tests-trunk-java7 - Build # 3346 - Still Failing
Date Sat, 27 Oct 2012 14:45:02 GMT
This hung for hours. I ran kill -3 to get stacktraces, then i tried
'kill', which didnt kill the process (i then ran kill -3 again, and
then kill -9).

appears to me that the first kill triggered a shutdown hook, but the
shutdown hook itself got hung

On Sat, Oct 27, 2012 at 10:40 AM, Apache Jenkins Server
<jenkins@builds.apache.org> wrote:
> Build: https://builds.apache.org/job/Lucene-Solr-Tests-trunk-java7/3346/
>
> 5 tests failed.
> FAILED:  junit.framework.TestSuite.org.apache.solr.cloud.BasicDistributedZk2Test
>
> Error Message:
> 16 threads leaked from SUITE scope at org.apache.solr.cloud.BasicDistributedZk2Test:     1) Thread[id=106, name=qtp547902119-106 Acceptor1 SelectChannelConnector@0.0.0.0:47836, state=BLOCKED, group=TGRP-BasicDistributedZk2Test]         at sun.nio.ch.ServerSocketChannelImpl.accept(ServerSocketChannelImpl.java:210)         at org.eclipse.jetty.server.nio.SelectChannelConnector.accept(SelectChannelConnector.java:104)         at org.eclipse.jetty.server.AbstractConnector$Acceptor.run(AbstractConnector.java:933)         at org.eclipse.jetty.util.thread.QueuedThreadPool.runJob(QueuedThreadPool.java:599)         at org.eclipse.jetty.util.thread.QueuedThreadPool$3.run(QueuedThreadPool.java:534)         at java.lang.Thread.run(Thread.java:722)    2) Thread[id=36, name=qtp3934603-36 Acceptor1 SelectChannelConnector@0.0.0.0:58077, state=BLOCKED, group=TGRP-BasicDistributedZk2Test]         at sun.nio.ch.ServerSocketChannelImpl.accept(ServerSocketChannelImpl.java:210)         at org.eclipse.jetty.server.nio.SelectChannelConnector.accept(SelectChannelConnector.java:104)         at org.eclipse.jetty.server.AbstractConnector$Acceptor.run(AbstractConnector.java:933)         at org.eclipse.jetty.util.thread.QueuedThreadPool.runJob(QueuedThreadPool.java:599)         at org.eclipse.jetty.util.thread.QueuedThreadPool$3.run(QueuedThreadPool.java:534)         at java.lang.Thread.run(Thread.java:722)    3) Thread[id=105, name=qtp547902119-105 Acceptor0 SelectChannelConnector@0.0.0.0:47836, state=BLOCKED, group=TGRP-BasicDistributedZk2Test]         at sun.nio.ch.ServerSocketChannelImpl.accept(ServerSocketChannelImpl.java:210)         at org.eclipse.jetty.server.nio.SelectChannelConnector.accept(SelectChannelConnector.java:104)         at org.eclipse.jetty.server.AbstractConnector$Acceptor.run(AbstractConnector.java:933)         at org.eclipse.jetty.util.thread.QueuedThreadPool.runJob(QueuedThreadPool.java:599)         at org.eclipse.jetty.util.thread.QueuedThreadPool$3.run(QueuedThreadPool.java:534)         at java.lang.Thread.run(Thread.java:722)    4) Thread[id=57, name=qtp2058239703-57 Acceptor2 SelectChannelConnector@0.0.0.0:58091, state=BLOCKED, group=TGRP-BasicDistributedZk2Test]         at sun.nio.ch.ServerSocketChannelImpl.accept(ServerSocketChannelImpl.java:210)         at org.eclipse.jetty.server.nio.SelectChannelConnector.accept(SelectChannelConnector.java:104)         at org.eclipse.jetty.server.AbstractConnector$Acceptor.run(AbstractConnector.java:933)         at org.eclipse.jetty.util.thread.QueuedThreadPool.runJob(QueuedThreadPool.java:599)         at org.eclipse.jetty.util.thread.QueuedThreadPool$3.run(QueuedThreadPool.java:534)         at java.lang.Thread.run(Thread.java:722)    5) Thread[id=56, name=qtp2058239703-56 Acceptor1 SelectChannelConnector@0.0.0.0:58091, state=RUNNABLE, group=TGRP-BasicDistributedZk2Test]         at sun.nio.ch.ServerSocketChannelImpl.accept0(Native Method)         at sun.nio.ch.ServerSocketChannelImpl.accept(ServerSocketChannelImpl.java:226)         at org.eclipse.jetty.server.nio.SelectChannelConnector.accept(SelectChannelConnector.java:104)         at org.eclipse.jetty.server.AbstractConnector$Acceptor.run(AbstractConnector.java:933)         at org.eclipse.jetty.util.thread.QueuedThreadPool.runJob(QueuedThreadPool.java:599)         at org.eclipse.jetty.util.thread.QueuedThreadPool$3.run(QueuedThreadPool.java:534)         at java.lang.Thread.run(Thread.java:722)    6) Thread[id=89, name=qtp381299134-89 Acceptor2 SelectChannelConnector@0.0.0.0:58107, state=BLOCKED, group=TGRP-BasicDistributedZk2Test]         at sun.nio.ch.ServerSocketChannelImpl.accept(ServerSocketChannelImpl.java:210)         at org.eclipse.jetty.server.nio.SelectChannelConnector.accept(SelectChannelConnector.java:104)         at org.eclipse.jetty.server.AbstractConnector$Acceptor.run(AbstractConnector.java:933)         at org.eclipse.jetty.util.thread.QueuedThreadPool.runJob(QueuedThreadPool.java:599)         at org.eclipse.jetty.util.thread.QueuedThreadPool$3.run(QueuedThreadPool.java:534)         at java.lang.Thread.run(Thread.java:722)    7) Thread[id=87, name=qtp381299134-87 Acceptor0 SelectChannelConnector@0.0.0.0:58107, state=BLOCKED, group=TGRP-BasicDistributedZk2Test]         at sun.nio.ch.ServerSocketChannelImpl.accept(ServerSocketChannelImpl.java:210)         at org.eclipse.jetty.server.nio.SelectChannelConnector.accept(SelectChannelConnector.java:104)         at org.eclipse.jetty.server.AbstractConnector$Acceptor.run(AbstractConnector.java:933)         at org.eclipse.jetty.util.thread.QueuedThreadPool.runJob(QueuedThreadPool.java:599)         at org.eclipse.jetty.util.thread.QueuedThreadPool$3.run(QueuedThreadPool.java:534)         at java.lang.Thread.run(Thread.java:722)    8) Thread[id=58, name=qtp2058239703-58 Acceptor3 SelectChannelConnector@0.0.0.0:58091, state=BLOCKED, group=TGRP-BasicDistributedZk2Test]         at sun.nio.ch.ServerSocketChannelImpl.accept(ServerSocketChannelImpl.java:210)         at org.eclipse.jetty.server.nio.SelectChannelConnector.accept(SelectChannelConnector.java:104)         at org.eclipse.jetty.server.AbstractConnector$Acceptor.run(AbstractConnector.java:933)         at org.eclipse.jetty.util.thread.QueuedThreadPool.runJob(QueuedThreadPool.java:599)         at org.eclipse.jetty.util.thread.QueuedThreadPool$3.run(QueuedThreadPool.java:534)         at java.lang.Thread.run(Thread.java:722)    9) Thread[id=35, name=qtp3934603-35 Acceptor0 SelectChannelConnector@0.0.0.0:58077, state=BLOCKED, group=TGRP-BasicDistributedZk2Test]         at sun.nio.ch.ServerSocketChannelImpl.accept(ServerSocketChannelImpl.java:210)         at org.eclipse.jetty.server.nio.SelectChannelConnector.accept(SelectChannelConnector.java:104)         at org.eclipse.jetty.server.AbstractConnector$Acceptor.run(AbstractConnector.java:933)         at org.eclipse.jetty.util.thread.QueuedThreadPool.runJob(QueuedThreadPool.java:599)         at org.eclipse.jetty.util.thread.QueuedThreadPool$3.run(QueuedThreadPool.java:534)         at java.lang.Thread.run(Thread.java:722)   10) Thread[id=88, name=qtp381299134-88 Acceptor1 SelectChannelConnector@0.0.0.0:58107, state=BLOCKED, group=TGRP-BasicDistributedZk2Test]         at sun.nio.ch.ServerSocketChannelImpl.accept(ServerSocketChannelImpl.java:210)         at org.eclipse.jetty.server.nio.SelectChannelConnector.accept(SelectChannelConnector.java:104)         at org.eclipse.jetty.server.AbstractConnector$Acceptor.run(AbstractConnector.java:933)         at org.eclipse.jetty.util.thread.QueuedThreadPool.runJob(QueuedThreadPool.java:599)         at org.eclipse.jetty.util.thread.QueuedThreadPool$3.run(QueuedThreadPool.java:534)         at java.lang.Thread.run(Thread.java:722)   11) Thread[id=37, name=qtp3934603-37 Acceptor2 SelectChannelConnector@0.0.0.0:58077, state=RUNNABLE, group=TGRP-BasicDistributedZk2Test]         at sun.nio.ch.ServerSocketChannelImpl.accept0(Native Method)         at sun.nio.ch.ServerSocketChannelImpl.accept(ServerSocketChannelImpl.java:226)         at org.eclipse.jetty.server.nio.SelectChannelConnector.accept(SelectChannelConnector.java:104)         at org.eclipse.jetty.server.AbstractConnector$Acceptor.run(AbstractConnector.java:933)         at org.eclipse.jetty.util.thread.QueuedThreadPool.runJob(QueuedThreadPool.java:599)         at org.eclipse.jetty.util.thread.QueuedThreadPool$3.run(QueuedThreadPool.java:534)         at java.lang.Thread.run(Thread.java:722)   12) Thread[id=90, name=qtp381299134-90 Acceptor3 SelectChannelConnector@0.0.0.0:58107, state=RUNNABLE, group=TGRP-BasicDistributedZk2Test]         at sun.nio.ch.ServerSocketChannelImpl.accept0(Native Method)         at sun.nio.ch.ServerSocketChannelImpl.accept(ServerSocketChannelImpl.java:226)         at org.eclipse.jetty.server.nio.SelectChannelConnector.accept(SelectChannelConnector.java:104)         at org.eclipse.jetty.server.AbstractConnector$Acceptor.run(AbstractConnector.java:933)         at org.eclipse.jetty.util.thread.QueuedThreadPool.runJob(QueuedThreadPool.java:599)         at org.eclipse.jetty.util.thread.QueuedThreadPool$3.run(QueuedThreadPool.java:534)         at java.lang.Thread.run(Thread.java:722)   13) Thread[id=55, name=qtp2058239703-55 Acceptor0 SelectChannelConnector@0.0.0.0:58091, state=BLOCKED, group=TGRP-BasicDistributedZk2Test]         at sun.nio.ch.ServerSocketChannelImpl.accept(ServerSocketChannelImpl.java:210)         at org.eclipse.jetty.server.nio.SelectChannelConnector.accept(SelectChannelConnector.java:104)         at org.eclipse.jetty.server.AbstractConnector$Acceptor.run(AbstractConnector.java:933)         at org.eclipse.jetty.util.thread.QueuedThreadPool.runJob(QueuedThreadPool.java:599)         at org.eclipse.jetty.util.thread.QueuedThreadPool$3.run(QueuedThreadPool.java:534)         at java.lang.Thread.run(Thread.java:722)   14) Thread[id=107, name=qtp547902119-107 Acceptor2 SelectChannelConnector@0.0.0.0:47836, state=RUNNABLE, group=TGRP-BasicDistributedZk2Test]         at sun.nio.ch.ServerSocketChannelImpl.accept0(Native Method)         at sun.nio.ch.ServerSocketChannelImpl.accept(ServerSocketChannelImpl.java:226)         at org.eclipse.jetty.server.nio.SelectChannelConnector.accept(SelectChannelConnector.java:104)         at org.eclipse.jetty.server.AbstractConnector$Acceptor.run(AbstractConnector.java:933)         at org.eclipse.jetty.util.thread.QueuedThreadPool.runJob(QueuedThreadPool.java:599)         at org.eclipse.jetty.util.thread.QueuedThreadPool$3.run(QueuedThreadPool.java:534)         at java.lang.Thread.run(Thread.java:722)   15) Thread[id=38, name=qtp3934603-38 Acceptor3 SelectChannelConnector@0.0.0.0:58077, state=BLOCKED, group=TGRP-BasicDistributedZk2Test]         at sun.nio.ch.ServerSocketChannelImpl.accept(ServerSocketChannelImpl.java:210)         at org.eclipse.jetty.server.nio.SelectChannelConnector.accept(SelectChannelConnector.java:104)         at org.eclipse.jetty.server.AbstractConnector$Acceptor.run(AbstractConnector.java:933)         at org.eclipse.jetty.util.thread.QueuedThreadPool.runJob(QueuedThreadPool.java:599)         at org.eclipse.jetty.util.thread.QueuedThreadPool$3.run(QueuedThreadPool.java:534)         at java.lang.Thread.run(Thread.java:722)   16) Thread[id=108, name=qtp547902119-108 Acceptor3 SelectChannelConnector@0.0.0.0:47836, state=BLOCKED, group=TGRP-BasicDistributedZk2Test]         at sun.nio.ch.ServerSocketChannelImpl.accept(ServerSocketChannelImpl.java:210)         at org.eclipse.jetty.server.nio.SelectChannelConnector.accept(SelectChannelConnector.java:104)         at org.eclipse.jetty.server.AbstractConnector$Acceptor.run(AbstractConnector.java:933)         at org.eclipse.jetty.util.thread.QueuedThreadPool.runJob(QueuedThreadPool.java:599)         at org.eclipse.jetty.util.thread.QueuedThreadPool$3.run(QueuedThreadPool.java:534)         at java.lang.Thread.run(Thread.java:722)
>
> Stack Trace:
> com.carrotsearch.randomizedtesting.ThreadLeakError: 16 threads leaked from SUITE scope at org.apache.solr.cloud.BasicDistributedZk2Test:
>    1) Thread[id=106, name=qtp547902119-106 Acceptor1 SelectChannelConnector@0.0.0.0:47836, state=BLOCKED, group=TGRP-BasicDistributedZk2Test]
>         at sun.nio.ch.ServerSocketChannelImpl.accept(ServerSocketChannelImpl.java:210)
>         at org.eclipse.jetty.server.nio.SelectChannelConnector.accept(SelectChannelConnector.java:104)
>         at org.eclipse.jetty.server.AbstractConnector$Acceptor.run(AbstractConnector.java:933)
>         at org.eclipse.jetty.util.thread.QueuedThreadPool.runJob(QueuedThreadPool.java:599)
>         at org.eclipse.jetty.util.thread.QueuedThreadPool$3.run(QueuedThreadPool.java:534)
>         at java.lang.Thread.run(Thread.java:722)
>    2) Thread[id=36, name=qtp3934603-36 Acceptor1 SelectChannelConnector@0.0.0.0:58077, state=BLOCKED, group=TGRP-BasicDistributedZk2Test]
>         at sun.nio.ch.ServerSocketChannelImpl.accept(ServerSocketChannelImpl.java:210)
>         at org.eclipse.jetty.server.nio.SelectChannelConnector.accept(SelectChannelConnector.java:104)
>         at org.eclipse.jetty.server.AbstractConnector$Acceptor.run(AbstractConnector.java:933)
>         at org.eclipse.jetty.util.thread.QueuedThreadPool.runJob(QueuedThreadPool.java:599)
>         at org.eclipse.jetty.util.thread.QueuedThreadPool$3.run(QueuedThreadPool.java:534)
>         at java.lang.Thread.run(Thread.java:722)
>    3) Thread[id=105, name=qtp547902119-105 Acceptor0 SelectChannelConnector@0.0.0.0:47836, state=BLOCKED, group=TGRP-BasicDistributedZk2Test]
>         at sun.nio.ch.ServerSocketChannelImpl.accept(ServerSocketChannelImpl.java:210)
>         at org.eclipse.jetty.server.nio.SelectChannelConnector.accept(SelectChannelConnector.java:104)
>         at org.eclipse.jetty.server.AbstractConnector$Acceptor.run(AbstractConnector.java:933)
>         at org.eclipse.jetty.util.thread.QueuedThreadPool.runJob(QueuedThreadPool.java:599)
>         at org.eclipse.jetty.util.thread.QueuedThreadPool$3.run(QueuedThreadPool.java:534)
>         at java.lang.Thread.run(Thread.java:722)
>    4) Thread[id=57, name=qtp2058239703-57 Acceptor2 SelectChannelConnector@0.0.0.0:58091, state=BLOCKED, group=TGRP-BasicDistributedZk2Test]
>         at sun.nio.ch.ServerSocketChannelImpl.accept(ServerSocketChannelImpl.java:210)
>         at org.eclipse.jetty.server.nio.SelectChannelConnector.accept(SelectChannelConnector.java:104)
>         at org.eclipse.jetty.server.AbstractConnector$Acceptor.run(AbstractConnector.java:933)
>         at org.eclipse.jetty.util.thread.QueuedThreadPool.runJob(QueuedThreadPool.java:599)
>         at org.eclipse.jetty.util.thread.QueuedThreadPool$3.run(QueuedThreadPool.java:534)
>         at java.lang.Thread.run(Thread.java:722)
>    5) Thread[id=56, name=qtp2058239703-56 Acceptor1 SelectChannelConnector@0.0.0.0:58091, state=RUNNABLE, group=TGRP-BasicDistributedZk2Test]
>         at sun.nio.ch.ServerSocketChannelImpl.accept0(Native Method)
>         at sun.nio.ch.ServerSocketChannelImpl.accept(ServerSocketChannelImpl.java:226)
>         at org.eclipse.jetty.server.nio.SelectChannelConnector.accept(SelectChannelConnector.java:104)
>         at org.eclipse.jetty.server.AbstractConnector$Acceptor.run(AbstractConnector.java:933)
>         at org.eclipse.jetty.util.thread.QueuedThreadPool.runJob(QueuedThreadPool.java:599)
>         at org.eclipse.jetty.util.thread.QueuedThreadPool$3.run(QueuedThreadPool.java:534)
>         at java.lang.Thread.run(Thread.java:722)
>    6) Thread[id=89, name=qtp381299134-89 Acceptor2 SelectChannelConnector@0.0.0.0:58107, state=BLOCKED, group=TGRP-BasicDistributedZk2Test]
>         at sun.nio.ch.ServerSocketChannelImpl.accept(ServerSocketChannelImpl.java:210)
>         at org.eclipse.jetty.server.nio.SelectChannelConnector.accept(SelectChannelConnector.java:104)
>         at org.eclipse.jetty.server.AbstractConnector$Acceptor.run(AbstractConnector.java:933)
>         at org.eclipse.jetty.util.thread.QueuedThreadPool.runJob(QueuedThreadPool.java:599)
>         at org.eclipse.jetty.util.thread.QueuedThreadPool$3.run(QueuedThreadPool.java:534)
>         at java.lang.Thread.run(Thread.java:722)
>    7) Thread[id=87, name=qtp381299134-87 Acceptor0 SelectChannelConnector@0.0.0.0:58107, state=BLOCKED, group=TGRP-BasicDistributedZk2Test]
>         at sun.nio.ch.ServerSocketChannelImpl.accept(ServerSocketChannelImpl.java:210)
>         at org.eclipse.jetty.server.nio.SelectChannelConnector.accept(SelectChannelConnector.java:104)
>         at org.eclipse.jetty.server.AbstractConnector$Acceptor.run(AbstractConnector.java:933)
>         at org.eclipse.jetty.util.thread.QueuedThreadPool.runJob(QueuedThreadPool.java:599)
>         at org.eclipse.jetty.util.thread.QueuedThreadPool$3.run(QueuedThreadPool.java:534)
>         at java.lang.Thread.run(Thread.java:722)
>    8) Thread[id=58, name=qtp2058239703-58 Acceptor3 SelectChannelConnector@0.0.0.0:58091, state=BLOCKED, group=TGRP-BasicDistributedZk2Test]
>         at sun.nio.ch.ServerSocketChannelImpl.accept(ServerSocketChannelImpl.java:210)
>         at org.eclipse.jetty.server.nio.SelectChannelConnector.accept(SelectChannelConnector.java:104)
>         at org.eclipse.jetty.server.AbstractConnector$Acceptor.run(AbstractConnector.java:933)
>         at org.eclipse.jetty.util.thread.QueuedThreadPool.runJob(QueuedThreadPool.java:599)
>         at org.eclipse.jetty.util.thread.QueuedThreadPool$3.run(QueuedThreadPool.java:534)
>         at java.lang.Thread.run(Thread.java:722)
>    9) Thread[id=35, name=qtp3934603-35 Acceptor0 SelectChannelConnector@0.0.0.0:58077, state=BLOCKED, group=TGRP-BasicDistributedZk2Test]
>         at sun.nio.ch.ServerSocketChannelImpl.accept(ServerSocketChannelImpl.java:210)
>         at org.eclipse.jetty.server.nio.SelectChannelConnector.accept(SelectChannelConnector.java:104)
>         at org.eclipse.jetty.server.AbstractConnector$Acceptor.run(AbstractConnector.java:933)
>         at org.eclipse.jetty.util.thread.QueuedThreadPool.runJob(QueuedThreadPool.java:599)
>         at org.eclipse.jetty.util.thread.QueuedThreadPool$3.run(QueuedThreadPool.java:534)
>         at java.lang.Thread.run(Thread.java:722)
>   10) Thread[id=88, name=qtp381299134-88 Acceptor1 SelectChannelConnector@0.0.0.0:58107, state=BLOCKED, group=TGRP-BasicDistributedZk2Test]
>         at sun.nio.ch.ServerSocketChannelImpl.accept(ServerSocketChannelImpl.java:210)
>         at org.eclipse.jetty.server.nio.SelectChannelConnector.accept(SelectChannelConnector.java:104)
>         at org.eclipse.jetty.server.AbstractConnector$Acceptor.run(AbstractConnector.java:933)
>         at org.eclipse.jetty.util.thread.QueuedThreadPool.runJob(QueuedThreadPool.java:599)
>         at org.eclipse.jetty.util.thread.QueuedThreadPool$3.run(QueuedThreadPool.java:534)
>         at java.lang.Thread.run(Thread.java:722)
>   11) Thread[id=37, name=qtp3934603-37 Acceptor2 SelectChannelConnector@0.0.0.0:58077, state=RUNNABLE, group=TGRP-BasicDistributedZk2Test]
>         at sun.nio.ch.ServerSocketChannelImpl.accept0(Native Method)
>         at sun.nio.ch.ServerSocketChannelImpl.accept(ServerSocketChannelImpl.java:226)
>         at org.eclipse.jetty.server.nio.SelectChannelConnector.accept(SelectChannelConnector.java:104)
>         at org.eclipse.jetty.server.AbstractConnector$Acceptor.run(AbstractConnector.java:933)
>         at org.eclipse.jetty.util.thread.QueuedThreadPool.runJob(QueuedThreadPool.java:599)
>         at org.eclipse.jetty.util.thread.QueuedThreadPool$3.run(QueuedThreadPool.java:534)
>         at java.lang.Thread.run(Thread.java:722)
>   12) Thread[id=90, name=qtp381299134-90 Acceptor3 SelectChannelConnector@0.0.0.0:58107, state=RUNNABLE, group=TGRP-BasicDistributedZk2Test]
>         at sun.nio.ch.ServerSocketChannelImpl.accept0(Native Method)
>         at sun.nio.ch.ServerSocketChannelImpl.accept(ServerSocketChannelImpl.java:226)
>         at org.eclipse.jetty.server.nio.SelectChannelConnector.accept(SelectChannelConnector.java:104)
>         at org.eclipse.jetty.server.AbstractConnector$Acceptor.run(AbstractConnector.java:933)
>         at org.eclipse.jetty.util.thread.QueuedThreadPool.runJob(QueuedThreadPool.java:599)
>         at org.eclipse.jetty.util.thread.QueuedThreadPool$3.run(QueuedThreadPool.java:534)
>         at java.lang.Thread.run(Thread.java:722)
>   13) Thread[id=55, name=qtp2058239703-55 Acceptor0 SelectChannelConnector@0.0.0.0:58091, state=BLOCKED, group=TGRP-BasicDistributedZk2Test]
>         at sun.nio.ch.ServerSocketChannelImpl.accept(ServerSocketChannelImpl.java:210)
>         at org.eclipse.jetty.server.nio.SelectChannelConnector.accept(SelectChannelConnector.java:104)
>         at org.eclipse.jetty.server.AbstractConnector$Acceptor.run(AbstractConnector.java:933)
>         at org.eclipse.jetty.util.thread.QueuedThreadPool.runJob(QueuedThreadPool.java:599)
>         at org.eclipse.jetty.util.thread.QueuedThreadPool$3.run(QueuedThreadPool.java:534)
>         at java.lang.Thread.run(Thread.java:722)
>   14) Thread[id=107, name=qtp547902119-107 Acceptor2 SelectChannelConnector@0.0.0.0:47836, state=RUNNABLE, group=TGRP-BasicDistributedZk2Test]
>         at sun.nio.ch.ServerSocketChannelImpl.accept0(Native Method)
>         at sun.nio.ch.ServerSocketChannelImpl.accept(ServerSocketChannelImpl.java:226)
>         at org.eclipse.jetty.server.nio.SelectChannelConnector.accept(SelectChannelConnector.java:104)
>         at org.eclipse.jetty.server.AbstractConnector$Acceptor.run(AbstractConnector.java:933)
>         at org.eclipse.jetty.util.thread.QueuedThreadPool.runJob(QueuedThreadPool.java:599)
>         at org.eclipse.jetty.util.thread.QueuedThreadPool$3.run(QueuedThreadPool.java:534)
>         at java.lang.Thread.run(Thread.java:722)
>   15) Thread[id=38, name=qtp3934603-38 Acceptor3 SelectChannelConnector@0.0.0.0:58077, state=BLOCKED, group=TGRP-BasicDistributedZk2Test]
>         at sun.nio.ch.ServerSocketChannelImpl.accept(ServerSocketChannelImpl.java:210)
>         at org.eclipse.jetty.server.nio.SelectChannelConnector.accept(SelectChannelConnector.java:104)
>         at org.eclipse.jetty.server.AbstractConnector$Acceptor.run(AbstractConnector.java:933)
>         at org.eclipse.jetty.util.thread.QueuedThreadPool.runJob(QueuedThreadPool.java:599)
>         at org.eclipse.jetty.util.thread.QueuedThreadPool$3.run(QueuedThreadPool.java:534)
>         at java.lang.Thread.run(Thread.java:722)
>   16) Thread[id=108, name=qtp547902119-108 Acceptor3 SelectChannelConnector@0.0.0.0:47836, state=BLOCKED, group=TGRP-BasicDistributedZk2Test]
>         at sun.nio.ch.ServerSocketChannelImpl.accept(ServerSocketChannelImpl.java:210)
>         at org.eclipse.jetty.server.nio.SelectChannelConnector.accept(SelectChannelConnector.java:104)
>         at org.eclipse.jetty.server.AbstractConnector$Acceptor.run(AbstractConnector.java:933)
>         at org.eclipse.jetty.util.thread.QueuedThreadPool.runJob(QueuedThreadPool.java:599)
>         at org.eclipse.jetty.util.thread.QueuedThreadPool$3.run(QueuedThreadPool.java:534)
>         at java.lang.Thread.run(Thread.java:722)
>         at __randomizedtesting.SeedInfo.seed([F5299F006E07FE5C]:0)
>
>
> FAILED:  junit.framework.TestSuite.org.apache.solr.cloud.BasicDistributedZk2Test
>
> Error Message:
> There are still zombie threads that couldn't be terminated:    1) Thread[id=106, name=qtp547902119-106 Acceptor1 SelectChannelConnector@0.0.0.0:47836, state=BLOCKED, group=TGRP-BasicDistributedZk2Test]         at sun.nio.ch.ServerSocketChannelImpl.accept(ServerSocketChannelImpl.java:210)         at org.eclipse.jetty.server.nio.SelectChannelConnector.accept(SelectChannelConnector.java:104)         at org.eclipse.jetty.server.AbstractConnector$Acceptor.run(AbstractConnector.java:933)         at org.eclipse.jetty.util.thread.QueuedThreadPool.runJob(QueuedThreadPool.java:599)         at org.eclipse.jetty.util.thread.QueuedThreadPool$3.run(QueuedThreadPool.java:534)         at java.lang.Thread.run(Thread.java:722)    2) Thread[id=36, name=qtp3934603-36 Acceptor1 SelectChannelConnector@0.0.0.0:58077, state=BLOCKED, group=TGRP-BasicDistributedZk2Test]         at sun.nio.ch.ServerSocketChannelImpl.accept(ServerSocketChannelImpl.java:210)         at org.eclipse.jetty.server.nio.SelectChannelConnector.accept(SelectChannelConnector.java:104)         at org.eclipse.jetty.server.AbstractConnector$Acceptor.run(AbstractConnector.java:933)         at org.eclipse.jetty.util.thread.QueuedThreadPool.runJob(QueuedThreadPool.java:599)         at org.eclipse.jetty.util.thread.QueuedThreadPool$3.run(QueuedThreadPool.java:534)         at java.lang.Thread.run(Thread.java:722)    3) Thread[id=57, name=qtp2058239703-57 Acceptor2 SelectChannelConnector@0.0.0.0:58091, state=BLOCKED, group=TGRP-BasicDistributedZk2Test]         at sun.nio.ch.ServerSocketChannelImpl.accept(ServerSocketChannelImpl.java:210)         at org.eclipse.jetty.server.nio.SelectChannelConnector.accept(SelectChannelConnector.java:104)         at org.eclipse.jetty.server.AbstractConnector$Acceptor.run(AbstractConnector.java:933)         at org.eclipse.jetty.util.thread.QueuedThreadPool.runJob(QueuedThreadPool.java:599)         at org.eclipse.jetty.util.thread.QueuedThreadPool$3.run(QueuedThreadPool.java:534)         at java.lang.Thread.run(Thread.java:722)    4) Thread[id=105, name=qtp547902119-105 Acceptor0 SelectChannelConnector@0.0.0.0:47836, state=BLOCKED, group=TGRP-BasicDistributedZk2Test]         at sun.nio.ch.ServerSocketChannelImpl.accept(ServerSocketChannelImpl.java:210)         at org.eclipse.jetty.server.nio.SelectChannelConnector.accept(SelectChannelConnector.java:104)         at org.eclipse.jetty.server.AbstractConnector$Acceptor.run(AbstractConnector.java:933)         at org.eclipse.jetty.util.thread.QueuedThreadPool.runJob(QueuedThreadPool.java:599)         at org.eclipse.jetty.util.thread.QueuedThreadPool$3.run(QueuedThreadPool.java:534)         at java.lang.Thread.run(Thread.java:722)    5) Thread[id=56, name=qtp2058239703-56 Acceptor1 SelectChannelConnector@0.0.0.0:58091, state=RUNNABLE, group=TGRP-BasicDistributedZk2Test]         at sun.nio.ch.ServerSocketChannelImpl.accept0(Native Method)         at sun.nio.ch.ServerSocketChannelImpl.accept(ServerSocketChannelImpl.java:226)         at org.eclipse.jetty.server.nio.SelectChannelConnector.accept(SelectChannelConnector.java:104)         at org.eclipse.jetty.server.AbstractConnector$Acceptor.run(AbstractConnector.java:933)         at org.eclipse.jetty.util.thread.QueuedThreadPool.runJob(QueuedThreadPool.java:599)         at org.eclipse.jetty.util.thread.QueuedThreadPool$3.run(QueuedThreadPool.java:534)         at java.lang.Thread.run(Thread.java:722)    6) Thread[id=87, name=qtp381299134-87 Acceptor0 SelectChannelConnector@0.0.0.0:58107, state=BLOCKED, group=TGRP-BasicDistributedZk2Test]         at sun.nio.ch.ServerSocketChannelImpl.accept(ServerSocketChannelImpl.java:210)         at org.eclipse.jetty.server.nio.SelectChannelConnector.accept(SelectChannelConnector.java:104)         at org.eclipse.jetty.server.AbstractConnector$Acceptor.run(AbstractConnector.java:933)         at org.eclipse.jetty.util.thread.QueuedThreadPool.runJob(QueuedThreadPool.java:599)         at org.eclipse.jetty.util.thread.QueuedThreadPool$3.run(QueuedThreadPool.java:534)         at java.lang.Thread.run(Thread.java:722)    7) Thread[id=89, name=qtp381299134-89 Acceptor2 SelectChannelConnector@0.0.0.0:58107, state=BLOCKED, group=TGRP-BasicDistributedZk2Test]         at sun.nio.ch.ServerSocketChannelImpl.accept(ServerSocketChannelImpl.java:210)         at org.eclipse.jetty.server.nio.SelectChannelConnector.accept(SelectChannelConnector.java:104)         at org.eclipse.jetty.server.AbstractConnector$Acceptor.run(AbstractConnector.java:933)         at org.eclipse.jetty.util.thread.QueuedThreadPool.runJob(QueuedThreadPool.java:599)         at org.eclipse.jetty.util.thread.QueuedThreadPool$3.run(QueuedThreadPool.java:534)         at java.lang.Thread.run(Thread.java:722)    8) Thread[id=35, name=qtp3934603-35 Acceptor0 SelectChannelConnector@0.0.0.0:58077, state=BLOCKED, group=TGRP-BasicDistributedZk2Test]         at sun.nio.ch.ServerSocketChannelImpl.accept(ServerSocketChannelImpl.java:210)         at org.eclipse.jetty.server.nio.SelectChannelConnector.accept(SelectChannelConnector.java:104)         at org.eclipse.jetty.server.AbstractConnector$Acceptor.run(AbstractConnector.java:933)         at org.eclipse.jetty.util.thread.QueuedThreadPool.runJob(QueuedThreadPool.java:599)         at org.eclipse.jetty.util.thread.QueuedThreadPool$3.run(QueuedThreadPool.java:534)         at java.lang.Thread.run(Thread.java:722)    9) Thread[id=58, name=qtp2058239703-58 Acceptor3 SelectChannelConnector@0.0.0.0:58091, state=BLOCKED, group=TGRP-BasicDistributedZk2Test]         at sun.nio.ch.ServerSocketChannelImpl.accept(ServerSocketChannelImpl.java:210)         at org.eclipse.jetty.server.nio.SelectChannelConnector.accept(SelectChannelConnector.java:104)         at org.eclipse.jetty.server.AbstractConnector$Acceptor.run(AbstractConnector.java:933)         at org.eclipse.jetty.util.thread.QueuedThreadPool.runJob(QueuedThreadPool.java:599)         at org.eclipse.jetty.util.thread.QueuedThreadPool$3.run(QueuedThreadPool.java:534)         at java.lang.Thread.run(Thread.java:722)   10) Thread[id=88, name=qtp381299134-88 Acceptor1 SelectChannelConnector@0.0.0.0:58107, state=BLOCKED, group=TGRP-BasicDistributedZk2Test]         at sun.nio.ch.ServerSocketChannelImpl.accept(ServerSocketChannelImpl.java:210)         at org.eclipse.jetty.server.nio.SelectChannelConnector.accept(SelectChannelConnector.java:104)         at org.eclipse.jetty.server.AbstractConnector$Acceptor.run(AbstractConnector.java:933)         at org.eclipse.jetty.util.thread.QueuedThreadPool.runJob(QueuedThreadPool.java:599)         at org.eclipse.jetty.util.thread.QueuedThreadPool$3.run(QueuedThreadPool.java:534)         at java.lang.Thread.run(Thread.java:722)   11) Thread[id=90, name=qtp381299134-90 Acceptor3 SelectChannelConnector@0.0.0.0:58107, state=RUNNABLE, group=TGRP-BasicDistributedZk2Test]         at sun.nio.ch.ServerSocketChannelImpl.accept0(Native Method)         at sun.nio.ch.ServerSocketChannelImpl.accept(ServerSocketChannelImpl.java:226)         at org.eclipse.jetty.server.nio.SelectChannelConnector.accept(SelectChannelConnector.java:104)         at org.eclipse.jetty.server.AbstractConnector$Acceptor.run(AbstractConnector.java:933)         at org.eclipse.jetty.util.thread.QueuedThreadPool.runJob(QueuedThreadPool.java:599)         at org.eclipse.jetty.util.thread.QueuedThreadPool$3.run(QueuedThreadPool.java:534)         at java.lang.Thread.run(Thread.java:722)   12) Thread[id=37, name=qtp3934603-37 Acceptor2 SelectChannelConnector@0.0.0.0:58077, state=RUNNABLE, group=TGRP-BasicDistributedZk2Test]         at sun.nio.ch.ServerSocketChannelImpl.accept0(Native Method)         at sun.nio.ch.ServerSocketChannelImpl.accept(ServerSocketChannelImpl.java:226)         at org.eclipse.jetty.server.nio.SelectChannelConnector.accept(SelectChannelConnector.java:104)         at org.eclipse.jetty.server.AbstractConnector$Acceptor.run(AbstractConnector.java:933)         at org.eclipse.jetty.util.thread.QueuedThreadPool.runJob(QueuedThreadPool.java:599)         at org.eclipse.jetty.util.thread.QueuedThreadPool$3.run(QueuedThreadPool.java:534)         at java.lang.Thread.run(Thread.java:722)   13) Thread[id=55, name=qtp2058239703-55 Acceptor0 SelectChannelConnector@0.0.0.0:58091, state=BLOCKED, group=TGRP-BasicDistributedZk2Test]         at sun.nio.ch.ServerSocketChannelImpl.accept(ServerSocketChannelImpl.java:210)         at org.eclipse.jetty.server.nio.SelectChannelConnector.accept(SelectChannelConnector.java:104)         at org.eclipse.jetty.server.AbstractConnector$Acceptor.run(AbstractConnector.java:933)         at org.eclipse.jetty.util.thread.QueuedThreadPool.runJob(QueuedThreadPool.java:599)         at org.eclipse.jetty.util.thread.QueuedThreadPool$3.run(QueuedThreadPool.java:534)         at java.lang.Thread.run(Thread.java:722)   14) Thread[id=107, name=qtp547902119-107 Acceptor2 SelectChannelConnector@0.0.0.0:47836, state=RUNNABLE, group=TGRP-BasicDistributedZk2Test]         at sun.nio.ch.ServerSocketChannelImpl.accept0(Native Method)         at sun.nio.ch.ServerSocketChannelImpl.accept(ServerSocketChannelImpl.java:226)         at org.eclipse.jetty.server.nio.SelectChannelConnector.accept(SelectChannelConnector.java:104)         at org.eclipse.jetty.server.AbstractConnector$Acceptor.run(AbstractConnector.java:933)         at org.eclipse.jetty.util.thread.QueuedThreadPool.runJob(QueuedThreadPool.java:599)         at org.eclipse.jetty.util.thread.QueuedThreadPool$3.run(QueuedThreadPool.java:534)         at java.lang.Thread.run(Thread.java:722)   15) Thread[id=38, name=qtp3934603-38 Acceptor3 SelectChannelConnector@0.0.0.0:58077, state=BLOCKED, group=TGRP-BasicDistributedZk2Test]         at sun.nio.ch.ServerSocketChannelImpl.accept(ServerSocketChannelImpl.java:210)         at org.eclipse.jetty.server.nio.SelectChannelConnector.accept(SelectChannelConnector.java:104)         at org.eclipse.jetty.server.AbstractConnector$Acceptor.run(AbstractConnector.java:933)         at org.eclipse.jetty.util.thread.QueuedThreadPool.runJob(QueuedThreadPool.java:599)         at org.eclipse.jetty.util.thread.QueuedThreadPool$3.run(QueuedThreadPool.java:534)         at java.lang.Thread.run(Thread.java:722)   16) Thread[id=108, name=qtp547902119-108 Acceptor3 SelectChannelConnector@0.0.0.0:47836, state=BLOCKED, group=TGRP-BasicDistributedZk2Test]         at sun.nio.ch.ServerSocketChannelImpl.accept(ServerSocketChannelImpl.java:210)         at org.eclipse.jetty.server.nio.SelectChannelConnector.accept(SelectChannelConnector.java:104)         at org.eclipse.jetty.server.AbstractConnector$Acceptor.run(AbstractConnector.java:933)         at org.eclipse.jetty.util.thread.QueuedThreadPool.runJob(QueuedThreadPool.java:599)         at org.eclipse.jetty.util.thread.QueuedThreadPool$3.run(QueuedThreadPool.java:534)         at java.lang.Thread.run(Thread.java:722)
>
> Stack Trace:
> com.carrotsearch.randomizedtesting.ThreadLeakError: There are still zombie threads that couldn't be terminated:
>    1) Thread[id=106, name=qtp547902119-106 Acceptor1 SelectChannelConnector@0.0.0.0:47836, state=BLOCKED, group=TGRP-BasicDistributedZk2Test]
>         at sun.nio.ch.ServerSocketChannelImpl.accept(ServerSocketChannelImpl.java:210)
>         at org.eclipse.jetty.server.nio.SelectChannelConnector.accept(SelectChannelConnector.java:104)
>         at org.eclipse.jetty.server.AbstractConnector$Acceptor.run(AbstractConnector.java:933)
>         at org.eclipse.jetty.util.thread.QueuedThreadPool.runJob(QueuedThreadPool.java:599)
>         at org.eclipse.jetty.util.thread.QueuedThreadPool$3.run(QueuedThreadPool.java:534)
>         at java.lang.Thread.run(Thread.java:722)
>    2) Thread[id=36, name=qtp3934603-36 Acceptor1 SelectChannelConnector@0.0.0.0:58077, state=BLOCKED, group=TGRP-BasicDistributedZk2Test]
>         at sun.nio.ch.ServerSocketChannelImpl.accept(ServerSocketChannelImpl.java:210)
>         at org.eclipse.jetty.server.nio.SelectChannelConnector.accept(SelectChannelConnector.java:104)
>         at org.eclipse.jetty.server.AbstractConnector$Acceptor.run(AbstractConnector.java:933)
>         at org.eclipse.jetty.util.thread.QueuedThreadPool.runJob(QueuedThreadPool.java:599)
>         at org.eclipse.jetty.util.thread.QueuedThreadPool$3.run(QueuedThreadPool.java:534)
>         at java.lang.Thread.run(Thread.java:722)
>    3) Thread[id=57, name=qtp2058239703-57 Acceptor2 SelectChannelConnector@0.0.0.0:58091, state=BLOCKED, group=TGRP-BasicDistributedZk2Test]
>         at sun.nio.ch.ServerSocketChannelImpl.accept(ServerSocketChannelImpl.java:210)
>         at org.eclipse.jetty.server.nio.SelectChannelConnector.accept(SelectChannelConnector.java:104)
>         at org.eclipse.jetty.server.AbstractConnector$Acceptor.run(AbstractConnector.java:933)
>         at org.eclipse.jetty.util.thread.QueuedThreadPool.runJob(QueuedThreadPool.java:599)
>         at org.eclipse.jetty.util.thread.QueuedThreadPool$3.run(QueuedThreadPool.java:534)
>         at java.lang.Thread.run(Thread.java:722)
>    4) Thread[id=105, name=qtp547902119-105 Acceptor0 SelectChannelConnector@0.0.0.0:47836, state=BLOCKED, group=TGRP-BasicDistributedZk2Test]
>         at sun.nio.ch.ServerSocketChannelImpl.accept(ServerSocketChannelImpl.java:210)
>         at org.eclipse.jetty.server.nio.SelectChannelConnector.accept(SelectChannelConnector.java:104)
>         at org.eclipse.jetty.server.AbstractConnector$Acceptor.run(AbstractConnector.java:933)
>         at org.eclipse.jetty.util.thread.QueuedThreadPool.runJob(QueuedThreadPool.java:599)
>         at org.eclipse.jetty.util.thread.QueuedThreadPool$3.run(QueuedThreadPool.java:534)
>         at java.lang.Thread.run(Thread.java:722)
>    5) Thread[id=56, name=qtp2058239703-56 Acceptor1 SelectChannelConnector@0.0.0.0:58091, state=RUNNABLE, group=TGRP-BasicDistributedZk2Test]
>         at sun.nio.ch.ServerSocketChannelImpl.accept0(Native Method)
>         at sun.nio.ch.ServerSocketChannelImpl.accept(ServerSocketChannelImpl.java:226)
>         at org.eclipse.jetty.server.nio.SelectChannelConnector.accept(SelectChannelConnector.java:104)
>         at org.eclipse.jetty.server.AbstractConnector$Acceptor.run(AbstractConnector.java:933)
>         at org.eclipse.jetty.util.thread.QueuedThreadPool.runJob(QueuedThreadPool.java:599)
>         at org.eclipse.jetty.util.thread.QueuedThreadPool$3.run(QueuedThreadPool.java:534)
>         at java.lang.Thread.run(Thread.java:722)
>    6) Thread[id=87, name=qtp381299134-87 Acceptor0 SelectChannelConnector@0.0.0.0:58107, state=BLOCKED, group=TGRP-BasicDistributedZk2Test]
>         at sun.nio.ch.ServerSocketChannelImpl.accept(ServerSocketChannelImpl.java:210)
>         at org.eclipse.jetty.server.nio.SelectChannelConnector.accept(SelectChannelConnector.java:104)
>         at org.eclipse.jetty.server.AbstractConnector$Acceptor.run(AbstractConnector.java:933)
>         at org.eclipse.jetty.util.thread.QueuedThreadPool.runJob(QueuedThreadPool.java:599)
>         at org.eclipse.jetty.util.thread.QueuedThreadPool$3.run(QueuedThreadPool.java:534)
>         at java.lang.Thread.run(Thread.java:722)
>    7) Thread[id=89, name=qtp381299134-89 Acceptor2 SelectChannelConnector@0.0.0.0:58107, state=BLOCKED, group=TGRP-BasicDistributedZk2Test]
>         at sun.nio.ch.ServerSocketChannelImpl.accept(ServerSocketChannelImpl.java:210)
>         at org.eclipse.jetty.server.nio.SelectChannelConnector.accept(SelectChannelConnector.java:104)
>         at org.eclipse.jetty.server.AbstractConnector$Acceptor.run(AbstractConnector.java:933)
>         at org.eclipse.jetty.util.thread.QueuedThreadPool.runJob(QueuedThreadPool.java:599)
>         at org.eclipse.jetty.util.thread.QueuedThreadPool$3.run(QueuedThreadPool.java:534)
>         at java.lang.Thread.run(Thread.java:722)
>    8) Thread[id=35, name=qtp3934603-35 Acceptor0 SelectChannelConnector@0.0.0.0:58077, state=BLOCKED, group=TGRP-BasicDistributedZk2Test]
>         at sun.nio.ch.ServerSocketChannelImpl.accept(ServerSocketChannelImpl.java:210)
>         at org.eclipse.jetty.server.nio.SelectChannelConnector.accept(SelectChannelConnector.java:104)
>         at org.eclipse.jetty.server.AbstractConnector$Acceptor.run(AbstractConnector.java:933)
>         at org.eclipse.jetty.util.thread.QueuedThreadPool.runJob(QueuedThreadPool.java:599)
>         at org.eclipse.jetty.util.thread.QueuedThreadPool$3.run(QueuedThreadPool.java:534)
>         at java.lang.Thread.run(Thread.java:722)
>    9) Thread[id=58, name=qtp2058239703-58 Acceptor3 SelectChannelConnector@0.0.0.0:58091, state=BLOCKED, group=TGRP-BasicDistributedZk2Test]
>         at sun.nio.ch.ServerSocketChannelImpl.accept(ServerSocketChannelImpl.java:210)
>         at org.eclipse.jetty.server.nio.SelectChannelConnector.accept(SelectChannelConnector.java:104)
>         at org.eclipse.jetty.server.AbstractConnector$Acceptor.run(AbstractConnector.java:933)
>         at org.eclipse.jetty.util.thread.QueuedThreadPool.runJob(QueuedThreadPool.java:599)
>         at org.eclipse.jetty.util.thread.QueuedThreadPool$3.run(QueuedThreadPool.java:534)
>         at java.lang.Thread.run(Thread.java:722)
>   10) Thread[id=88, name=qtp381299134-88 Acceptor1 SelectChannelConnector@0.0.0.0:58107, state=BLOCKED, group=TGRP-BasicDistributedZk2Test]
>         at sun.nio.ch.ServerSocketChannelImpl.accept(ServerSocketChannelImpl.java:210)
>         at org.eclipse.jetty.server.nio.SelectChannelConnector.accept(SelectChannelConnector.java:104)
>         at org.eclipse.jetty.server.AbstractConnector$Acceptor.run(AbstractConnector.java:933)
>         at org.eclipse.jetty.util.thread.QueuedThreadPool.runJob(QueuedThreadPool.java:599)
>         at org.eclipse.jetty.util.thread.QueuedThreadPool$3.run(QueuedThreadPool.java:534)
>         at java.lang.Thread.run(Thread.java:722)
>   11) Thread[id=90, name=qtp381299134-90 Acceptor3 SelectChannelConnector@0.0.0.0:58107, state=RUNNABLE, group=TGRP-BasicDistributedZk2Test]
>         at sun.nio.ch.ServerSocketChannelImpl.accept0(Native Method)
>         at sun.nio.ch.ServerSocketChannelImpl.accept(ServerSocketChannelImpl.java:226)
>         at org.eclipse.jetty.server.nio.SelectChannelConnector.accept(SelectChannelConnector.java:104)
>         at org.eclipse.jetty.server.AbstractConnector$Acceptor.run(AbstractConnector.java:933)
>         at org.eclipse.jetty.util.thread.QueuedThreadPool.runJob(QueuedThreadPool.java:599)
>         at org.eclipse.jetty.util.thread.QueuedThreadPool$3.run(QueuedThreadPool.java:534)
>         at java.lang.Thread.run(Thread.java:722)
>   12) Thread[id=37, name=qtp3934603-37 Acceptor2 SelectChannelConnector@0.0.0.0:58077, state=RUNNABLE, group=TGRP-BasicDistributedZk2Test]
>         at sun.nio.ch.ServerSocketChannelImpl.accept0(Native Method)
>         at sun.nio.ch.ServerSocketChannelImpl.accept(ServerSocketChannelImpl.java:226)
>         at org.eclipse.jetty.server.nio.SelectChannelConnector.accept(SelectChannelConnector.java:104)
>         at org.eclipse.jetty.server.AbstractConnector$Acceptor.run(AbstractConnector.java:933)
>         at org.eclipse.jetty.util.thread.QueuedThreadPool.runJob(QueuedThreadPool.java:599)
>         at org.eclipse.jetty.util.thread.QueuedThreadPool$3.run(QueuedThreadPool.java:534)
>         at java.lang.Thread.run(Thread.java:722)
>   13) Thread[id=55, name=qtp2058239703-55 Acceptor0 SelectChannelConnector@0.0.0.0:58091, state=BLOCKED, group=TGRP-BasicDistributedZk2Test]
>         at sun.nio.ch.ServerSocketChannelImpl.accept(ServerSocketChannelImpl.java:210)
>         at org.eclipse.jetty.server.nio.SelectChannelConnector.accept(SelectChannelConnector.java:104)
>         at org.eclipse.jetty.server.AbstractConnector$Acceptor.run(AbstractConnector.java:933)
>         at org.eclipse.jetty.util.thread.QueuedThreadPool.runJob(QueuedThreadPool.java:599)
>         at org.eclipse.jetty.util.thread.QueuedThreadPool$3.run(QueuedThreadPool.java:534)
>         at java.lang.Thread.run(Thread.java:722)
>   14) Thread[id=107, name=qtp547902119-107 Acceptor2 SelectChannelConnector@0.0.0.0:47836, state=RUNNABLE, group=TGRP-BasicDistributedZk2Test]
>         at sun.nio.ch.ServerSocketChannelImpl.accept0(Native Method)
>         at sun.nio.ch.ServerSocketChannelImpl.accept(ServerSocketChannelImpl.java:226)
>         at org.eclipse.jetty.server.nio.SelectChannelConnector.accept(SelectChannelConnector.java:104)
>         at org.eclipse.jetty.server.AbstractConnector$Acceptor.run(AbstractConnector.java:933)
>         at org.eclipse.jetty.util.thread.QueuedThreadPool.runJob(QueuedThreadPool.java:599)
>         at org.eclipse.jetty.util.thread.QueuedThreadPool$3.run(QueuedThreadPool.java:534)
>         at java.lang.Thread.run(Thread.java:722)
>   15) Thread[id=38, name=qtp3934603-38 Acceptor3 SelectChannelConnector@0.0.0.0:58077, state=BLOCKED, group=TGRP-BasicDistributedZk2Test]
>         at sun.nio.ch.ServerSocketChannelImpl.accept(ServerSocketChannelImpl.java:210)
>         at org.eclipse.jetty.server.nio.SelectChannelConnector.accept(SelectChannelConnector.java:104)
>         at org.eclipse.jetty.server.AbstractConnector$Acceptor.run(AbstractConnector.java:933)
>         at org.eclipse.jetty.util.thread.QueuedThreadPool.runJob(QueuedThreadPool.java:599)
>         at org.eclipse.jetty.util.thread.QueuedThreadPool$3.run(QueuedThreadPool.java:534)
>         at java.lang.Thread.run(Thread.java:722)
>   16) Thread[id=108, name=qtp547902119-108 Acceptor3 SelectChannelConnector@0.0.0.0:47836, state=BLOCKED, group=TGRP-BasicDistributedZk2Test]
>         at sun.nio.ch.ServerSocketChannelImpl.accept(ServerSocketChannelImpl.java:210)
>         at org.eclipse.jetty.server.nio.SelectChannelConnector.accept(SelectChannelConnector.java:104)
>         at org.eclipse.jetty.server.AbstractConnector$Acceptor.run(AbstractConnector.java:933)
>         at org.eclipse.jetty.util.thread.QueuedThreadPool.runJob(QueuedThreadPool.java:599)
>         at org.eclipse.jetty.util.thread.QueuedThreadPool$3.run(QueuedThreadPool.java:534)
>         at java.lang.Thread.run(Thread.java:722)
>         at __randomizedtesting.SeedInfo.seed([F5299F006E07FE5C]:0)
>
>
> FAILED:  junit.framework.TestSuite.org.apache.solr.cloud.FullSolrCloudDistribCmdsTest
>
> Error Message:
> Suite timeout exceeded (>= 7200000 msec).
>
> Stack Trace:
> java.lang.Exception: Suite timeout exceeded (>= 7200000 msec).
>         at __randomizedtesting.SeedInfo.seed([F5299F006E07FE5C]:0)
>
>
> FAILED:  org.apache.solr.cloud.BasicDistributedZk2Test.testDistribSearch
>
> Error Message:
> Shard still reported as live in zk - 0 jetty
>
> Stack Trace:
> java.lang.AssertionError: Shard still reported as live in zk - 0 jetty
>         at __randomizedtesting.SeedInfo.seed([F5299F006E07FE5C:74CF111819589E60]:0)
>         at org.junit.Assert.fail(Assert.java:93)
>         at org.apache.solr.cloud.AbstractFullDistribZkTestBase.waitToSeeNotLive(AbstractFullDistribZkTestBase.java:1231)
>         at org.apache.solr.cloud.BasicDistributedZk2Test.brindDownShardIndexSomeDocsAndRecover(BasicDistributedZk2Test.java:217)
>         at org.apache.solr.cloud.BasicDistributedZk2Test.doTest(BasicDistributedZk2Test.java:92)
>         at org.apache.solr.BaseDistributedSearchTestCase.testDistribSearch(BaseDistributedSearchTestCase.java:695)
>         at sun.reflect.NativeMethodAccessorImpl.invoke0(Native Method)
>         at sun.reflect.NativeMethodAccessorImpl.invoke(NativeMethodAccessorImpl.java:57)
>         at sun.reflect.DelegatingMethodAccessorImpl.invoke(DelegatingMethodAccessorImpl.java:43)
>         at java.lang.reflect.Method.invoke(Method.java:601)
>         at com.carrotsearch.randomizedtesting.RandomizedRunner.invoke(RandomizedRunner.java:1559)
>         at com.carrotsearch.randomizedtesting.RandomizedRunner.access$600(RandomizedRunner.java:79)
>         at com.carrotsearch.randomizedtesting.RandomizedRunner$6.evaluate(RandomizedRunner.java:737)
>         at com.carrotsearch.randomizedtesting.RandomizedRunner$7.evaluate(RandomizedRunner.java:773)
>         at com.carrotsearch.randomizedtesting.RandomizedRunner$8.evaluate(RandomizedRunner.java:787)
>         at com.carrotsearch.randomizedtesting.rules.SystemPropertiesRestoreRule$1.evaluate(SystemPropertiesRestoreRule.java:53)
>         at org.apache.lucene.util.TestRuleSetupTeardownChained$1.evaluate(TestRuleSetupTeardownChained.java:50)
>         at org.apache.lucene.util.TestRuleFieldCacheSanity$1.evaluate(TestRuleFieldCacheSanity.java:51)
>         at org.apache.lucene.util.AbstractBeforeAfterRule$1.evaluate(AbstractBeforeAfterRule.java:45)
>         at com.carrotsearch.randomizedtesting.rules.SystemPropertiesInvariantRule$1.evaluate(SystemPropertiesInvariantRule.java:55)
>         at org.apache.lucene.util.TestRuleThreadAndTestName$1.evaluate(TestRuleThreadAndTestName.java:48)
>         at org.apache.lucene.util.TestRuleIgnoreAfterMaxFailures$1.evaluate(TestRuleIgnoreAfterMaxFailures.java:70)
>         at org.apache.lucene.util.TestRuleMarkFailure$1.evaluate(TestRuleMarkFailure.java:48)
>         at com.carrotsearch.randomizedtesting.rules.StatementAdapter.evaluate(StatementAdapter.java:36)
>         at com.carrotsearch.randomizedtesting.ThreadLeakControl$StatementRunner.run(ThreadLeakControl.java:358)
>         at com.carrotsearch.randomizedtesting.ThreadLeakControl.forkTimeoutingTask(ThreadLeakControl.java:782)
>         at com.carrotsearch.randomizedtesting.ThreadLeakControl$3.evaluate(ThreadLeakControl.java:442)
>         at com.carrotsearch.randomizedtesting.RandomizedRunner.runSingleTest(RandomizedRunner.java:746)
>         at com.carrotsearch.randomizedtesting.RandomizedRunner$3.evaluate(RandomizedRunner.java:648)
>         at com.carrotsearch.randomizedtesting.RandomizedRunner$4.evaluate(RandomizedRunner.java:682)
>         at com.carrotsearch.randomizedtesting.RandomizedRunner$5.evaluate(RandomizedRunner.java:693)
>         at com.carrotsearch.randomizedtesting.rules.StatementAdapter.evaluate(StatementAdapter.java:36)
>         at com.carrotsearch.randomizedtesting.rules.SystemPropertiesRestoreRule$1.evaluate(SystemPropertiesRestoreRule.java:53)
>         at org.apache.lucene.util.AbstractBeforeAfterRule$1.evaluate(AbstractBeforeAfterRule.java:45)
>         at org.apache.lucene.util.TestRuleStoreClassName$1.evaluate(TestRuleStoreClassName.java:42)
>         at com.carrotsearch.randomizedtesting.rules.SystemPropertiesInvariantRule$1.evaluate(SystemPropertiesInvariantRule.java:55)
>         at com.carrotsearch.randomizedtesting.rules.NoShadowingOrOverridesOnMethodsRule$1.evaluate(NoShadowingOrOverridesOnMethodsRule.java:39)
>         at com.carrotsearch.randomizedtesting.rules.NoShadowingOrOverridesOnMethodsRule$1.evaluate(NoShadowingOrOverridesOnMethodsRule.java:39)
>         at com.carrotsearch.randomizedtesting.rules.StatementAdapter.evaluate(StatementAdapter.java:36)
>         at org.apache.lucene.util.TestRuleAssertionsRequired$1.evaluate(TestRuleAssertionsRequired.java:43)
>         at org.apache.lucene.util.TestRuleMarkFailure$1.evaluate(TestRuleMarkFailure.java:48)
>         at org.apache.lucene.util.TestRuleIgnoreAfterMaxFailures$1.evaluate(TestRuleIgnoreAfterMaxFailures.java:70)
>         at org.apache.lucene.util.TestRuleIgnoreTestSuites$1.evaluate(TestRuleIgnoreTestSuites.java:55)
>         at com.carrotsearch.randomizedtesting.rules.StatementAdapter.evaluate(StatementAdapter.java:36)
>         at com.carrotsearch.randomizedtesting.ThreadLeakControl$StatementRunner.run(ThreadLeakControl.java:358)
>         at java.lang.Thread.run(Thread.java:722)
>
>
> FAILED:  org.apache.solr.cloud.FullSolrCloudDistribCmdsTest.testDistribSearch
>
> Error Message:
> Test abandoned because suite timeout was reached.
>
> Stack Trace:
> java.lang.Exception: Test abandoned because suite timeout was reached.
>         at __randomizedtesting.SeedInfo.seed([F5299F006E07FE5C]:0)
>
>
>
>
> Build Log:
> [...truncated 8398 lines...]
> [junit4:junit4] Suite: org.apache.solr.cloud.BasicDistributedZk2Test
> [junit4:junit4]   2> 9 T19 oas.SolrTestCaseJ4.setUp ###Starting testDistribSearch
> [junit4:junit4]   2> Creating dataDir: /usr/home/hudson/hudson-slave/workspace/Lucene-Solr-Tests-trunk-java7/solr/build/solr-core/test/J0/./solrtest-BasicDistributedZk2Test-1351326119324
> [junit4:junit4]   2> 16 T19 oasc.ZkTestServer.run STARTING ZK TEST SERVER
> [junit4:junit4]   2> 143 T20 oaz.Environment.logEnv Server environment:zookeeper.version=3.3.6-1366786, built on 07/29/2012 06:22 GMT
> [junit4:junit4]   2> 144 T20 oaz.Environment.logEnv Server environment:host.name=lucene.zones.apache.org
> [junit4:junit4]   2> 145 T20 oaz.Environment.logEnv Server environment:java.version=1.7.0_06
> [junit4:junit4]   2> 145 T20 oaz.Environment.logEnv Server environment:java.vendor=Oracle Corporation
> [junit4:junit4]   2> 146 T20 oaz.Environment.logEnv Server environment:java.home=/usr/local/openjdk7/jre
> [junit4:junit4]   2> 146 T20 oaz.Environment.logEnv Server environment:java.class.path=/usr/home/hudson/hudson-slave/workspace/Lucene-Solr-Tests-trunk-java7/solr/build/solr-core/classes/test:/usr/home/hudson/hudson-slave/workspace/Lucene-Solr-Tests-trunk-java7/solr/build/solr-test-framework/classes/java:/usr/home/hudson/hudson-slave/workspace/Lucene-Solr-Tests-trunk-java7/solr/build/solr-core/test-files:/usr/home/hudson/hudson-slave/workspace/Lucene-Solr-Tests-trunk-java7/lucene/build/test-framework/classes/java:/usr/home/hudson/hudson-slave/workspace/Lucene-Solr-Tests-trunk-java7/lucene/build/codecs/classes/java:/usr/home/hudson/hudson-slave/workspace/Lucene-Solr-Tests-trunk-java7/solr/build/solr-solrj/classes/java:/usr/home/hudson/hudson-slave/workspace/Lucene-Solr-Tests-trunk-java7/solr/build/solr-core/classes/java:/usr/home/hudson/hudson-slave/workspace/Lucene-Solr-Tests-trunk-java7/lucene/build/analysis/common/lucene-analyzers-common-5.0-SNAPSHOT.jar:/usr/home/hudson/hudson-slave/workspace/Lucene-Solr-Tests-trunk-java7/lucene/build/analysis/kuromoji/lucene-analyzers-kuromoji-5.0-SNAPSHOT.jar:/usr/home/hudson/hudson-slave/workspace/Lucene-Solr-Tests-trunk-java7/lucene/build/analysis/phonetic/lucene-analyzers-phonetic-5.0-SNAPSHOT.jar:/usr/home/hudson/hudson-slave/workspace/Lucene-Solr-Tests-trunk-java7/lucene/build/highlighter/lucene-highlighter-5.0-SNAPSHOT.jar:/usr/home/hudson/hudson-slave/workspace/Lucene-Solr-Tests-trunk-java7/lucene/build/memory/lucene-memory-5.0-SNAPSHOT.jar:/usr/home/hudson/hudson-slave/workspace/Lucene-Solr-Tests-trunk-java7/lucene/build/misc/lucene-misc-5.0-SNAPSHOT.jar:/usr/home/hudson/hudson-slave/workspace/Lucene-Solr-Tests-trunk-java7/lucene/build/spatial/lucene-spatial-5.0-SNAPSHOT.jar:/usr/home/hudson/hudson-slave/workspace/Lucene-Solr-Tests-trunk-java7/lucene/build/suggest/lucene-suggest-5.0-SNAPSHOT.jar:/usr/home/hudson/hudson-slave/workspace/Lucene-Solr-Tests-trunk-java7/lucene/build/grouping/lucene-grouping-5.0-SNAPSHOT.jar:/usr/home/hudson/hudson-slave/workspace/Lucene-Solr-Tests-trunk-java7/lucene/build/queries/lucene-queries-5.0-SNAPSHOT.jar:/usr/home/hudson/hudson-slave/workspace/Lucene-Solr-Tests-trunk-java7/lucene/build/queryparser/lucene-queryparser-5.0-SNAPSHOT.jar:/usr/home/hudson/hudson-slave/workspace/Lucene-Solr-Tests-trunk-java7/solr/core/lib/commons-cli-1.2.jar:/usr/home/hudson/hudson-slave/workspace/Lucene-Solr-Tests-trunk-java7/solr/core/lib/commons-codec-1.7.jar:/usr/home/hudson/hudson-slave/workspace/Lucene-Solr-Tests-trunk-java7/solr/core/lib/commons-fileupload-1.2.1.jar:/usr/home/hudson/hudson-slave/workspace/Lucene-Solr-Tests-trunk-java7/solr/core/lib/commons-lang-2.6.jar:/usr/home/hudson/hudson-slave/workspace/Lucene-Solr-Tests-trunk-java7/solr/core/lib/easymock-2.2.jar:/usr/home/hudson/hudson-slave/workspace/Lucene-Solr-Tests-trunk-java7/solr/core/lib/guava-r05.jar:/usr/home/hudson/hudson-slave/workspace/Lucene-Solr-Tests-trunk-java7/solr/core/lib/javax.servlet-api-3.0.1.jar:/usr/home/hudson/hudson-slave/workspace/Lucene-Solr-Tests-trunk-java7/solr/core/lib/spatial4j-0.3.jar:/usr/home/hudson/hudson-slave/workspace/Lucene-Solr-Tests-trunk-java7/solr/solrj/lib/commons-io-2.1.jar:/usr/home/hudson/hudson-slave/workspace/Lucene-Solr-Tests-trunk-java7/solr/solrj/lib/httpclient-4.1.3.jar:/usr/home/hudson/hudson-slave/workspace/Lucene-Solr-Tests-trunk-java7/solr/solrj/lib/httpcore-4.1.4.jar:/usr/home/hudson/hudson-slave/workspace/Lucene-Solr-Tests-trunk-java7/solr/solrj/lib/httpmime-4.1.3.jar:/usr/home/hudson/hudson-slave/workspace/Lucene-Solr-Tests-trunk-java7/solr/solrj/lib/jcl-over-slf4j-1.6.4.jar:/usr/home/hudson/hudson-slave/workspace/Lucene-Solr-Tests-trunk-java7/solr/solrj/lib/log4j-over-slf4j-1.6.4.jar:/usr/home/hudson/hudson-slave/workspace/Lucene-Solr-Tests-trunk-java7/solr/solrj/lib/slf4j-api-1.6.4.jar:/usr/home/hudson/hudson-slave/workspace/Lucene-Solr-Tests-trunk-java7/solr/solrj/lib/slf4j-jdk14-1.6.4.jar:/usr/home/hudson/hudson-slave/workspace/Lucene-Solr-Tests-trunk-java7/solr/solrj/lib/wstx-asl-3.2.7.jar:/usr/home/hudson/hudson-slave/workspace/Lucene-Solr-Tests-trunk-java7/solr/solrj/lib/zookeeper-3.3.6.jar:/usr/home/hudson/hudson-slave/workspace/Lucene-Solr-Tests-trunk-java7/solr/example/lib/jetty-continuation-8.1.2.v20120308.jar:/usr/home/hudson/hudson-slave/workspace/Lucene-Solr-Tests-trunk-java7/solr/example/lib/jetty-deploy-8.1.2.v20120308.jar:/usr/home/hudson/hudson-slave/workspace/Lucene-Solr-Tests-trunk-java7/solr/example/lib/jetty-http-8.1.2.v20120308.jar:/usr/home/hudson/hudson-slave/workspace/Lucene-Solr-Tests-trunk-java7/solr/example/lib/jetty-io-8.1.2.v20120308.jar:/usr/home/hudson/hudson-slave/workspace/Lucene-Solr-Tests-trunk-java7/solr/example/lib/jetty-jmx-8.1.2.v20120308.jar:/usr/home/hudson/hudson-slave/workspace/Lucene-Solr-Tests-trunk-java7/solr/example/lib/jetty-security-8.1.2.v20120308.jar:/usr/home/hudson/hudson-slave/workspace/Lucene-Solr-Tests-trunk-java7/solr/example/lib/jetty-server-8.1.2.v20120308.jar:/usr/home/hudson/hudson-slave/workspace/Lucene-Solr-Tests-trunk-java7/solr/example/lib/jetty-servlet-8.1.2.v20120308.jar:/usr/home/hudson/hudson-slave/workspace/Lucene-Solr-Tests-trunk-java7/solr/example/lib/jetty-util-8.1.2.v20120308.jar:/usr/home/hudson/hudson-slave/workspace/Lucene-Solr-Tests-trunk-java7/solr/example/lib/jetty-webapp-8.1.2.v20120308.jar:/usr/home/hudson/hudson-slave/workspace/Lucene-Solr-Tests-trunk-java7/solr/example/lib/jetty-xml-8.1.2.v20120308.jar:/usr/home/hudson/hudson-slave/workspace/Lucene-Solr-Tests-trunk-java7/solr/example/lib/servlet-api-3.0.jar:/usr/home/hudson/hudson-slave/workspace/Lucene-Solr-Tests-trunk-java7/solr/example/example-DIH/solr/db/lib/hsqldb-1.8.0.10.jar:/usr/home/hudson/hudson-slave/workspace/Lucene-Solr-Tests-trunk-java7/lucene/build/core/classes/java:/usr/home/hudson/hudson-slave/workspace/Lucene-Solr-Tests-trunk-java7/lucene/test-framework/lib/junit-4.10.jar:/usr/home/hudson/hudson-slave/workspace/Lucene-Solr-Tests-trunk-java7/lucene/test-framework/lib/randomizedtesting-runner-2.0.3.jar:/home/hudson/hudson-slave/tools/Ant/ant-1.8.2/lib/ant-launcher.jar:/home/hudson/.ant/lib/ivy-2.2.0.jar:/home/hudson/hudson-slave/tools/Ant/ant-1.8.2/lib/ant-apache-regexp.jar:/home/hudson/hudson-slave/tools/Ant/ant-1.8.2/lib/ant-junit.jar:/home/hudson/hudson-slave/tools/Ant/ant-1.8.2/lib/ant-apache-bsf.jar:/home/hudson/hudson-slave/tools/Ant/ant-1.8.2/lib/ant-commons-net.jar:/home/hudson/hudson-slave/tools/Ant/ant-1.8.2/lib/ant-antlr.jar:/home/hudson/hudson-slave/tools/Ant/ant-1.8.2/lib/ant-apache-log4j.jar:/home/hudson/hudson-slave/tools/Ant/ant-1.8.2/lib/ant-commons-logging.jar:/home/hudson/hudson-slave/tools/Ant/ant-1.8.2/lib/ant-apache-xalan2.jar:/home/hudson/hudson-slave/tools/Ant/ant-1.8.2/lib/ant-apache-oro.jar:/home/hudson/hudson-slave/tools/Ant/ant-1.8.2/lib/ant-junit4.jar:/home/hudson/hudson-slave/tools/Ant/ant-1.8.2/lib/ant-netrexx.jar:/home/hudson/hudson-slave/tools/Ant/ant-1.8.2/lib/ant-swing.jar:/home/hudson/hudson-slave/tools/Ant/ant-1.8.2/lib/ant-javamail.jar:/home/hudson/hudson-slave/tools/Ant/ant-1.8.2/lib/ant-jsch.jar:/home/hudson/hudson-slave/tools/Ant/ant-1.8.2/lib/ant-jmf.jar:/home/hudson/hudson-slave/tools/Ant/ant-1.8.2/lib/ant.jar:/home/hudson/hudson-slave/tools/Ant/ant-1.8.2/lib/ant-apache-bcel.jar:/home/hudson/hudson-slave/tools/Ant/ant-1.8.2/lib/ant-jai.jar:/home/hudson/hudson-slave/tools/Ant/ant-1.8.2/lib/ant-testutil.jar:/home/hudson/hudson-slave/tools/Ant/ant-1.8.2/lib/ant-apache-resolver.jar:/home/hudson/hudson-slave/tools/Ant/ant-1.8.2/lib/ant-jdepend.jar:/usr/local/openjdk7/lib/tools.jar:/home/hudson/.ivy2/cache/com.carrotsearch.randomizedtesting/junit4-ant/jars/junit4-ant-2.0.3.jar
> [junit4:junit4]   2> 148 T20 oaz.Environment.logEnv Server environment:java.library.path=/usr/local/openjdk7/jre/lib/amd64/server:/usr/local/openjdk7/jre/lib/amd64:/usr/local/openjdk7/jre/../lib/amd64:/usr/local/openjdk6/jre/lib/amd64/server:/usr/local/openjdk6/jre/lib/amd64:/usr/local/openjdk6/jre/../lib/amd64:/usr/java/packages/lib/amd64:/lib:/usr/lib:/usr/local/lib
> [junit4:junit4]   2> 148 T20 oaz.Environment.logEnv Server environment:java.io.tmpdir=.
> [junit4:junit4]   2> 149 T20 oaz.Environment.logEnv Server environment:java.compiler=<NA>
> [junit4:junit4]   2> 149 T20 oaz.Environment.logEnv Server environment:os.name=FreeBSD
> [junit4:junit4]   2> 150 T20 oaz.Environment.logEnv Server environment:os.arch=amd64
> [junit4:junit4]   2> 150 T20 oaz.Environment.logEnv Server environment:os.version=9.0-RELEASE
> [junit4:junit4]   2> 151 T20 oaz.Environment.logEnv Server environment:user.name=hudson
> [junit4:junit4]   2> 151 T20 oaz.Environment.logEnv Server environment:user.home=/home/hudson
> [junit4:junit4]   2> 151 T20 oaz.Environment.logEnv Server environment:user.dir=/usr/home/hudson/hudson-slave/workspace/Lucene-Solr-Tests-trunk-java7/solr/build/solr-core/test/J0
> [junit4:junit4]   2> 210 T20 oazs.ZooKeeperServer.setTickTime tickTime set to 1000
> [junit4:junit4]   2> 265 T20 oazs.NIOServerCnxn$Factory.<init> binding to port 0.0.0.0/0.0.0.0:0
> [junit4:junit4]   2> 325 T19 oasc.ZkTestServer.run start zk server on port:58068
> [junit4:junit4]   2> 371 T20 oazsp.FileTxnSnapLog.save Snapshotting: 0
> [junit4:junit4]   2> 416 T19 oaz.Environment.logEnv Client environment:zookeeper.version=3.3.6-1366786, built on 07/29/2012 06:22 GMT
> [junit4:junit4]   2> 416 T19 oaz.Environment.logEnv Client environment:host.name=lucene.zones.apache.org
> [junit4:junit4]   2> 417 T19 oaz.Environment.logEnv Client environment:java.version=1.7.0_06
> [junit4:junit4]   2> 417 T19 oaz.Environment.logEnv Client environment:java.vendor=Oracle Corporation
> [junit4:junit4]   2> 418 T19 oaz.Environment.logEnv Client environment:java.home=/usr/local/openjdk7/jre
> [junit4:junit4]   2> 418 T19 oaz.Environment.logEnv Client environment:java.class.path=/usr/home/hudson/hudson-slave/workspace/Lucene-Solr-Tests-trunk-java7/solr/build/solr-core/classes/test:/usr/home/hudson/hudson-slave/workspace/Lucene-Solr-Tests-trunk-java7/solr/build/solr-test-framework/classes/java:/usr/home/hudson/hudson-slave/workspace/Lucene-Solr-Tests-trunk-java7/solr/build/solr-core/test-files:/usr/home/hudson/hudson-slave/workspace/Lucene-Solr-Tests-trunk-java7/lucene/build/test-framework/classes/java:/usr/home/hudson/hudson-slave/workspace/Lucene-Solr-Tests-trunk-java7/lucene/build/codecs/classes/java:/usr/home/hudson/hudson-slave/workspace/Lucene-Solr-Tests-trunk-java7/solr/build/solr-solrj/classes/java:/usr/home/hudson/hudson-slave/workspace/Lucene-Solr-Tests-trunk-java7/solr/build/solr-core/classes/java:/usr/home/hudson/hudson-slave/workspace/Lucene-Solr-Tests-trunk-java7/lucene/build/analysis/common/lucene-analyzers-common-5.0-SNAPSHOT.jar:/usr/home/hudson/hudson-slave/workspace/Lucene-Solr-Tests-trunk-java7/lucene/build/analysis/kuromoji/lucene-analyzers-kuromoji-5.0-SNAPSHOT.jar:/usr/home/hudson/hudson-slave/workspace/Lucene-Solr-Tests-trunk-java7/lucene/build/analysis/phonetic/lucene-analyzers-phonetic-5.0-SNAPSHOT.jar:/usr/home/hudson/hudson-slave/workspace/Lucene-Solr-Tests-trunk-java7/lucene/build/highlighter/lucene-highlighter-5.0-SNAPSHOT.jar:/usr/home/hudson/hudson-slave/workspace/Lucene-Solr-Tests-trunk-java7/lucene/build/memory/lucene-memory-5.0-SNAPSHOT.jar:/usr/home/hudson/hudson-slave/workspace/Lucene-Solr-Tests-trunk-java7/lucene/build/misc/lucene-misc-5.0-SNAPSHOT.jar:/usr/home/hudson/hudson-slave/workspace/Lucene-Solr-Tests-trunk-java7/lucene/build/spatial/lucene-spatial-5.0-SNAPSHOT.jar:/usr/home/hudson/hudson-slave/workspace/Lucene-Solr-Tests-trunk-java7/lucene/build/suggest/lucene-suggest-5.0-SNAPSHOT.jar:/usr/home/hudson/hudson-slave/workspace/Lucene-Solr-Tests-trunk-java7/lucene/build/grouping/lucene-grouping-5.0-SNAPSHOT.jar:/usr/home/hudson/hudson-slave/workspace/Lucene-Solr-Tests-trunk-java7/lucene/build/queries/lucene-queries-5.0-SNAPSHOT.jar:/usr/home/hudson/hudson-slave/workspace/Lucene-Solr-Tests-trunk-java7/lucene/build/queryparser/lucene-queryparser-5.0-SNAPSHOT.jar:/usr/home/hudson/hudson-slave/workspace/Lucene-Solr-Tests-trunk-java7/solr/core/lib/commons-cli-1.2.jar:/usr/home/hudson/hudson-slave/workspace/Lucene-Solr-Tests-trunk-java7/solr/core/lib/commons-codec-1.7.jar:/usr/home/hudson/hudson-slave/workspace/Lucene-Solr-Tests-trunk-java7/solr/core/lib/commons-fileupload-1.2.1.jar:/usr/home/hudson/hudson-slave/workspace/Lucene-Solr-Tests-trunk-java7/solr/core/lib/commons-lang-2.6.jar:/usr/home/hudson/hudson-slave/workspace/Lucene-Solr-Tests-trunk-java7/solr/core/lib/easymock-2.2.jar:/usr/home/hudson/hudson-slave/workspace/Lucene-Solr-Tests-trunk-java7/solr/core/lib/guava-r05.jar:/usr/home/hudson/hudson-slave/workspace/Lucene-Solr-Tests-trunk-java7/solr/core/lib/javax.servlet-api-3.0.1.jar:/usr/home/hudson/hudson-slave/workspace/Lucene-Solr-Tests-trunk-java7/solr/core/lib/spatial4j-0.3.jar:/usr/home/hudson/hudson-slave/workspace/Lucene-Solr-Tests-trunk-java7/solr/solrj/lib/commons-io-2.1.jar:/usr/home/hudson/hudson-slave/workspace/Lucene-Solr-Tests-trunk-java7/solr/solrj/lib/httpclient-4.1.3.jar:/usr/home/hudson/hudson-slave/workspace/Lucene-Solr-Tests-trunk-java7/solr/solrj/lib/httpcore-4.1.4.jar:/usr/home/hudson/hudson-slave/workspace/Lucene-Solr-Tests-trunk-java7/solr/solrj/lib/httpmime-4.1.3.jar:/usr/home/hudson/hudson-slave/workspace/Lucene-Solr-Tests-trunk-java7/solr/solrj/lib/jcl-over-slf4j-1.6.4.jar:/usr/home/hudson/hudson-slave/workspace/Lucene-Solr-Tests-trunk-java7/solr/solrj/lib/log4j-over-slf4j-1.6.4.jar:/usr/home/hudson/hudson-slave/workspace/Lucene-Solr-Tests-trunk-java7/solr/solrj/lib/slf4j-api-1.6.4.jar:/usr/home/hudson/hudson-slave/workspace/Lucene-Solr-Tests-trunk-java7/solr/solrj/lib/slf4j-jdk14-1.6.4.jar:/usr/home/hudson/hudson-slave/workspace/Lucene-Solr-Tests-trunk-java7/solr/solrj/lib/wstx-asl-3.2.7.jar:/usr/home/hudson/hudson-slave/workspace/Lucene-Solr-Tests-trunk-java7/solr/solrj/lib/zookeeper-3.3.6.jar:/usr/home/hudson/hudson-slave/workspace/Lucene-Solr-Tests-trunk-java7/solr/example/lib/jetty-continuation-8.1.2.v20120308.jar:/usr/home/hudson/hudson-slave/workspace/Lucene-Solr-Tests-trunk-java7/solr/example/lib/jetty-deploy-8.1.2.v20120308.jar:/usr/home/hudson/hudson-slave/workspace/Lucene-Solr-Tests-trunk-java7/solr/example/lib/jetty-http-8.1.2.v20120308.jar:/usr/home/hudson/hudson-slave/workspace/Lucene-Solr-Tests-trunk-java7/solr/example/lib/jetty-io-8.1.2.v20120308.jar:/usr/home/hudson/hudson-slave/workspace/Lucene-Solr-Tests-trunk-java7/solr/example/lib/jetty-jmx-8.1.2.v20120308.jar:/usr/home/hudson/hudson-slave/workspace/Lucene-Solr-Tests-trunk-java7/solr/example/lib/jetty-security-8.1.2.v20120308.jar:/usr/home/hudson/hudson-slave/workspace/Lucene-Solr-Tests-trunk-java7/solr/example/lib/jetty-server-8.1.2.v20120308.jar:/usr/home/hudson/hudson-slave/workspace/Lucene-Solr-Tests-trunk-java7/solr/example/lib/jetty-servlet-8.1.2.v20120308.jar:/usr/home/hudson/hudson-slave/workspace/Lucene-Solr-Tests-trunk-java7/solr/example/lib/jetty-util-8.1.2.v20120308.jar:/usr/home/hudson/hudson-slave/workspace/Lucene-Solr-Tests-trunk-java7/solr/example/lib/jetty-webapp-8.1.2.v20120308.jar:/usr/home/hudson/hudson-slave/workspace/Lucene-Solr-Tests-trunk-java7/solr/example/lib/jetty-xml-8.1.2.v20120308.jar:/usr/home/hudson/hudson-slave/workspace/Lucene-Solr-Tests-trunk-java7/solr/example/lib/servlet-api-3.0.jar:/usr/home/hudson/hudson-slave/workspace/Lucene-Solr-Tests-trunk-java7/solr/example/example-DIH/solr/db/lib/hsqldb-1.8.0.10.jar:/usr/home/hudson/hudson-slave/workspace/Lucene-Solr-Tests-trunk-java7/lucene/build/core/classes/java:/usr/home/hudson/hudson-slave/workspace/Lucene-Solr-Tests-trunk-java7/lucene/test-framework/lib/junit-4.10.jar:/usr/home/hudson/hudson-slave/workspace/Lucene-Solr-Tests-trunk-java7/lucene/test-framework/lib/randomizedtesting-runner-2.0.3.jar:/home/hudson/hudson-slave/tools/Ant/ant-1.8.2/lib/ant-launcher.jar:/home/hudson/.ant/lib/ivy-2.2.0.jar:/home/hudson/hudson-slave/tools/Ant/ant-1.8.2/lib/ant-apache-regexp.jar:/home/hudson/hudson-slave/tools/Ant/ant-1.8.2/lib/ant-junit.jar:/home/hudson/hudson-slave/tools/Ant/ant-1.8.2/lib/ant-apache-bsf.jar:/home/hudson/hudson-slave/tools/Ant/ant-1.8.2/lib/ant-commons-net.jar:/home/hudson/hudson-slave/tools/Ant/ant-1.8.2/lib/ant-antlr.jar:/home/hudson/hudson-slave/tools/Ant/ant-1.8.2/lib/ant-apache-log4j.jar:/home/hudson/hudson-slave/tools/Ant/ant-1.8.2/lib/ant-commons-logging.jar:/home/hudson/hudson-slave/tools/Ant/ant-1.8.2/lib/ant-apache-xalan2.jar:/home/hudson/hudson-slave/tools/Ant/ant-1.8.2/lib/ant-apache-oro.jar:/home/hudson/hudson-slave/tools/Ant/ant-1.8.2/lib/ant-junit4.jar:/home/hudson/hudson-slave/tools/Ant/ant-1.8.2/lib/ant-netrexx.jar:/home/hudson/hudson-slave/tools/Ant/ant-1.8.2/lib/ant-swing.jar:/home/hudson/hudson-slave/tools/Ant/ant-1.8.2/lib/ant-javamail.jar:/home/hudson/hudson-slave/tools/Ant/ant-1.8.2/lib/ant-jsch.jar:/home/hudson/hudson-slave/tools/Ant/ant-1.8.2/lib/ant-jmf.jar:/home/hudson/hudson-slave/tools/Ant/ant-1.8.2/lib/ant.jar:/home/hudson/hudson-slave/tools/Ant/ant-1.8.2/lib/ant-apache-bcel.jar:/home/hudson/hudson-slave/tools/Ant/ant-1.8.2/lib/ant-jai.jar:/home/hudson/hudson-slave/tools/Ant/ant-1.8.2/lib/ant-testutil.jar:/home/hudson/hudson-slave/tools/Ant/ant-1.8.2/lib/ant-apache-resolver.jar:/home/hudson/hudson-slave/tools/Ant/ant-1.8.2/lib/ant-jdepend.jar:/usr/local/openjdk7/lib/tools.jar:/home/hudson/.ivy2/cache/com.carrotsearch.randomizedtesting/junit4-ant/jars/junit4-ant-2.0.3.jar
> [junit4:junit4]   2> 420 T19 oaz.Environment.logEnv Client environment:java.library.path=/usr/local/openjdk7/jre/lib/amd64/server:/usr/local/openjdk7/jre/lib/amd64:/usr/local/openjdk7/jre/../lib/amd64:/usr/local/openjdk6/jre/lib/amd64/server:/usr/local/openjdk6/jre/lib/amd64:/usr/local/openjdk6/jre/../lib/amd64:/usr/java/packages/lib/amd64:/lib:/usr/lib:/usr/local/lib
> [junit4:junit4]   2> 420 T19 oaz.Environment.logEnv Client environment:java.io.tmpdir=.
> [junit4:junit4]   2> 421 T19 oaz.Environment.logEnv Client environment:java.compiler=<NA>
> [junit4:junit4]   2> 421 T19 oaz.Environment.logEnv Client environment:os.name=FreeBSD
> [junit4:junit4]   2> 421 T19 oaz.Environment.logEnv Client environment:os.arch=amd64
> [junit4:junit4]   2> 422 T19 oaz.Environment.logEnv Client environment:os.version=9.0-RELEASE
> [junit4:junit4]   2> 422 T19 oaz.Environment.logEnv Client environment:user.name=hudson
> [junit4:junit4]   2> 423 T19 oaz.Environment.logEnv Client environment:user.home=/home/hudson
> [junit4:junit4]   2> 423 T19 oaz.Environment.logEnv Client environment:user.dir=/usr/home/hudson/hudson-slave/workspace/Lucene-Solr-Tests-trunk-java7/solr/build/solr-core/test/J0
> [junit4:junit4]   2> 429 T19 oaz.ZooKeeper.<init> Initiating client connection, connectString=127.0.0.1:58068 sessionTimeout=10000 watcher=org.apache.solr.common.cloud.ConnectionManager@3250559d
> [junit4:junit4]   2> 485 T23 oaz.ClientCnxn$SendThread.startConnect Opening socket connection to server /127.0.0.1:58068
> [junit4:junit4]   2> 485 T19 oascc.ConnectionManager.waitForConnected Waiting for client to connect to ZooKeeper
> [junit4:junit4]   2> 489 T23 oaz.ClientCnxn$SendThread.primeConnection Socket connection established to localhost/127.0.0.1:58068, initiating session
> [junit4:junit4]   2> 490 T21 oazs.NIOServerCnxn$Factory.run Accepted socket connection from /140.211.11.196:58069
> [junit4:junit4]   2> 513 T21 oazs.NIOServerCnxn.doIO WARNING Exception causing close of session 0x0 due to java.io.IOException: ZooKeeperServer not running
> [junit4:junit4]   2> 514 T21 oazs.NIOServerCnxn.closeSock Closed socket connection for client /140.211.11.196:58069 (no session established for client)
> [junit4:junit4]   2> 514 T23 oaz.ClientCnxn$SendThread.run Unable to read additional data from server sessionid 0x0, likely server has closed socket, closing socket connection and attempting reconnect
> [junit4:junit4]   2> 2086 T23 oaz.ClientCnxn$SendThread.startConnect Opening socket connection to server localhost/127.0.0.1:58068
> [junit4:junit4]   2> 2087 T23 oaz.ClientCnxn$SendThread.primeConnection Socket connection established to localhost/127.0.0.1:58068, initiating session
> [junit4:junit4]   2> 2087 T21 oazs.NIOServerCnxn$Factory.run Accepted socket connection from /140.211.11.196:58072
> [junit4:junit4]   2> 2089 T21 oazs.NIOServerCnxn.readConnectRequest Client attempting to establish new session at /140.211.11.196:58072
> [junit4:junit4]   2> 2120 T24 oazsp.FileTxnLog.append Creating new log file: log.1
> [junit4:junit4]   2> 2180 T24 oazs.NIOServerCnxn.finishSessionInit Established session 0x13aa15037410000 with negotiated timeout 10000 for client /140.211.11.196:58072
> [junit4:junit4]   2> 2180 T23 oaz.ClientCnxn$SendThread.readConnectResult Session establishment complete on server localhost/127.0.0.1:58068, sessionid = 0x13aa15037410000, negotiated timeout = 10000
> [junit4:junit4]   2> 2184 T25 oascc.ConnectionManager.process Watcher org.apache.solr.common.cloud.ConnectionManager@3250559d name:ZooKeeperConnection Watcher:127.0.0.1:58068 got event WatchedEvent state:SyncConnected type:None path:null path:null type:None
> [junit4:junit4]   2> 2185 T19 oascc.ConnectionManager.waitForConnected Client is connected to ZooKeeper
> [junit4:junit4]   2> 2191 T19 oascc.SolrZkClient.makePath makePath: /solr
> [junit4:junit4]   2> 2294 T26 oazs.PrepRequestProcessor.pRequest Processed session termination for sessionid: 0x13aa15037410000
> [junit4:junit4]   2> 2295 T25 oaz.ClientCnxn$EventThread.run EventThread shut down
> [junit4:junit4]   2> 2295 T19 oaz.ZooKeeper.close Session: 0x13aa15037410000 closed
> [junit4:junit4]   2> 2296 T21 oazs.NIOServerCnxn.closeSock Closed socket connection for client /140.211.11.196:58072 which had sessionid 0x13aa15037410000
> [junit4:junit4]   2> 2296 T19 oaz.ZooKeeper.<init> Initiating client connection, connectString=127.0.0.1:58068/solr sessionTimeout=10000 watcher=org.apache.solr.common.cloud.ConnectionManager@2573332e
> [junit4:junit4]   2> 2298 T27 oaz.ClientCnxn$SendThread.startConnect Opening socket connection to server /127.0.0.1:58068
> [junit4:junit4]   2> 2298 T19 oascc.ConnectionManager.waitForConnected Waiting for client to connect to ZooKeeper
> [junit4:junit4]   2> 2299 T27 oaz.ClientCnxn$SendThread.primeConnection Socket connection established to localhost/127.0.0.1:58068, initiating session
> [junit4:junit4]   2> 2300 T21 oazs.NIOServerCnxn$Factory.run Accepted socket connection from /140.211.11.196:58073
> [junit4:junit4]   2> 2301 T21 oazs.NIOServerCnxn.readConnectRequest Client attempting to establish new session at /140.211.11.196:58073
> [junit4:junit4]   2> 2302 T24 oazs.NIOServerCnxn.finishSessionInit Established session 0x13aa15037410001 with negotiated timeout 10000 for client /140.211.11.196:58073
> [junit4:junit4]   2> 2303 T27 oaz.ClientCnxn$SendThread.readConnectResult Session establishment complete on server localhost/127.0.0.1:58068, sessionid = 0x13aa15037410001, negotiated timeout = 10000
> [junit4:junit4]   2> 2303 T28 oascc.ConnectionManager.process Watcher org.apache.solr.common.cloud.ConnectionManager@2573332e name:ZooKeeperConnection Watcher:127.0.0.1:58068/solr got event WatchedEvent state:SyncConnected type:None path:null path:null type:None
> [junit4:junit4]   2> 2304 T19 oascc.ConnectionManager.waitForConnected Client is connected to ZooKeeper
> [junit4:junit4]   2> 2340 T19 oascc.SolrZkClient.makePath makePath: /collections/collection1
> [junit4:junit4]   2> 2346 T19 oascc.SolrZkClient.makePath makePath: /collections/collection1/shards
> [junit4:junit4]   2> 2355 T19 oascc.SolrZkClient.makePath makePath: /collections/control_collection
> [junit4:junit4]   2> 2359 T19 oascc.SolrZkClient.makePath makePath: /collections/control_collection/shards
> [junit4:junit4]   2> 2363 T19 oasc.AbstractZkTestCase.putConfig put /usr/home/hudson/hudson-slave/workspace/Lucene-Solr-Tests-trunk-java7/solr/build/solr-core/test-files/solr/collection1/conf/solrconfig.xml to /configs/conf1/solrconfig.xml
> [junit4:junit4]   2> 2406 T19 oascc.SolrZkClient.makePath makePath: /configs/conf1/solrconfig.xml
> [junit4:junit4]   2> 2422 T19 oasc.AbstractZkTestCase.putConfig put /usr/home/hudson/hudson-slave/workspace/Lucene-Solr-Tests-trunk-java7/solr/build/solr-core/test-files/solr/collection1/conf/schema.xml to /configs/conf1/schema.xml
> [junit4:junit4]   2> 2423 T19 oascc.SolrZkClient.makePath makePath: /configs/conf1/schema.xml
> [junit4:junit4]   2> 2538 T19 oasc.AbstractZkTestCase.putConfig put /usr/home/hudson/hudson-slave/workspace/Lucene-Solr-Tests-trunk-java7/solr/build/solr-core/test-files/solr/collection1/conf/solrconfig.xml to /configs/conf1/solrconfig.xml
> [junit4:junit4]   2> 2539 T19 oascc.SolrZkClient.makePath makePath: /configs/conf1/solrconfig.xml
> [junit4:junit4]   2> 2568 T19 oasc.AbstractZkTestCase.putConfig put /usr/home/hudson/hudson-slave/workspace/Lucene-Solr-Tests-trunk-java7/solr/build/solr-core/test-files/solr/collection1/conf/stopwords.txt to /configs/conf1/stopwords.txt
> [junit4:junit4]   2> 2569 T19 oascc.SolrZkClient.makePath makePath: /configs/conf1/stopwords.txt
> [junit4:junit4]   2> 2574 T19 oasc.AbstractZkTestCase.putConfig put /usr/home/hudson/hudson-slave/workspace/Lucene-Solr-Tests-trunk-java7/solr/build/solr-core/test-files/solr/collection1/conf/protwords.txt to /configs/conf1/protwords.txt
> [junit4:junit4]   2> 2576 T19 oascc.SolrZkClient.makePath makePath: /configs/conf1/protwords.txt
> [junit4:junit4]   2> 2580 T19 oasc.AbstractZkTestCase.putConfig put /usr/home/hudson/hudson-slave/workspace/Lucene-Solr-Tests-trunk-java7/solr/build/solr-core/test-files/solr/collection1/conf/currency.xml to /configs/conf1/currency.xml
> [junit4:junit4]   2> 2582 T19 oascc.SolrZkClient.makePath makePath: /configs/conf1/currency.xml
> [junit4:junit4]   2> 2587 T19 oasc.AbstractZkTestCase.putConfig put /usr/home/hudson/hudson-slave/workspace/Lucene-Solr-Tests-trunk-java7/solr/build/solr-core/test-files/solr/collection1/conf/open-exchange-rates.json to /configs/conf1/open-exchange-rates.json
> [junit4:junit4]   2> 2588 T19 oascc.SolrZkClient.makePath makePath: /configs/conf1/open-exchange-rates.json
> [junit4:junit4]   2> 2593 T19 oasc.AbstractZkTestCase.putConfig put /usr/home/hudson/hudson-slave/workspace/Lucene-Solr-Tests-trunk-java7/solr/build/solr-core/test-files/solr/collection1/conf/mapping-ISOLatin1Accent.txt to /configs/conf1/mapping-ISOLatin1Accent.txt
> [junit4:junit4]   2> 2594 T19 oascc.SolrZkClient.makePath makePath: /configs/conf1/mapping-ISOLatin1Accent.txt
> [junit4:junit4]   2> 2599 T19 oasc.AbstractZkTestCase.putConfig put /usr/home/hudson/hudson-slave/workspace/Lucene-Solr-Tests-trunk-java7/solr/build/solr-core/test-files/solr/collection1/conf/old_synonyms.txt to /configs/conf1/old_synonyms.txt
> [junit4:junit4]   2> 2600 T19 oascc.SolrZkClient.makePath makePath: /configs/conf1/old_synonyms.txt
> [junit4:junit4]   2> 2605 T19 oasc.AbstractZkTestCase.putConfig put /usr/home/hudson/hudson-slave/workspace/Lucene-Solr-Tests-trunk-java7/solr/build/solr-core/test-files/solr/collection1/conf/synonyms.txt to /configs/conf1/synonyms.txt
> [junit4:junit4]   2> 2606 T19 oascc.SolrZkClient.makePath makePath: /configs/conf1/synonyms.txt
> [junit4:junit4]   2> 2611 T26 oazs.PrepRequestProcessor.pRequest Processed session termination for sessionid: 0x13aa15037410001
> [junit4:junit4]   2> 2612 T28 oaz.ClientCnxn$EventThread.run EventThread shut down
> [junit4:junit4]   2> 2612 T21 oazs.NIOServerCnxn.closeSock Closed socket connection for client /140.211.11.196:58073 which had sessionid 0x13aa15037410001
> [junit4:junit4]   2> 2612 T19 oaz.ZooKeeper.close Session: 0x13aa15037410001 closed
> [junit4:junit4]   2> 3643 T19 oejs.Server.doStart jetty-8.1.2.v20120308
> [junit4:junit4]   2> 4010 T19 oejs.AbstractConnector.doStart Started SelectChannelConnector@0.0.0.0:58077
> [junit4:junit4]   2> 4076 T19 oasc.SolrResourceLoader.locateSolrHome JNDI not configured for solr (NoInitialContextEx)
> [junit4:junit4]   2> 4077 T19 oasc.SolrResourceLoader.locateSolrHome using system property solr.solr.home: /usr/home/hudson/hudson-slave/workspace/Lucene-Solr-Tests-trunk-java7/solr/build/solr-core/test/J0/./org.apache.solr.cloud.BasicDistributedZk2Test-controljetty-1351326121928
> [junit4:junit4]   2> 4077 T19 oasc.SolrResourceLoader.<init> new SolrResourceLoader for deduced Solr Home: '/usr/home/hudson/hudson-slave/workspace/Lucene-Solr-Tests-trunk-java7/solr/build/solr-core/test/J0/./org.apache.solr.cloud.BasicDistributedZk2Test-controljetty-1351326121928/'
> [junit4:junit4]   2> 4133 T19 oass.SolrDispatchFilter.init SolrDispatchFilter.init()
> [junit4:junit4]   2> 4134 T19 oasc.SolrResourceLoader.locateSolrHome JNDI not configured for solr (NoInitialContextEx)
> [junit4:junit4]   2> 4134 T19 oasc.SolrResourceLoader.locateSolrHome using system property solr.solr.home: /usr/home/hudson/hudson-slave/workspace/Lucene-Solr-Tests-trunk-java7/solr/build/solr-core/test/J0/./org.apache.solr.cloud.BasicDistributedZk2Test-controljetty-1351326121928
> [junit4:junit4]   2> 4135 T19 oasc.CoreContainer$Initializer.initialize looking for solr.xml: /usr/home/hudson/hudson-slave/workspace/Lucene-Solr-Tests-trunk-java7/solr/build/solr-core/test/J0/./org.apache.solr.cloud.BasicDistributedZk2Test-controljetty-1351326121928/solr.xml
> [junit4:junit4]   2> 4136 T19 oasc.CoreContainer.<init> New CoreContainer 24358278
> [junit4:junit4]   2> 4137 T19 oasc.CoreContainer.load Loading CoreContainer using Solr Home: '/usr/home/hudson/hudson-slave/workspace/Lucene-Solr-Tests-trunk-java7/solr/build/solr-core/test/J0/./org.apache.solr.cloud.BasicDistributedZk2Test-controljetty-1351326121928/'
> [junit4:junit4]   2> 4137 T19 oasc.SolrResourceLoader.<init> new SolrResourceLoader for directory: '/usr/home/hudson/hudson-slave/workspace/Lucene-Solr-Tests-trunk-java7/solr/build/solr-core/test/J0/./org.apache.solr.cloud.BasicDistributedZk2Test-controljetty-1351326121928/'
> [junit4:junit4]   2> 4178 T19 oasc.CoreContainer.load Registering Log Listener
> [junit4:junit4]   2> 4196 T19 oasc.CoreContainer.initZooKeeper Zookeeper client=127.0.0.1:58068/solr
> [junit4:junit4]   2> 4245 T19 oaz.ZooKeeper.<init> Initiating client connection, connectString=127.0.0.1:58068/solr sessionTimeout=5000 watcher=org.apache.solr.common.cloud.ConnectionManager@7ac03fdb
> [junit4:junit4]   2> 4246 T39 oaz.ClientCnxn$SendThread.startConnect Opening socket connection to server /127.0.0.1:58068
> [junit4:junit4]   2> 4246 T19 oascc.ConnectionManager.waitForConnected Waiting for client to connect to ZooKeeper
> [junit4:junit4]   2> 4248 T39 oaz.ClientCnxn$SendThread.primeConnection Socket connection established to localhost/127.0.0.1:58068, initiating session
> [junit4:junit4]   2> 4248 T21 oazs.NIOServerCnxn$Factory.run Accepted socket connection from /140.211.11.196:58078
> [junit4:junit4]   2> 4249 T21 oazs.NIOServerCnxn.readConnectRequest Client attempting to establish new session at /140.211.11.196:58078
> [junit4:junit4]   2> 4252 T24 oazs.NIOServerCnxn.finishSessionInit Established session 0x13aa15037410002 with negotiated timeout 5000 for client /140.211.11.196:58078
> [junit4:junit4]   2> 4253 T39 oaz.ClientCnxn$SendThread.readConnectResult Session establishment complete on server localhost/127.0.0.1:58068, sessionid = 0x13aa15037410002, negotiated timeout = 5000
> [junit4:junit4]   2> 4254 T40 oascc.ConnectionManager.process Watcher org.apache.solr.common.cloud.ConnectionManager@7ac03fdb name:ZooKeeperConnection Watcher:127.0.0.1:58068/solr got event WatchedEvent state:SyncConnected type:None path:null path:null type:None
> [junit4:junit4]   2> 4254 T19 oascc.ConnectionManager.waitForConnected Client is connected to ZooKeeper
> [junit4:junit4]   2> 4307 T26 oazs.PrepRequestProcessor.pRequest Got user-level KeeperException when processing sessionid:0x13aa15037410002 type:create cxid:0x2 zxid:0xfffffffffffffffe txntype:unknown reqpath:n/a Error Path:/solr/overseer Error:KeeperErrorCode = NodeExists for /solr/overseer
> [junit4:junit4]   2> 4389 T19 oascc.SolrZkClient.makePath makePath: /live_nodes
> [junit4:junit4]   2> 4420 T19 oasc.ZkController.createEphemeralLiveNode Register node as live in ZooKeeper:/live_nodes/127.0.0.1:58077_solr
> [junit4:junit4]   2> 4425 T26 oazs.PrepRequestProcessor.pRequest Got user-level KeeperException when processing sessionid:0x13aa15037410002 type:delete cxid:0x7 zxid:0xfffffffffffffffe txntype:unknown reqpath:n/a Error Path:/solr/live_nodes/127.0.0.1:58077_solr Error:KeeperErrorCode = NoNode for /solr/live_nodes/127.0.0.1:58077_solr
> [junit4:junit4]   2> 4501 T19 oascc.SolrZkClient.makePath makePath: /live_nodes/127.0.0.1:58077_solr
> [junit4:junit4]   2> 4532 T19 oashc.HttpShardHandlerFactory.getParameter Setting socketTimeout to: 0
> [junit4:junit4]   2> 4533 T19 oashc.HttpShardHandlerFactory.getParameter Setting urlScheme to: http://
> [junit4:junit4]   2> 4534 T19 oashc.HttpShardHandlerFactory.getParameter Setting connTimeout to: 0
> [junit4:junit4]   2> 4534 T19 oashc.HttpShardHandlerFactory.getParameter Setting maxConnectionsPerHost to: 20
> [junit4:junit4]   2> 4535 T19 oashc.HttpShardHandlerFactory.getParameter Setting corePoolSize to: 0
> [junit4:junit4]   2> 4536 T19 oashc.HttpShardHandlerFactory.getParameter Setting maximumPoolSize to: 2147483647
> [junit4:junit4]   2> 4537 T19 oashc.HttpShardHandlerFactory.getParameter Setting maxThreadIdleTime to: 5
> [junit4:junit4]   2> 4538 T19 oashc.HttpShardHandlerFactory.getParameter Setting sizeOfQueue to: -1
> [junit4:junit4]   2> 4539 T19 oashc.HttpShardHandlerFactory.getParameter Setting fairnessPolicy to: false
> [junit4:junit4]   2> 4540 T19 oascsi.HttpClientUtil.createClient Creating new http client, config:maxConnectionsPerHost=20&maxConnections=10000&socketTimeout=0&connTimeout=0&retry=false
> [junit4:junit4]   2> 4564 T19 oascc.SolrZkClient.makePath makePath: /overseer_elect/election
> [junit4:junit4]   2> 4601 T26 oazs.PrepRequestProcessor.pRequest Got user-level KeeperException when processing sessionid:0x13aa15037410002 type:delete cxid:0x15 zxid:0xfffffffffffffffe txntype:unknown reqpath:n/a Error Path:/solr/overseer_elect/leader Error:KeeperErrorCode = NoNode for /solr/overseer_elect/leader
> [junit4:junit4]   2> 4603 T19 oascc.SolrZkClient.makePath makePath: /overseer_elect/leader
> [junit4:junit4]   2> 4608 T19 oasc.Overseer.start Overseer (id=88560508583608322-127.0.0.1:58077_solr-n_0000000000) starting
> [junit4:junit4]   2> 4610 T26 oazs.PrepRequestProcessor.pRequest Got user-level KeeperException when processing sessionid:0x13aa15037410002 type:create cxid:0x1a zxid:0xfffffffffffffffe txntype:unknown reqpath:n/a Error Path:/solr/overseer Error:KeeperErrorCode = NodeExists for /solr/overseer
> [junit4:junit4]   2> 4633 T26 oazs.PrepRequestProcessor.pRequest Got user-level KeeperException when processing sessionid:0x13aa15037410002 type:create cxid:0x1b zxid:0xfffffffffffffffe txntype:unknown reqpath:n/a Error Path:/solr/overseer Error:KeeperErrorCode = NodeExists for /solr/overseer
> [junit4:junit4]   2> 4635 T26 oazs.PrepRequestProcessor.pRequest Got user-level KeeperException when processing sessionid:0x13aa15037410002 type:create cxid:0x1c zxid:0xfffffffffffffffe txntype:unknown reqpath:n/a Error Path:/solr/overseer Error:KeeperErrorCode = NodeExists for /solr/overseer
> [junit4:junit4]   2> 4645 T26 oazs.PrepRequestProcessor.pRequest Got user-level KeeperException when processing sessionid:0x13aa15037410002 type:create cxid:0x1d zxid:0xfffffffffffffffe txntype:unknown reqpath:n/a Error Path:/solr/overseer Error:KeeperErrorCode = NodeExists for /solr/overseer
> [junit4:junit4]   2> 4646 T46 oasc.OverseerCollectionProcessor.run Process current queue of collection creations
> [junit4:junit4]   2> 4648 T19 oascc.SolrZkClient.makePath makePath: /clusterstate.json
> [junit4:junit4]   2> 4652 T19 oascc.ZkStateReader.createClusterStateWatchersAndUpdate Updating cluster state from ZooKeeper...
> [junit4:junit4]   2> 4685 T45 oasc.Overseer$ClusterStateUpdater.run Starting to work on the main queue
> [junit4:junit4]   2> 4742 T19 oasc.CoreContainer.create Creating SolrCore 'collection1' using instanceDir: /usr/home/hudson/hudson-slave/workspace/Lucene-Solr-Tests-trunk-java7/solr/build/solr-core/test/J0/./org.apache.solr.cloud.BasicDistributedZk2Test-controljetty-1351326121928/collection1
> [junit4:junit4]   2> 4743 T19 oasc.ZkController.createCollectionZkNode Check for collection zkNode:control_collection
> [junit4:junit4]   2> 4745 T19 oasc.ZkController.createCollectionZkNode Collection zkNode exists
> [junit4:junit4]   2> 4745 T19 oasc.ZkController.readConfigName Load collection config from:/collections/control_collection
> [junit4:junit4]   2> 4748 T19 oasc.SolrResourceLoader.<init> new SolrResourceLoader for directory: '/usr/home/hudson/hudson-slave/workspace/Lucene-Solr-Tests-trunk-java7/solr/build/solr-core/test/J0/./org.apache.solr.cloud.BasicDistributedZk2Test-controljetty-1351326121928/collection1/'
> [junit4:junit4]   2> 4751 T19 oasc.SolrResourceLoader.replaceClassLoader Adding 'file:/usr/home/hudson/hudson-slave/workspace/Lucene-Solr-Tests-trunk-java7/solr/build/solr-core/test/J0/org.apache.solr.cloud.BasicDistributedZk2Test-controljetty-1351326121928/collection1/lib/classes/' to classloader
> [junit4:junit4]   2> 4752 T19 oasc.SolrResourceLoader.replaceClassLoader Adding 'file:/usr/home/hudson/hudson-slave/workspace/Lucene-Solr-Tests-trunk-java7/solr/build/solr-core/test/J0/org.apache.solr.cloud.BasicDistributedZk2Test-controljetty-1351326121928/collection1/lib/README' to classloader
> [junit4:junit4]   2> 5001 T19 oasc.SolrConfig.<init> Using Lucene MatchVersion: LUCENE_50
> [junit4:junit4]   2> 5137 T19 oasc.SolrConfig.<init> Loaded SolrConfig: solrconfig.xml
> [junit4:junit4]   2> 5189 T19 oass.IndexSchema.readSchema Reading Solr Schema
> [junit4:junit4]   2> 5259 T19 oass.IndexSchema.readSchema Schema name=test
> [junit4:junit4]   2> 6068 T19 oass.OpenExchangeRatesOrgProvider.init Initialized with rates=open-exchange-rates.json, refreshInterval=1440.
> [junit4:junit4]   2> 6089 T19 oass.IndexSchema.readSchema default search field in schema is text
> [junit4:junit4]   2> 6092 T19 oass.IndexSchema.readSchema unique key field: id
> [junit4:junit4]   2> 6120 T19 oass.FileExchangeRateProvider.reload Reloading exchange rates from file currency.xml
> [junit4:junit4]   2> 6127 T19 oass.FileExchangeRateProvider.reload Reloading exchange rates from file currency.xml
> [junit4:junit4]   2> 6132 T19 oass.OpenExchangeRatesOrgProvider.reload Reloading exchange rates from open-exchange-rates.json
> [junit4:junit4]   2> 6136 T19 oass.OpenExchangeRatesOrgProvider.reload Reloading exchange rates from open-exchange-rates.json
> [junit4:junit4]   2> 6140 T19 oasc.SolrCore.<init> [collection1] Opening new SolrCore at /usr/home/hudson/hudson-slave/workspace/Lucene-Solr-Tests-trunk-java7/solr/build/solr-core/test/J0/./org.apache.solr.cloud.BasicDistributedZk2Test-controljetty-1351326121928/collection1/, dataDir=./org.apache.solr.cloud.BasicDistributedZk2Test-1351326119324/control/data/
> [junit4:junit4]   2> 6147 T19 oasc.JmxMonitoredMap.<init> JMX monitoring is enabled. Adding Solr mbeans to JMX Server: com.sun.jmx.mbeanserver.JmxMBeanServer@834f715
> [junit4:junit4]   2> 6152 T19 oasc.SolrCore.initDirectoryFactory solr.NRTCachingDirectoryFactory
> [junit4:junit4]   2> 6187 T19 oasc.CachingDirectoryFactory.injectLockFactory WARNING No lockType configured for NRTCachingDirectory(org.apache.lucene.store.NIOFSDirectory@/usr/home/hudson/hudson-slave/workspace/Lucene-Solr-Tests-trunk-java7/solr/build/solr-core/test/J0/org.apache.solr.cloud.BasicDistributedZk2Test-1351326119324/control/data lockFactory=org.apache.lucene.store.NativeFSLockFactory@4d95e9c4; maxCacheMB=48.0 maxMergeSizeMB=4.0) assuming 'simple'
> [junit4:junit4]   2> 6188 T19 oasc.CachingDirectoryFactory.get return new directory for /usr/home/hudson/hudson-slave/workspace/Lucene-Solr-Tests-trunk-java7/solr/build/solr-core/test/J0/./org.apache.solr.cloud.BasicDistributedZk2Test-1351326119324/control/data forceNew:false
> [junit4:junit4]   2> 6189 T19 oasc.CachingDirectoryFactory.close Releasing directory:/usr/home/hudson/hudson-slave/workspace/Lucene-Solr-Tests-trunk-java7/solr/build/solr-core/test/J0/./org.apache.solr.cloud.BasicDistributedZk2Test-1351326119324/control/data
> [junit4:junit4]   2> 6189 T19 oasc.SolrCore.getNewIndexDir New index directory detected: old=null new=./org.apache.solr.cloud.BasicDistributedZk2Test-1351326119324/control/data/index/
> [junit4:junit4]   2> 6190 T19 oasc.SolrCore.initIndex WARNING [collection1] Solr index directory './org.apache.solr.cloud.BasicDistributedZk2Test-1351326119324/control/data/index' doesn't exist. Creating new index...
> [junit4:junit4]   2> 6191 T19 oasc.CachingDirectoryFactory.get return new directory for /usr/home/hudson/hudson-slave/workspace/Lucene-Solr-Tests-trunk-java7/solr/build/solr-core/test/J0/./org.apache.solr.cloud.BasicDistributedZk2Test-1351326119324/control/data/index forceNew:false
> [junit4:junit4]   2> 6220 T19 oasc.SolrDeletionPolicy.onCommit SolrDeletionPolicy.onCommit: commits:num=1
> [junit4:junit4]   2>            commit{dir=NRTCachingDirectory(org.apache.lucene.store.NIOFSDirectory@/usr/home/hudson/hudson-slave/workspace/Lucene-Solr-Tests-trunk-java7/solr/build/solr-core/test/J0/org.apache.solr.cloud.BasicDistributedZk2Test-1351326119324/control/data/index lockFactory=org.apache.lucene.store.NativeFSLockFactory@7e76b2bd; maxCacheMB=48.0 maxMergeSizeMB=4.0),segFN=segments_1,generation=1,filenames=[segments_1]
> [junit4:junit4]   2> 6221 T19 oasc.SolrDeletionPolicy.updateCommits newest commit = 1[segments_1]
> [junit4:junit4]   2> 6222 T19 oasc.CachingDirectoryFactory.close Releasing directory:/usr/home/hudson/hudson-slave/workspace/Lucene-Solr-Tests-trunk-java7/solr/build/solr-core/test/J0/./org.apache.solr.cloud.BasicDistributedZk2Test-1351326119324/control/data/index
> [junit4:junit4]   2> 6249 T19 oasc.SolrCore.initWriters created xml: solr.XMLResponseWriter
> [junit4:junit4]   2> 6376 T19 oasup.UpdateRequestProcessorChain.init inserting DistributedUpdateProcessorFactory into updateRequestProcessorChain "dedupe"
> [junit4:junit4]   2> 6377 T19 oasup.UpdateRequestProcessorChain.init inserting DistributedUpdateProcessorFactory into updateRequestProcessorChain "dedupe-allfields"
> [junit4:junit4]   2> 6377 T19 oasup.UpdateRequestProcessorChain.init inserting DistributedUpdateProcessorFactory into updateRequestProcessorChain "stored_sig"
> [junit4:junit4]   2> 6385 T19 oasup.UpdateRequestProcessorChain.init inserting DistributedUpdateProcessorFactory into updateRequestProcessorChain "uniq-fields"
> [junit4:junit4]   2> 6488 T19 oasup.UpdateRequestProcessorChain.init inserting DistributedUpdateProcessorFactory into updateRequestProcessorChain "distrib-dup-test-chain-implicit"
> [junit4:junit4]   2> 6489 T19 oasc.RequestHandlers.initHandlersFromConfig adding lazy requestHandler: solr.ReplicationHandler
> [junit4:junit4]   2> 6493 T19 oasc.RequestHandlers.initHandlersFromConfig created /replication: solr.ReplicationHandler
> [junit4:junit4]   2> 6494 T19 oasc.RequestHandlers.initHandlersFromConfig created standard: solr.StandardRequestHandler
> [junit4:junit4]   2> 6512 T19 oasc.RequestHandlers.initHandlersFromConfig created /get: solr.RealTimeGetHandler
> [junit4:junit4]   2> 6567 T19 oasc.RequestHandlers.initHandlersFromConfig created dismax: solr.SearchHandler
> [junit4:junit4]   2> 6570 T19 oasc.RequestHandlers.initHandlersFromConfig created mock: org.apache.solr.core.MockQuerySenderListenerReqHandler
> [junit4:junit4]   2> 6576 T19 oasc.RequestHandlers.initHandlersFromConfig created /admin/: org.apache.solr.handler.admin.AdminHandlers
> [junit4:junit4]   2> 6577 T19 oasc.RequestHandlers.initHandlersFromConfig created defaults: solr.StandardRequestHandler
> [junit4:junit4]   2> 6578 T19 oasc.RequestHandlers.initHandlersFromConfig adding lazy requestHandler: solr.StandardRequestHandler
> [junit4:junit4]   2> 6579 T19 oasc.RequestHandlers.initHandlersFromConfig created lazy: solr.StandardRequestHandler
> [junit4:junit4]   2> 6594 T19 oasc.RequestHandlers.initHandlersFromConfig created /update: solr.UpdateRequestHandler
> [junit4:junit4]   2> 6595 T19 oasc.RequestHandlers.initHandlersFromConfig created /terms: org.apache.solr.handler.component.SearchHandler
> [junit4:junit4]   2> 6596 T19 oasc.RequestHandlers.initHandlersFromConfig created spellCheckCompRH: org.apache.solr.handler.component.SearchHandler
> [junit4:junit4]   2> 6597 T19 oasc.RequestHandlers.initHandlersFromConfig created spellCheckCompRH_Direct: org.apache.solr.handler.component.SearchHandler
> [junit4:junit4]   2> 6598 T19 oasc.RequestHandlers.initHandlersFromConfig created spellCheckWithWordbreak: org.apache.solr.handler.component.SearchHandler
> [junit4:junit4]   2> 6599 T19 oasc.RequestHandlers.initHandlersFromConfig created spellCheckWithWordbreak_Direct: org.apache.solr.handler.component.SearchHandler
> [junit4:junit4]   2> 6600 T19 oasc.RequestHandlers.initHandlersFromConfig created spellCheckCompRH1: org.apache.solr.handler.component.SearchHandler
> [junit4:junit4]   2> 6601 T19 oasc.RequestHandlers.initHandlersFromConfig created tvrh: org.apache.solr.handler.component.SearchHandler
> [junit4:junit4]   2> 6620 T19 oasc.RequestHandlers.initHandlersFromConfig created /mlt: solr.MoreLikeThisHandler
> [junit4:junit4]   2> 6638 T19 oasc.RequestHandlers.initHandlersFromConfig created /debug/dump: solr.DumpRequestHandler
> [junit4:junit4]   2> 6648 T19 oashl.XMLLoader.init xsltCacheLifetimeSeconds=60
> [junit4:junit4]   2> 6653 T19 oasc.SolrCore.initDeprecatedSupport WARNING solrconfig.xml uses deprecated <admin/gettableFiles>, Please update your config to use the ShowFileRequestHandler.
> [junit4:junit4]   2> 6659 T19 oasc.SolrCore.initDeprecatedSupport WARNING adding ShowFileRequestHandler with hidden files: [SCHEMA.XML, OLD_SYNONYMS.TXT, STOPWORDS.TXT, PROTWORDS.TXT, OPEN-EXCHANGE-RATES.JSON, SYNONYMS.TXT, CURRENCY.XML, MAPPING-ISOLATIN1ACCENT.TXT]
> [junit4:junit4]   2> 6664 T19 oasc.CachingDirectoryFactory.close Releasing directory:/usr/home/hudson/hudson-slave/workspace/Lucene-Solr-Tests-trunk-java7/solr/build/solr-core/test/J0/./org.apache.solr.cloud.BasicDistributedZk2Test-1351326119324/control/data
> [junit4:junit4]   2> 6668 T19 oass.SolrIndexSearcher.<init> Opening Searcher@5c10826c main
> [junit4:junit4]   2> 6722 T19 oasu.CommitTracker.<init> Hard AutoCommit: disabled
> [junit4:junit4]   2> 6722 T19 oasu.CommitTracker.<init> Soft AutoCommit: disabled
> [junit4:junit4]   2> 6724 T19 oashc.SpellCheckComponent.inform Initializing spell checkers
> [junit4:junit4]   2> 6891 T19 oass.DirectSolrSpellChecker.init init: {name=direct,classname=DirectSolrSpellChecker,field=lowerfilt,minQueryLength=3}
> [junit4:junit4]   2> 7266 T47 oasc.SolrCore.registerSearcher [collection1] Registered new searcher Searcher@5c10826c main{StandardDirectoryReader(segments_1:1)}
> [junit4:junit4]   2> 7286 T19 oasc.ZkController.publish numShards not found on descriptor - reading it from system property
> [junit4:junit4]   2> 7288 T26 oazs.PrepRequestProcessor.pRequest Got user-level KeeperException when processing sessionid:0x13aa15037410002 type:create cxid:0x5f zxid:0xfffffffffffffffe txntype:unknown reqpath:n/a Error Path:/solr/overseer/queue Error:KeeperErrorCode = NoNode for /solr/overseer/queue
> [junit4:junit4]   2> 7301 T19 oasc.CoreContainer.register registering core: collection1
> [junit4:junit4]   2> 7302 T19 oasc.ZkController.register Register shard - core:collection1 address:http://127.0.0.1:58077/solr shardId:control_shard
> [junit4:junit4]   2> 7318 T19 oascsi.HttpClientUtil.createClient Creating new http client, config:maxConnections=10000&maxConnectionsPerHost=20&connTimeout=30000&socketTimeout=30000&retry=false
> [junit4:junit4]   2> 7338 T19 oascc.SolrZkClient.makePath makePath: /collections/control_collection/leader_elect/control_shard/election
> [junit4:junit4]   2> 7357 T26 oazs.PrepRequestProcessor.pRequest Got user-level KeeperException when processing sessionid:0x13aa15037410002 type:delete cxid:0x6e zxid:0xfffffffffffffffe txntype:unknown reqpath:n/a Error Path:/solr/collections/control_collection/leaders Error:KeeperErrorCode = NoNode for /solr/collections/control_collection/leaders
> [junit4:junit4]   2> 7358 T19 oasc.ShardLeaderElectionContext.runLeaderProcess Running the leader process.
> [junit4:junit4]   2> 7359 T26 oazs.PrepRequestProcessor.pRequest Got user-level KeeperException when processing sessionid:0x13aa15037410002 type:create cxid:0x6f zxid:0xfffffffffffffffe txntype:unknown reqpath:n/a Error Path:/solr/overseer Error:KeeperErrorCode = NodeExists for /solr/overseer
> [junit4:junit4]   2> 7704 T45 oascc.ZkStateReader.updateClusterState Updating cloud state from ZooKeeper...
> [junit4:junit4]   2> 7706 T45 oasc.Overseer$ClusterStateUpdater.updateState Update state numShards=null message={
> [junit4:junit4]   2>      "operation":"state",
> [junit4:junit4]   2>      "numShards":null,
> [junit4:junit4]   2>      "shard":"control_shard",
> [junit4:junit4]   2>      "roles":null,
> [junit4:junit4]   2>      "state":"down",
> [junit4:junit4]   2>      "core":"collection1",
> [junit4:junit4]   2>      "collection":"control_collection",
> [junit4:junit4]   2>      "node_name":"127.0.0.1:58077_solr",
> [junit4:junit4]   2>      "base_url":"http://127.0.0.1:58077/solr"}
> [junit4:junit4]   2> 7717 T26 oazs.PrepRequestProcessor.pRequest Got user-level KeeperException when processing sessionid:0x13aa15037410002 type:create cxid:0x76 zxid:0xfffffffffffffffe txntype:unknown reqpath:n/a Error Path:/solr/overseer/queue-work Error:KeeperErrorCode = NoNode for /solr/overseer/queue-work
> [junit4:junit4]   2> 7737 T40 oascc.ZkStateReader$2.process A cluster state change has occurred - updating... (1)
> [junit4:junit4]   2> 7863 T19 oasc.ShardLeaderElectionContext.waitForReplicasToComeUp Enough replicas found to continue.
> [junit4:junit4]   2> 7864 T19 oasc.ShardLeaderElectionContext.runLeaderProcess I may be the new leader - try and sync
> [junit4:junit4]   2> 7865 T19 oasc.SyncStrategy.sync Sync replicas to http://127.0.0.1:58077/solr/collection1/
> [junit4:junit4]   2> 7865 T19 oasc.SyncStrategy.syncReplicas Sync Success - now sync replicas to me
> [junit4:junit4]   2> 7867 T19 oasc.SyncStrategy.syncToMe http://127.0.0.1:58077/solr/collection1/ has no replicas
> [junit4:junit4]   2> 7867 T19 oasc.ShardLeaderElectionContext.runLeaderProcess I am the new leader: http://127.0.0.1:58077/solr/collection1/
> [junit4:junit4]   2> 7868 T19 oascc.SolrZkClient.makePath makePath: /collections/control_collection/leaders/control_shard
> [junit4:junit4]   2> 7882 T26 oazs.PrepRequestProcessor.pRequest Got user-level KeeperException when processing sessionid:0x13aa15037410002 type:create cxid:0x95 zxid:0xfffffffffffffffe txntype:unknown reqpath:n/a Error Path:/solr/overseer Error:KeeperErrorCode = NodeExists for /solr/overseer
> [junit4:junit4]   2> 8245 T45 oascc.ZkStateReader.updateClusterState Updating cloud state from ZooKeeper...
> [junit4:junit4]   2> 8263 T40 oascc.ZkStateReader$2.process A cluster state change has occurred - updating... (1)
> [junit4:junit4]   2> 8299 T19 oasc.ZkController.register We are http://127.0.0.1:58077/solr/collection1/ and leader is http://127.0.0.1:58077/solr/collection1/
> [junit4:junit4]   2> 8302 T19 oasc.ZkController.register No LogReplay needed for core=collection1 baseURL=http://127.0.0.1:58077/solr
> [junit4:junit4]   2> 8303 T19 oasc.ZkController.checkRecovery I am the leader, no recovery necessary
> [junit4:junit4]   2> 8303 T19 oasc.ZkController.publish numShards not found on descriptor - reading it from system property
> [junit4:junit4]   2> 8306 T19 oascc.ZkStateReader.updateClusterState Updating cloud state from ZooKeeper...
> [junit4:junit4]   2> 8307 T19 oass.SolrDispatchFilter.init user.dir=/usr/home/hudson/hudson-slave/workspace/Lucene-Solr-Tests-trunk-java7/solr/build/solr-core/test/J0
> [junit4:junit4]   2> 8308 T19 oass.SolrDispatchFilter.init SolrDispatchFilter.init() done
> [junit4:junit4]   2> 8356 T19 oascsi.HttpClientUtil.createClient Creating new http client, config:maxConnections=128&maxConnectionsPerHost=32&followRedirects=false
> [junit4:junit4]   2> 8376 T19 oascsi.HttpClientUtil.createClient Creating new http client, config:
> [junit4:junit4]   2> 8389 T19 oaz.ZooKeeper.<init> Initiating client connection, connectString=127.0.0.1:58068/solr sessionTimeout=10000 watcher=org.apache.solr.common.cloud.ConnectionManager@6211e63b
> [junit4:junit4]   2> 8390 T48 oaz.ClientCnxn$SendThread.startConnect Opening socket connection to server /127.0.0.1:58068
> [junit4:junit4]   2> 8390 T19 oascc.ConnectionManager.waitForConnected Waiting for client to connect to ZooKeeper
> [junit4:junit4]   2> 8391 T48 oaz.ClientCnxn$SendThread.primeConnection Socket connection established to localhost/127.0.0.1:58068, initiating session
> [junit4:junit4]   2> 8392 T21 oazs.NIOServerCnxn$Factory.run Accepted socket connection from /140.211.11.196:58090
> [junit4:junit4]   2> 8392 T21 oazs.NIOServerCnxn.readConnectRequest Client attempting to establish new session at /140.211.11.196:58090
> [junit4:junit4]   2> 8394 T24 oazs.NIOServerCnxn.finishSessionInit Established session 0x13aa15037410003 with negotiated timeout 10000 for client /140.211.11.196:58090
> [junit4:junit4]   2> 8394 T48 oaz.ClientCnxn$SendThread.readConnectResult Session establishment complete on server localhost/127.0.0.1:58068, sessionid = 0x13aa15037410003, negotiated timeout = 10000
> [junit4:junit4]   2> 8395 T49 oascc.ConnectionManager.process Watcher org.apache.solr.common.cloud.ConnectionManager@6211e63b name:ZooKeeperConnection Watcher:127.0.0.1:58068/solr got event WatchedEvent state:SyncConnected type:None path:null path:null type:None
> [junit4:junit4]   2> 8395 T19 oascc.ConnectionManager.waitForConnected Client is connected to ZooKeeper
> [junit4:junit4]   2> 8396 T19 oascc.ZkStateReader.createClusterStateWatchersAndUpdate Updating cluster state from ZooKeeper...
> [junit4:junit4]   2> 8401 T19 oasc.ChaosMonkey.monkeyLog monkey: init - expire sessions:true cause connection loss:true
> [junit4:junit4]   2> 8521 T19 oejs.Server.doStart jetty-8.1.2.v20120308
> [junit4:junit4]   2> 8524 T19 oejs.AbstractConnector.doStart Started SelectChannelConnector@0.0.0.0:58091
> [junit4:junit4]   2> 8525 T19 oasc.SolrResourceLoader.locateSolrHome JNDI not configured for solr (NoInitialContextEx)
> [junit4:junit4]   2> 8525 T19 oasc.SolrResourceLoader.locateSolrHome using system property solr.solr.home: /usr/home/hudson/hudson-slave/workspace/Lucene-Solr-Tests-trunk-java7/solr/build/solr-core/test/J0/./org.apache.solr.cloud.BasicDistributedZk2Test-jetty1-1351326127715
> [junit4:junit4]   2> 8526 T19 oasc.SolrResourceLoader.<init> new SolrResourceLoader for deduced Solr Home: '/usr/home/hudson/hudson-slave/workspace/Lucene-Solr-Tests-trunk-java7/solr/build/solr-core/test/J0/./org.apache.solr.cloud.BasicDistributedZk2Test-jetty1-1351326127715/'
> [junit4:junit4]   2> 8558 T19 oass.SolrDispatchFilter.init SolrDispatchFilter.init()
> [junit4:junit4]   2> 8559 T19 oasc.SolrResourceLoader.locateSolrHome JNDI not configured for solr (NoInitialContextEx)
> [junit4:junit4]   2> 8559 T19 oasc.SolrResourceLoader.locateSolrHome using system property solr.solr.home: /usr/home/hudson/hudson-slave/workspace/Lucene-Solr-Tests-trunk-java7/solr/build/solr-core/test/J0/./org.apache.solr.cloud.BasicDistributedZk2Test-jetty1-1351326127715
> [junit4:junit4]   2> 8560 T19 oasc.CoreContainer$Initializer.initialize looking for solr.xml: /usr/home/hudson/hudson-slave/workspace/Lucene-Solr-Tests-trunk-java7/solr/build/solr-core/test/J0/./org.apache.solr.cloud.BasicDistributedZk2Test-jetty1-1351326127715/solr.xml
> [junit4:junit4]   2> 8560 T19 oasc.CoreContainer.<init> New CoreContainer 1569386299
> [junit4:junit4]   2> 8561 T19 oasc.CoreContainer.load Loading CoreContainer using Solr Home: '/usr/home/hudson/hudson-slave/workspace/Lucene-Solr-Tests-trunk-java7/solr/build/solr-core/test/J0/./org.apache.solr.cloud.BasicDistributedZk2Test-jetty1-1351326127715/'
> [junit4:junit4]   2> 8561 T19 oasc.SolrResourceLoader.<init> new SolrResourceLoader for directory: '/usr/home/hudson/hudson-slave/workspace/Lucene-Solr-Tests-trunk-java7/solr/build/solr-core/test/J0/./org.apache.solr.cloud.BasicDistributedZk2Test-jetty1-1351326127715/'
> [junit4:junit4]   2> 8587 T19 oasc.CoreContainer.load Registering Log Listener
> [junit4:junit4]   2> 8616 T19 oasc.CoreContainer.initZooKeeper Zookeeper client=127.0.0.1:58068/solr
> [junit4:junit4]   2> 8617 T19 oaz.ZooKeeper.<init> Initiating client connection, connectString=127.0.0.1:58068/solr sessionTimeout=5000 watcher=org.apache.solr.common.cloud.ConnectionManager@21a9234d
> [junit4:junit4]   2> 8618 T59 oaz.ClientCnxn$SendThread.startConnect Opening socket connection to server /127.0.0.1:58068
> [junit4:junit4]   2> 8618 T19 oascc.ConnectionManager.waitForConnected Waiting for client to connect to ZooKeeper
> [junit4:junit4]   2> 8620 T59 oaz.ClientCnxn$SendThread.primeConnection Socket connection established to localhost/127.0.0.1:58068, initiating session
> [junit4:junit4]   2> 8621 T21 oazs.NIOServerCnxn$Factory.run Accepted socket connection from /140.211.11.196:58092
> [junit4:junit4]   2> 8622 T21 oazs.NIOServerCnxn.readConnectRequest Client attempting to establish new session at /140.211.11.196:58092
> [junit4:junit4]   2> 8624 T24 oazs.NIOServerCnxn.finishSessionInit Established session 0x13aa15037410004 with negotiated timeout 5000 for client /140.211.11.196:58092
> [junit4:junit4]   2> 8624 T59 oaz.ClientCnxn$SendThread.readConnectResult Session establishment complete on server localhost/127.0.0.1:58068, sessionid = 0x13aa15037410004, negotiated timeout = 5000
> [junit4:junit4]   2> 8625 T60 oascc.ConnectionManager.process Watcher org.apache.solr.common.cloud.ConnectionManager@21a9234d name:ZooKeeperConnection Watcher:127.0.0.1:58068/solr got event WatchedEvent state:SyncConnected type:None path:null path:null type:None
> [junit4:junit4]   2> 8626 T19 oascc.ConnectionManager.waitForConnected Client is connected to ZooKeeper
> [junit4:junit4]   2> 8627 T26 oazs.PrepRequestProcessor.pRequest Got user-level KeeperException when processing sessionid:0x13aa15037410004 type:create cxid:0x1 zxid:0xfffffffffffffffe txntype:unknown reqpath:n/a Error Path:/solr/overseer Error:KeeperErrorCode = NodeExists for /solr/overseer
> [junit4:junit4]   2> 8629 T26 oazs.PrepRequestProcessor.pRequest Got user-level KeeperException when processing sessionid:0x13aa15037410004 type:create cxid:0x2 zxid:0xfffffffffffffffe txntype:unknown reqpath:n/a Error Path:/solr/overseer Error:KeeperErrorCode = NodeExists for /solr/overseer
> [junit4:junit4]   2> 8638 T19 oasc.ZkController.createEphemeralLiveNode Register node as live in ZooKeeper:/live_nodes/127.0.0.1:58091_solr
> [junit4:junit4]   2> 8639 T26 oazs.PrepRequestProcessor.pRequest Got user-level KeeperException when processing sessionid:0x13aa15037410004 type:delete cxid:0x4 zxid:0xfffffffffffffffe txntype:unknown reqpath:n/a Error Path:/solr/live_nodes/127.0.0.1:58091_solr Error:KeeperErrorCode = NoNode for /solr/live_nodes/127.0.0.1:58091_solr
> [junit4:junit4]   2> 8640 T19 oascc.SolrZkClient.makePath makePath: /live_nodes/127.0.0.1:58091_solr
> [junit4:junit4]   2> 8644 T40 oascc.ZkStateReader$2.process A cluster state change has occurred - updating... (1)
> [junit4:junit4]   2> 8645 T49 oascc.ZkStateReader$3.process Updating live nodes... (2)
> [junit4:junit4]   2> 8646 T19 oashc.HttpShardHandlerFactory.getParameter Setting socketTimeout to: 0
> [junit4:junit4]   2> 8647 T40 oascc.ZkStateReader$3.process Updating live nodes... (2)
> [junit4:junit4]   2> 8647 T19 oashc.HttpShardHandlerFactory.getParameter Setting urlScheme to: http://
> [junit4:junit4]   2> 8648 T19 oashc.HttpShardHandlerFactory.getParameter Setting connTimeout to: 0
> [junit4:junit4]   2> 8649 T19 oashc.HttpShardHandlerFactory.getParameter Setting maxConnectionsPerHost to: 20
> [junit4:junit4]   2> 8649 T19 oashc.HttpShardHandlerFactory.getParameter Setting corePoolSize to: 0
> [junit4:junit4]   2> 8650 T19 oashc.HttpShardHandlerFactory.getParameter Setting maximumPoolSize to: 2147483647
> [junit4:junit4]   2> 8651 T19 oashc.HttpShardHandlerFactory.getParameter Setting maxThreadIdleTime to: 5
> [junit4:junit4]   2> 8652 T19 oashc.HttpShardHandlerFactory.getParameter Setting sizeOfQueue to: -1
> [junit4:junit4]   2> 8652 T19 oashc.HttpShardHandlerFactory.getParameter Setting fairnessPolicy to: false
> [junit4:junit4]   2> 8653 T19 oascsi.HttpClientUtil.createClient Creating new http client, config:maxConnectionsPerHost=20&maxConnections=10000&socketTimeout=0&connTimeout=0&retry=false
> [junit4:junit4]   2> 8680 T19 oascc.ZkStateReader.createClusterStateWatchersAndUpdate Updating cluster state from ZooKeeper...
> [junit4:junit4]   2> 8690 T19 oasc.CoreContainer.create Creating SolrCore 'collection1' using instanceDir: /usr/home/hudson/hudson-slave/workspace/Lucene-Solr-Tests-trunk-java7/solr/build/solr-core/test/J0/./org.apache.solr.cloud.BasicDistributedZk2Test-jetty1-1351326127715/collection1
> [junit4:junit4]   2> 8691 T19 oasc.ZkController.createCollectionZkNode Check for collection zkNode:collection1
> [junit4:junit4]   2> 8693 T19 oasc.ZkController.createCollectionZkNode Collection zkNode exists
> [junit4:junit4]   2> 8693 T19 oasc.ZkController.readConfigName Load collection config from:/collections/collection1
> [junit4:junit4]   2> 8696 T19 oasc.SolrResourceLoader.<init> new SolrResourceLoader for directory: '/usr/home/hudson/hudson-slave/workspace/Lucene-Solr-Tests-trunk-java7/solr/build/solr-core/test/J0/./org.apache.solr.cloud.BasicDistributedZk2Test-jetty1-1351326127715/collection1/'
> [junit4:junit4]   2> 8698 T19 oasc.SolrResourceLoader.replaceClassLoader Adding 'file:/usr/home/hudson/hudson-slave/workspace/Lucene-Solr-Tests-trunk-java7/solr/build/solr-core/test/J0/org.apache.solr.cloud.BasicDistributedZk2Test-jetty1-1351326127715/collection1/lib/README' to classloader
> [junit4:junit4]   2> 8699 T19 oasc.SolrResourceLoader.replaceClassLoader Adding 'file:/usr/home/hudson/hudson-slave/workspace/Lucene-Solr-Tests-trunk-java7/solr/build/solr-core/test/J0/org.apache.solr.cloud.BasicDistributedZk2Test-jetty1-1351326127715/collection1/lib/classes/' to classloader
> [junit4:junit4]   2> 8774 T45 oascc.ZkStateReader.updateClusterState Updating cloud state from ZooKeeper...
> [junit4:junit4]   2> 8776 T45 oasc.Overseer$ClusterStateUpdater.updateState Update state numShards=null message={
> [junit4:junit4]   2>      "operation":"state",
> [junit4:junit4]   2>      "numShards":null,
> [junit4:junit4]   2>      "shard":"control_shard",
> [junit4:junit4]   2>      "roles":null,
> [junit4:junit4]   2>      "state":"active",
> [junit4:junit4]   2>      "core":"collection1",
> [junit4:junit4]   2>      "collection":"control_collection",
> [junit4:junit4]   2>      "node_name":"127.0.0.1:58077_solr",
> [junit4:junit4]   2>      "base_url":"http://127.0.0.1:58077/solr"}
> [junit4:junit4]   2> 8785 T40 oascc.ZkStateReader$2.process A cluster state change has occurred - updating... (2)
> [junit4:junit4]   2> 8785 T49 oascc.ZkStateReader$2.process A cluster state change has occurred - updating... (2)
> [junit4:junit4]   2> 8786 T60 oascc.ZkStateReader$2.process A cluster state change has occurred - updating... (2)
> [junit4:junit4]   2> 8791 T19 oasc.SolrConfig.<init> Using Lucene MatchVersion: LUCENE_50
> [junit4:junit4]   2> 8926 T19 oasc.SolrConfig.<init> Loaded SolrConfig: solrconfig.xml
> [junit4:junit4]   2> 9028 T19 oass.IndexSchema.readSchema Reading Solr Schema
> [junit4:junit4]   2> 9086 T19 oass.IndexSchema.readSchema Schema name=test
> [junit4:junit4]   2> 9795 T19 oass.OpenExchangeRatesOrgProvider.init Initialized with rates=open-exchange-rates.json, refreshInterval=1440.
> [junit4:junit4]   2> 9809 T19 oass.IndexSchema.readSchema default search field in schema is text
> [junit4:junit4]   2> 9812 T19 oass.IndexSchema.readSchema unique key field: id
> [junit4:junit4]   2> 9837 T19 oass.FileExchangeRateProvider.reload Reloading exchange rates from file currency.xml
> [junit4:junit4]   2> 9843 T19 oass.FileExchangeRateProvider.reload Reloading exchange rates from file currency.xml
> [junit4:junit4]   2> 9848 T19 oass.OpenExchangeRatesOrgProvider.reload Reloading exchange rates from open-exchange-rates.json
> [junit4:junit4]   2> 9851 T19 oass.OpenExchangeRatesOrgProvider.reload Reloading exchange rates from open-exchange-rates.json
> [junit4:junit4]   2> 9854 T19 oasc.SolrCore.<init> [collection1] Opening new SolrCore at /usr/home/hudson/hudson-slave/workspace/Lucene-Solr-Tests-trunk-java7/solr/build/solr-core/test/J0/./org.apache.solr.cloud.BasicDistributedZk2Test-jetty1-1351326127715/collection1/, dataDir=./org.apache.solr.cloud.BasicDistributedZk2Test-1351326119324/jetty1/
> [junit4:junit4]   2> 9855 T19 oasc.JmxMonitoredMap.<init> JMX monitoring is enabled. Adding Solr mbeans to JMX Server: com.sun.jmx.mbeanserver.JmxMBeanServer@834f715
> [junit4:junit4]   2> 9856 T19 oasc.SolrCore.initDirectoryFactory solr.NRTCachingDirectoryFactory
> [junit4:junit4]   2> 9857 T19 oasc.CachingDirectoryFactory.injectLockFactory WARNING No lockType configured for NRTCachingDirectory(org.apache.lucene.store.NIOFSDirectory@/usr/home/hudson/hudson-slave/workspace/Lucene-Solr-Tests-trunk-java7/solr/build/solr-core/test/J0/org.apache.solr.cloud.BasicDistributedZk2Test-1351326119324/jetty1 lockFactory=org.apache.lucene.store.NativeFSLockFactory@3ce89cd5; maxCacheMB=48.0 maxMergeSizeMB=4.0) assuming 'simple'
> [junit4:junit4]   2> 9857 T19 oasc.CachingDirectoryFactory.get return new directory for /usr/home/hudson/hudson-slave/workspace/Lucene-Solr-Tests-trunk-java7/solr/build/solr-core/test/J0/./org.apache.solr.cloud.BasicDistributedZk2Test-1351326119324/jetty1 forceNew:false
> [junit4:junit4]   2> 9858 T19 oasc.CachingDirectoryFactory.close Releasing directory:/usr/home/hudson/hudson-slave/workspace/Lucene-Solr-Tests-trunk-java7/solr/build/solr-core/test/J0/./org.apache.solr.cloud.BasicDistributedZk2Test-1351326119324/jetty1
> [junit4:junit4]   2> 9859 T19 oasc.SolrCore.getNewIndexDir New index directory detected: old=null new=./org.apache.solr.cloud.BasicDistributedZk2Test-1351326119324/jetty1/index/
> [junit4:junit4]   2> 9859 T19 oasc.SolrCore.initIndex WARNING [collection1] Solr index directory './org.apache.solr.cloud.BasicDistributedZk2Test-1351326119324/jetty1/index' doesn't exist. Creating new index...
> [junit4:junit4]   2> 9860 T19 oasc.CachingDirectoryFactory.get return new directory for /usr/home/hudson/hudson-slave/workspace/Lucene-Solr-Tests-trunk-java7/solr/build/solr-core/test/J0/./org.apache.solr.cloud.BasicDistributedZk2Test-1351326119324/jetty1/index forceNew:false
> [junit4:junit4]   2> 9866 T19 oasc.SolrDeletionPolicy.onCommit SolrDeletionPolicy.onCommit: commits:num=1
> [junit4:junit4]   2>            commit{dir=NRTCachingDirectory(org.apache.lucene.store.NIOFSDirectory@/usr/home/hudson/hudson-slave/workspace/Lucene-Solr-Tests-trunk-java7/solr/build/solr-core/test/J0/org.apache.solr.cloud.BasicDistributedZk2Test-1351326119324/jetty1/index lockFactory=org.apache.lucene.store.NativeFSLockFactory@6f7422d9; maxCacheMB=48.0 maxMergeSizeMB=4.0),segFN=segments_1,generation=1,filenames=[segments_1]
> [junit4:junit4]   2> 9866 T19 oasc.SolrDeletionPolicy.updateCommits newest commit = 1[segments_1]
> [junit4:junit4]   2> 9867 T19 oasc.CachingDirectoryFactory.close Releasing directory:/usr/home/hudson/hudson-slave/workspace/Lucene-Solr-Tests-trunk-java7/solr/build/solr-core/test/J0/./org.apache.solr.cloud.BasicDistributedZk2Test-1351326119324/jetty1/index
> [junit4:junit4]   2> 9868 T19 oasc.SolrCore.initWriters created xml: solr.XMLResponseWriter
> [junit4:junit4]   2> 9871 T19 oasup.UpdateRequestProcessorChain.init inserting DistributedUpdateProcessorFactory into updateRequestProcessorChain "dedupe"
> [junit4:junit4]   2> 9871 T19 oasup.UpdateRequestProcessorChain.init inserting DistributedUpdateProcessorFactory into updateRequestProcessorChain "dedupe-allfields"
> [junit4:junit4]   2> 9872 T19 oasup.UpdateRequestProcessorChain.init inserting DistributedUpdateProcessorFactory into updateRequestProcessorChain "stored_sig"
> [junit4:junit4]   2> 9873 T19 oasup.UpdateRequestProcessorChain.init inserting DistributedUpdateProcessorFactory into updateRequestProcessorChain "uniq-fields"
> [junit4:junit4]   2> 9874 T19 oasup.UpdateRequestProcessorChain.init inserting DistributedUpdateProcessorFactory into updateRequestProcessorChain "distrib-dup-test-chain-implicit"
> [junit4:junit4]   2> 9874 T19 oasc.RequestHandlers.initHandlersFromConfig adding lazy requestHandler: solr.ReplicationHandler
> [junit4:junit4]   2> 9875 T19 oasc.RequestHandlers.initHandlersFromConfig created /replication: solr.ReplicationHandler
> [junit4:junit4]   2> 9876 T19 oasc.RequestHandlers.initHandlersFromConfig created standard: solr.StandardRequestHandler
> [junit4:junit4]   2> 9877 T19 oasc.RequestHandlers.initHandlersFromConfig created /get: solr.RealTimeGetHandler
> [junit4:junit4]   2> 9879 T19 oasc.RequestHandlers.initHandlersFromConfig created dismax: solr.SearchHandler
> [junit4:junit4]   2> 9880 T19 oasc.RequestHandlers.initHandlersFromConfig created mock: org.apache.solr.core.MockQuerySenderListenerReqHandler
> [junit4:junit4]   2> 9881 T19 oasc.RequestHandlers.initHandlersFromConfig created /admin/: org.apache.solr.handler.admin.AdminHandlers
> [junit4:junit4]   2> 9882 T19 oasc.RequestHandlers.initHandlersFromConfig created defaults: solr.StandardRequestHandler
> [junit4:junit4]   2> 9882 T19 oasc.RequestHandlers.initHandlersFromConfig adding lazy requestHandler: solr.StandardRequestHandler
> [junit4:junit4]   2> 9883 T19 oasc.RequestHandlers.initHandlersFromConfig created lazy: solr.StandardRequestHandler
> [junit4:junit4]   2> 9884 T19 oasc.RequestHandlers.initHandlersFromConfig created /update: solr.UpdateRequestHandler
> [junit4:junit4]   2> 9886 T19 oasc.RequestHandlers.initHandlersFromConfig created /terms: org.apache.solr.handler.component.SearchHandler
> [junit4:junit4]   2> 9887 T19 oasc.RequestHandlers.initHandlersFromConfig created spellCheckCompRH: org.apache.solr.handler.component.SearchHandler
> [junit4:junit4]   2> 9888 T19 oasc.RequestHandlers.initHandlersFromConfig created spellCheckCompRH_Direct: org.apache.solr.handler.component.SearchHandler
> [junit4:junit4]   2> 9889 T19 oasc.RequestHandlers.initHandlersFromConfig created spellCheckWithWordbreak: org.apache.solr.handler.component.SearchHandler
> [junit4:junit4]   2> 9890 T19 oasc.RequestHandlers.initHandlersFromConfig created spellCheckWithWordbreak_Direct: org.apache.solr.handler.component.SearchHandler
> [junit4:junit4]   2> 9892 T19 oasc.RequestHandlers.initHandlersFromConfig created spellCheckCompRH1: org.apache.solr.handler.component.SearchHandler
> [junit4:junit4]   2> 9893 T19 oasc.RequestHandlers.initHandlersFromConfig created tvrh: org.apache.solr.handler.component.SearchHandler
> [junit4:junit4]   2> 9894 T19 oasc.RequestHandlers.initHandlersFromConfig created /mlt: solr.MoreLikeThisHandler
> [junit4:junit4]   2> 9896 T19 oasc.RequestHandlers.initHandlersFromConfig created /debug/dump: solr.DumpRequestHandler
> [junit4:junit4]   2> 9904 T19 oashl.XMLLoader.init xsltCacheLifetimeSeconds=60
> [junit4:junit4]   2> 9908 T19 oasc.SolrCore.initDeprecatedSupport WARNING solrconfig.xml uses deprecated <admin/gettableFiles>, Please update your config to use the ShowFileRequestHandler.
> [junit4:junit4]   2> 9910 T19 oasc.SolrCore.initDeprecatedSupport WARNING adding ShowFileRequestHandler with hidden files: [SCHEMA.XML, OLD_SYNONYMS.TXT, STOPWORDS.TXT, PROTWORDS.TXT, OPEN-EXCHANGE-RATES.JSON, SYNONYMS.TXT, CURRENCY.XML, MAPPING-ISOLATIN1ACCENT.TXT]
> [junit4:junit4]   2> 9913 T19 oasc.CachingDirectoryFactory.close Releasing directory:/usr/home/hudson/hudson-slave/workspace/Lucene-Solr-Tests-trunk-java7/solr/build/solr-core/test/J0/./org.apache.solr.cloud.BasicDistributedZk2Test-1351326119324/jetty1
> [junit4:junit4]   2> 9915 T19 oass.SolrIndexSearcher.<init> Opening Searcher@6610ead6 main
> [junit4:junit4]   2> 9916 T19 oasu.CommitTracker.<init> Hard AutoCommit: disabled
> [junit4:junit4]   2> 9916 T19 oasu.CommitTracker.<init> Soft AutoCommit: disabled
> [junit4:junit4]   2> 9918 T19 oashc.SpellCheckComponent.inform Initializing spell checkers
> [junit4:junit4]   2> 9935 T19 oass.DirectSolrSpellChecker.init init: {name=direct,classname=DirectSolrSpellChecker,field=lowerfilt,minQueryLength=3}
> [junit4:junit4]   2> 9996 T65 oasc.SolrCore.registerSearcher [collection1] Registered new searcher Searcher@6610ead6 main{StandardDirectoryReader(segments_1:1)}
> [junit4:junit4]   2> 10008 T19 oasc.ZkController.publish numShards not found on descriptor - reading it from system property
> [junit4:junit4]   2> 10302 T45 oascc.ZkStateReader.updateClusterState Updating cloud state from ZooKeeper...
> [junit4:junit4]   2> 10303 T45 oasc.Overseer$ClusterStateUpdater.updateState Update state numShards=2 message={
> [junit4:junit4]   2>      "operation":"state",
> [junit4:junit4]   2>      "numShards":"2",
> [junit4:junit4]   2>      "shard":null,
> [junit4:junit4]   2>      "roles":null,
> [junit4:junit4]   2>      "state":"down",
> [junit4:junit4]   2>      "core":"collection1",
> [junit4:junit4]   2>      "collection":"collection1",
> [junit4:junit4]   2>      "node_name":"127.0.0.1:58091_solr",
> [junit4:junit4]   2>      "base_url":"http://127.0.0.1:58091/solr"}
> [junit4:junit4]   2> 10304 T45 oasc.Overseer$ClusterStateUpdater.createCollection Create collection collection1 with numShards 2
> [junit4:junit4]   2> 10316 T49 oascc.ZkStateReader$2.process A cluster state change has occurred - updating... (2)
> [junit4:junit4]   2> 10316 T40 oascc.ZkStateReader$2.process A cluster state change has occurred - updating... (2)
> [junit4:junit4]   2> 10316 T60 oascc.ZkStateReader$2.process A cluster state change has occurred - updating... (2)
> [junit4:junit4]   2> 10512 T19 oasc.CoreContainer.register registering core: collection1
> [junit4:junit4]   2> 10512 T19 oasc.ZkController.register Register shard - core:collection1 address:http://127.0.0.1:58091/solr shardId:shard1
> [junit4:junit4]   2> 10514 T19 oascc.SolrZkClient.makePath makePath: /collections/collection1/leader_elect/shard1/election
> [junit4:junit4]   2> 10538 T26 oazs.PrepRequestProcessor.pRequest Got user-level KeeperException when processing sessionid:0x13aa15037410004 type:delete cxid:0x45 zxid:0xfffffffffffffffe txntype:unknown reqpath:n/a Error Path:/solr/collections/collection1/leaders Error:KeeperErrorCode = NoNode for /solr/collections/collection1/leaders
> [junit4:junit4]   2> 10539 T19 oasc.ShardLeaderElectionContext.runLeaderProcess Running the leader process.
> [junit4:junit4]   2> 10539 T26 oazs.PrepRequestProcessor.pRequest Got user-level KeeperException when processing sessionid:0x13aa15037410004 type:create cxid:0x46 zxid:0xfffffffffffffffe txntype:unknown reqpath:n/a Error Path:/solr/overseer Error:KeeperErrorCode = NodeExists for /solr/overseer
> [junit4:junit4]   2> 10549 T19 oasc.ShardLeaderElectionContext.waitForReplicasToComeUp Enough replicas found to continue.
> [junit4:junit4]   2> 10549 T19 oasc.ShardLeaderElectionContext.runLeaderProcess I may be the new leader - try and sync
> [junit4:junit4]   2> 10550 T19 oasc.SyncStrategy.sync Sync replicas to http://127.0.0.1:58091/solr/collection1/
> [junit4:junit4]   2> 10550 T19 oasc.SyncStrategy.syncReplicas Sync Success - now sync replicas to me
> [junit4:junit4]   2> 10551 T19 oasc.SyncStrategy.syncToMe http://127.0.0.1:58091/solr/collection1/ has no replicas
> [junit4:junit4]   2> 10551 T19 oasc.ShardLeaderElectionContext.runLeaderProcess I am the new leader: http://127.0.0.1:58091/solr/collection1/
> [junit4:junit4]   2> 10552 T19 oascc.SolrZkClient.makePath makePath: /collections/collection1/leaders/shard1
> [junit4:junit4]   2> 10556 T26 oazs.PrepRequestProcessor.pRequest Got user-level KeeperException when processing sessionid:0x13aa15037410004 type:create cxid:0x50 zxid:0xfffffffffffffffe txntype:unknown reqpath:n/a Error Path:/solr/overseer Error:KeeperErrorCode = NodeExists for /solr/overseer
> [junit4:junit4]   2> 10822 T45 oascc.ZkStateReader.updateClusterState Updating cloud state from ZooKeeper...
> [junit4:junit4]   2> 10854 T49 oascc.ZkStateReader$2.process A cluster state change has occurred - updating... (2)
> [junit4:junit4]   2> 10854 T60 oascc.ZkStateReader$2.process A cluster state change has occurred - updating... (2)
> [junit4:junit4]   2> 10854 T40 oascc.ZkStateReader$2.process A cluster state change has occurred - updating... (2)
> [junit4:junit4]   2> 10864 T19 oasc.ZkController.register We are http://127.0.0.1:58091/solr/collection1/ and leader is http://127.0.0.1:58091/solr/collection1/
> [junit4:junit4]   2> 10865 T19 oasc.ZkController.register No LogReplay needed for core=collection1 baseURL=http://127.0.0.1:58091/solr
> [junit4:junit4]   2> 10866 T19 oasc.ZkController.checkRecovery I am the leader, no recovery necessary
> [junit4:junit4]   2> 10867 T19 oasc.ZkController.publish numShards not found on descriptor - reading it from system property
> [junit4:junit4]   2> 10876 T19 oascc.ZkStateReader.updateClusterState Updating cloud state from ZooKeeper...
> [junit4:junit4]   2> 10877 T19 oass.SolrDispatchFilter.init user.dir=/usr/home/hudson/hudson-slave/workspace/Lucene-Solr-Tests-trunk-java7/solr/build/solr-core/test/J0
> [junit4:junit4]   2> 10878 T19 oass.SolrDispatchFilter.init SolrDispatchFilter.init() done
> [junit4:junit4]   2> 10879 T19 oascsi.HttpClientUtil.createClient Creating new http client, config:maxConnections=128&maxConnectionsPerHost=32&followRedirects=false
> [junit4:junit4]   2> 11094 T19 oejs.Server.doStart jetty-8.1.2.v20120308
> [junit4:junit4]   2> 11098 T19 oejs.AbstractConnector.doStart Started SelectChannelConnector@0.0.0.0:58096
> [junit4:junit4]   2> 11099 T19 oasc.SolrResourceLoader.locateSolrHome JNDI not configured for solr (NoInitialContextEx)
> [junit4:junit4]   2> 11100 T19 oasc.SolrResourceLoader.locateSolrHome using system property solr.solr.home: /usr/home/hudson/hudson-slave/workspace/Lucene-Solr-Tests-trunk-java7/solr/build/solr-core/test/J0/./org.apache.solr.cloud.BasicDistributedZk2Test-jetty2-1351326130210
> [junit4:junit4]   2> 11101 T19 oasc.SolrResourceLoader.<init> new SolrResourceLoader for deduced Solr Home: '/usr/home/hudson/hudson-slave/workspace/Lucene-Solr-Tests-trunk-java7/solr/build/solr-core/test/J0/./org.apache.solr.cloud.BasicDistributedZk2Test-jetty2-1351326130210/'
> [junit4:junit4]   2> 11147 T19 oass.SolrDispatchFilter.init SolrDispatchFilter.init()
> [junit4:junit4]   2> 11147 T19 oasc.SolrResourceLoader.locateSolrHome JNDI not configured for solr (NoInitialContextEx)
> [junit4:junit4]   2> 11148 T19 oasc.SolrResourceLoader.locateSolrHome using system property solr.solr.home: /usr/home/hudson/hudson-slave/workspace/Lucene-Solr-Tests-trunk-java7/solr/build/solr-core/test/J0/./org.apache.solr.cloud.BasicDistributedZk2Test-jetty2-1351326130210
> [junit4:junit4]   2> 11149 T19 oasc.CoreContainer$Initializer.initialize looking for solr.xml: /usr/home/hudson/hudson-slave/workspace/Lucene-Solr-Tests-trunk-java7/solr/build/solr-core/test/J0/./org.apache.solr.cloud.BasicDistributedZk2Test-jetty2-1351326130210/solr.xml
> [junit4:junit4]   2> 11149 T19 oasc.CoreContainer.<init> New CoreContainer 420407682
> [junit4:junit4]   2> 11151 T19 oasc.CoreContainer.load Loading CoreContainer using Solr Home: '/usr/home/hudson/hudson-slave/workspace/Lucene-Solr-Tests-trunk-java7/solr/build/solr-core/test/J0/./org.apache.solr.cloud.BasicDistributedZk2Test-jetty2-1351326130210/'
> [junit4:junit4]   2> 11151 T19 oasc.SolrResourceLoader.<init> new SolrResourceLoader for directory: '/usr/home/hudson/hudson-slave/workspace/Lucene-Solr-Tests-trunk-java7/solr/build/solr-core/test/J0/./org.apache.solr.cloud.BasicDistributedZk2Test-jetty2-1351326130210/'
> [junit4:junit4]   2> 11189 T19 oasc.CoreContainer.load Registering Log Listener
> [junit4:junit4]   2> 11210 T19 oasc.CoreContainer.initZooKeeper Zookeeper client=127.0.0.1:58068/solr
> [junit4:junit4]   2> 11211 T19 oaz.ZooKeeper.<init> Initiating client connection, connectString=127.0.0.1:58068/solr sessionTimeout=5000 watcher=org.apache.solr.common.cloud.ConnectionManager@37adabfc
> [junit4:junit4]   2> 11212 T75 oaz.ClientCnxn$SendThread.startConnect Opening socket connection to server /127.0.0.1:58068
> [junit4:junit4]   2> 11212 T19 oascc.ConnectionManager.waitForConnected Waiting for client to connect to ZooKeeper
> [junit4:junit4]   2> 11214 T75 oaz.ClientCnxn$SendThread.primeConnection Socket connection established to localhost/127.0.0.1:58068, initiating session
> [junit4:junit4]   2> 11214 T21 oazs.NIOServerCnxn$Factory.run Accepted socket connection from /140.211.11.196:58097
> [junit4:junit4]   2> 11215 T21 oazs.NIOServerCnxn.readConnectRequest Client attempting to establish new session at /140.211.11.196:58097
> [junit4:junit4]   2> 11217 T24 oazs.NIOServerCnxn.finishSessionInit Established session 0x13aa15037410005 with negotiated timeout 5000 for client /140.211.11.196:58097
> [junit4:junit4]   2> 11218 T75 oaz.ClientCnxn$SendThread.readConnectResult Session establishment complete on server localhost/127.0.0.1:58068, sessionid = 0x13aa15037410005, negotiated timeout = 5000
> [junit4:junit4]   2> 11218 T76 oascc.ConnectionManager.process Watcher org.apache.solr.common.cloud.ConnectionManager@37adabfc name:ZooKeeperConnection Watcher:127.0.0.1:58068/solr got event WatchedEvent state:SyncConnected type:None path:null path:null type:None
> [junit4:junit4]   2> 11219 T19 oascc.ConnectionManager.waitForConnected Client is connected to ZooKeeper
> [junit4:junit4]   2> 11220 T26 oazs.PrepRequestProcessor.pRequest Got user-level KeeperException when processing sessionid:0x13aa15037410005 type:create cxid:0x1 zxid:0xfffffffffffffffe txntype:unknown reqpath:n/a Error Path:/solr/overseer Error:KeeperErrorCode = NodeExists for /solr/overseer
> [junit4:junit4]   2> 11222 T26 oazs.PrepRequestProcessor.pRequest Got user-level KeeperException when processing sessionid:0x13aa15037410005 type:create cxid:0x2 zxid:0xfffffffffffffffe txntype:unknown reqpath:n/a Error Path:/solr/overseer Error:KeeperErrorCode = NodeExists for /solr/overseer
> [junit4:junit4]   2> 11224 T19 oasc.ZkController.createEphemeralLiveNode Register node as live in ZooKeeper:/live_nodes/127.0.0.1:58096_solr
> [junit4:junit4]   2> 11225 T26 oazs.PrepRequestProcessor.pRequest Got user-level KeeperException when processing sessionid:0x13aa15037410005 type:delete cxid:0x4 zxid:0xfffffffffffffffe txntype:unknown reqpath:n/a Error Path:/solr/live_nodes/127.0.0.1:58096_solr Error:KeeperErrorCode = NoNode for /solr/live_nodes/127.0.0.1:58096_solr
> [junit4:junit4]   2> 11233 T19 oascc.SolrZkClient.makePath makePath: /live_nodes/127.0.0.1:58096_solr
> [junit4:junit4]   2> 11236 T49 oascc.ZkStateReader$2.process A cluster state change has occurred - updating... (2)
> [junit4:junit4]   2> 11236 T40 oascc.ZkStateReader$2.process A cluster state change has occurred - updating... (2)
> [junit4:junit4]   2> 11237 T60 oascc.ZkStateReader$3.process Updating live nodes... (3)
> [junit4:junit4]   2> 11238 T60 oascc.ZkStateReader$2.process A cluster state change has occurred - updating... (3)
> [junit4:junit4]   2> 11238 T19 oashc.HttpShardHandlerFactory.getParameter Setting socketTimeout to: 0
> [junit4:junit4]   2> 11239 T49 oascc.ZkStateReader$3.process Updating live nodes... (3)
> [junit4:junit4]   2> 11239 T40 oascc.ZkStateReader$3.process Updating live nodes... (3)
> [junit4:junit4]   2> 11239 T19 oashc.HttpShardHandlerFactory.getParameter Setting urlScheme to: http://
> [junit4:junit4]   2> 11241 T19 oashc.HttpShardHandlerFactory.getParameter Setting connTimeout to: 0
> [junit4:junit4]   2> 11242 T19 oashc.HttpShardHandlerFactory.getParameter Setting maxConnectionsPerHost to: 20
> [junit4:junit4]   2> 11242 T19 oashc.HttpShardHandlerFactory.getParameter Setting corePoolSize to: 0
> [junit4:junit4]   2> 11243 T19 oashc.HttpShardHandlerFactory.getParameter Setting maximumPoolSize to: 2147483647
> [junit4:junit4]   2> 11244 T19 oashc.HttpShardHandlerFactory.getParameter Setting maxThreadIdleTime to: 5
> [junit4:junit4]   2> 11244 T19 oashc.HttpShardHandlerFactory.getParameter Setting sizeOfQueue to: -1
> [junit4:junit4]   2> 11245 T19 oashc.HttpShardHandlerFactory.getParameter Setting fairnessPolicy to: false
> [junit4:junit4]   2> 11246 T19 oascsi.HttpClientUtil.createClient Creating new http client, config:maxConnectionsPerHost=20&maxConnections=10000&socketTimeout=0&connTimeout=0&retry=false
> [junit4:junit4]   2> 11269 T19 oascc.ZkStateReader.createClusterStateWatchersAndUpdate Updating cluster state from ZooKeeper...
> [junit4:junit4]   2> 11279 T19 oasc.CoreContainer.create Creating SolrCore 'collection1' using instanceDir: /usr/home/hudson/hudson-slave/workspace/Lucene-Solr-Tests-trunk-java7/solr/build/solr-core/test/J0/./org.apache.solr.cloud.BasicDistributedZk2Test-jetty2-1351326130210/collection1
> [junit4:junit4]   2> 11280 T19 oasc.ZkController.createCollectionZkNode Check for collection zkNode:collection1
> [junit4:junit4]   2> 11281 T19 oasc.ZkController.createCollectionZkNode Collection zkNode exists
> [junit4:junit4]   2> 11282 T19 oasc.ZkController.readConfigName Load collection config from:/collections/collection1
> [junit4:junit4]   2> 11284 T19 oasc.SolrResourceLoader.<init> new SolrResourceLoader for directory: '/usr/home/hudson/hudson-slave/workspace/Lucene-Solr-Tests-trunk-java7/solr/build/solr-core/test/J0/./org.apache.solr.cloud.BasicDistributedZk2Test-jetty2-1351326130210/collection1/'
> [junit4:junit4]   2> 11287 T19 oasc.SolrResourceLoader.replaceClassLoader Adding 'file:/usr/home/hudson/hudson-slave/workspace/Lucene-Solr-Tests-trunk-java7/solr/build/solr-core/test/J0/org.apache.solr.cloud.BasicDistributedZk2Test-jetty2-1351326130210/collection1/lib/classes/' to classloader
> [junit4:junit4]   2> 11288 T19 oasc.SolrResourceLoader.replaceClassLoader Adding 'file:/usr/home/hudson/hudson-slave/workspace/Lucene-Solr-Tests-trunk-java7/solr/build/solr-core/test/J0/org.apache.solr.cloud.BasicDistributedZk2Test-jetty2-1351326130210/collection1/lib/README' to classloader
> [junit4:junit4]   2> 11368 T45 oascc.ZkStateReader.updateClusterState Updating cloud state from ZooKeeper...
> [junit4:junit4]   2> 11370 T45 oasc.Overseer$ClusterStateUpdater.updateState Update state numShards=2 message={
> [junit4:junit4]   2>      "operation":"state",
> [junit4:junit4]   2>      "numShards":"2",
> [junit4:junit4]   2>      "shard":"shard1",
> [junit4:junit4]   2>      "roles":null,
> [junit4:junit4]   2>      "state":"active",
> [junit4:junit4]   2>      "core":"collection1",
> [junit4:junit4]   2>      "collection":"collection1",
> [junit4:junit4]   2>      "node_name":"127.0.0.1:58091_solr",
> [junit4:junit4]   2>      "base_url":"http://127.0.0.1:58091/solr"}
> [junit4:junit4]   2> 11375 T19 oasc.SolrConfig.<init> Using Lucene MatchVersion: LUCENE_50
> [junit4:junit4]   2> 11379 T49 oascc.ZkStateReader$2.process A cluster state change has occurred - updating... (3)
> [junit4:junit4]   2> 11379 T60 oascc.ZkStateReader$2.process A cluster state change has occurred - updating... (3)
> [junit4:junit4]   2> 11379 T40 oascc.ZkStateReader$2.process A cluster state change has occurred - updating... (3)
> [junit4:junit4]   2> 11379 T76 oascc.ZkStateReader$2.process A cluster state change has occurred - updating... (3)
> [junit4:junit4]   2> 11471 T19 oasc.SolrConfig.<init> Loaded SolrConfig: solrconfig.xml
> [junit4:junit4]   2> 11572 T19 oass.IndexSchema.readSchema Reading Solr Schema
> [junit4:junit4]   2> 11613 T19 oass.IndexSchema.readSchema Schema name=test
> [junit4:junit4]   2> 12291 T19 oass.OpenExchangeRatesOrgProvider.init Initialized with rates=open-exchange-rates.json, refreshInterval=1440.
> [junit4:junit4]   2> 12304 T19 oass.IndexSchema.readSchema default search field in schema is text
> [junit4:junit4]   2> 12307 T19 oass.IndexSchema.readSchema unique key field: id
> [junit4:junit4]   2> 12331 T19 oass.FileExchangeRateProvider.reload Reloading exchange rates from file currency.xml
> [junit4:junit4]   2> 12336 T19 oass.FileExchangeRateProvider.reload Reloading exchange rates from file currency.xml
> [junit4:junit4]   2> 12342 T19 oass.OpenExchangeRatesOrgProvider.reload Reloading exchange rates from open-exchange-rates.json
> [junit4:junit4]   2> 12344 T19 oass.OpenExchangeRatesOrgProvider.reload Reloading exchange rates from open-exchange-rates.json
> [junit4:junit4]   2> 12346 T19 oasc.SolrCore.<init> [collection1] Opening new SolrCore at /usr/home/hudson/hudson-slave/workspace/Lucene-Solr-Tests-trunk-java7/solr/build/solr-core/test/J0/./org.apache.solr.cloud.BasicDistributedZk2Test-jetty2-1351326130210/collection1/, dataDir=./org.apache.solr.cloud.BasicDistributedZk2Test-1351326119324/jetty2/
> [junit4:junit4]   2> 12347 T19 oasc.JmxMonitoredMap.<init> JMX monitoring is enabled. Adding Solr mbeans to JMX Server: com.sun.jmx.mbeanserver.JmxMBeanServer@834f715
> [junit4:junit4]   2> 12348 T19 oasc.SolrCore.initDirectoryFactory solr.NRTCachingDirectoryFactory
> [junit4:junit4]   2> 12349 T19 oasc.CachingDirectoryFactory.injectLockFactory WARNING No lockType configured for NRTCachingDirectory(org.apache.lucene.store.NIOFSDirectory@/usr/home/hudson/hudson-slave/workspace/Lucene-Solr-Tests-trunk-java7/solr/build/solr-core/test/J0/org.apache.solr.cloud.BasicDistributedZk2Test-1351326119324/jetty2 lockFactory=org.apache.lucene.store.NativeFSLockFactory@8b45937; maxCacheMB=48.0 maxMergeSizeMB=4.0) assuming 'simple'
> [junit4:junit4]   2> 12350 T19 oasc.CachingDirectoryFactory.get return new directory for /usr/home/hudson/hudson-slave/workspace/Lucene-Solr-Tests-trunk-java7/solr/build/solr-core/test/J0/./org.apache.solr.cloud.BasicDistributedZk2Test-1351326119324/jetty2 forceNew:false
> [junit4:junit4]   2> 12350 T19 oasc.CachingDirectoryFactory.close Releasing directory:/usr/home/hudson/hudson-slave/workspace/Lucene-Solr-Tests-trunk-java7/solr/build/solr-core/test/J0/./org.apache.solr.cloud.BasicDistributedZk2Test-1351326119324/jetty2
> [junit4:junit4]   2> 12351 T19 oasc.SolrCore.getNewIndexDir New index directory detected: old=null new=./org.apache.solr.cloud.BasicDistributedZk2Test-1351326119324/jetty2/index/
> [junit4:junit4]   2> 12352 T19 oasc.SolrCore.initIndex WARNING [collection1] Solr index directory './org.apache.solr.cloud.BasicDistributedZk2Test-1351326119324/jetty2/index' doesn't exist. Creating new index...
> [junit4:junit4]   2> 12352 T19 oasc.CachingDirectoryFactory.get return new directory for /usr/home/hudson/hudson-slave/workspace/Lucene-Solr-Tests-trunk-java7/solr/build/solr-core/test/J0/./org.apache.solr.cloud.BasicDistributedZk2Test-1351326119324/jetty2/index forceNew:false
> [junit4:junit4]   2> 12358 T19 oasc.SolrDeletionPolicy.onCommit SolrDeletionPolicy.onCommit: commits:num=1
> [junit4:junit4]   2>            commit{dir=NRTCachingDirectory(org.apache.lucene.store.NIOFSDirectory@/usr/home/hudson/hudson-slave/workspace/Lucene-Solr-Tests-trunk-java7/solr/build/solr-core/test/J0/org.apache.solr.cloud.BasicDistributedZk2Test-1351326119324/jetty2/index lockFactory=org.apache.lucene.store.NativeFSLockFactory@b85cfd8; maxCacheMB=48.0 maxMergeSizeMB=4.0),segFN=segments_1,generation=1,filenames=[segments_1]
> [junit4:junit4]   2> 12358 T19 oasc.SolrDeletionPolicy.updateCommits newest commit = 1[segments_1]
> [junit4:junit4]   2> 12359 T19 oasc.CachingDirectoryFactory.close Releasing directory:/usr/home/hudson/hudson-slave/workspace/Lucene-Solr-Tests-trunk-java7/solr/build/solr-core/test/J0/./org.apache.solr.cloud.BasicDistributedZk2Test-1351326119324/jetty2/index
> [junit4:junit4]   2> 12360 T19 oasc.SolrCore.initWriters created xml: solr.XMLResponseWriter
> [junit4:junit4]   2> 12363 T19 oasup.UpdateRequestProcessorChain.init inserting DistributedUpdateProcessorFactory into updateRequestProcessorChain "dedupe"
> [junit4:junit4]   2> 12363 T19 oasup.UpdateRequestProcessorChain.init inserting DistributedUpdateProcessorFactory into updateRequestProcessorChain "dedupe-allfields"
> [junit4:junit4]   2> 12364 T19 oasup.UpdateRequestProcessorChain.init inserting DistributedUpdateProcessorFactory into updateRequestProcessorChain "stored_sig"
> [junit4:junit4]   2> 12365 T19 oasup.UpdateRequestProcessorChain.init inserting DistributedUpdateProcessorFactory into updateRequestProcessorChain "uniq-fields"
> [junit4:junit4]   2> 12366 T19 oasup.UpdateRequestProcessorChain.init inserting DistributedUpdateProcessorFactory into updateRequestProcessorChain "distrib-dup-test-chain-implicit"
> [junit4:junit4]   2> 12367 T19 oasc.RequestHandlers.initHandlersFromConfig adding lazy requestHandler: solr.ReplicationHandler
> [junit4:junit4]   2> 12368 T19 oasc.RequestHandlers.initHandlersFromConfig created /replication: solr.ReplicationHandler
> [junit4:junit4]   2> 12369 T19 oasc.RequestHandlers.initHandlersFromConfig created standard: solr.StandardRequestHandler
> [junit4:junit4]   2> 12370 T19 oasc.RequestHandlers.initHandlersFromConfig created /get: solr.RealTimeGetHandler
> [junit4:junit4]   2> 12371 T19 oasc.RequestHandlers.initHandlersFromConfig created dismax: solr.SearchHandler
> [junit4:junit4]   2> 12372 T19 oasc.RequestHandlers.initHandlersFromConfig created mock: org.apache.solr.core.MockQuerySenderListenerReqHandler
> [junit4:junit4]   2> 12373 T19 oasc.RequestHandlers.initHandlersFromConfig created /admin/: org.apache.solr.handler.admin.AdminHandlers
> [junit4:junit4]   2> 12374 T19 oasc.RequestHandlers.initHandlersFromConfig created defaults: solr.StandardRequestHandler
> [junit4:junit4]   2> 12375 T19 oasc.RequestHandlers.initHandlersFromConfig adding lazy requestHandler: solr.StandardRequestHandler
> [junit4:junit4]   2> 12375 T19 oasc.RequestHandlers.initHandlersFromConfig created lazy: solr.StandardRequestHandler
> [junit4:junit4]   2> 12377 T19 oasc.RequestHandlers.initHandlersFromConfig created /update: solr.UpdateRequestHandler
> [junit4:junit4]   2> 12378 T19 oasc.RequestHandlers.initHandlersFromConfig created /terms: org.apache.solr.handler.component.SearchHandler
> [junit4:junit4]   2> 12379 T19 oasc.RequestHandlers.initHandlersFromConfig created spellCheckCompRH: org.apache.solr.handler.component.SearchHandler
> [junit4:junit4]   2> 12380 T19 oasc.RequestHandlers.initHandlersFromConfig created spellCheckCompRH_Direct: org.apache.solr.handler.component.SearchHandler
> [junit4:junit4]   2> 12381 T19 oasc.RequestHandlers.initHandlersFromConfig created spellCheckWithWordbreak: org.apache.solr.handler.component.SearchHandler
> [junit4:junit4]   2> 12382 T19 oasc.RequestHandlers.initHandlersFromConfig created spellCheckWithWordbreak_Direct: org.apache.solr.handler.component.SearchHandler
> [junit4:junit4]   2> 12384 T19 oasc.RequestHandlers.initHandlersFromConfig created spellCheckCompRH1: org.apache.solr.handler.component.SearchHandler
> [junit4:junit4]   2> 12385 T19 oasc.RequestHandlers.initHandlersFromConfig created tvrh: org.apache.solr.handler.component.SearchHandler
> [junit4:junit4]   2> 12386 T19 oasc.RequestHandlers.initHandlersFromConfig created /mlt: solr.MoreLikeThisHandler
> [junit4:junit4]   2> 12387 T19 oasc.RequestHandlers.initHandlersFromConfig created /debug/dump: solr.DumpRequestHandler
> [junit4:junit4]   2> 12396 T19 oashl.XMLLoader.init xsltCacheLifetimeSeconds=60
> [junit4:junit4]   2> 12400 T19 oasc.SolrCore.initDeprecatedSupport WARNING solrconfig.xml uses deprecated <admin/gettableFiles>, Please update your config to use the ShowFileRequestHandler.
> [junit4:junit4]   2> 12402 T19 oasc.SolrCore.initDeprecatedSupport WARNING adding ShowFileRequestHandler with hidden files: [SCHEMA.XML, OLD_SYNONYMS.TXT, STOPWORDS.TXT, PROTWORDS.TXT, OPEN-EXCHANGE-RATES.JSON, SYNONYMS.TXT, CURRENCY.XML, MAPPING-ISOLATIN1ACCENT.TXT]
> [junit4:junit4]   2> 12405 T19 oasc.CachingDirectoryFactory.close Releasing directory:/usr/home/hudson/hudson-slave/workspace/Lucene-Solr-Tests-trunk-java7/solr/build/solr-core/test/J0/./org.apache.solr.cloud.BasicDistributedZk2Test-1351326119324/jetty2
> [junit4:junit4]   2> 12407 T19 oass.SolrIndexSearcher.<init> Opening Searcher@58164c9c main
> [junit4:junit4]   2> 12408 T19 oasu.CommitTracker.<init> Hard AutoCommit: disabled
> [junit4:junit4]   2> 12408 T19 oasu.CommitTracker.<init> Soft AutoCommit: disabled
> [junit4:junit4]   2> 12410 T19 oashc.SpellCheckComponent.inform Initializing spell checkers
> [junit4:junit4]   2> 12417 T19 oass.DirectSolrSpellChecker.init init: {name=direct,classname=DirectSolrSpellChecker,field=lowerfilt,minQueryLength=3}
> [junit4:junit4]   2> 12476 T81 oasc.SolrCore.registerSearcher [collection1] Registered new searcher Searcher@58164c9c main{StandardDirectoryReader(segments_1:1)}
> [junit4:junit4]   2> 12485 T19 oasc.ZkController.publish numShards not found on descriptor - reading it from system property
> [junit4:junit4]   2> 12894 T45 oascc.ZkStateReader.updateClusterState Updating cloud state from ZooKeeper...
> [junit4:junit4]   2> 12895 T45 oasc.Overseer$ClusterStateUpdater.updateState Update state numShards=2 message={
> [junit4:junit4]   2>      "operation":"state",
> [junit4:junit4]   2>      "numShards":"2",
> [junit4:junit4]   2>      "shard":null,
> [junit4:junit4]   2>      "roles":null,
> [junit4:junit4]   2>      "state":"down",
> [junit4:junit4]   2>      "core":"collection1",
> [junit4:junit4]   2>      "collection":"collection1",
> [junit4:junit4]   2>      "node_name":"127.0.0.1:58096_solr",
> [junit4:junit4]   2>      "base_url":"http://127.0.0.1:58096/solr"}
> [junit4:junit4]   2> 12902 T49 oascc.ZkStateReader$2.process A cluster state change has occurred - updating... (3)
> [junit4:junit4]   2> 12902 T76 oascc.ZkStateReader$2.process A cluster state change has occurred - updating... (3)
> [junit4:junit4]   2> 12902 T60 oascc.ZkStateReader$2.process A cluster state change has occurred - updating... (3)
> [junit4:junit4]   2> 12902 T40 oascc.ZkStateReader$2.process A cluster state change has occurred - updating... (3)
> [junit4:junit4]   2> 12988 T19 oasc.CoreContainer.register registering core: collection1
> [junit4:junit4]   2> 12988 T19 oasc.ZkController.register Register shard - core:collection1 address:http://127.0.0.1:58096/solr shardId:shard2
> [junit4:junit4]   2> 12990 T19 oascc.SolrZkClient.makePath makePath: /collections/collection1/leader_elect/shard2/election
> [junit4:junit4]   2> 13015 T26 oazs.PrepRequestProcessor.pRequest Got user-level KeeperException when processing sessionid:0x13aa15037410005 type:delete cxid:0x44 zxid:0xfffffffffffffffe txntype:unknown reqpath:n/a Error Path:/solr/collections/collection1/leaders/shard2 Error:KeeperErrorCode = NoNode for /solr/collections/collection1/leaders/shard2
> [junit4:junit4]   2> 13017 T19 oasc.ShardLeaderElectionContext.runLeaderProcess Running the leader process.
> [junit4:junit4]   2> 13017 T26 oazs.PrepRequestProcessor.pRequest Got user-level KeeperException when processing sessionid:0x13aa15037410005 type:create cxid:0x45 zxid:0xfffffffffffffffe txntype:unknown reqpath:n/a Error Path:/solr/overseer Error:KeeperErrorCode = NodeExists for /solr/overseer
> [junit4:junit4]   2> 13028 T19 oasc.ShardLeaderElectionContext.waitForReplicasToComeUp Enough replicas found to continue.
> [junit4:junit4]   2> 13029 T19 oasc.ShardLeaderElectionContext.runLeaderProcess I may be the new leader - try and sync
> [junit4:junit4]   2> 13029 T19 oasc.SyncStrategy.sync Sync replicas to http://127.0.0.1:58096/solr/collection1/
> [junit4:junit4]   2> 13030 T19 oasc.SyncStrategy.syncReplicas Sync Success - now sync replicas to me
> [junit4:junit4]   2> 13030 T19 oasc.SyncStrategy.syncToMe http://127.0.0.1:58096/solr/collection1/ has no replicas
> [junit4:junit4]   2> 13031 T19 oasc.ShardLeaderElectionContext.runLeaderProcess I am the new leader: http://127.0.0.1:58096/solr/collection1/
> [junit4:junit4]   2> 13031 T19 oascc.SolrZkClient.makePath makePath: /collections/collection1/leaders/shard2
> [junit4:junit4]   2> 13036 T26 oazs.PrepRequestProcessor.pRequest Got user-level KeeperException when processing sessionid:0x13aa15037410005 type:create cxid:0x4e zxid:0xfffffffffffffffe txntype:unknown reqpath:n/a Error Path:/solr/overseer Error:KeeperErrorCode = NodeExists for /solr/overseer
> [junit4:junit4]   2> 13408 T45 oascc.ZkStateReader.updateClusterState Updating cloud state from ZooKeeper...
> [junit4:junit4]   2> 13429 T60 oascc.ZkStateReader$2.process A cluster state change has occurred - updating... (3)
> [junit4:junit4]   2> 13429 T40 oascc.ZkStateReader$2.process A cluster state change has occurred - updating... (3)
> [junit4:junit4]   2> 13429 T76 oascc.ZkStateReader$2.process A cluster state change has occurred - updating... (3)
> [junit4:junit4]   2> 13429 T49 oascc.ZkStateReader$2.process A cluster state change has occurred - updating... (3)
> [junit4:junit4]   2> 13454 T19 oasc.ZkController.register We are http://127.0.0.1:58096/solr/collection1/ and leader is http://127.0.0.1:58096/solr/collection1/
> [junit4:junit4]   2> 13455 T19 oasc.ZkController.register No LogReplay needed for core=collection1 baseURL=http://127.0.0.1:58096/solr
> [junit4:junit4]   2> 13455 T19 oasc.ZkController.checkRecovery I am the leader, no recovery necessary
> [junit4:junit4]   2> 13456 T19 oasc.ZkController.publish numShards not found on descriptor - reading it from system property
> [junit4:junit4]   2> 13459 T19 oascc.ZkStateReader.updateClusterState Updating cloud state from ZooKeeper...
> [junit4:junit4]   2> 13461 T19 oass.SolrDispatchFilter.init user.dir=/usr/home/hudson/hudson-slave/workspace/Lucene-Solr-Tests-trunk-java7/solr/build/solr-core/test/J0
> [junit4:junit4]   2> 13462 T19 oass.SolrDispatchFilter.init SolrDispatchFilter.init() done
> [junit4:junit4]   2> 13462 T19 oascsi.HttpClientUtil.createClient Creating new http client, config:maxConnections=128&maxConnectionsPerHost=32&followRedirects=false
> [junit4:junit4]   2> 13692 T19 oejs.Server.doStart jetty-8.1.2.v20120308
> [junit4:junit4]   2> 13696 T19 oejs.AbstractConnector.doStart Started SelectChannelConnector@0.0.0.0:58107
> [junit4:junit4]   2> 13697 T19 oasc.SolrResourceLoader.locateSolrHome JNDI not configured for solr (NoInitialContextEx)
> [junit4:junit4]   2> 13697 T19 oasc.SolrResourceLoader.locateSolrHome using system property solr.solr.home: /usr/home/hudson/hudson-slave/workspace/Lucene-Solr-Tests-trunk-java7/solr/build/solr-core/test/J0/./org.apache.solr.cloud.BasicDistributedZk2Test-jetty3-1351326132796
> [junit4:junit4]   2> 13698 T19 oasc.SolrResourceLoader.<init> new SolrResourceLoader for deduced Solr Home: '/usr/home/hudson/hudson-slave/workspace/Lucene-Solr-Tests-trunk-java7/solr/build/solr-core/test/J0/./org.apache.solr.cloud.BasicDistributedZk2Test-jetty3-1351326132796/'
> [junit4:junit4]   2> 13742 T19 oass.SolrDispatchFilter.init SolrDispatchFilter.init()
> [junit4:junit4]   2> 13743 T19 oasc.SolrResourceLoader.locateSolrHome JNDI not configured for solr (NoInitialContextEx)
> [junit4:junit4]   2> 13743 T19 oasc.SolrResourceLoader.locateSolrHome using system property solr.solr.home: /usr/home/hudson/hudson-slave/workspace/Lucene-Solr-Tests-trunk-java7/solr/build/solr-core/test/J0/./org.apache.solr.cloud.BasicDistributedZk2Test-jetty3-1351326132796
> [junit4:junit4]   2> 13744 T19 oasc.CoreContainer$Initializer.initialize looking for solr.xml: /usr/home/hudson/hudson-slave/workspace/Lucene-Solr-Tests-trunk-java7/solr/build/solr-core/test/J0/./org.apache.solr.cloud.BasicDistributedZk2Test-jetty3-1351326132796/solr.xml
> [junit4:junit4]   2> 13745 T19 oasc.CoreContainer.<init> New CoreContainer 1099159826
> [junit4:junit4]   2> 13746 T19 oasc.CoreContainer.load Loading CoreContainer using Solr Home: '/usr/home/hudson/hudson-slave/workspace/Lucene-Solr-Tests-trunk-java7/solr/build/solr-core/test/J0/./org.apache.solr.cloud.BasicDistributedZk2Test-jetty3-1351326132796/'
> [junit4:junit4]   2> 13746 T19 oasc.SolrResourceLoader.<init> new SolrResourceLoader for directory: '/usr/home/hudson/hudson-slave/workspace/Lucene-Solr-Tests-trunk-java7/solr/build/solr-core/test/J0/./org.apache.solr.cloud.BasicDistributedZk2Test-jetty3-1351326132796/'
> [junit4:junit4]   2> 13792 T19 oasc.CoreContainer.load Registering Log Listener
> [junit4:junit4]   2> 13810 T19 oasc.CoreContainer.initZooKeeper Zookeeper client=127.0.0.1:58068/solr
> [junit4:junit4]   2> 13811 T19 oaz.ZooKeeper.<init> Initiating client connection, connectString=127.0.0.1:58068/solr sessionTimeout=5000 watcher=org.apache.solr.common.cloud.ConnectionManager@5d5060d1
> [junit4:junit4]   2> 13812 T91 oaz.ClientCnxn$SendThread.startConnect Opening socket connection to server /127.0.0.1:58068
> [junit4:junit4]   2> 13812 T19 oascc.ConnectionManager.waitForConnected Waiting for client to connect to ZooKeeper
> [junit4:junit4]   2> 13814 T91 oaz.ClientCnxn$SendThread.primeConnection Socket connection established to localhost/127.0.0.1:58068, initiating session
> [junit4:junit4]   2> 13814 T21 oazs.NIOServerCnxn$Factory.run Accepted socket connection from /140.211.11.196:58108
> [junit4:junit4]   2> 13815 T21 oazs.NIOServerCnxn.readConnectRequest Client attempting to establish new session at /140.211.11.196:58108
> [junit4:junit4]   2> 13821 T24 oazs.NIOServerCnxn.finishSessionInit Established session 0x13aa15037410006 with negotiated timeout 5000 for client /140.211.11.196:58108
> [junit4:junit4]   2> 13823 T91 oaz.ClientCnxn$SendThread.readConnectResult Session establishment complete on server localhost/127.0.0.1:58068, sessionid = 0x13aa15037410006, negotiated timeout = 5000
> [junit4:junit4]   2> 13827 T92 oascc.ConnectionManager.process Watcher org.apache.solr.common.cloud.ConnectionManager@5d5060d1 name:ZooKeeperConnection Watcher:127.0.0.1:58068/solr got event WatchedEvent state:SyncConnected type:None path:null path:null type:None
> [junit4:junit4]   2> 13828 T19 oascc.ConnectionManager.waitForConnected Client is connected to ZooKeeper
> [junit4:junit4]   2> 13831 T26 oazs.PrepRequestProcessor.pRequest Got user-level KeeperException when processing sessionid:0x13aa15037410006 type:create cxid:0x1 zxid:0xfffffffffffffffe txntype:unknown reqpath:n/a Error Path:/solr/overseer Error:KeeperErrorCode = NodeExists for /solr/overseer
> [junit4:junit4]   2> 13836 T26 oazs.PrepRequestProcessor.pRequest Got user-level KeeperException when processing sessionid:0x13aa15037410006 type:create cxid:0x2 zxid:0xfffffffffffffffe txntype:unknown reqpath:n/a Error Path:/solr/overseer Error:KeeperErrorCode = NodeExists for /solr/overseer
> [junit4:junit4]   2> 13873 T19 oasc.ZkController.createEphemeralLiveNode Register node as live in ZooKeeper:/live_nodes/127.0.0.1:58107_solr
> [junit4:junit4]   2> 13875 T26 oazs.PrepRequestProcessor.pRequest Got user-level KeeperException when processing sessionid:0x13aa15037410006 type:delete cxid:0x4 zxid:0xfffffffffffffffe txntype:unknown reqpath:n/a Error Path:/solr/live_nodes/127.0.0.1:58107_solr Error:KeeperErrorCode = NoNode for /solr/live_nodes/127.0.0.1:58107_solr
> [junit4:junit4]   2> 13900 T19 oascc.SolrZkClient.makePath makePath: /live_nodes/127.0.0.1:58107_solr
> [junit4:junit4]   2> 13903 T49 oascc.ZkStateReader$2.process A cluster state change has occurred - updating... (3)
> [junit4:junit4]   2> 13903 T40 oascc.ZkStateReader$2.process A cluster state change has occurred - updating... (3)
> [junit4:junit4]   2> 13904 T60 oascc.ZkStateReader$3.process Updating live nodes... (4)
> [junit4:junit4]   2> 13904 T76 oascc.ZkStateReader$3.process Updating live nodes... (4)
> [junit4:junit4]   2> 13905 T60 oascc.ZkStateReader$2.process A cluster state change has occurred - updating... (4)
> [junit4:junit4]   2> 13905 T76 oascc.ZkStateReader$2.process A cluster state change has occurred - updating... (4)
> [junit4:junit4]   2> 13906 T19 oashc.HttpShardHandlerFactory.getParameter Setting socketTimeout to: 0
> [junit4:junit4]   2> 13907 T40 oascc.ZkStateReader$3.process Updating live nodes... (4)
> [junit4:junit4]   2> 13907 T19 oashc.HttpShardHandlerFactory.getParameter Setting urlScheme to: http://
> [junit4:junit4]   2> 13907 T49 oascc.ZkStateReader$3.process Updating live nodes... (4)
> [junit4:junit4]   2> 13908 T19 oashc.HttpShardHandlerFactory.getParameter Setting connTimeout to: 0
> [junit4:junit4]   2> 13908 T19 oashc.HttpShardHandlerFactory.getParameter Setting maxConnectionsPerHost to: 20
> [junit4:junit4]   2> 13909 T19 oashc.HttpShardHandlerFactory.getParameter Setting corePoolSize to: 0
> [junit4:junit4]   2> 13910 T19 oashc.HttpShardHandlerFactory.getParameter Setting maximumPoolSize to: 2147483647
> [junit4:junit4]   2> 13910 T19 oashc.HttpShardHandlerFactory.getParameter Setting maxThreadIdleTime to: 5
> [junit4:junit4]   2> 13911 T19 oashc.HttpShardHandlerFactory.getParameter Setting sizeOfQueue to: -1
> [junit4:junit4]   2> 13911 T19 oashc.HttpShardHandlerFactory.getParameter Setting fairnessPolicy to: false
> [junit4:junit4]   2> 13912 T19 oascsi.HttpClientUtil.createClient Creating new http client, config:maxConnectionsPerHost=20&maxConnections=10000&socketTimeout=0&connTimeout=0&retry=false
> [junit4:junit4]   2> 13936 T19 oascc.ZkStateReader.createClusterStateWatchersAndUpdate Updating cluster state from ZooKeeper...
> [junit4:junit4]   2> 13943 T45 oascc.ZkStateReader.updateClusterState Updating cloud state from ZooKeeper...
> [junit4:junit4]   2> 13944 T19 oasc.CoreContainer.create Creating SolrCore 'collection1' using instanceDir: /usr/home/hudson/hudson-slave/workspace/Lucene-Solr-Tests-trunk-java7/solr/build/solr-core/test/J0/./org.apache.solr.cloud.BasicDistributedZk2Test-jetty3-1351326132796/collection1
> [junit4:junit4]   2> 13945 T45 oasc.Overseer$ClusterStateUpdater.updateState Update state numShards=2 message={
> [junit4:junit4]   2>      "operation":"state",
> [junit4:junit4]   2>      "numShards":"2",
> [junit4:junit4]   2>      "shard":"shard2",
> [junit4:junit4]   2>      "roles":null,
> [junit4:junit4]   2>      "state":"active",
> [junit4:junit4]   2>      "core":"collection1",
> [junit4:junit4]   2>      "collection":"collection1",
> [junit4:junit4]   2>      "node_name":"127.0.0.1:58096_solr",
> [junit4:junit4]   2>      "base_url":"http://127.0.0.1:58096/solr"}
> [junit4:junit4]   2> 13945 T19 oasc.ZkController.createCollectionZkNode Check for collection zkNode:collection1
> [junit4:junit4]   2> 13981 T19 oasc.ZkController.createCollectionZkNode Collection zkNode exists
> [junit4:junit4]   2> 13982 T19 oasc.ZkController.readConfigName Load collection config from:/collections/collection1
> [junit4:junit4]   2> 13985 T19 oasc.SolrResourceLoader.<init> new SolrResourceLoader for directory: '/usr/home/hudson/hudson-slave/workspace/Lucene-Solr-Tests-trunk-java7/solr/build/solr-core/test/J0/./org.apache.solr.cloud.BasicDistributedZk2Test-jetty3-1351326132796/collection1/'
> [junit4:junit4]   2> 13987 T19 oasc.SolrResourceLoader.replaceClassLoader Adding 'file:/usr/home/hudson/hudson-slave/workspace/Lucene-Solr-Tests-trunk-java7/solr/build/solr-core/test/J0/org.apache.solr.cloud.BasicDistributedZk2Test-jetty3-1351326132796/collection1/lib/classes/' to classloader
> [junit4:junit4]   2> 13988 T19 oasc.SolrResourceLoader.replaceClassLoader Adding 'file:/usr/home/hudson/hudson-slave/workspace/Lucene-Solr-Tests-trunk-java7/solr/build/solr-core/test/J0/org.apache.solr.cloud.BasicDistributedZk2Test-jetty3-1351326132796/collection1/lib/README' to classloader
> [junit4:junit4]   2> 14027 T92 oascc.ZkStateReader$2.process A cluster state change has occurred - updating... (4)
> [junit4:junit4]   2> 14027 T60 oascc.ZkStateReader$2.process A cluster state change has occurred - updating... (4)
> [junit4:junit4]   2> 14027 T76 oascc.ZkStateReader$2.process A cluster state change has occurred - updating... (4)
> [junit4:junit4]   2> 14027 T40 oascc.ZkStateReader$2.process A cluster state change has occurred - updating... (4)
> [junit4:junit4]   2> 14027 T49 oascc.ZkStateReader$2.process A cluster state change has occurred - updating... (4)
> [junit4:junit4]   2> 14078 T19 oasc.SolrConfig.<init> Using Lucene MatchVersion: LUCENE_50
> [junit4:junit4]   2> 14165 T19 oasc.SolrConfig.<init> Loaded SolrConfig: solrconfig.xml
> [junit4:junit4]   2> 14266 T19 oass.IndexSchema.readSchema Reading Solr Schema
> [junit4:junit4]   2> 14294 T19 oass.IndexSchema.readSchema Schema name=test
> [junit4:junit4]   2> 14921 T19 oass.OpenExchangeRatesOrgProvider.init Initialized with rates=open-exchange-rates.json, refreshInterval=1440.
> [junit4:junit4]   2> 14936 T19 oass.IndexSchema.readSchema default search field in schema is text
> [junit4:junit4]   2> 14940 T19 oass.IndexSchema.readSchema unique key field: id
> [junit4:junit4]   2> 14971 T19 oass.FileExchangeRateProvider.reload Reloading exchange rates from file currency.xml
> [junit4:junit4]   2> 14977 T19 oass.FileExchangeRateProvider.reload Reloading exchange rates from file currency.xml
> [junit4:junit4]   2> 14982 T19 oass.OpenExchangeRatesOrgProvider.reload Reloading exchange rates from open-exchange-rates.json
> [junit4:junit4]   2> 14985 T19 oass.OpenExchangeRatesOrgProvider.reload Reloading exchange rates from open-exchange-rates.json
> [junit4:junit4]   2> 14988 T19 oasc.SolrCore.<init> [collection1] Opening new SolrCore at /usr/home/hudson/hudson-slave/workspace/Lucene-Solr-Tests-trunk-java7/solr/build/solr-core/test/J0/./org.apache.solr.cloud.BasicDistributedZk2Test-jetty3-1351326132796/collection1/, dataDir=./org.apache.solr.cloud.BasicDistributedZk2Test-1351326119324/jetty3/
> [junit4:junit4]   2> 14989 T19 oasc.JmxMonitoredMap.<init> JMX monitoring is enabled. Adding Solr mbeans to JMX Server: com.sun.jmx.mbeanserver.JmxMBeanServer@834f715
> [junit4:junit4]   2> 14990 T19 oasc.SolrCore.initDirectoryFactory solr.NRTCachingDirectoryFactory
> [junit4:junit4]   2> 14991 T19 oasc.CachingDirectoryFactory.injectLockFactory WARNING No lockType configured for NRTCachingDirectory(org.apache.lucene.store.NIOFSDirectory@/usr/home/hudson/hudson-slave/workspace/Lucene-Solr-Tests-trunk-java7/solr/build/solr-core/test/J0/org.apache.solr.cloud.BasicDistributedZk2Test-1351326119324/jetty3 lockFactory=org.apache.lucene.store.NativeFSLockFactory@27cecb4e; maxCacheMB=48.0 maxMergeSizeMB=4.0) assuming 'simple'
> [junit4:junit4]   2> 14992 T19 oasc.CachingDirectoryFactory.get return new directory for /usr/home/hudson/hudson-slave/workspace/Lucene-Solr-Tests-trunk-java7/solr/build/solr-core/test/J0/./org.apache.solr.cloud.BasicDistributedZk2Test-1351326119324/jetty3 forceNew:false
> [junit4:junit4]   2> 14993 T19 oasc.CachingDirectoryFactory.close Releasing directory:/usr/home/hudson/hudson-slave/workspace/Lucene-Solr-Tests-trunk-java7/solr/build/solr-core/test/J0/./org.apache.solr.cloud.BasicDistributedZk2Test-1351326119324/jetty3
> [junit4:junit4]   2> 14993 T19 oasc.SolrCore.getNewIndexDir New index directory detected: old=null new=./org.apache.solr.cloud.BasicDistributedZk2Test-1351326119324/jetty3/index/
> [junit4:junit4]   2> 14994 T19 oasc.SolrCore.initIndex WARNING [collection1] Solr index directory './org.apache.solr.cloud.BasicDistributedZk2Test-1351326119324/jetty3/index' doesn't exist. Creating new index...
> [junit4:junit4]   2> 14996 T19 oasc.CachingDirectoryFactory.get return new directory for /usr/home/hudson/hudson-slave/workspace/Lucene-Solr-Tests-trunk-java7/solr/build/solr-core/test/J0/./org.apache.solr.cloud.BasicDistributedZk2Test-1351326119324/jetty3/index forceNew:false
> [junit4:junit4]   2> 15002 T19 oasc.SolrDeletionPolicy.onCommit SolrDeletionPolicy.onCommit: commits:num=1
> [junit4:junit4]   2>            commit{dir=NRTCachingDirectory(org.apache.lucene.store.NIOFSDirectory@/usr/home/hudson/hudson-slave/workspace/Lucene-Solr-Tests-trunk-java7/solr/build/solr-core/test/J0/org.apache.solr.cloud.BasicDistributedZk2Test-1351326119324/jetty3/index lockFactory=org.apache.lucene.store.NativeFSLockFactory@417b51d9; maxCacheMB=48.0 maxMergeSizeMB=4.0),segFN=segments_1,generation=1,filenames=[segments_1]
> [junit4:junit4]   2> 15003 T19 oasc.SolrDeletionPolicy.updateCommits newest commit = 1[segments_1]
> [junit4:junit4]   2> 15004 T19 oasc.CachingDirectoryFactory.close Releasing directory:/usr/home/hudson/hudson-slave/workspace/Lucene-Solr-Tests-trunk-java7/solr/build/solr-core/test/J0/./org.apache.solr.cloud.BasicDistributedZk2Test-1351326119324/jetty3/index
> [junit4:junit4]   2> 15005 T19 oasc.SolrCore.initWriters created xml: solr.XMLResponseWriter
> [junit4:junit4]   2> 15008 T19 oasup.UpdateRequestProcessorChain.init inserting DistributedUpdateProcessorFactory into updateRequestProcessorChain "dedupe"
> [junit4:junit4]   2> 15009 T19 oasup.UpdateRequestProcessorChain.init inserting DistributedUpdateProcessorFactory into updateRequestProcessorChain "dedupe-allfields"
> [junit4:junit4]   2> 15010 T19 oasup.UpdateRequestProcessorChain.init inserting DistributedUpdateProcessorFactory into updateRequestProcessorChain "stored_sig"
> [junit4:junit4]   2> 15011 T19 oasup.UpdateRequestProcessorChain.init inserting DistributedUpdateProcessorFactory into updateRequestProcessorChain "uniq-fields"
> [junit4:junit4]   2> 15012 T19 oasup.UpdateRequestProcessorChain.init inserting DistributedUpdateProcessorFactory into updateRequestProcessorChain "distrib-dup-test-chain-implicit"
> [junit4:junit4]   2> 15013 T19 oasc.RequestHandlers.initHandlersFromConfig adding lazy requestHandler: solr.ReplicationHandler
> [junit4:junit4]   2> 15014 T19 oasc.RequestHandlers.initHandlersFromConfig created /replication: solr.ReplicationHandler
> [junit4:junit4]   2> 15015 T19 oasc.RequestHandlers.initHandlersFromConfig created standard: solr.StandardRequestHandler
> [junit4:junit4]   2> 15016 T19 oasc.RequestHandlers.initHandlersFromConfig created /get: solr.RealTimeGetHandler
> [junit4:junit4]   2> 15017 T19 oasc.RequestHandlers.initHandlersFromConfig created dismax: solr.SearchHandler
> [junit4:junit4]   2> 15019 T19 oasc.RequestHandlers.initHandlersFromConfig created mock: org.apache.solr.core.MockQuerySenderListenerReqHandler
> [junit4:junit4]   2> 15020 T19 oasc.RequestHandlers.initHandlersFromConfig created /admin/: org.apache.solr.handler.admin.AdminHandlers
> [junit4:junit4]   2> 15021 T19 oasc.RequestHandlers.initHandlersFromConfig created defaults: solr.StandardRequestHandler
> [junit4:junit4]   2> 15021 T19 oasc.RequestHandlers.initHandlersFromConfig adding lazy requestHandler: solr.StandardRequestHandler
> [junit4:junit4]   2> 15022 T19 oasc.RequestHandlers.initHandlersFromConfig created lazy: solr.StandardRequestHandler
> [junit4:junit4]   2> 15024 T19 oasc.RequestHandlers.initHandlersFromConfig created /update: solr.UpdateRequestHandler
> [junit4:junit4]   2> 15025 T19 oasc.RequestHandlers.initHandlersFromConfig created /terms: org.apache.solr.handler.component.SearchHandler
> [junit4:junit4]   2> 15026 T19 oasc.RequestHandlers.initHandlersFromConfig created spellCheckCompRH: org.apache.solr.handler.component.SearchHandler
> [junit4:junit4]   2> 15027 T19 oasc.RequestHandlers.initHandlersFromConfig created spellCheckCompRH_Direct: org.apache.solr.handler.component.SearchHandler
> [junit4:junit4]   2> 15028 T19 oasc.RequestHandlers.initHandlersFromConfig created spellCheckWithWordbreak: org.apache.solr.handler.component.SearchHandler
> [junit4:junit4]   2> 15029 T19 oasc.RequestHandlers.initHandlersFromConfig created spellCheckWithWordbreak_Direct: org.apache.solr.handler.component.SearchHandler
> [junit4:junit4]   2> 15031 T19 oasc.RequestHandlers.initHandlersFromConfig created spellCheckCompRH1: org.apache.solr.handler.component.SearchHandler
> [junit4:junit4]   2> 15032 T19 oasc.RequestHandlers.initHandlersFromConfig created tvrh: org.apache.solr.handler.component.SearchHandler
> [junit4:junit4]   2> 15033 T19 oasc.RequestHandlers.initHandlersFromConfig created /mlt: solr.MoreLikeThisHandler
> [junit4:junit4]   2> 15034 T19 oasc.RequestHandlers.initHandlersFromConfig created /debug/dump: solr.DumpRequestHandler
> [junit4:junit4]   2> 15046 T19 oashl.XMLLoader.init xsltCacheLifetimeSeconds=60
> [junit4:junit4]   2> 15050 T19 oasc.SolrCore.initDeprecatedSupport WARNING solrconfig.xml uses deprecated <admin/gettableFiles>, Please update your config to use the ShowFileRequestHandler.
> [junit4:junit4]   2> 15052 T19 oasc.SolrCore.initDeprecatedSupport WARNING adding ShowFileRequestHandler with hidden files: [SCHEMA.XML, OLD_SYNONYMS.TXT, STOPWORDS.TXT, PROTWORDS.TXT, OPEN-EXCHANGE-RATES.JSON, SYNONYMS.TXT, CURRENCY.XML, MAPPING-ISOLATIN1ACCENT.TXT]
> [junit4:junit4]   2> 15055 T19 oasc.CachingDirectoryFactory.close Releasing directory:/usr/home/hudson/hudson-slave/workspace/Lucene-Solr-Tests-trunk-java7/solr/build/solr-core/test/J0/./org.apache.solr.cloud.BasicDistributedZk2Test-1351326119324/jetty3
> [junit4:junit4]   2> 15057 T19 oass.SolrIndexSearcher.<init> Opening Searcher@1ed55aac main
> [junit4:junit4]   2> 15058 T19 oasu.CommitTracker.<init> Hard AutoCommit: disabled
> [junit4:junit4]   2> 15059 T19 oasu.CommitTracker.<init> Soft AutoCommit: disabled
> [junit4:junit4]   2> 15061 T19 oashc.SpellCheckComponent.inform Initializing spell checkers
> [junit4:junit4]   2> 15078 T19 oass.DirectSolrSpellChecker.init init: {name=direct,classname=DirectSolrSpellChecker,field=lowerfilt,minQueryLength=3}
> [junit4:junit4]   2> 15139 T97 oasc.SolrCore.registerSearcher [collection1] Registered new searcher Searcher@1ed55aac main{StandardDirectoryReader(segments_1:1)}
> [junit4:junit4]   2> 15152 T19 oasc.ZkController.publish numShards not found on descriptor - reading it from system property
> [junit4:junit4]   2> 15539 T45 oascc.ZkStateReader.updateClusterState Updating cloud state from ZooKeeper...
> [junit4:junit4]   2> 15541 T45 oasc.Overseer$ClusterStateUpdater.updateState Update state numShards=2 message={
> [junit4:junit4]   2>      "operation":"state",
> [junit4:junit4]   2>      "numShards":"2",
> [junit4:junit4]   2>      "shard":null,
> [junit4:junit4]   2>      "roles":null,
> [junit4:junit4]   2>      "state":"down",
> [junit4:junit4]   2>      "core":"collection1",
> [junit4:junit4]   2>      "collection":"collection1",
> [junit4:junit4]   2>      "node_name":"127.0.0.1:58107_solr",
> [junit4:junit4]   2>      "base_url":"http://127.0.0.1:58107/solr"}
> [junit4:junit4]   2> 15554 T40 oascc.ZkStateReader$2.process A cluster state change has occurred - updating... (4)
> [junit4:junit4]   2> 15554 T76 oascc.ZkStateReader$2.process A cluster state change has occurred - updating... (4)
> [junit4:junit4]   2> 15554 T92 oascc.ZkStateReader$2.process A cluster state change has occurred - updating... (4)
> [junit4:junit4]   2> 15554 T49 oascc.ZkStateReader$2.process A cluster state change has occurred - updating... (4)
> [junit4:junit4]   2> 15554 T60 oascc.ZkStateReader$2.process A cluster state change has occurred - updating... (4)
> [junit4:junit4]   2> 15655 T19 oasc.CoreContainer.register registering core: collection1
> [junit4:junit4]   2> 15655 T19 oasc.ZkController.register Register shard - core:collection1 address:http://127.0.0.1:58107/solr shardId:shard1
> [junit4:junit4]   2> 15660 T19 oasc.ZkController.register We are http://127.0.0.1:58107/solr/collection1/ and leader is http://127.0.0.1:58091/solr/collection1/
> [junit4:junit4]   2> 15660 T19 oasc.ZkController.register No LogReplay needed for core=collection1 baseURL=http://127.0.0.1:58107/solr
> [junit4:junit4]   2> 15661 T19 oasc.ZkController.checkRecovery Core needs to recover:collection1
> [junit4:junit4]   2> 15662 T19 oasu.DefaultSolrCoreState.doRecovery Running recovery - first canceling any ongoing recovery
> [junit4:junit4]   2> ASYNC  NEW_CORE C1 name=collection1 org.apache.solr.core.SolrCore@41f6e11e url=http://127.0.0.1:58107/solr/collection1 node=127.0.0.1:58107_solr
> [junit4:junit4]   2> 15669 T98 C1 P58107 oasc.RecoveryStrategy.run Starting recovery process.  core=collection1 recoveringAfterStartup=true
> [junit4:junit4]   2> 15669 T19 oascc.ZkStateReader.updateClusterState Updating cloud state from ZooKeeper...
> [junit4:junit4]   2> 15669 T98 C1 P58107 oasc.RecoveryStrategy.doRecovery ###### startupVersions=[]
> [junit4:junit4]   2> 15670 T98 C1 P58107 oasc.ZkController.publish numShards not found on descriptor - reading it from system property
> [junit4:junit4]   2> 15671 T19 oass.SolrDispatchFilter.init user.dir=/usr/home/hudson/hudson-slave/workspace/Lucene-Solr-Tests-trunk-java7/solr/build/solr-core/test/J0
> [junit4:junit4]   2> 15672 T98 C1 P58107 oasc.RecoveryStrategy.doRecovery Attempting to PeerSync from http://127.0.0.1:58091/solr/collection1/ core=collection1 - recoveringAfterStartup=true
> [junit4:junit4]   2> 15672 T19 oass.SolrDispatchFilter.init SolrDispatchFilter.init() done
> [junit4:junit4]   2> 15674 T19 oascsi.HttpClientUtil.createClient Creating new http client, config:maxConnections=128&maxConnectionsPerHost=32&followRedirects=false
> [junit4:junit4]   2> 15682 T98 C1 P58107 oascsi.HttpClientUtil.createClient Creating new http client, config:maxConnectionsPerHost=20&maxConnections=10000&connTimeout=30000&socketTimeout=30000&retry=false
> [junit4:junit4]   2> 15708 T98 C1 P58107 oasu.PeerSync.sync PeerSync: core=collection1 url=http://127.0.0.1:58107/solr START replicas=[http://127.0.0.1:58091/solr/collection1/] nUpdates=100
> [junit4:junit4]   2> 15727 T98 C1 P58107 oasu.PeerSync.sync WARNING no frame of reference to tell of we've missed updates
> [junit4:junit4]   2> 15729 T98 C1 P58107 oasc.RecoveryStrategy.doRecovery PeerSync Recovery was not successful - trying replication. core=collection1
> [junit4:junit4]   2> 15729 T98 C1 P58107 oasc.RecoveryStrategy.doRecovery Starting Replication Recovery. core=collection1
> [junit4:junit4]   2> 15729 T98 C1 P58107 oascsi.HttpClientUtil.createClient Creating new http client, config:maxConnections=128&maxConnectionsPerHost=32&followRedirects=false
> [junit4:junit4]   2> 15966 T19 oejs.Server.doStart jetty-8.1.2.v20120308
> [junit4:junit4]   2> 15969 T19 oejs.AbstractConnector.doStart Started SelectChannelConnector@0.0.0.0:47836
> [junit4:junit4]   2> 15970 T19 oasc.SolrResourceLoader.locateSolrHome JNDI not configured for solr (NoInitialContextEx)
> [junit4:junit4]   2> 15971 T19 oasc.SolrResourceLoader.locateSolrHome using system property solr.solr.home: /usr/home/hudson/hudson-slave/workspace/Lucene-Solr-Tests-trunk-java7/solr/build/solr-core/test/J0/./org.apache.solr.cloud.BasicDistributedZk2Test-jetty4-1351326135013
> [junit4:junit4]   2> 15971 T19 oasc.SolrResourceLoader.<init> new SolrResourceLoader for deduced Solr Home: '/usr/home/hudson/hudson-slave/workspace/Lucene-Solr-Tests-trunk-java7/solr/build/solr-core/test/J0/./org.apache.solr.cloud.BasicDistributedZk2Test-jetty4-1351326135013/'
> [junit4:junit4]   2> 16034 T19 oass.SolrDispatchFilter.init SolrDispatchFilter.init()
> [junit4:junit4]   2> 16035 T19 oasc.SolrResourceLoader.locateSolrHome JNDI not configured for solr (NoInitialContextEx)
> [junit4:junit4]   2> 16036 T19 oasc.SolrResourceLoader.locateSolrHome using system property solr.solr.home: /usr/home/hudson/hudson-slave/workspace/Lucene-Solr-Tests-trunk-java7/solr/build/solr-core/test/J0/./org.apache.solr.cloud.BasicDistributedZk2Test-jetty4-1351326135013
> [junit4:junit4]   2> 16036 T19 oasc.CoreContainer$Initializer.initialize looking for solr.xml: /usr/home/hudson/hudson-slave/workspace/Lucene-Solr-Tests-trunk-java7/solr/build/solr-core/test/J0/./org.apache.solr.cloud.BasicDistributedZk2Test-jetty4-1351326135013/solr.xml
> [junit4:junit4]   2> 16037 T19 oasc.CoreContainer.<init> New CoreContainer 1669504257
> [junit4:junit4]   2> 16038 T19 oasc.CoreContainer.load Loading CoreContainer using Solr Home: '/usr/home/hudson/hudson-slave/workspace/Lucene-Solr-Tests-trunk-java7/solr/build/solr-core/test/J0/./org.apache.solr.cloud.BasicDistributedZk2Test-jetty4-1351326135013/'
> [junit4:junit4]   2> 16039 T19 oasc.SolrResourceLoader.<init> new SolrResourceLoader for directory: '/usr/home/hudson/hudson-slave/workspace/Lucene-Solr-Tests-trunk-java7/solr/build/solr-core/test/J0/./org.apache.solr.cloud.BasicDistributedZk2Test-jetty4-1351326135013/'
> [junit4:junit4]   2> 16060 T45 oascc.ZkStateReader.updateClusterState Updating cloud state from ZooKeeper...
> [junit4:junit4]   2> 16061 T45 oasc.Overseer$ClusterStateUpdater.updateState Update state numShards=2 message={
> [junit4:junit4]   2>      "operation":"state",
> [junit4:junit4]   2>      "numShards":"2",
> [junit4:junit4]   2>      "shard":"shard1",
> [junit4:junit4]   2>      "roles":null,
> [junit4:junit4]   2>      "state":"recovering",
> [junit4:junit4]   2>      "core":"collection1",
> [junit4:junit4]   2>      "collection":"collection1",
> [junit4:junit4]   2>      "node_name":"127.0.0.1:58107_solr",
> [junit4:junit4]   2>      "base_url":"http://127.0.0.1:58107/solr"}
> [junit4:junit4]   2> 16089 T49 oascc.ZkStateReader$2.process A cluster state change has occurred - updating... (4)
> [junit4:junit4]   2> 16089 T60 oascc.ZkStateReader$2.process A cluster state change has occurred - updating... (4)
> [junit4:junit4]   2> 16089 T92 oascc.ZkStateReader$2.process A cluster state change has occurred - updating... (4)
> [junit4:junit4]   2> 16089 T76 oascc.ZkStateReader$2.process A cluster state change has occurred - updating... (4)
> [junit4:junit4]   2> 16089 T40 oascc.ZkStateReader$2.process A cluster state change has occurred - updating... (4)
> [junit4:junit4]   2> 16093 T19 oasc.CoreContainer.load Registering Log Listener
> [junit4:junit4]   2> 16106 T19 oasc.CoreContainer.initZooKeeper Zookeeper client=127.0.0.1:58068/solr
> [junit4:junit4]   2> 16107 T19 oaz.ZooKeeper.<init> Initiating client connection, connectString=127.0.0.1:58068/solr sessionTimeout=5000 watcher=org.apache.solr.common.cloud.ConnectionManager@1baa3b
> [junit4:junit4]   2> 16108 T109 oaz.ClientCnxn$SendThread.startConnect Opening socket connection to server /127.0.0.1:58068
> [junit4:junit4]   2> 16108 T19 oascc.ConnectionManager.waitForConnected Waiting for client to connect to ZooKeeper
> [junit4:junit4]   2> 16110 T109 oaz.ClientCnxn$SendThread.primeConnection Socket connection established to localhost/127.0.0.1:58068, initiating session
> [junit4:junit4]   2> 16110 T21 oazs.NIOServerCnxn$Factory.run Accepted socket connection from /140.211.11.196:16436
> [junit4:junit4]   2> 16111 T21 oazs.NIOServerCnxn.readConnectRequest Client attempting to establish new session at /140.211.11.196:16436
> [junit4:junit4]   2> 16115 T24 oazs.NIOServerCnxn.finishSessionInit Established session 0x13aa15037410007 with negotiated timeout 5000 for client /140.211.11.196:16436
> [junit4:junit4]   2> 16115 T109 oaz.ClientCnxn$SendThread.readConnectResult Session establishment complete on server localhost/127.0.0.1:58068, sessionid = 0x13aa15037410007, negotiated timeout = 5000
> [junit4:junit4]   2> 16116 T110 oascc.ConnectionManager.process Watcher org.apache.solr.common.cloud.ConnectionManager@1baa3b name:ZooKeeperConnection Watcher:127.0.0.1:58068/solr got event WatchedEvent state:SyncConnected type:None path:null path:null type:None
> [junit4:junit4]   2> 16116 T19 oascc.ConnectionManager.waitForConnected Client is connected to ZooKeeper
> [junit4:junit4]   2> 16117 T26 oazs.PrepRequestProcessor.pRequest Got user-level KeeperException when processing sessionid:0x13aa15037410007 type:create cxid:0x1 zxid:0xfffffffffffffffe txntype:unknown reqpath:n/a Error Path:/solr/overseer Error:KeeperErrorCode = NodeExists for /solr/overseer
> [junit4:junit4]   2> 16119 T26 oazs.PrepRequestProcessor.pRequest Got user-level KeeperException when processing sessionid:0x13aa15037410007 type:create cxid:0x2 zxid:0xfffffffffffffffe txntype:unknown reqpath:n/a Error Path:/solr/overseer Error:KeeperErrorCode = NodeExists for /solr/overseer
> [junit4:junit4]   2> 16126 T19 oasc.ZkController.createEphemeralLiveNode Register node as live in ZooKeeper:/live_nodes/127.0.0.1:47836_solr
> [junit4:junit4]   2> 16127 T26 oazs.PrepRequestProcessor.pRequest Got user-level KeeperException when processing sessionid:0x13aa15037410007 type:delete cxid:0x4 zxid:0xfffffffffffffffe txntype:unknown reqpath:n/a Error Path:/solr/live_nodes/127.0.0.1:47836_solr Error:KeeperErrorCode = NoNode for /solr/live_nodes/127.0.0.1:47836_solr
> [junit4:junit4]   2> 16129 T19 oascc.SolrZkClient.makePath makePath: /live_nodes/127.0.0.1:47836_solr
> [junit4:junit4]   2> 16132 T92 oascc.ZkStateReader$2.process A cluster state change has occurred - updating... (4)
> [junit4:junit4]   2> 16132 T49 oascc.ZkStateReader$2.process A cluster state change has occurred - updating... (4)
> [junit4:junit4]   2> 16132 T40 oascc.ZkStateReader$2.process A cluster state change has occurred - updating... (4)
> [junit4:junit4]   2> 16133 T60 oascc.ZkStateReader$3.process Updating live nodes... (5)
> [junit4:junit4]   2> 16133 T76 oascc.ZkStateReader$3.process Updating live nodes... (5)
> [junit4:junit4]   2> 16134 T60 oascc.ZkStateReader$2.process A cluster state change has occurred - updating... (5)
> [junit4:junit4]   2> 16134 T76 oascc.ZkStateReader$2.process A cluster state change has occurred - updating... (5)
> [junit4:junit4]   2> 16134 T19 oashc.HttpShardHandlerFactory.getParameter Setting socketTimeout to: 0
> [junit4:junit4]   2> 16135 T49 oascc.ZkStateReader$3.process Updating live nodes... (5)
> [junit4:junit4]   2> 16136 T92 oascc.ZkStateReader$3.process Updating live nodes... (5)
> [junit4:junit4]   2> 16135 T19 oashc.HttpShardHandlerFactory.getParameter Setting urlScheme to: http://
> [junit4:junit4]   2> 16136 T40 oascc.ZkStateReader$3.process Updating live nodes... (5)
> [junit4:junit4]   2> 16137 T19 oashc.HttpShardHandlerFactory.getParameter Setting connTimeout to: 0
> [junit4:junit4]   2> 16137 T19 oashc.HttpShardHandlerFactory.getParameter Setting maxConnectionsPerHost to: 20
> [junit4:junit4]   2> 16138 T19 oashc.HttpShardHandlerFactory.getParameter Setting corePoolSize to: 0
> [junit4:junit4]   2> 16138 T19 oashc.HttpShardHandlerFactory.getParameter Setting maximumPoolSize to: 2147483647
> [junit4:junit4]   2> 16138 T19 oashc.HttpShardHandlerFactory.getParameter Setting maxThreadIdleTime to: 5
> [junit4:junit4]   2> 16139 T19 oashc.HttpShardHandlerFactory.getParameter Setting sizeOfQueue to: -1
> [junit4:junit4]   2> 16139 T19 oashc.HttpShardHandlerFactory.getParameter Setting fairnessPolicy to: false
> [junit4:junit4]   2> 16140 T19 oascsi.HttpClientUtil.createClient Creating new http client, config:maxConnectionsPerHost=20&maxConnections=10000&socketTimeout=0&connTimeout=0&retry=false
> [junit4:junit4]   2> 16158 T19 oascc.ZkStateReader.createClusterStateWatchersAndUpdate Updating cluster state from ZooKeeper...
> [junit4:junit4]   2> 16167 T19 oasc.CoreContainer.create Creating SolrCore 'collection1' using instanceDir: /usr/home/hudson/hudson-slave/workspace/Lucene-Solr-Tests-trunk-java7/solr/build/solr-core/test/J0/./org.apache.solr.cloud.BasicDistributedZk2Test-jetty4-1351326135013/collection1
> [junit4:junit4]   2> 16168 T19 oasc.ZkController.createCollectionZkNode Check for collection zkNode:collection1
> [junit4:junit4]   2> 16169 T19 oasc.ZkController.createCollectionZkNode Collection zkNode exists
> [junit4:junit4]   2> 16170 T19 oasc.ZkController.readConfigName Load collection config from:/collections/collection1
> [junit4:junit4]   2> 16172 T19 oasc.SolrResourceLoader.<init> new SolrResourceLoader for directory: '/usr/home/hudson/hudson-slave/workspace/Lucene-Solr-Tests-trunk-java7/solr/build/solr-core/test/J0/./org.apache.solr.cloud.BasicDistributedZk2Test-jetty4-1351326135013/collection1/'
> [junit4:junit4]   2> 16173 T19 oasc.SolrResourceLoader.replaceClassLoader Adding 'file:/usr/home/hudson/hudson-slave/workspace/Lucene-Solr-Tests-trunk-java7/solr/build/solr-core/test/J0/org.apache.solr.cloud.BasicDistributedZk2Test-jetty4-1351326135013/collection1/lib/README' to classloader
> [junit4:junit4]   2> 16174 T19 oasc.SolrResourceLoader.replaceClassLoader Adding 'file:/usr/home/hudson/hudson-slave/workspace/Lucene-Solr-Tests-trunk-java7/solr/build/solr-core/test/J0/org.apache.solr.cloud.BasicDistributedZk2Test-jetty4-1351326135013/collection1/lib/classes/' to classloader
> [junit4:junit4]   2> 16241 T19 oasc.SolrConfig.<init> Using Lucene MatchVersion: LUCENE_50
> [junit4:junit4]   2> 16301 T19 oasc.SolrConfig.<init> Loaded SolrConfig: solrconfig.xml
> [junit4:junit4]   2> 16402 T19 oass.IndexSchema.readSchema Reading Solr Schema
> [junit4:junit4]   2> 16432 T19 oass.IndexSchema.readSchema Schema name=test
> [junit4:junit4]   2> ASYNC  NEW_CORE C2 name=collection1 org.apache.solr.core.SolrCore@79c05dfa url=http://127.0.0.1:58091/solr/collection1 node=127.0.0.1:58091_solr
> [junit4:junit4]   2> 16858 T64 C2 P58091 REQ /get {distrib=false&qt=/get&wt=javabin&version=2&getVersions=100} status=0 QTime=16
> [junit4:junit4]   2> 17030 T19 oass.OpenExchangeRatesOrgProvider.init Initialized with rates=open-exchange-rates.json, refreshInterval=1440.
> [junit4:junit4]   2> 17042 T19 oass.IndexSchema.readSchema default search field in schema is text
> [junit4:junit4]   2> 17045 T19 oass.IndexSchema.readSchema unique key field: id
> [junit4:junit4]   2> 17068 T19 oass.FileExchangeRateProvider.reload Reloading exchange rates from file currency.xml
> [junit4:junit4]   2> 17081 T19 oass.FileExchangeRateProvider.reload Reloading exchange rates from file currency.xml
> [junit4:junit4]   2> 17086 T19 oass.OpenExchangeRatesOrgProvider.reload Reloading exchange rates from open-exchange-rates.json
> [junit4:junit4]   2> 17088 T19 oass.OpenExchangeRatesOrgProvider.reload Reloading exchange rates from open-exchange-rates.json
> [junit4:junit4]   2> 17091 T19 oasc.SolrCore.<init> [collection1] Opening new SolrCore at /usr/home/hudson/hudson-slave/workspace/Lucene-Solr-Tests-trunk-java7/solr/build/solr-core/test/J0/./org.apache.solr.cloud.BasicDistributedZk2Test-jetty4-1351326135013/collection1/, dataDir=./org.apache.solr.cloud.BasicDistributedZk2Test-1351326119324/jetty4/
> [junit4:junit4]   2> 17091 T19 oasc.JmxMonitoredMap.<init> JMX monitoring is enabled. Adding Solr mbeans to JMX Server: com.sun.jmx.mbeanserver.JmxMBeanServer@834f715
> [junit4:junit4]   2> 17092 T19 oasc.SolrCore.initDirectoryFactory solr.NRTCachingDirectoryFactory
> [junit4:junit4]   2> 17093 T19 oasc.CachingDirectoryFactory.injectLockFactory WARNING No lockType configured for NRTCachingDirectory(org.apache.lucene.store.NIOFSDirectory@/usr/home/hudson/hudson-slave/workspace/Lucene-Solr-Tests-trunk-java7/solr/build/solr-core/test/J0/org.apache.solr.cloud.BasicDistributedZk2Test-1351326119324/jetty4 lockFactory=org.apache.lucene.store.NativeFSLockFactory@8aea957; maxCacheMB=48.0 maxMergeSizeMB=4.0) assuming 'simple'
> [junit4:junit4]   2> 17093 T19 oasc.CachingDirectoryFactory.get return new directory for /usr/home/hudson/hudson-slave/workspace/Lucene-Solr-Tests-trunk-java7/solr/build/solr-core/test/J0/./org.apache.solr.cloud.BasicDistributedZk2Test-1351326119324/jetty4 forceNew:false
> [junit4:junit4]   2> 17094 T19 oasc.CachingDirectoryFactory.close Releasing directory:/usr/home/hudson/hudson-slave/workspace/Lucene-Solr-Tests-trunk-java7/solr/build/solr-core/test/J0/./org.apache.solr.cloud.BasicDistributedZk2Test-1351326119324/jetty4
> [junit4:junit4]   2> 17095 T19 oasc.SolrCore.getNewIndexDir New index directory detected: old=null new=./org.apache.solr.cloud.BasicDistributedZk2Test-1351326119324/jetty4/index/
> [junit4:junit4]   2> 17095 T19 oasc.SolrCore.initIndex WARNING [collection1] Solr index directory './org.apache.solr.cloud.BasicDistributedZk2Test-1351326119324/jetty4/index' doesn't exist. Creating new index...
> [junit4:junit4]   2> 17096 T19 oasc.CachingDirectoryFactory.get return new directory for /usr/home/hudson/hudson-slave/workspace/Lucene-Solr-Tests-trunk-java7/solr/build/solr-core/test/J0/./org.apache.solr.cloud.BasicDistributedZk2Test-1351326119324/jetty4/index forceNew:false
> [junit4:junit4]   2> 17128 T19 oasc.SolrDeletionPolicy.onCommit SolrDeletionPolicy.onCommit: commits:num=1
> [junit4:junit4]   2>            commit{dir=NRTCachingDirectory(org.apache.lucene.store.NIOFSDirectory@/usr/home/hudson/hudson-slave/workspace/Lucene-Solr-Tests-trunk-java7/solr/build/solr-core/test/J0/org.apache.solr.cloud.BasicDistributedZk2Test-1351326119324/jetty4/index lockFactory=org.apache.lucene.store.NativeFSLockFactory@4e065873; maxCacheMB=48.0 maxMergeSizeMB=4.0),segFN=segments_1,generation=1,filenames=[segments_1]
> [junit4:junit4]   2> 17129 T19 oasc.SolrDeletionPolicy.updateCommits newest commit = 1[segments_1]
> [junit4:junit4]   2> 17130 T19 oasc.CachingDirectoryFactory.close Releasing directory:/usr/home/hudson/hudson-slave/workspace/Lucene-Solr-Tests-trunk-java7/solr/build/solr-core/test/J0/./org.apache.solr.cloud.BasicDistributedZk2Test-1351326119324/jetty4/index
> [junit4:junit4]   2> 17130 T19 oasc.SolrCore.initWriters created xml: solr.XMLResponseWriter
> [junit4:junit4]   2> 17133 T19 oasup.UpdateRequestProcessorChain.init inserting DistributedUpdateProcessorFactory in
>
> [...truncated too long message...]
>
> asses/test:/usr/home/hudson/hudson-slave/workspace/Lucene-Solr-Tests-trunk-java7/solr/build/solr-test-framework/classes/java:/usr/home/hudson/hudson-slave/workspace/Lucene-Solr-Tests-trunk-java7/solr/build/solr-core/test-files:/usr/home/hudson/hudson-slave/workspace/Lucene-Solr-Tests-trunk-java7/lucene/build/test-framework/classes/java:/usr/home/hudson/hudson-slave/workspace/Lucene-Solr-Tests-trunk-java7/lucene/build/codecs/classes/java:/usr/home/hudson/hudson-slave/workspace/Lucene-Solr-Tests-trunk-java7/solr/build/solr-solrj/classes/java:/usr/home/hudson/hudson-slave/workspace/Lucene-Solr-Tests-trunk-java7/solr/build/solr-core/classes/java:/usr/home/hudson/hudson-slave/workspace/Lucene-Solr-Tests-trunk-java7/lucene/build/analysis/common/lucene-analyzers-common-5.0-SNAPSHOT.jar:/usr/home/hudson/hudson-slave/workspace/Lucene-Solr-Tests-trunk-java7/lucene/build/analysis/kuromoji/lucene-analyzers-kuromoji-5.0-SNAPSHOT.jar:/usr/home/hudson/hudson-slave/workspace/Lucene-Solr-Tests-trunk-java7/lucene/build/analysis/phonetic/lucene-analyzers-phonetic-5.0-SNAPSHOT.jar:/usr/home/hudson/hudson-slave/workspace/Lucene-Solr-Tests-trunk-java7/lucene/build/highlighter/lucene-highlighter-5.0-SNAPSHOT.jar:/usr/home/hudson/hudson-slave/workspace/Lucene-Solr-Tests-trunk-java7/lucene/build/memory/lucene-memory-5.0-SNAPSHOT.jar:/usr/home/hudson/hudson-slave/workspace/Lucene-Solr-Tests-trunk-java7/lucene/build/misc/lucene-misc-5.0-SNAPSHOT.jar:/usr/home/hudson/hudson-slave/workspace/Lucene-Solr-Tests-trunk-java7/lucene/build/spatial/lucene-spatial-5.0-SNAPSHOT.jar:/usr/home/hudson/hudson-slave/workspace/Lucene-Solr-Tests-trunk-java7/lucene/build/suggest/lucene-suggest-5.0-SNAPSHOT.jar:/usr/home/hudson/hudson-slave/workspace/Lucene-Solr-Tests-trunk-java7/lucene/build/grouping/lucene-grouping-5.0-SNAPSHOT.jar:/usr/home/hudson/hudson-slave/workspace/Lucene-Solr-Tests-trunk-java7/lucene/build/queries/lucene-queries-5.0-SNAPSHOT.jar:/usr/home/hudson/hudson-slave/workspace/Lucene-Solr-Tests-trunk-java7/lucene/build/queryparser/lucene-queryparser-5.0-SNAPSHOT.jar:/usr/home/hudson/hudson-slave/workspace/Lucene-Solr-Tests-trunk-java7/solr/core/lib/commons-cli-1.2.jar:/usr/home/hudson/hudson-slave/workspace/Lucene-Solr-Tests-trunk-java7/solr/core/lib/commons-codec-1.7.jar:/usr/home/hudson/hudson-slave/workspace/Lucene-Solr-Tests-trunk-java7/solr/core/lib/commons-fileupload-1.2.1.jar:/usr/home/hudson/hudson-slave/workspace/Lucene-Solr-Tests-trunk-java7/solr/core/lib/commons-lang-2.6.jar:/usr/home/hudson/hudson-slave/workspace/Lucene-Solr-Tests-trunk-java7/solr/core/lib/easymock-2.2.jar:/usr/home/hudson/hudson-slave/workspace/Lucene-Solr-Tests-trunk-java7/solr/core/lib/guava-r05.jar:/usr/home/hudson/hudson-slave/workspace/Lucene-Solr-Tests-trunk-java7/solr/core/lib/javax.servlet-api-3.0.1.jar:/usr/home/hudson/hudson-slave/workspace/Lucene-Solr-Tests-trunk-java7/solr/core/lib/spatial4j-0.3.jar:/usr/home/hudson/hudson-slave/workspace/Lucene-Solr-Tests-trunk-java7/solr/solrj/lib/commons-io-2.1.jar:/usr/home/hudson/hudson-slave/workspace/Lucene-Solr-Tests-trunk-java7/solr/solrj/lib/httpclient-4.1.3.jar:/usr/home/hudson/hudson-slave/workspace/Lucene-Solr-Tests-trunk-java7/solr/solrj/lib/httpcore-4.1.4.jar:/usr/home/hudson/hudson-slave/workspace/Lucene-Solr-Tests-trunk-java7/solr/solrj/lib/httpmime-4.1.3.jar:/usr/home/hudson/hudson-slave/workspace/Lucene-Solr-Tests-trunk-java7/solr/solrj/lib/jcl-over-slf4j-1.6.4.jar:/usr/home/hudson/hudson-slave/workspace/Lucene-Solr-Tests-trunk-java7/solr/solrj/lib/log4j-over-slf4j-1.6.4.jar:/usr/home/hudson/hudson-slave/workspace/Lucene-Solr-Tests-trunk-java7/solr/solrj/lib/slf4j-api-1.6.4.jar:/usr/home/hudson/hudson-slave/workspace/Lucene-Solr-Tests-trunk-java7/solr/solrj/lib/slf4j-jdk14-1.6.4.jar:/usr/home/hudson/hudson-slave/workspace/Lucene-Solr-Tests-trunk-java7/solr/solrj/lib/wstx-asl-3.2.7.jar:/usr/home/hudson/hudson-slave/workspace/Lucene-Solr-Tests-trunk-java7/solr/solrj/lib/zookeeper-3.3.6.jar:/usr/home/hudson/hudson-slave/workspace/Lucene-Solr-Tests-trunk-java7/solr/example/lib/jetty-continuation-8.1.2.v20120308.jar:/usr/home/hudson/hudson-slave/workspace/Lucene-Solr-Tests-trunk-java7/solr/example/lib/jetty-deploy-8.1.2.v20120308.jar:/usr/home/hudson/hudson-slave/workspace/Lucene-Solr-Tests-trunk-java7/solr/example/lib/jetty-http-8.1.2.v20120308.jar:/usr/home/hudson/hudson-slave/workspace/Lucene-Solr-Tests-trunk-java7/solr/example/lib/jetty-io-8.1.2.v20120308.jar:/usr/home/hudson/hudson-slave/workspace/Lucene-Solr-Tests-trunk-java7/solr/example/lib/jetty-jmx-8.1.2.v20120308.jar:/usr/home/hudson/hudson-slave/workspace/Lucene-Solr-Tests-trunk-java7/solr/example/lib/jetty-security-8.1.2.v20120308.jar:/usr/home/hudson/hudson-slave/workspace/Lucene-Solr-Tests-trunk-java7/solr/example/lib/jetty-server-8.1.2.v20120308.jar:/usr/home/hudson/hudson-slave/workspace/Lucene-Solr-Tests-trunk-java7/solr/example/lib/jetty-servlet-8.1.2.v20120308.jar:/usr/home/hudson/hudson-slave/workspace/Lucene-Solr-Tests-trunk-java7/solr/example/lib/jetty-util-8.1.2.v20120308.jar:/usr/home/hudson/hudson-slave/workspace/Lucene-Solr-Tests-trunk-java7/solr/example/lib/jetty-webapp-8.1.2.v20120308.jar:/usr/home/hudson/hudson-slave/workspace/Lucene-Solr-Tests-trunk-java7/solr/example/lib/jetty-xml-8.1.2.v20120308.jar:/usr/home/hudson/hudson-slave/workspace/Lucene-Solr-Tests-trunk-java7/solr/example/lib/servlet-api-3.0.jar:/usr/home/hudson/hudson-slave/workspace/Lucene-Solr-Tests-trunk-java7/solr/example/example-DIH/solr/db/lib/hsqldb-1.8.0.10.jar:/usr/home/hudson/hudson-slave/workspace/Lucene-Solr-Tests-trunk-java7/lucene/build/core/classes/java:/usr/home/hudson/hudson-slave/workspace/Lucene-Solr-Tests-trunk-java7/lucene/test-framework/lib/junit-4.10.jar:/usr/home/hudson/hudson-slave/workspace/Lucene-Solr-Tests-trunk-java7/lucene/test-framework/lib/randomizedtesting-runner-2.0.3.jar:/home/hudson/hudson-slave/tools/Ant/ant-1.8.2/lib/ant-launcher.jar:/home/hudson/.ant/lib/ivy-2.2.0.jar:/home/hudson/hudson-slave/tools/Ant/ant-1.8.2/lib/ant-apache-regexp.jar:/home/hudson/hudson-slave/tools/Ant/ant-1.8.2/lib/ant-junit.jar:/home/hudson/hudson-slave/tools/Ant/ant-1.8.2/lib/ant-apache-bsf.jar:/home/hudson/hudson-slave/tools/Ant/ant-1.8.2/lib/ant-commons-net.jar:/home/hudson/hudson-slave/tools/Ant/ant-1.8.2/lib/ant-antlr.jar:/home/hudson/hudson-slave/tools/Ant/ant-1.8.2/lib/ant-apache-log4j.jar:/home/hudson/hudson-slave/tools/Ant/ant-1.8.2/lib/ant-commons-logging.jar:/home/hudson/hudson-slave/tools/Ant/ant-1.8.2/lib/ant-apache-xalan2.jar:/home/hudson/hudson-slave/tools/Ant/ant-1.8.2/lib/ant-apache-oro.jar:/home/hudson/hudson-slave/tools/Ant/ant-1.8.2/lib/ant-junit4.jar:/home/hudson/hudson-slave/tools/Ant/ant-1.8.2/lib/ant-netrexx.jar:/home/hudson/hudson-slave/tools/Ant/ant-1.8.2/lib/ant-swing.jar:/home/hudson/hudson-slave/tools/Ant/ant-1.8.2/lib/ant-javamail.jar:/home/hudson/hudson-slave/tools/Ant/ant-1.8.2/lib/ant-jsch.jar:/home/hudson/hudson-slave/tools/Ant/ant-1.8.2/lib/ant-jmf.jar:/home/hudson/hudson-slave/tools/Ant/ant-1.8.2/lib/ant.jar:/home/hudson/hudson-slave/tools/Ant/ant-1.8.2/lib/ant-apache-bcel.jar:/home/hudson/hudson-slave/tools/Ant/ant-1.8.2/lib/ant-jai.jar:/home/hudson/hudson-slave/tools/Ant/ant-1.8.2/lib/ant-testutil.jar:/home/hudson/hudson-slave/tools/Ant/ant-1.8.2/lib/ant-apache-resolver.jar:/home/hudson/hudson-slave/tools/Ant/ant-1.8.2/lib/ant-jdepend.jar:/usr/local/openjdk7/lib/tools.jar:/home/hudson/.ivy2/cache/com.carrotsearch.randomizedtesting/junit4-ant/jars/junit4-ant-2.0.3.jar -ea:org.apache.lucene... -ea:org.apache.solr... com.carrotsearch.ant.tasks.junit4.slave.SlaveMainSafe -eventsfile /usr/home/hudson/hudson-slave/workspace/Lucene-Solr-Tests-trunk-java7/solr/build/solr-core/test/junit4-J1-20121027_082142_782.events @/usr/home/hudson/hudson-slave/workspace/Lucene-Solr-Tests-trunk-java7/solr/build/solr-core/test/junit4-J1-20121027_082142_782.suites
> [junit4:junit4] ERROR: JVM J1 ended with an exception: Forked process exited with an error code: 137
> [junit4:junit4]         at com.carrotsearch.ant.tasks.junit4.JUnit4.forkProcess(JUnit4.java:1312)
> [junit4:junit4]         at com.carrotsearch.ant.tasks.junit4.JUnit4.executeSlave(JUnit4.java:1178)
> [junit4:junit4]         at com.carrotsearch.ant.tasks.junit4.JUnit4.access$000(JUnit4.java:65)
> [junit4:junit4]         at com.carrotsearch.ant.tasks.junit4.JUnit4$2.call(JUnit4.java:813)
> [junit4:junit4]         at com.carrotsearch.ant.tasks.junit4.JUnit4$2.call(JUnit4.java:810)
> [junit4:junit4]         at java.util.concurrent.FutureTask$Sync.innerRun(FutureTask.java:334)
> [junit4:junit4]         at java.util.concurrent.FutureTask.run(FutureTask.java:166)
> [junit4:junit4]         at java.util.concurrent.ThreadPoolExecutor.runWorker(ThreadPoolExecutor.java:1110)
> [junit4:junit4]         at java.util.concurrent.ThreadPoolExecutor$Worker.run(ThreadPoolExecutor.java:603)
> [junit4:junit4]         at java.lang.Thread.run(Thread.java:722)
>
> BUILD FAILED
> /usr/home/hudson/hudson-slave/workspace/Lucene-Solr-Tests-trunk-java7/build.xml:335: The following error occurred while executing this line:
> /usr/home/hudson/hudson-slave/workspace/Lucene-Solr-Tests-trunk-java7/build.xml:39: The following error occurred while executing this line:
> /usr/home/hudson/hudson-slave/workspace/Lucene-Solr-Tests-trunk-java7/solr/build.xml:178: The following error occurred while executing this line:
> /usr/home/hudson/hudson-slave/workspace/Lucene-Solr-Tests-trunk-java7/lucene/module-build.xml:61: The following error occurred while executing this line:
> /usr/home/hudson/hudson-slave/workspace/Lucene-Solr-Tests-trunk-java7/lucene/common-build.xml:1159: The following error occurred while executing this line:
> /usr/home/hudson/hudson-slave/workspace/Lucene-Solr-Tests-trunk-java7/lucene/common-build.xml:827: At least one slave process threw an exception, first: Forked process exited with an error code: 137
>
> Total time: 401 minutes 47 seconds
> Build step 'Invoke Ant' marked build as failure
> Archiving artifacts
> Recording test results
> Email was triggered for: Failure
> Sending email for trigger: Failure
>
>
>
>
> ---------------------------------------------------------------------
> To unsubscribe, e-mail: dev-unsubscribe@lucene.apache.org
> For additional commands, e-mail: dev-help@lucene.apache.org

---------------------------------------------------------------------
To unsubscribe, e-mail: dev-unsubscribe@lucene.apache.org
For additional commands, e-mail: dev-help@lucene.apache.org


Mime
View raw message