lucene-dev mailing list archives

Site index · List index
Message view « Date » · « Thread »
Top « Date » · « Thread »
From Policeman Jenkins Server <jenk...@sd-datasolutions.de>
Subject [JENKINS] Lucene-Solr-trunk-Windows (32bit/jdk1.7.0_09) - Build # 2266 - Failure!
Date Sat, 22 Dec 2012 22:59:03 GMT
Build: http://jenkins.sd-datasolutions.de/job/Lucene-Solr-trunk-Windows/2266/
Java: 32bit/jdk1.7.0_09 -server -XX:+UseG1GC

1 tests failed.
REGRESSION:  org.apache.solr.handler.component.SpellCheckComponentTest.testThresholdTokenFrequency

Error Message:
Path not found: /spellcheck/suggestions/[1]/suggestion

Stack Trace:
java.lang.RuntimeException: Path not found: /spellcheck/suggestions/[1]/suggestion
	at __randomizedtesting.SeedInfo.seed([8A2E111CCA787BC6:899EED459342BD]:0)
	at org.apache.solr.SolrTestCaseJ4.assertJQ(SolrTestCaseJ4.java:604)
	at org.apache.solr.SolrTestCaseJ4.assertJQ(SolrTestCaseJ4.java:552)
	at org.apache.solr.handler.component.SpellCheckComponentTest.testThresholdTokenFrequency(SpellCheckComponentTest.java:214)
	at sun.reflect.NativeMethodAccessorImpl.invoke0(Native Method)
	at sun.reflect.NativeMethodAccessorImpl.invoke(NativeMethodAccessorImpl.java:57)
	at sun.reflect.DelegatingMethodAccessorImpl.invoke(DelegatingMethodAccessorImpl.java:43)
	at java.lang.reflect.Method.invoke(Method.java:601)
	at com.carrotsearch.randomizedtesting.RandomizedRunner.invoke(RandomizedRunner.java:1559)
	at com.carrotsearch.randomizedtesting.RandomizedRunner.access$600(RandomizedRunner.java:79)
	at com.carrotsearch.randomizedtesting.RandomizedRunner$6.evaluate(RandomizedRunner.java:737)
	at com.carrotsearch.randomizedtesting.RandomizedRunner$7.evaluate(RandomizedRunner.java:773)
	at com.carrotsearch.randomizedtesting.RandomizedRunner$8.evaluate(RandomizedRunner.java:787)
	at com.carrotsearch.randomizedtesting.rules.SystemPropertiesRestoreRule$1.evaluate(SystemPropertiesRestoreRule.java:53)
	at org.apache.lucene.util.TestRuleSetupTeardownChained$1.evaluate(TestRuleSetupTeardownChained.java:50)
	at org.apache.lucene.util.TestRuleFieldCacheSanity$1.evaluate(TestRuleFieldCacheSanity.java:51)
	at org.apache.lucene.util.AbstractBeforeAfterRule$1.evaluate(AbstractBeforeAfterRule.java:46)
	at com.carrotsearch.randomizedtesting.rules.SystemPropertiesInvariantRule$1.evaluate(SystemPropertiesInvariantRule.java:55)
	at org.apache.lucene.util.TestRuleThreadAndTestName$1.evaluate(TestRuleThreadAndTestName.java:49)
	at org.apache.lucene.util.TestRuleIgnoreAfterMaxFailures$1.evaluate(TestRuleIgnoreAfterMaxFailures.java:70)
	at org.apache.lucene.util.TestRuleMarkFailure$1.evaluate(TestRuleMarkFailure.java:48)
	at com.carrotsearch.randomizedtesting.rules.StatementAdapter.evaluate(StatementAdapter.java:36)
	at com.carrotsearch.randomizedtesting.ThreadLeakControl$StatementRunner.run(ThreadLeakControl.java:358)
	at com.carrotsearch.randomizedtesting.ThreadLeakControl.forkTimeoutingTask(ThreadLeakControl.java:782)
	at com.carrotsearch.randomizedtesting.ThreadLeakControl$3.evaluate(ThreadLeakControl.java:442)
	at com.carrotsearch.randomizedtesting.RandomizedRunner.runSingleTest(RandomizedRunner.java:746)
	at com.carrotsearch.randomizedtesting.RandomizedRunner$3.evaluate(RandomizedRunner.java:648)
	at com.carrotsearch.randomizedtesting.RandomizedRunner$4.evaluate(RandomizedRunner.java:682)
	at com.carrotsearch.randomizedtesting.RandomizedRunner$5.evaluate(RandomizedRunner.java:693)
	at com.carrotsearch.randomizedtesting.rules.StatementAdapter.evaluate(StatementAdapter.java:36)
	at com.carrotsearch.randomizedtesting.rules.SystemPropertiesRestoreRule$1.evaluate(SystemPropertiesRestoreRule.java:53)
	at org.apache.lucene.util.AbstractBeforeAfterRule$1.evaluate(AbstractBeforeAfterRule.java:46)
	at org.apache.lucene.util.TestRuleStoreClassName$1.evaluate(TestRuleStoreClassName.java:42)
	at com.carrotsearch.randomizedtesting.rules.SystemPropertiesInvariantRule$1.evaluate(SystemPropertiesInvariantRule.java:55)
	at com.carrotsearch.randomizedtesting.rules.NoShadowingOrOverridesOnMethodsRule$1.evaluate(NoShadowingOrOverridesOnMethodsRule.java:39)
	at com.carrotsearch.randomizedtesting.rules.NoShadowingOrOverridesOnMethodsRule$1.evaluate(NoShadowingOrOverridesOnMethodsRule.java:39)
	at com.carrotsearch.randomizedtesting.rules.StatementAdapter.evaluate(StatementAdapter.java:36)
	at org.apache.lucene.util.TestRuleAssertionsRequired$1.evaluate(TestRuleAssertionsRequired.java:43)
	at org.apache.lucene.util.TestRuleMarkFailure$1.evaluate(TestRuleMarkFailure.java:48)
	at org.apache.lucene.util.TestRuleIgnoreAfterMaxFailures$1.evaluate(TestRuleIgnoreAfterMaxFailures.java:70)
	at org.apache.lucene.util.TestRuleIgnoreTestSuites$1.evaluate(TestRuleIgnoreTestSuites.java:55)
	at com.carrotsearch.randomizedtesting.rules.StatementAdapter.evaluate(StatementAdapter.java:36)
	at com.carrotsearch.randomizedtesting.ThreadLeakControl$StatementRunner.run(ThreadLeakControl.java:358)
	at java.lang.Thread.run(Thread.java:722)




Build Log:
[...truncated 8914 lines...]
[junit4:junit4] Suite: org.apache.solr.handler.component.SpellCheckComponentTest
[junit4:junit4]   2> 1 T1520 oas.SolrTestCaseJ4.initCore ####initCore
[junit4:junit4]   2> Creating dataDir: C:\Users\JenkinsSlave\workspace\Lucene-Solr-trunk-Windows\solr\build\solr-core\test\J0\.\solrtest-SpellCheckComponentTest-1356216184679
[junit4:junit4]   2> 3 T1520 oasc.SolrResourceLoader.<init> new SolrResourceLoader for directory: 'C:\Users\JenkinsSlave\workspace\Lucene-Solr-trunk-Windows\solr\build\solr-core\test-files\solr\collection1\'
[junit4:junit4]   2> 6 T1520 oasc.SolrResourceLoader.replaceClassLoader Adding 'file:/C:/Users/JenkinsSlave/workspace/Lucene-Solr-trunk-Windows/solr/build/solr-core/test-files/solr/collection1/lib/classes/' to classloader
[junit4:junit4]   2> 7 T1520 oasc.SolrResourceLoader.replaceClassLoader Adding 'file:/C:/Users/JenkinsSlave/workspace/Lucene-Solr-trunk-Windows/solr/build/solr-core/test-files/solr/collection1/lib/README' to classloader
[junit4:junit4]   2> 86 T1520 oasc.SolrConfig.<init> Using Lucene MatchVersion: LUCENE_50
[junit4:junit4]   2> 165 T1520 oasc.SolrConfig.<init> Loaded SolrConfig: solrconfig-spellcheckcomponent.xml
[junit4:junit4]   2> 166 T1520 oass.IndexSchema.readSchema Reading Solr Schema
[junit4:junit4]   2> 174 T1520 oass.IndexSchema.readSchema Schema name=test
[junit4:junit4]   2> 1060 T1520 oass.OpenExchangeRatesOrgProvider.init Initialized with rates=open-exchange-rates.json, refreshInterval=1440.
[junit4:junit4]   2> 1073 T1520 oass.IndexSchema.readSchema default search field in schema is text
[junit4:junit4]   2> 1078 T1520 oass.IndexSchema.readSchema unique key field: id
[junit4:junit4]   2> 1087 T1520 oass.FileExchangeRateProvider.reload Reloading exchange rates from file currency.xml
[junit4:junit4]   2> 1092 T1520 oass.FileExchangeRateProvider.reload Reloading exchange rates from file currency.xml
[junit4:junit4]   2> 1097 T1520 oass.OpenExchangeRatesOrgProvider.reload Reloading exchange rates from open-exchange-rates.json
[junit4:junit4]   2> 1098 T1520 oass.OpenExchangeRatesOrgProvider.reload Reloading exchange rates from open-exchange-rates.json
[junit4:junit4]   2> 1099 T1520 oasc.SolrResourceLoader.locateSolrHome JNDI not configured for solr (NoInitialContextEx)
[junit4:junit4]   2> 1099 T1520 oasc.SolrResourceLoader.locateSolrHome using system property solr.solr.home: C:\Users\JenkinsSlave\workspace\Lucene-Solr-trunk-Windows\solr\build\solr-core\test-files\solr
[junit4:junit4]   2> 1100 T1520 oasc.SolrResourceLoader.<init> new SolrResourceLoader for directory: 'C:\Users\JenkinsSlave\workspace\Lucene-Solr-trunk-Windows\solr\build\solr-core\test-files\solr\'
[junit4:junit4]   2> 1111 T1520 oasc.CoreContainer.<init> New CoreContainer 6668608
[junit4:junit4]   2> 1111 T1520 oasc.SolrCore.<init> [collection1] Opening new SolrCore at C:\Users\JenkinsSlave\workspace\Lucene-Solr-trunk-Windows\solr\build\solr-core\test-files\solr\collection1\, dataDir=C:\Users\JenkinsSlave\workspace\Lucene-Solr-trunk-Windows\solr\build\solr-core\test\J0\.\solrtest-SpellCheckComponentTest-1356216184679\
[junit4:junit4]   2> 1112 T1520 oasc.SolrCore.<init> JMX monitoring not detected for core: collection1
[junit4:junit4]   2> 1112 T1520 oasc.SolrCore.initDirectoryFactory org.apache.solr.core.MockDirectoryFactory
[junit4:junit4]   2> 1113 T1520 oasc.CachingDirectoryFactory.get return new directory for C:\Users\JenkinsSlave\workspace\Lucene-Solr-trunk-Windows\solr\build\solr-core\test\J0\.\solrtest-SpellCheckComponentTest-1356216184679 forceNew:false
[junit4:junit4]   2> 1113 T1520 oasc.CachingDirectoryFactory.close Releasing directory:C:\Users\JenkinsSlave\workspace\Lucene-Solr-trunk-Windows\solr\build\solr-core\test\J0\.\solrtest-SpellCheckComponentTest-1356216184679
[junit4:junit4]   2> 1113 T1520 oasc.SolrCore.getNewIndexDir New index directory detected: old=null new=C:\Users\JenkinsSlave\workspace\Lucene-Solr-trunk-Windows\solr\build\solr-core\test\J0\.\solrtest-SpellCheckComponentTest-1356216184679\index/
[junit4:junit4]   2> 1114 T1520 oasc.SolrCore.initIndex WARNING [collection1] Solr index directory 'C:\Users\JenkinsSlave\workspace\Lucene-Solr-trunk-Windows\solr\build\solr-core\test\J0\.\solrtest-SpellCheckComponentTest-1356216184679\index' doesn't exist. Creating new index...
[junit4:junit4]   2> 1115 T1520 oasc.CachingDirectoryFactory.get return new directory for C:\Users\JenkinsSlave\workspace\Lucene-Solr-trunk-Windows\solr\build\solr-core\test\J0\.\solrtest-SpellCheckComponentTest-1356216184679\index forceNew:false
[junit4:junit4]   2> 1118 T1520 oasc.SolrDeletionPolicy.onCommit SolrDeletionPolicy.onCommit: commits:num=1
[junit4:junit4]   2> 		commit{dir=MockDirWrapper(org.apache.lucene.store.RAMDirectory@1cd8f8 lockFactory=org.apache.lucene.store.NativeFSLockFactory@1f3c5f8),segFN=segments_1,generation=1,filenames=[segments_1]
[junit4:junit4]   2> 1118 T1520 oasc.SolrDeletionPolicy.updateCommits newest commit = 1[segments_1]
[junit4:junit4]   2> 1120 T1520 oasc.CachingDirectoryFactory.close Releasing directory:C:\Users\JenkinsSlave\workspace\Lucene-Solr-trunk-Windows\solr\build\solr-core\test\J0\.\solrtest-SpellCheckComponentTest-1356216184679\index
[junit4:junit4]   2> 1121 T1520 oasc.RequestHandlers.initHandlersFromConfig created standard: solr.StandardRequestHandler
[junit4:junit4]   2> 1122 T1520 oasc.RequestHandlers.initHandlersFromConfig created spellCheckCompRH: org.apache.solr.handler.component.SearchHandler
[junit4:junit4]   2> 1124 T1520 oasc.RequestHandlers.initHandlersFromConfig created spellCheckCompRH1: org.apache.solr.handler.component.SearchHandler
[junit4:junit4]   2> 1125 T1520 oasc.RequestHandlers.initHandlersFromConfig created spellCheckWithWordbreak: org.apache.solr.handler.component.SearchHandler
[junit4:junit4]   2> 1136 T1520 oasc.CachingDirectoryFactory.close Releasing directory:C:\Users\JenkinsSlave\workspace\Lucene-Solr-trunk-Windows\solr\build\solr-core\test\J0\.\solrtest-SpellCheckComponentTest-1356216184679
[junit4:junit4]   2> 1137 T1520 oass.SolrIndexSearcher.<init> Opening Searcher@c3b645 main
[junit4:junit4]   2> 1137 T1520 oasu.CommitTracker.<init> Hard AutoCommit: disabled
[junit4:junit4]   2> 1138 T1520 oasu.CommitTracker.<init> Soft AutoCommit: disabled
[junit4:junit4]   2> 1138 T1520 oashc.SpellCheckComponent.inform Initializing spell checkers
[junit4:junit4]   2> 1159 T1520 oashc.SpellCheckComponent.inform Registering newSearcher listener for spellchecker: default
[junit4:junit4]   2> 1175 T1520 oashc.SpellCheckComponent.inform Registering newSearcher listener for spellchecker: default_teststop
[junit4:junit4]   2> 1264 T1520 oass.DirectSolrSpellChecker.init init: {name=direct,classname=solr.DirectSolrSpellChecker,minQueryLength=3,maxQueryFrequency=100.0,field=teststop}
[junit4:junit4]   2> 1265 T1520 oass.DirectSolrSpellChecker.init init: {name=direct_lowerfilt,classname=solr.DirectSolrSpellChecker,minQueryLength=3,maxQueryFrequency=100.0,field=lowerfilt}
[junit4:junit4]   2> 1287 T1520 oashc.SpellCheckComponent.inform Registering newSearcher listener for spellchecker: threshold
[junit4:junit4]   2> 1288 T1520 oass.DirectSolrSpellChecker.init init: {name=threshold_direct,classname=solr.DirectSolrSpellChecker,field=lowerfilt,spellcheckIndexDir=spellcheckerThreshold,buildOnCommit=true,thresholdTokenFrequency=0.29}
[junit4:junit4]   2> 1288 T1520 oashc.SpellCheckComponent.inform Registering newSearcher listener for spellchecker: threshold_direct
[junit4:junit4]   2> 1303 T1520 oashc.SpellCheckComponent.inform Registering newSearcher listener for spellchecker: multipleFields
[junit4:junit4]   2> 1346 T1520 oashc.SpellCheckComponent.inform Registering newSearcher listener for spellchecker: freq
[junit4:junit4]   2> 1361 T1520 oashc.SpellCheckComponent.inform Registering newSearcher listener for spellchecker: fqcn
[junit4:junit4]   2> 1363 T1520 oasc.CoreContainer.registerCore registering core: collection1
[junit4:junit4]   2> 1383 T1520 oas.SolrTestCaseJ4.initCore ####initCore end
[junit4:junit4]   2> 1388 T1520 oas.SolrTestCaseJ4.setUp ###Starting testThresholdTokenFrequency
[junit4:junit4]   2> ASYNC  NEW_CORE C129 name=collection1 org.apache.solr.core.SolrCore@106bd17
[junit4:junit4]   2> 1433 T1520 C129 oasc.CachingDirectoryFactory.close Releasing directory:C:\Users\JenkinsSlave\workspace\Lucene-Solr-trunk-Windows\solr\build\solr-core\test\J0\.\solrtest-SpellCheckComponentTest-1356216184679
[junit4:junit4]   2> 1440 T1520 C129 oasc.SolrDeletionPolicy.onInit SolrDeletionPolicy.onInit: commits:num=1
[junit4:junit4]   2> 		commit{dir=MockDirWrapper(org.apache.lucene.store.RAMDirectory@1cd8f8 lockFactory=org.apache.lucene.store.NativeFSLockFactory@1f3c5f8),segFN=segments_1,generation=1,filenames=[segments_1]
[junit4:junit4]   2> 1440 T1520 C129 oasc.SolrDeletionPolicy.updateCommits newest commit = 1[segments_1]
[junit4:junit4]   2> 1441 T1520 C129 UPDATE [collection1] webapp=null path=null params={} {add=[0]} 0 8
[junit4:junit4]   2> 1462 T1520 C129 UPDATE [collection1] webapp=null path=null params={} {add=[1]} 0 1
[junit4:junit4]   2> 1471 T1520 C129 UPDATE [collection1] webapp=null path=null params={} {add=[2]} 0 1
[junit4:junit4]   2> 1479 T1520 C129 UPDATE [collection1] webapp=null path=null params={} {add=[3]} 0 1
[junit4:junit4]   2> 1488 T1520 C129 UPDATE [collection1] webapp=null path=null params={} {add=[4]} 0 0
[junit4:junit4]   2> 1498 T1520 C129 UPDATE [collection1] webapp=null path=null params={} {add=[5]} 0 1
[junit4:junit4]   2> 1505 T1520 C129 UPDATE [collection1] webapp=null path=null params={} {add=[6]} 0 0
[junit4:junit4]   2> 1516 T1520 C129 UPDATE [collection1] webapp=null path=null params={} {add=[7]} 0 1
[junit4:junit4]   2> 1525 T1520 C129 UPDATE [collection1] webapp=null path=null params={} {add=[8]} 0 1
[junit4:junit4]   2> 1535 T1520 C129 UPDATE [collection1] webapp=null path=null params={} {add=[9]} 0 1
[junit4:junit4]   2> 1543 T1520 C129 oasu.DirectUpdateHandler2.commit start commit{flags=0,_version_=0,optimize=false,openSearcher=true,waitSearcher=true,expungeDeletes=false,softCommit=false}
[junit4:junit4]   2> 1548 T1520 C129 oasc.SolrDeletionPolicy.onCommit SolrDeletionPolicy.onCommit: commits:num=2
[junit4:junit4]   2> 		commit{dir=MockDirWrapper(org.apache.lucene.store.RAMDirectory@1cd8f8 lockFactory=org.apache.lucene.store.NativeFSLockFactory@1f3c5f8),segFN=segments_1,generation=1,filenames=[segments_1]
[junit4:junit4]   2> 		commit{dir=MockDirWrapper(org.apache.lucene.store.RAMDirectory@1cd8f8 lockFactory=org.apache.lucene.store.NativeFSLockFactory@1f3c5f8),segFN=segments_2,generation=2,filenames=[_0_NestedPulsing_0.doc, _0.fnm, _0_Pulsing41_1.tip, _0_nrm.cfs, _0_NestedPulsing_0.tip, _0_NestedPulsing_0.tim, _0_Pulsing41_1.tim, _0_NestedPulsing_0.pos, _0_Direct_0.doc, _0_Pulsing41_0.doc, _0_Pulsing41_0.pos, _0_Pulsing41_0.tim, _0_Pulsing41_0.tip, _0_nrm.cfe, _0_Direct_0.pos, segments_2, _0_Pulsing41_1.doc, _0_Direct_0.tip, _0.fdx, _0.si, _0_Pulsing41_1.pos, _0_Direct_0.tim, _0.fdt]
[junit4:junit4]   2> 1549 T1520 C129 oasc.SolrDeletionPolicy.updateCommits newest commit = 2[_0_NestedPulsing_0.doc, _0.fnm, _0_Pulsing41_1.tip, _0_nrm.cfs, _0_NestedPulsing_0.tip, _0_NestedPulsing_0.tim, _0_Pulsing41_1.tim, _0_NestedPulsing_0.pos, _0_Direct_0.doc, _0_Pulsing41_0.doc, _0_Pulsing41_0.pos, _0_Pulsing41_0.tim, _0_Pulsing41_0.tip, _0_nrm.cfe, _0_Direct_0.pos, segments_2, _0_Pulsing41_1.doc, _0_Direct_0.tip, _0.fdx, _0.si, _0_Pulsing41_1.pos, _0_Direct_0.tim, _0.fdt]
[junit4:junit4]   2> 1549 T1520 C129 oasc.SolrCore.getSearcher WARNING [collection1] PERFORMANCE WARNING: Overlapping onDeckSearchers=2
[junit4:junit4]   2> 1549 T1520 C129 oasc.CachingDirectoryFactory.close Releasing directory:C:\Users\JenkinsSlave\workspace\Lucene-Solr-trunk-Windows\solr\build\solr-core\test\J0\.\solrtest-SpellCheckComponentTest-1356216184679
[junit4:junit4]   2> 1552 T1520 C129 oass.SolrIndexSearcher.<init> Opening Searcher@ab8405 main
[junit4:junit4]   2> 1560 T1520 C129 oasu.DirectUpdateHandler2.commit end_commit_flush
[junit4:junit4]   2> 1562 T1521 oasc.SolrCore.registerSearcher [collection1] Registered new searcher Searcher@c3b645 main{StandardDirectoryReader(segments_1:1)}
[junit4:junit4]   2> 1562 T1521 oashc.SpellCheckComponent$SpellCheckerListener.newSearcher Loading spell index for spellchecker: default
[junit4:junit4]   2> 1565 T1521 oashc.SpellCheckComponent$SpellCheckerListener.newSearcher Loading spell index for spellchecker: default_teststop
[junit4:junit4]   2> 1569 T1521 oashc.SpellCheckComponent$SpellCheckerListener.newSearcher Loading spell index for spellchecker: direct
[junit4:junit4]   2> 1570 T1521 oashc.SpellCheckComponent$SpellCheckerListener.newSearcher Loading spell index for spellchecker: direct_lowerfilt
[junit4:junit4]   2> 1570 T1521 oashc.SpellCheckComponent$SpellCheckerListener.newSearcher Loading spell index for spellchecker: wordbreak
[junit4:junit4]   2> 1570 T1521 oashc.SpellCheckComponent$SpellCheckerListener.newSearcher Loading spell index for spellchecker: threshold
[junit4:junit4]   2> 1574 T1521 oashc.SpellCheckComponent$SpellCheckerListener.newSearcher Loading spell index for spellchecker: threshold_direct
[junit4:junit4]   2> 1575 T1521 oashc.SpellCheckComponent$SpellCheckerListener.newSearcher Loading spell index for spellchecker: multipleFields
[junit4:junit4]   2> 1578 T1521 oashc.SpellCheckComponent$SpellCheckerListener.newSearcher Loading spell index for spellchecker: jarowinkler
[junit4:junit4]   2> 1581 T1521 oashc.SpellCheckComponent$SpellCheckerListener.newSearcher Loading spell index for spellchecker: external
[junit4:junit4]   2> 1586 T1521 oashc.SpellCheckComponent$SpellCheckerListener.newSearcher Loading spell index for spellchecker: freq
[junit4:junit4]   2> 1588 T1521 oashc.SpellCheckComponent$SpellCheckerListener.newSearcher Loading spell index for spellchecker: fqcn
[junit4:junit4]   2> 1593 T1521 oashc.SpellCheckComponent$SpellCheckerListener.newSearcher Loading spell index for spellchecker: perDict
[junit4:junit4]   2> 1594 T1521 oasc.CachingDirectoryFactory.close Releasing directory:C:\Users\JenkinsSlave\workspace\Lucene-Solr-trunk-Windows\solr\build\solr-core\test\J0\.\solrtest-SpellCheckComponentTest-1356216184679\index
[junit4:junit4]   2> 1594 T1521 oasc.SolrCore.registerSearcher [collection1] Registered new searcher Searcher@ab8405 main{StandardDirectoryReader(segments_2:3 _0(5.0):C10)}
[junit4:junit4]   2> 1595 T1520 C129 UPDATE [collection1] webapp=null path=null params={} {commit=} 0 52
[junit4:junit4]   2> 1599 T1520 C129 REQ [collection1] webapp=null path=null params={spellcheck=true&spellcheck.extendedResults=true&q=documenq&spellcheck.dictionary=threshold&spellcheck.count=5&qt=spellCheckCompRH} hits=0 status=0 QTime=1 
[junit4:junit4]   2> 1601 T1520 oas.SolrTestCaseJ4.assertJQ SEVERE query failed JSON validation. error=Path not found: /spellcheck/suggestions/[1]/suggestion
[junit4:junit4]   2> 	 expected =/spellcheck/suggestions/[1]/suggestion==[{"word":"document","freq":2}]
[junit4:junit4]   2> 	 response = {
[junit4:junit4]   2> 	  "responseHeader":{
[junit4:junit4]   2> 	    "status":0,
[junit4:junit4]   2> 	    "QTime":1},
[junit4:junit4]   2> 	  "response":{"numFound":0,"start":0,"docs":[]
[junit4:junit4]   2> 	  },
[junit4:junit4]   2> 	  "spellcheck":{
[junit4:junit4]   2> 	    "suggestions":[
[junit4:junit4]   2> 	      "correctlySpelled",false]}}
[junit4:junit4]   2> 	
[junit4:junit4]   2> 	 request = spellcheck=true&spellcheck.extendedResults=true&q=documenq&spellcheck.dictionary=threshold&spellcheck.count=5&qt=spellCheckCompRH
[junit4:junit4]   2> 1602 T1520 oas.SolrTestCaseJ4.tearDown ###Ending testThresholdTokenFrequency
[junit4:junit4]   2> 1609 T1520 C129 oasu.DirectUpdateHandler2.deleteAll [collection1] REMOVING ALL DOCUMENTS FROM INDEX
[junit4:junit4]   2> 1610 T1520 C129 UPDATE [collection1] webapp=null path=null params={} {deleteByQuery=*:*} 0 1
[junit4:junit4]   2> 1619 T1520 C129 oasu.DirectUpdateHandler2.commit start commit{flags=0,_version_=0,optimize=false,openSearcher=true,waitSearcher=true,expungeDeletes=false,softCommit=false}
[junit4:junit4]   2> 1627 T1520 C129 oasc.SolrDeletionPolicy.onCommit SolrDeletionPolicy.onCommit: commits:num=2
[junit4:junit4]   2> 		commit{dir=MockDirWrapper(org.apache.lucene.store.RAMDirectory@1cd8f8 lockFactory=org.apache.lucene.store.NativeFSLockFactory@1f3c5f8),segFN=segments_2,generation=2,filenames=[_0_NestedPulsing_0.doc, _0.fnm, _0_Pulsing41_1.tip, _0_nrm.cfs, _0_NestedPulsing_0.tip, _0_NestedPulsing_0.tim, _0_Pulsing41_1.tim, _0_NestedPulsing_0.pos, _0_Direct_0.doc, _0_Pulsing41_0.doc, _0_Pulsing41_0.pos, _0_Pulsing41_0.tim, _0_Pulsing41_0.tip, _0_nrm.cfe, _0_Direct_0.pos, segments_2, _0_Pulsing41_1.doc, _0_Direct_0.tip, _0.fdx, _0.si, _0_Pulsing41_1.pos, _0_Direct_0.tim, _0.fdt]
[junit4:junit4]   2> 		commit{dir=MockDirWrapper(org.apache.lucene.store.RAMDirectory@1cd8f8 lockFactory=org.apache.lucene.store.NativeFSLockFactory@1f3c5f8),segFN=segments_3,generation=3,filenames=[segments_3]
[junit4:junit4]   2> 1628 T1520 C129 oasc.SolrDeletionPolicy.updateCommits newest commit = 3[segments_3]
[junit4:junit4]   2> 1629 T1520 C129 oasc.CachingDirectoryFactory.close Releasing directory:C:\Users\JenkinsSlave\workspace\Lucene-Solr-trunk-Windows\solr\build\solr-core\test\J0\.\solrtest-SpellCheckComponentTest-1356216184679
[junit4:junit4]   2> 1630 T1520 C129 oass.SolrIndexSearcher.<init> Opening Searcher@10e8c63 main
[junit4:junit4]   2> 1630 T1520 C129 oasu.DirectUpdateHandler2.commit end_commit_flush
[junit4:junit4]   2> 1632 T1521 oashc.SpellCheckComponent$SpellCheckerListener.buildSpellIndex Building spell index for spell checker: default
[junit4:junit4]   2> 1669 T1521 oashc.SpellCheckComponent$SpellCheckerListener.buildSpellIndex Building spell index for spell checker: default_teststop
[junit4:junit4]   2> 1694 T1521 oashc.SpellCheckComponent$SpellCheckerListener.buildSpellIndex Building spell index for spell checker: threshold
[junit4:junit4]   2> 1721 T1521 oashc.SpellCheckComponent$SpellCheckerListener.buildSpellIndex Building spell index for spell checker: threshold_direct
[junit4:junit4]   2> 1721 T1521 oashc.SpellCheckComponent$SpellCheckerListener.buildSpellIndex Building spell index for spell checker: multipleFields
[junit4:junit4]   2> 1748 T1521 oashc.SpellCheckComponent$SpellCheckerListener.buildSpellIndex Building spell index for spell checker: freq
[junit4:junit4]   2> 1774 T1521 oashc.SpellCheckComponent$SpellCheckerListener.buildSpellIndex Building spell index for spell checker: fqcn
[junit4:junit4]   2> 1805 T1521 oasc.SolrCore.registerSearcher [collection1] Registered new searcher Searcher@10e8c63 main{StandardDirectoryReader(segments_3:4)}
[junit4:junit4]   2> 1860 T1521 oasc.CachingDirectoryFactory.close Releasing directory:C:\Users\JenkinsSlave\workspace\Lucene-Solr-trunk-Windows\solr\build\solr-core\test\J0\.\solrtest-SpellCheckComponentTest-1356216184679\index
[junit4:junit4]   2> 1860 T1520 C129 UPDATE [collection1] webapp=null path=null params={} {commit=} 0 241
[junit4:junit4]   2> NOTE: reproduce with: ant test  -Dtestcase=SpellCheckComponentTest -Dtests.method=testThresholdTokenFrequency -Dtests.seed=8A2E111CCA787BC6 -Dtests.slow=true -Dtests.locale=en_IN -Dtests.timezone=America/Indiana/Knox -Dtests.file.encoding=US-ASCII
[junit4:junit4] ERROR   0.53s | SpellCheckComponentTest.testThresholdTokenFrequency <<<
[junit4:junit4]    > Throwable #1: java.lang.RuntimeException: Path not found: /spellcheck/suggestions/[1]/suggestion
[junit4:junit4]    > 	at __randomizedtesting.SeedInfo.seed([8A2E111CCA787BC6:899EED459342BD]:0)
[junit4:junit4]    > 	at org.apache.solr.SolrTestCaseJ4.assertJQ(SolrTestCaseJ4.java:604)
[junit4:junit4]    > 	at org.apache.solr.SolrTestCaseJ4.assertJQ(SolrTestCaseJ4.java:552)
[junit4:junit4]    > 	at org.apache.solr.handler.component.SpellCheckComponentTest.testThresholdTokenFrequency(SpellCheckComponentTest.java:214)
[junit4:junit4]    > 	at sun.reflect.NativeMethodAccessorImpl.invoke0(Native Method)
[junit4:junit4]    > 	at sun.reflect.NativeMethodAccessorImpl.invoke(NativeMethodAccessorImpl.java:57)
[junit4:junit4]    > 	at sun.reflect.DelegatingMethodAccessorImpl.invoke(DelegatingMethodAccessorImpl.java:43)
[junit4:junit4]    > 	at java.lang.reflect.Method.invoke(Method.java:601)
[junit4:junit4]    > 	at com.carrotsearch.randomizedtesting.RandomizedRunner.invoke(RandomizedRunner.java:1559)
[junit4:junit4]    > 	at com.carrotsearch.randomizedtesting.RandomizedRunner.access$600(RandomizedRunner.java:79)
[junit4:junit4]    > 	at com.carrotsearch.randomizedtesting.RandomizedRunner$6.evaluate(RandomizedRunner.java:737)
[junit4:junit4]    > 	at com.carrotsearch.randomizedtesting.RandomizedRunner$7.evaluate(RandomizedRunner.java:773)
[junit4:junit4]    > 	at com.carrotsearch.randomizedtesting.RandomizedRunner$8.evaluate(RandomizedRunner.java:787)
[junit4:junit4]    > 	at com.carrotsearch.randomizedtesting.rules.SystemPropertiesRestoreRule$1.evaluate(SystemPropertiesRestoreRule.java:53)
[junit4:junit4]    > 	at org.apache.lucene.util.TestRuleSetupTeardownChained$1.evaluate(TestRuleSetupTeardownChained.java:50)
[junit4:junit4]    > 	at org.apache.lucene.util.TestRuleFieldCacheSanity$1.evaluate(TestRuleFieldCacheSanity.java:51)
[junit4:junit4]    > 	at org.apache.lucene.util.AbstractBeforeAfterRule$1.evaluate(AbstractBeforeAfterRule.java:46)
[junit4:junit4]    > 	at com.carrotsearch.randomizedtesting.rules.SystemPropertiesInvariantRule$1.evaluate(SystemPropertiesInvariantRule.java:55)
[junit4:junit4]    > 	at org.apache.lucene.util.TestRuleThreadAndTestName$1.evaluate(TestRuleThreadAndTestName.java:49)
[junit4:junit4]    > 	at org.apache.lucene.util.TestRuleIgnoreAfterMaxFailures$1.evaluate(TestRuleIgnoreAfterMaxFailures.java:70)
[junit4:junit4]    > 	at org.apache.lucene.util.TestRuleMarkFailure$1.evaluate(TestRuleMarkFailure.java:48)
[junit4:junit4]    > 	at com.carrotsearch.randomizedtesting.rules.StatementAdapter.evaluate(StatementAdapter.java:36)
[junit4:junit4]    > 	at com.carrotsearch.randomizedtesting.ThreadLeakControl$StatementRunner.run(ThreadLeakControl.java:358)
[junit4:junit4]    > 	at com.carrotsearch.randomizedtesting.ThreadLeakControl.forkTimeoutingTask(ThreadLeakControl.java:782)
[junit4:junit4]    > 	at com.carrotsearch.randomizedtesting.ThreadLeakControl$3.evaluate(ThreadLeakControl.java:442)
[junit4:junit4]    > 	at com.carrotsearch.randomizedtesting.RandomizedRunner.runSingleTest(RandomizedRunner.java:746)
[junit4:junit4]    > 	at com.carrotsearch.randomizedtesting.RandomizedRunner$3.evaluate(RandomizedRunner.java:648)
[junit4:junit4]    > 	at com.carrotsearch.randomizedtesting.RandomizedRunner$4.evaluate(RandomizedRunner.java:682)
[junit4:junit4]    > 	at com.carrotsearch.randomizedtesting.RandomizedRunner$5.evaluate(RandomizedRunner.java:693)
[junit4:junit4]    > 	at com.carrotsearch.randomizedtesting.rules.StatementAdapter.evaluate(StatementAdapter.java:36)
[junit4:junit4]    > 	at com.carrotsearch.randomizedtesting.rules.SystemPropertiesRestoreRule$1.evaluate(SystemPropertiesRestoreRule.java:53)
[junit4:junit4]    > 	at org.apache.lucene.util.AbstractBeforeAfterRule$1.evaluate(AbstractBeforeAfterRule.java:46)
[junit4:junit4]    > 	at org.apache.lucene.util.TestRuleStoreClassName$1.evaluate(TestRuleStoreClassName.java:42)
[junit4:junit4]    > 	at com.carrotsearch.randomizedtesting.rules.SystemPropertiesInvariantRule$1.evaluate(SystemPropertiesInvariantRule.java:55)
[junit4:junit4]    > 	at com.carrotsearch.randomizedtesting.rules.NoShadowingOrOverridesOnMethodsRule$1.evaluate(NoShadowingOrOverridesOnMethodsRule.java:39)
[junit4:junit4]    > 	at com.carrotsearch.randomizedtesting.rules.NoShadowingOrOverridesOnMethodsRule$1.evaluate(NoShadowingOrOverridesOnMethodsRule.java:39)
[junit4:junit4]    > 	at com.carrotsearch.randomizedtesting.rules.StatementAdapter.evaluate(StatementAdapter.java:36)
[junit4:junit4]    > 	at org.apache.lucene.util.TestRuleAssertionsRequired$1.evaluate(TestRuleAssertionsRequired.java:43)
[junit4:junit4]    > 	at org.apache.lucene.util.TestRuleMarkFailure$1.evaluate(TestRuleMarkFailure.java:48)
[junit4:junit4]    > 	at org.apache.lucene.util.TestRuleIgnoreAfterMaxFailures$1.evaluate(TestRuleIgnoreAfterMaxFailures.java:70)
[junit4:junit4]    > 	at org.apache.lucene.util.TestRuleIgnoreTestSuites$1.evaluate(TestRuleIgnoreTestSuites.java:55)
[junit4:junit4]    > 	at com.carrotsearch.randomizedtesting.rules.StatementAdapter.evaluate(StatementAdapter.java:36)
[junit4:junit4]    > 	at com.carrotsearch.randomizedtesting.ThreadLeakControl$StatementRunner.run(ThreadLeakControl.java:358)
[junit4:junit4]    > 	at java.lang.Thread.run(Thread.java:722)
[junit4:junit4]   2> 1920 T1520 oas.SolrTestCaseJ4.setUp ###Starting testPerDictionary
[junit4:junit4]   2> 1929 T1520 C129 UPDATE [collection1] webapp=null path=null params={} {add=[0]} 0 2
[junit4:junit4]   2> 1938 T1520 C129 UPDATE [collection1] webapp=null path=null params={} {add=[1]} 0 1
[junit4:junit4]   2> 1950 T1520 C129 UPDATE [collection1] webapp=null path=null params={} {add=[2]} 0 1
[junit4:junit4]   2> 1960 T1520 C129 UPDATE [collection1] webapp=null path=null params={} {add=[3]} 0 1
[junit4:junit4]   2> 1969 T1520 C129 UPDATE [collection1] webapp=null path=null params={} {add=[4]} 0 0
[junit4:junit4]   2> 1977 T1520 C129 UPDATE [collection1] webapp=null path=null params={} {add=[5]} 0 0
[junit4:junit4]   2> 1987 T1520 C129 UPDATE [collection1] webapp=null path=null params={} {add=[6]} 0 0
[junit4:junit4]   2> 1995 T1520 C129 UPDATE [collection1] webapp=null path=null params={} {add=[7]} 0 0
[junit4:junit4]   2> 2006 T1520 C129 UPDATE [collection1] webapp=null path=null params={} {add=[8]} 0 0
[junit4:junit4]   2> 2017 T1520 C129 UPDATE [collection1] webapp=null path=null params={} {add=[9]} 0 0
[junit4:junit4]   2> 2027 T1520 C129 oasu.DirectUpdateHandler2.commit start commit{flags=0,_version_=0,optimize=false,openSearcher=true,waitSearcher=true,expungeDeletes=false,softCommit=false}
[junit4:junit4]   2> 2032 T1520 C129 oasc.SolrDeletionPolicy.onCommit SolrDeletionPolicy.onCommit: commits:num=2
[junit4:junit4]   2> 		commit{dir=MockDirWrapper(org.apache.lucene.store.RAMDirectory@1cd8f8 lockFactory=org.apache.lucene.store.NativeFSLockFactory@1f3c5f8),segFN=segments_3,generation=3,filenames=[segments_3]
[junit4:junit4]   2> 		commit{dir=MockDirWrapper(org.apache.lucene.store.RAMDirectory@1cd8f8 lockFactory=org.apache.lucene.store.NativeFSLockFactory@1f3c5f8),segFN=segments_4,generation=4,filenames=[_1_NestedPulsing_0.tip, _1_Direct_0.pos, _1_nrm.cfs, _1_Direct_0.doc, _1_Pulsing41_1.doc, _1_Pulsing41_1.pos, _1_Pulsing41_1.tip, _1_NestedPulsing_0.pos, _1_Pulsing41_0.doc, _1.fnm, _1_Pulsing41_0.pos, _1_Pulsing41_1.tim, _1_nrm.cfe, _1_NestedPulsing_0.doc, _1.fdx, _1_Pulsing41_0.tip, _1.fdt, _1_Pulsing41_0.tim, _1.si, _1_Direct_0.tim, _1_NestedPulsing_0.tim, _1_Direct_0.tip, segments_4]
[junit4:junit4]   2> 2033 T1520 C129 oasc.SolrDeletionPolicy.updateCommits newest commit = 4[_1_NestedPulsing_0.tip, _1_Direct_0.pos, _1_nrm.cfs, _1_Direct_0.doc, _1_Pulsing41_1.doc, _1_Pulsing41_1.pos, _1_Pulsing41_1.tip, _1_NestedPulsing_0.pos, _1_Pulsing41_0.doc, _1.fnm, _1_Pulsing41_0.pos, _1_Pulsing41_1.tim, _1_nrm.cfe, _1_NestedPulsing_0.doc, _1.fdx, _1_Pulsing41_0.tip, _1.fdt, _1_Pulsing41_0.tim, _1.si, _1_Direct_0.tim, _1_NestedPulsing_0.tim, _1_Direct_0.tip, segments_4]
[junit4:junit4]   2> 2033 T1520 C129 oasc.CachingDirectoryFactory.close Releasing directory:C:\Users\JenkinsSlave\workspace\Lucene-Solr-trunk-Windows\solr\build\solr-core\test\J0\.\solrtest-SpellCheckComponentTest-1356216184679
[junit4:junit4]   2> 2036 T1520 C129 oass.SolrIndexSearcher.<init> Opening Searcher@1c59109 main
[junit4:junit4]   2> 2037 T1521 oashc.SpellCheckComponent$SpellCheckerListener.buildSpellIndex Building spell index for spell checker: default
[junit4:junit4]   2> 2037 T1520 C129 oasu.DirectUpdateHandler2.commit end_commit_flush
[junit4:junit4]   2> 2112 T1521 oashc.SpellCheckComponent$SpellCheckerListener.buildSpellIndex Building spell index for spell checker: default_teststop
[junit4:junit4]   2> 2135 T1521 oashc.SpellCheckComponent$SpellCheckerListener.buildSpellIndex Building spell index for spell checker: threshold
[junit4:junit4]   2> 2202 T1521 oashc.SpellCheckComponent$SpellCheckerListener.buildSpellIndex Building spell index for spell checker: threshold_direct
[junit4:junit4]   2> 2202 T1521 oashc.SpellCheckComponent$SpellCheckerListener.buildSpellIndex Building spell index for spell checker: multipleFields
[junit4:junit4]   2> 2280 T1521 oashc.SpellCheckComponent$SpellCheckerListener.buildSpellIndex Building spell index for spell checker: freq
[junit4:junit4]   2> 2359 T1521 oashc.SpellCheckComponent$SpellCheckerListener.buildSpellIndex Building spell index for spell checker: fqcn
[junit4:junit4]   2> 2437 T1521 oasc.SolrCore.registerSearcher [collection1] Registered new searcher Searcher@1c59109 main{StandardDirectoryReader(segments_4:6 _1(5.0):C10)}
[junit4:junit4]   2> 2438 T1521 oasc.CachingDirectoryFactory.close Releasing directory:C:\Users\JenkinsSlave\workspace\Lucene-Solr-trunk-Windows\solr\build\solr-core\test\J0\.\solrtest-SpellCheckComponentTest-1356216184679\index
[junit4:junit4]   2> 2438 T1520 C129 UPDATE [collection1] webapp=null path=null params={} {commit=} 0 411
[junit4:junit4]   2> 2447 T1520 C129 REQ [collection1] webapp=null path=null params={spellcheck..perDict.bar=foo&spellcheck=true&q=documemt&spellcheck.dictionary=perDict&json.nl=map&qt=spellCheckCompRH&spellcheck..perDict.foo=bar&spellcheck.build=true} hits=0 status=0 QTime=1 
[junit4:junit4]   2> 2447 T1520 oas.SolrTestCaseJ4.tearDown ###Ending testPerDictionary
[junit4:junit4]   2> 2455 T1520 C129 oasu.DirectUpdateHandler2.deleteAll [collection1] REMOVING ALL DOCUMENTS FROM INDEX
[junit4:junit4]   2> 2456 T1520 C129 UPDATE [collection1] webapp=null path=null params={} {deleteByQuery=*:*} 0 2
[junit4:junit4]   2> 2465 T1520 C129 oasu.DirectUpdateHandler2.commit start commit{flags=0,_version_=0,optimize=false,openSearcher=true,waitSearcher=true,expungeDeletes=false,softCommit=false}
[junit4:junit4]   2> 2467 T1520 C129 oasc.SolrDeletionPolicy.onCommit SolrDeletionPolicy.onCommit: commits:num=2
[junit4:junit4]   2> 		commit{dir=MockDirWrapper(org.apache.lucene.store.RAMDirectory@1cd8f8 lockFactory=org.apache.lucene.store.NativeFSLockFactory@1f3c5f8),segFN=segments_4,generation=4,filenames=[_1_NestedPulsing_0.tip, _1_Direct_0.pos, _1_nrm.cfs, _1_Direct_0.doc, _1_Pulsing41_1.doc, _1_Pulsing41_1.pos, _1_Pulsing41_1.tip, _1_NestedPulsing_0.pos, _1_Pulsing41_0.doc, _1.fnm, _1_Pulsing41_0.pos, _1_Pulsing41_1.tim, _1_nrm.cfe, _1_NestedPulsing_0.doc, _1.fdx, _1_Pulsing41_0.tip, _1.fdt, _1_Pulsing41_0.tim, _1.si, _1_Direct_0.tim, _1_NestedPulsing_0.tim, _1_Direct_0.tip, segments_4]
[junit4:junit4]   2> 		commit{dir=MockDirWrapper(org.apache.lucene.store.RAMDirectory@1cd8f8 lockFactory=org.apache.lucene.store.NativeFSLockFactory@1f3c5f8),segFN=segments_5,generation=5,filenames=[segments_5]
[junit4:junit4]   2> 2467 T1520 C129 oasc.SolrDeletionPolicy.updateCommits newest commit = 5[segments_5]
[junit4:junit4]   2> 2468 T1520 C129 oasc.CachingDirectoryFactory.close Releasing directory:C:\Users\JenkinsSlave\workspace\Lucene-Solr-trunk-Windows\solr\build\solr-core\test\J0\.\solrtest-SpellCheckComponentTest-1356216184679
[junit4:junit4]   2> 2469 T1520 C129 oass.SolrIndexSearcher.<init> Opening Searcher@7fdcd4 main
[junit4:junit4]   2> 2470 T1521 oashc.SpellCheckComponent$SpellCheckerListener.buildSpellIndex Building spell index for spell checker: default
[junit4:junit4]   2> 2470 T1520 C129 oasu.DirectUpdateHandler2.commit end_commit_flush
[junit4:junit4]   2> 2539 T1521 oashc.SpellCheckComponent$SpellCheckerListener.buildSpellIndex Building spell index for spell checker: default_teststop
[junit4:junit4]   2> 2570 T1521 oashc.SpellCheckComponent$SpellCheckerListener.buildSpellIndex Building spell index for spell checker: threshold
[junit4:junit4]   2> 2639 T1521 oashc.SpellCheckComponent$SpellCheckerListener.buildSpellIndex Building spell index for spell checker: threshold_direct
[junit4:junit4]   2> 2640 T1521 oashc.SpellCheckComponent$SpellCheckerListener.buildSpellIndex Building spell index for spell checker: multipleFields
[junit4:junit4]   2> 2705 T1521 oashc.SpellCheckComponent$SpellCheckerListener.buildSpellIndex Building spell index for spell checker: freq
[junit4:junit4]   2> 2770 T1521 oashc.SpellCheckComponent$SpellCheckerListener.buildSpellIndex Building spell index for spell checker: fqcn
[junit4:junit4]   2> 2828 T1521 oasc.SolrCore.registerSearcher [collection1] Registered new searcher Searcher@7fdcd4 main{StandardDirectoryReader(segments_5:7)}
[junit4:junit4]   2> 2829 T1521 oasc.CachingDirectoryFactory.close Releasing directory:C:\Users\JenkinsSlave\workspace\Lucene-Solr-trunk-Windows\solr\build\solr-core\test\J0\.\solrtest-SpellCheckComponentTest-1356216184679\index
[junit4:junit4]   2> 2830 T1520 C129 UPDATE [collection1] webapp=null path=null params={} {commit=} 0 365
[junit4:junit4]   2> 2843 T1520 oas.SolrTestCaseJ4.setUp ###Starting testRebuildOnCommit
[junit4:junit4]   2> 2851 T1520 C129 UPDATE [collection1] webapp=null path=null params={} {add=[0]} 0 1
[junit4:junit4]   2> 2861 T1520 C129 UPDATE [collection1] webapp=null path=null params={} {add=[1]} 0 1
[junit4:junit4]   2> 2871 T1520 C129 UPDATE [collection1] webapp=null path=null params={} {add=[2]} 0 1
[junit4:junit4]   2> 2882 T1520 C129 UPDATE [collection1] webapp=null path=null params={} {add=[3]} 0 2
[junit4:junit4]   2> 2893 T1520 C129 UPDATE [collection1] webapp=null path=null params={} {add=[4]} 0 1
[junit4:junit4]   2> 2907 T1520 C129 UPDATE [collection1] webapp=null path=null params={} {add=[5]} 0 1
[junit4:junit4]   2> 2917 T1520 C129 UPDATE [collection1] webapp=null path=null params={} {add=[6]} 0 1
[junit4:junit4]   2> 2927 T1520 C129 UPDATE [collection1] webapp=null path=null params={} {add=[7]} 0 0
[junit4:junit4]   2> 2937 T1520 C129 UPDATE [collection1] webapp=null path=null params={} {add=[8]} 0 1
[junit4:junit4]   2> 2948 T1520 C129 UPDATE [collection1] webapp=null path=null params={} {add=[9]} 0 1
[junit4:junit4]   2> 2957 T1520 C129 oasu.DirectUpdateHandler2.commit start commit{flags=0,_version_=0,optimize=false,openSearcher=true,waitSearcher=true,expungeDeletes=false,softCommit=false}
[junit4:junit4]   2> 2961 T1520 C129 oasc.SolrDeletionPolicy.onCommit SolrDeletionPolicy.onCommit: commits:num=2
[junit4:junit4]   2> 		commit{dir=MockDirWrapper(org.apache.lucene.store.RAMDirectory@1cd8f8 lockFactory=org.apache.lucene.store.NativeFSLockFactory@1f3c5f8),segFN=segments_5,generation=5,filenames=[segments_5]
[junit4:junit4]   2> 		commit{dir=MockDirWrapper(org.apache.lucene.store.RAMDirectory@1cd8f8 lockFactory=org.apache.lucene.store.NativeFSLockFactory@1f3c5f8),segFN=segments_6,generation=6,filenames=[_2_NestedPulsing_0.tim, _2_Pulsing41_0.doc, _2_Direct_0.doc, _2_Direct_0.tip, _2.si, _2_Pulsing41_1.tip, _2_Direct_0.tim, _2_Pulsing41_1.tim, _2.fdt, _2_Direct_0.pos, _2_Pulsing41_1.doc, _2.fdx, _2.fnm, _2_Pulsing41_0.tim, _2_Pulsing41_0.pos, _2_nrm.cfe, _2_Pulsing41_1.pos, _2_Pulsing41_0.tip, _2_NestedPulsing_0.pos, _2_nrm.cfs, segments_6, _2_NestedPulsing_0.tip, _2_NestedPulsing_0.doc]
[junit4:junit4]   2> 2962 T1520 C129 oasc.SolrDeletionPolicy.updateCommits newest commit = 6[_2_NestedPulsing_0.tim, _2_Pulsing41_0.doc, _2_Direct_0.doc, _2_Direct_0.tip, _2.si, _2_Pulsing41_1.tip, _2_Direct_0.tim, _2_Pulsing41_1.tim, _2.fdt, _2_Direct_0.pos, _2_Pulsing41_1.doc, _2.fdx, _2.fnm, _2_Pulsing41_0.tim, _2_Pulsing41_0.pos, _2_nrm.cfe, _2_Pulsing41_1.pos, _2_Pulsing41_0.tip, _2_NestedPulsing_0.pos, _2_nrm.cfs, segments_6, _2_NestedPulsing_0.tip, _2_NestedPulsing_0.doc]
[junit4:junit4]   2> 2963 T1520 C129 oasc.CachingDirectoryFactory.close Releasing directory:C:\Users\JenkinsSlave\workspace\Lucene-Solr-trunk-Windows\solr\build\solr-core\test\J0\.\solrtest-SpellCheckComponentTest-1356216184679
[junit4:junit4]   2> 2966 T1520 C129 oass.SolrIndexSearcher.<init> Opening Searcher@1f68e0c main
[junit4:junit4]   2> 2967 T1521 oashc.SpellCheckComponent$SpellCheckerListener.buildSpellIndex Building spell index for spell checker: default
[junit4:junit4]   2> 2967 T1520 C129 oasu.DirectUpdateHandler2.commit end_commit_flush
[junit4:junit4]   2> 3027 T1521 oashc.SpellCheckComponent$SpellCheckerListener.buildSpellIndex Building spell index for spell checker: default_teststop
[junit4:junit4]   2> 3044 T1521 oashc.SpellCheckComponent$SpellCheckerListener.buildSpellIndex Building spell index for spell checker: threshold
[junit4:junit4]   2> 3190 T1521 oashc.SpellCheckComponent$SpellCheckerListener.buildSpellIndex Building spell index for spell checker: threshold_direct
[junit4:junit4]   2> 3190 T1521 oashc.SpellCheckComponent$SpellCheckerListener.buildSpellIndex Building spell index for spell checker: multipleFields
[junit4:junit4]   2> 3269 T1521 oashc.SpellCheckComponent$SpellCheckerListener.buildSpellIndex Building spell index for spell checker: freq
[junit4:junit4]   2> 3337 T1521 oashc.SpellCheckComponent$SpellCheckerListener.buildSpellIndex Building spell index for spell checker: fqcn
[junit4:junit4]   2> 3395 T1521 oasc.SolrCore.registerSearcher [collection1] Registered new searcher Searcher@1f68e0c main{StandardDirectoryReader(segments_6:9 _2(5.0):C10)}
[junit4:junit4]   2> 3395 T1521 oasc.CachingDirectoryFactory.close Releasing directory:C:\Users\JenkinsSlave\workspace\Lucene-Solr-trunk-Windows\solr\build\solr-core\test\J0\.\solrtest-SpellCheckComponentTest-1356216184679\index
[junit4:junit4]   2> 3396 T1520 C129 UPDATE [collection1] webapp=null path=null params={} {commit=} 0 439
[junit4:junit4]   2> 3404 T1520 C129 REQ [collection1] webapp=null path=null params={spellcheck=true&q=lowerfilt:lucenejavt&qt=spellCheckCompRH} hits=0 status=0 QTime=2 
[junit4:junit4]   2> 3411 T1520 C129 UPDATE [collection1] webapp=null path=null params={} {add=[11231]} 0 1
[junit4:junit4]   2> 3418 T1520 C129 oasu.DirectUpdateHandler2.commit start commit{flags=0,_version_=0,optimize=false,openSearcher=true,waitSearcher=true,expungeDeletes=false,softCommit=false}
[junit4:junit4]   2> 3422 T1520 C129 oasc.SolrDeletionPolicy.onCommit SolrDeletionPolicy.onCommit: commits:num=2
[junit4:junit4]   2> 		commit{dir=MockDirWrapper(org.apache.lucene.store.RAMDirectory@1cd8f8 lockFactory=org.apache.lucene.store.NativeFSLockFactory@1f3c5f8),segFN=segments_6,generation=6,filenames=[_2_NestedPulsing_0.tim, _2_Pulsing41_0.doc, _2_Direct_0.doc, _2_Direct_0.tip, _2.si, _2_Pulsing41_1.tip, _2_Direct_0.tim, _2_Pulsing41_1.tim, _2.fdt, _2_Direct_0.pos, _2_Pulsing41_1.doc, _2.fdx, _2.fnm, _2_Pulsing41_0.tim, _2_Pulsing41_0.pos, _2_nrm.cfe, _2_Pulsing41_1.pos, _2_Pulsing41_0.tip, _2_NestedPulsing_0.pos, _2_nrm.cfs, segments_6, _2_NestedPulsing_0.tip, _2_NestedPulsing_0.doc]
[junit4:junit4]   2> 		commit{dir=MockDirWrapper(org.apache.lucene.store.RAMDirectory@1cd8f8 lockFactory=org.apache.lucene.store.NativeFSLockFactory@1f3c5f8),segFN=segments_7,generation=7,filenames=[_2.si, _2_Direct_0.tip, _2_Pulsing41_0.doc, _2_NestedPulsing_0.tim, _3_nrm.cfe, _3_Direct_0.doc, _2_Direct_0.tim, _2_Direct_0.pos, _3.fdt, _3.fnm, _2_Pulsing41_1.doc, _2_Pulsing41_0.tim, _2_nrm.cfe, _2_Pulsing41_1.pos, _2_Pulsing41_0.tip, _3_Pulsing41_0.tim, _3_Pulsing41_0.tip, _2_nrm.cfs, _3_Pulsing41_1.doc, _2_NestedPulsing_0.tip, _2_Direct_0.doc, _3_Direct_0.tip, _2_Pulsing41_1.tip, _3_NestedPulsing_0.pos, _2_Pulsing41_1.tim, _3_Pulsing41_1.tip, _3_NestedPulsing_0.tim, _2.fdt, _3_Pulsing41_1.tim, _2.fdx, _3_Pulsing41_1.pos, _2.fnm, _3_Pulsing41_0.pos, _3.fdx, _3_NestedPulsing_0.doc, _3_nrm.cfs, _2_Pulsing41_0.pos, segments_7, _3_NestedPulsing_0.tip, _2_NestedPulsing_0.pos, _3.si, _3_Direct_0.pos, _3_Direct_0.tim, _3_Pulsing41_0.doc, _2_NestedPulsing_0.doc]
[junit4:junit4]   2> 3423 T1520 C129 oasc.SolrDeletionPolicy.updateCommits newest commit = 7[_2.si, _2_Direct_0.tip, _2_Pulsing41_0.doc, _2_NestedPulsing_0.tim, _3_nrm.cfe, _3_Direct_0.doc, _2_Direct_0.tim, _2_Direct_0.pos, _3.fdt, _3.fnm, _2_Pulsing41_1.doc, _2_Pulsing41_0.tim, _2_nrm.cfe, _2_Pulsing41_1.pos, _2_Pulsing41_0.tip, _3_Pulsing41_0.tim, _3_Pulsing41_0.tip, _2_nrm.cfs, _3_Pulsing41_1.doc, _2_NestedPulsing_0.tip, _2_Direct_0.doc, _3_Direct_0.tip, _2_Pulsing41_1.tip, _3_NestedPulsing_0.pos, _2_Pulsing41_1.tim, _3_Pulsing41_1.tip, _3_NestedPulsing_0.tim, _2.fdt, _3_Pulsing41_1.tim, _2.fdx, _3_Pulsing41_1.pos, _2.fnm, _3_Pulsing41_0.pos, _3.fdx, _3_NestedPulsing_0.doc, _3_nrm.cfs, _2_Pulsing41_0.pos, segments_7, _3_NestedPulsing_0.tip, _2_NestedPulsing_0.pos, _3.si, _3_Direct_0.pos, _3_Direct_0.tim, _3_Pulsing41_0.doc, _2_NestedPulsing_0.doc]
[junit4:junit4]   2> 3424 T1520 C129 oasc.CachingDirectoryFactory.close Releasing directory:C:\Users\JenkinsSlave\workspace\Lucene-Solr-trunk-Windows\solr\build\solr-core\test\J0\.\solrtest-SpellCheckComponentTest-1356216184679
[junit4:junit4]   2> 3426 T1520 C129 oass.SolrIndexSearcher.<init> Opening Searcher@17af36b main
[junit4:junit4]   2> 3427 T1521 oashc.SpellCheckComponent$SpellCheckerListener.buildSpellIndex Building spell index for spell checker: default
[junit4:junit4]   2> 3427 T1520 C129 oasu.DirectUpdateHandler2.commit end_commit_flush
[junit4:junit4]   2> 3536 T1521 oashc.SpellCheckComponent$SpellCheckerListener.buildSpellIndex Building spell index for spell checker: default_teststop
[junit4:junit4]   2> 3556 T1521 oashc.SpellCheckComponent$SpellCheckerListener.buildSpellIndex Building spell index for spell checker: threshold
[junit4:junit4]   2> 3619 T1521 oashc.SpellCheckComponent$SpellCheckerListener.buildSpellIndex Building spell index for spell checker: threshold_direct
[junit4:junit4]   2> 3619 T1521 oashc.SpellCheckComponent$SpellCheckerListener.buildSpellIndex Building spell index for spell checker: multipleFields
[junit4:junit4]   2> 3723 T1521 oashc.SpellCheckComponent$SpellCheckerListener.buildSpellIndex Building spell index for spell checker: freq
[junit4:junit4]   2> 3825 T1521 oashc.SpellCheckComponent$SpellCheckerListener.buildSpellIndex Building spell index for spell checker: fqcn
[junit4:junit4]   2> 3910 T1521 oasc.SolrCore.registerSearcher [collection1] Registered new searcher Searcher@17af36b main{StandardDirectoryReader(segments_7:11 _2(5.0):C10 _3(5.0):C1)}
[junit4:junit4]   2> 3912 T1521 oasc.CachingDirectoryFactory.close Releasing directory:C:\Users\JenkinsSlave\workspace\Lucene-Solr-trunk-Windows\solr\build\solr-core\test\J0\.\solrtest-SpellCheckComponentTest-1356216184679\index
[junit4:junit4]   2> 3912 T1520 C129 UPDATE [collection1] webapp=null path=null params={} {commit=} 0 494
[junit4:junit4]   2> 3924 T1520 C129 REQ [collection1] webapp=null path=null params={spellcheck=true&q=lowerfilt:lucenejavt&qt=spellCheckCompRH} hits=0 status=0 QTime=522 
[junit4:junit4]   2> 3926 T1520 oas.SolrTestCaseJ4.tearDown ###Ending testRebuildOnCommit
[junit4:junit4]   2> 3932 T1520 C129 oasu.DirectUpdateHandler2.deleteAll [collection1] REMOVING ALL DOCUMENTS FROM INDEX
[junit4:junit4]   2> 3933 T1520 C129 UPDATE [collection1] webapp=null path=null params={} {deleteByQuery=*:*} 0 1
[junit4:junit4]   2> 3940 T1520 C129 oasu.DirectUpdateHandler2.commit start commit{flags=0,_version_=0,optimize=false,openSearcher=true,waitSearcher=true,expungeDeletes=false,softCommit=false}
[junit4:junit4]   2> 3941 T1520 C129 oasc.SolrDeletionPolicy.onCommit SolrDeletionPolicy.onCommit: commits:num=2
[junit4:junit4]   2> 		commit{dir=MockDirWrapper(org.apache.lucene.store.RAMDirectory@1cd8f8 lockFactory=org.apache.lucene.store.NativeFSLockFactory@1f3c5f8),segFN=segments_7,generation=7,filenames=[_2.si, _2_Direct_0.tip, _2_Pulsing41_0.doc, _2_NestedPulsing_0.tim, _3_nrm.cfe, _3_Direct_0.doc, _2_Direct_0.tim, _2_Direct_0.pos, _3.fdt, _3.fnm, _2_Pulsing41_1.doc, _2_Pulsing41_0.tim, _2_nrm.cfe, _2_Pulsing41_1.pos, _2_Pulsing41_0.tip, _3_Pulsing41_0.tim, _3_Pulsing41_0.tip, _2_nrm.cfs, _3_Pulsing41_1.doc, _2_NestedPulsing_0.tip, _2_Direct_0.doc, _3_Direct_0.tip, _2_Pulsing41_1.tip, _3_NestedPulsing_0.pos, _2_Pulsing41_1.tim, _3_Pulsing41_1.tip, _3_NestedPulsing_0.tim, _2.fdt, _3_Pulsing41_1.tim, _2.fdx, _3_Pulsing41_1.pos, _2.fnm, _3_Pulsing41_0.pos, _3.fdx, _3_NestedPulsing_0.doc, _3_nrm.cfs, _2_Pulsing41_0.pos, segments_7, _3_NestedPulsing_0.tip, _2_NestedPulsing_0.pos, _3.si, _3_Direct_0.pos, _3_Direct_0.tim, _3_Pulsing41_0.doc, _2_NestedPulsing_0.doc]
[junit4:junit4]   2> 		commit{dir=MockDirWrapper(org.apache.lucene.store.RAMDirectory@1cd8f8 lockFactory=org.apache.lucene.store.NativeFSLockFactory@1f3c5f8),segFN=segments_8,generation=8,filenames=[segments_8]
[junit4:junit4]   2> 3941 T1520 C129 oasc.SolrDeletionPolicy.updateCommits newest commit = 8[segments_8]
[junit4:junit4]   2> 3942 T1520 C129 oasc.CachingDirectoryFactory.close Releasing directory:C:\Users\JenkinsSlave\workspace\Lucene-Solr-trunk-Windows\solr\build\solr-core\test\J0\.\solrtest-SpellCheckComponentTest-1356216184679
[junit4:junit4]   2> 3943 T1520 C129 oass.SolrIndexSearcher.<init> Opening Searcher@7dc5a4 main
[junit4:junit4]   2> 3944 T1521 oashc.SpellCheckComponent$SpellCheckerListener.buildSpellIndex Building spell index for spell checker: default
[junit4:junit4]   2> 3944 T1520 C129 oasu.DirectUpdateHandler2.commit end_commit_flush
[junit4:junit4]   2> 3994 T1521 oashc.SpellCheckComponent$SpellCheckerListener.buildSpellIndex Building spell index for spell checker: default_teststop
[junit4:junit4]   2> 4014 T1521 oashc.SpellCheckComponent$SpellCheckerListener.buildSpellIndex Building spell index for spell checker: threshold
[junit4:junit4]   2> 4034 T1521 oashc.SpellCheckComponent$SpellCheckerListener.buildSpellIndex Building spell index for spell checker: threshold_direct
[junit4:junit4]   2> 4034 T1521 oashc.SpellCheckComponent$SpellCheckerListener.buildSpellIndex Building spell index for spell checker: multipleFields
[junit4:junit4]   2> 4081 T1521 oashc.SpellCheckComponent$SpellCheckerListener.buildSpellIndex Building spell index for spell checker: freq
[junit4:junit4]   2> 4127 T1521 oashc.SpellCheckComponent$SpellCheckerListener.buildSpellIndex Building spell index for spell checker: fqcn
[junit4:junit4]   2> 4172 T1521 oasc.SolrCore.registerSearcher [collection1] Registered new searcher Searcher@7dc5a4 main{StandardDirectoryReader(segments_8:12)}
[junit4:junit4]   2> 4173 T1521 oasc.CachingDirectoryFactory.close Releasing directory:C:\Users\JenkinsSlave\workspace\Lucene-Solr-trunk-Windows\solr\build\solr-core\test\J0\.\solrtest-SpellCheckComponentTest-1356216184679\index
[junit4:junit4]   2> 4173 T1520 C129 UPDATE [collection1] webapp=null path=null params={} {commit=} 0 233
[junit4:junit4]   2> 4183 T1520 oas.SolrTestCaseJ4.setUp ###Starting testCollate
[junit4:junit4]   2> 4189 T1520 C129 UPDATE [collection1] webapp=null path=null params={} {add=[0]} 0 1
[junit4:junit4]   2> 4195 T1520 C129 UPDATE [collection1] webapp=null path=null params={} {add=[1]} 0 0
[junit4:junit4]   2> 4203 T1520 C129 UPDATE [collection1] webapp=null path=null params={} {add=[2]} 0 1
[junit4:junit4]   2> 4210 T1520 C129 UPDATE [collection1] webapp=null path=null params={} {add=[3]} 0 1
[junit4:junit4]   2> 4217 T1520 C129 UPDATE [collection1] webapp=null path=null params={} {add=[4]} 0 1
[junit4:junit4]   2> 4223 T1520 C129 UPDATE [collection1] webapp=null path=null params={} {add=[5]} 0 0
[junit4:junit4]   2> 4230 T1520 C129 UPDATE [collection1] webapp=null path=null params={} {add=[6]} 0 1
[junit4:junit4]   2> 4235 T1520 C129 UPDATE [collection1] webapp=null path=null params={} {add=[7]} 0 0
[junit4:junit4]   2> 4242 T1520 C129 UPDATE [collection1] webapp=null path=null params={} {add=[8]} 0 1
[junit4:junit4]   2> 4249 T1520 C129 UPDATE [collection1] webapp=null path=null params={} {add=[9]} 0 1
[junit4:junit4]   2> 4255 T1520 C129 oasu.DirectUpdateHandler2.commit start commit{flags=0,_version_=0,optimize=false,openSearcher=true,waitSearcher=true,expungeDeletes=false,softCommit=false}
[junit4:junit4]   2> 4258 T1520 C129 oasc.SolrDeletionPolicy.onCommit SolrDeletionPolicy.onCommit: commits:num=2
[junit4:junit4]   2> 		commit{dir=MockDirWrapper(org.apache.lucene.store.RAMDirectory@1cd8f8 lockFactory=org.apache.lucene.store.NativeFSLockFactory@1f3c5f8),segFN=segments_8,generation=8,filenames=[segments_8]
[junit4:junit4]   2> 		commit{dir=MockDirWrapper(org.apache.lucene.store.RAMDirectory@1cd8f8 lockFactory=org.apache.lucene.store.NativeFSLockFactory@1f3c5f8),segFN=segments_9,generation=9,filenames=[_4_Pulsing41_1.tim, _4_NestedPulsing_0.pos, _4_NestedPulsing_0.doc, _4_Pulsing41_0.pos, _4_Pulsing41_0.doc, _4_Direct_0.tim, _4.fnm, _4_nrm.cfe, _4.fdt, _4.si, _4_Pulsing41_1.pos, _4_Direct_0.doc, _4_Pulsing41_1.tip, _4.fdx, segments_9, _4_Pulsing41_1.doc, _4_Pulsing41_0.tip, _4_nrm.cfs, _4_Direct_0.tip, _4_NestedPulsing_0.tip, _4_NestedPulsing_0.tim, _4_Direct_0.pos, _4_Pulsing41_0.tim]
[junit4:junit4]   2> 4258 T1520 C129 oasc.SolrDeletionPolicy.updateCommits newest commit = 9[_4_Pulsing41_1.tim, _4_NestedPulsing_0.pos, _4_NestedPulsing_0.doc, _4_Pulsing41_0.pos, _4_Pulsing41_0.doc, _4_Direct_0.tim, _4.fnm, _4_nrm.cfe, _4.fdt, _4.si, _4_Pulsing41_1.pos, _4_Direct_0.doc, _4_Pulsing41_1.tip, _4.fdx, segments_9, _4_Pulsing41_1.doc, _4_Pulsing41_0.tip, _4_nrm.cfs, _4_Direct_0.tip, _4_NestedPulsing_0.tip, _4_NestedPulsing_0.tim, _4_Direct_0.pos, _4_Pulsing41_0.tim]
[junit4:junit4]   2> 4259 T1520 C129 oasc.CachingDirectoryFactory.close Releasing directory:C:\Users\JenkinsSlave\workspace\Lucene-Solr-trunk-Windows\solr\build\solr-core\test\J0\.\solrtest-SpellCheckComponentTest-1356216184679
[junit4:junit4]   2> 4261 T1520 C129 oass.SolrIndexSearcher.<init> Opening Searcher@ca3406 main
[junit4:junit4]   2> 4262 T1521 oashc.SpellCheckComponent$SpellCheckerListener.buildSpellIndex Building spell index for spell checker: default
[junit4:junit4]   2> 4262 T1520 C129 oasu.DirectUpdateHandler2.commit end_commit_flush
[junit4:junit4]   2> 4317 T1521 oashc.SpellCheckComponent$SpellCheckerListener.buildSpellIndex Building spell index for spell checker: default_teststop
[junit4:junit4]   2> 4335 T1521 oashc.SpellCheckComponent$SpellCheckerListener.buildSpellIndex Building spell index for spell checker: threshold
[junit4:junit4]   2> 4386 T1521 oashc.SpellCheckComponent$SpellCheckerListener.buildSpellIndex Building spell index for spell checker: threshold_direct
[junit4:junit4]   2> 4386 T1521 oashc.SpellCheckComponent$SpellCheckerListener.buildSpellIndex Building spell index for spell checker: multipleFields
[junit4:junit4]   2> 4441 T1521 oashc.SpellCheckComponent$SpellCheckerListener.buildSpellIndex Building spell index for spell checker: freq
[junit4:junit4]   2> 4557 T1521 oashc.SpellCheckComponent$SpellCheckerListener.buildSpellIndex Building spell index for spell checker: fqcn
[junit4:junit4]   2> 4627 T1521 oasc.SolrCore.registerSearcher [collection1] Registered new searcher Searcher@ca3406 main{StandardDirectoryReader(segments_9:14 _4(5.0):C10)}
[junit4:junit4]   2> 4628 T1521 oasc.CachingDirectoryFactory.close Releasing directory:C:\Users\JenkinsSlave\workspace\Lucene-Solr-trunk-Windows\solr\build\solr-core\test\J0\.\solrtest-SpellCheckComponentTest-1356216184679\index
[junit4:junit4]   2> 4629 T1520 C129 UPDATE [collection1] webapp=null path=null params={} {commit=} 0 374
[junit4:junit4]   2> 4758 T1520 C129 REQ [collection1] webapp=null path=null params={spellcheck=true&q=documemt&json.nl=map&spellcheck.collate=true&qt=spellCheckCompRH&spellcheck.build=true} hits=0 status=0 QTime=120 
[junit4:junit4]   2> 4761 T1520 C129 REQ [collection1] webapp=null path=null params={spellcheck=true&q=documemt+lowerfilt:broen^4&json.nl=map&spellcheck.collate=true&qt=spellCheckCompRH} hits=0 status=0 QTime=2 
[junit4:junit4]   2> 4765 T1520 C129 REQ [collection1] webapp=null path=null params={spellcheck=true&q=documemtsss+broens&json.nl=map&spellcheck.collate=true&qt=spellCheckCompRH} hits=0 status=0 QTime=3 
[junit4:junit4]   2> 4767 T1520 C129 REQ [collection1] webapp=null path=null params={spellcheck=true&q=pixma&json.nl=map&spellcheck.collate=true&qt=spellCheckCompRH} hits=0 status=0 QTime=2 
[junit4:junit4]   2> 4767 T1520 oas.SolrTestCaseJ4.tearDown ###Ending testCollate
[junit4:junit4]   2> 4778 T1520 C129 oasu.DirectUpdateHandler2.deleteAll [collection1] REMOVING ALL DOCUMENTS FROM INDEX
[junit4:junit4]   2> 4779 T1520 C129 UPDATE [collection1] webapp=null path=null params={} {deleteByQuery=*:*} 0 2
[junit4:junit4]   2> 4787 T1520 C129 oasu.DirectUpdateHandler2.commit start commit{flags=0,_version_=0,optimize=false,openSearcher=true,waitSearcher=true,expungeDeletes=false,softCommit=false}
[junit4:junit4]   2> 4788 T1520 C129 oasc.SolrDeletionPolicy.onCommit SolrDeletionPolicy.onCommit: commits:num=2
[junit4:junit4]   2> 		commit{dir=MockDirWrapper(org.apache.lucene.store.RAMDirectory@1cd8f8 lockFactory=org.apache.lucene.store.NativeFSLockFactory@1f3c5f8),segFN=segments_9,generation=9,filenames=[_4_Pulsing41_1.tim, _4_NestedPulsing_0.pos, _4_NestedPulsing_0.doc, _4_Pulsing41_0.pos, _4_Pulsing41_0.doc, _4_Direct_0.tim, _4.fnm, _4_nrm.cfe, _4.fdt, _4.si, _4_Pulsing41_1.pos, _4_Direct_0.doc, _4_Pulsing41_1.tip, _4.fdx, segments_9, _4_Pulsing41_1.doc, _4_Pulsing41_0.tip, _4_nrm.cfs, _4_Direct_0.tip, _4_NestedPulsing_0.tip, _4_NestedPulsing_0.tim, _4_Direct_0.pos, _4_Pulsing41_0.tim]
[junit4:junit4]   2> 		commit{dir=MockDirWrapper(org.apache.lucene.store.RAMDirectory@1cd8f8 lockFactory=org.apache.lucene.store.NativeFSLockFactory@1f3c5f8),segFN=segments_a,generation=10,filenames=[segments_a]
[junit4:junit4]   2> 4789 T1520 C129 oasc.SolrDeletionPolicy.updateCommits newest commit = 10[segments_a]
[junit4:junit4]   2> 4790 T1520 C129 oasc.CachingDirectoryFactory.close Releasing directory:C:\Users\JenkinsSlave\workspace\Lucene-Solr-trunk-Windows\solr\build\solr-core\test\J0\.\solrtest-SpellCheckComponentTest-1356216184679
[junit4:junit4]   2> 4790 T1520 C129 oass.SolrIndexSearcher.<init> Opening Searcher@328850 main
[junit4:junit4]   2> 4791 T1521 oashc.SpellCheckComponent$SpellCheckerListener.buildSpellIndex Building spell index for spell checker: default
[junit4:junit4]   2> 4791 T1520 C129 oasu.DirectUpdateHandler2.commit end_commit_flush
[junit4:junit4]   2> 4837 T1521 oashc.SpellCheckComponent$SpellCheckerListener.buildSpellIndex Building spell index for spell checker: default_teststop
[junit4:junit4]   2> 4857 T1521 oashc.SpellCheckComponent$SpellCheckerListener.buildSpellIndex Building spell index for spell checker: threshold
[junit4:junit4]   2> 4911 T1521 oashc.SpellCheckComponent$SpellCheckerListener.buildSpellIndex Building spell index for spell checker: threshold_direct
[junit4:junit4]   2> 4911 T1521 oashc.SpellCheckComponent$SpellCheckerListener.buildSpellIndex Building spell index for spell checker: multipleFields
[junit4:junit4]   2> 4969 T1521 oashc.SpellCheckComponent$SpellCheckerListener.buildSpellIndex Building spell index for spell checker: freq
[junit4:junit4]   2> 5037 T1521 oashc.SpellCheckComponent$SpellCheckerListener.buildSpellIndex Building spell index for spell checker: fqcn
[junit4:junit4]   2> 5090 T1521 oasc.SolrCore.registerSearcher [collection1] Registered new searcher Searcher@328850 main{StandardDirectoryReader(segments_a:15)}
[junit4:junit4]   2> 5090 T1521 oasc.CachingDirectoryFactory.close Releasing directory:C:\Users\JenkinsSlave\workspace\Lucene-Solr-trunk-Windows\solr\build\solr-core\test\J0\.\solrtest-SpellCheckComponentTest-1356216184679\index
[junit4:junit4]   2> 5090 T1520 C129 UPDATE [collection1] webapp=null path=null params={} {commit=} 0 303
[junit4:junit4]   2> 5105 T1520 oas.SolrTestCaseJ4.setUp ###Starting test
[junit4:junit4]   2> 5111 T1520 C129 UPDATE [collection1] webapp=null path=null params={} {add=[0]} 0 0
[junit4:junit4]   2> 5120 T1520 C129 UPDATE [collection1] webapp=null path=null params={} {add=[1]} 0 1
[junit4:junit4]   2> 5128 T1520 C129 UPDATE [collection1] webapp=null path=null params={} {add=[2]} 0 1
[junit4:junit4]   2> 5137 T1520 C129 UPDATE [collection1] webapp=null path=null params={} {add=[3]} 0 1
[junit4:junit4]   2> 5145 T1520 C129 UPDATE [collection1] webapp=null path=null params={} {add=[4]} 0 1
[junit4:junit4]   2> 5153 T1520 C129 UPDATE [collection1] webapp=null path=null params={} {add=[5]} 0 1
[junit4:junit4]   2> 5161 T1520 C129 UPDATE [collection1] webapp=null path=null params={} {add=[6]} 0 0
[junit4:junit4]   2> 5170 T1520 C129 UPDATE [collection1] webapp=null path=null params={} {add=[7]} 0 1
[junit4:junit4]   2> 5178 T1520 C129 UPDATE [collection1] webapp=null path=null params={} {add=[8]} 0 1
[junit4:junit4]   2> 5188 T1520 C129 UPDATE [collection1] webapp=null path=null params={} {add=[9]} 0 1
[junit4:junit4]   2> 5197 T1520 C129 oasu.DirectUpdateHandler2.commit start commit{flags=0,_version_=0,optimize=false,openSearcher=true,waitSearcher=true,expungeDeletes=false,softCommit=false}
[junit4:junit4]   2> 5202 T1520 C129 oasc.SolrDeletionPolicy.onCommit SolrDeletionPolicy.onCommit: commits:num=2
[junit4:junit4]   2> 		commit{dir=MockDirWrapper(org.apache.lucene.store.RAMDirectory@1cd8f8 lockFactory=org.apache.lucene.store.NativeFSLockFactory@1f3c5f8),segFN=segments_a,generation=10,filenames=[segments_a]
[junit4:junit4]   2> 		commit{dir=MockDirWrapper(org.apache.lucene.store.RAMDirectory@1cd8f8 lockFactory=org.apache.lucene.store.NativeFSLockFactory@1f3c5f8),segFN=segments_b,generation=11,filenames=[_5_nrm.cfe, _5_NestedPulsing_0.tip, _5_Pulsing41_1.tip, _5_Direct_0.tim, _5.fnm, _5.fdt, _5_NestedPulsing_0.tim, segments_b, _5_NestedPulsing_0.doc, _5_Pulsing41_1.tim, _5_Direct_0.doc, _5.si, _5_Pulsing41_1.doc, _5_Pulsing41_0.tim, _5_Pulsing41_0.pos, _5_nrm.cfs, _5_Direct_0.pos, _5.fdx, _5_Pulsing41_1.pos, _5_Pulsing41_0.doc, _5_Direct_0.tip, _5_Pulsing41_0.tip, _5_NestedPulsing_0.pos]
[junit4:junit4]   2> 5203 T1520 C129 oasc.SolrDeletionPolicy.updateCommits newest commit = 11[_5_nrm.cfe, _5_NestedPulsing_0.tip, _5_Pulsing41_1.tip, _5_Direct_0.tim, _5.fnm, _5.fdt, _5_NestedPulsing_0.tim, segments_b, _5_NestedPulsing_0.doc, _5_Pulsing41_1.tim, _5_Direct_0.doc, _5.si, _5_Pulsing41_1.doc, _5_Pulsing41_0.tim, _5_Pulsing41_0.pos, _5_nrm.cfs, _5_Direct_0.pos, _5.fdx, _5_Pulsing41_1.pos, _5_Pulsing41_0.doc, _5_Direct_0.tip, _5_Pulsing41_0.tip, _5_NestedPulsing_0.pos]
[junit4:junit4]   2> 5204 T1520 C129 oasc.CachingDirectoryFactory.close Releasing directory:C:\Users\JenkinsSlave\workspace\Lucene-Solr-trunk-Windows\solr\build\solr-core\test\J0\.\solrtest-SpellCheckComponentTest-1356216184679
[junit4:junit4]   2> 5207 T1520 C129 oass.SolrIndexSearcher.<init> Opening Searcher@72193d main
[junit4:junit4]   2> 5243 T1521 oashc.SpellCheckComponent$SpellCheckerListener.buildSpellIndex Building spell index for spell checker: default
[junit4:junit4]   2> 5243 T1520 C129 oasu.DirectUpdateHandler2.commit end_commit_flush
[junit4:junit4]   2> 5307 T1521 oashc.SpellCheckComponent$SpellCheckerListener.buildSpellIndex Building spell index for spell checker: default_teststop
[junit4:junit4]   2> 5331 T1521 oashc.SpellCheckComponent$SpellCheckerListener.buildSpellIndex Building spell index for spell checker: threshold
[junit4:junit4]   2> 5393 T1521 oashc.SpellCheckComponent$SpellCheckerListener.buildSpellIndex Building spell index for spell checker: threshold_direct
[junit4:junit4]   2> 5393 T1521 oashc.SpellCheckComponent$SpellCheckerListener.buildSpellIndex Building spell index for spell checker: multipleFields
[junit4:junit4]   2> 5461 T1521 oashc.SpellCheckComponent$SpellCheckerListener.buildSpellIndex Building spell index for spell checker: freq
[junit4:junit4]   2> 5553 T1521 oashc.SpellCheckComponent$SpellCheckerListener.buildSpellIndex Building spell index for spell checker: fqcn
[junit4:junit4]   2> 5609 T1521 oasc.SolrCore.registerSearcher [collection1] Registered new searcher Searcher@72193d main{StandardDirectoryReader(segments_b:17 _5(5.0):C10)}
[junit4:junit4]   2> 5609 T1521 oasc.CachingDirectoryFactory.close Releasing directory:C:\Users\JenkinsSlave\workspace\Lucene-Solr-trunk-Windows\solr\build\solr-core\test\J0\.\solrtest-SpellCheckComponentTest-1356216184679\index
[junit4:junit4]   2> 5610 T1520 C129 UPDATE [collection1] webapp=null path=null params={} {commit=} 0 413
[junit4:junit4]   2> 5618 T1520 C129 REQ [collection1] webapp=null path=null params={spellcheck=true&q=documemt&qt=spellCheckCompRH} hits=0 status=0 QTime=2 
[junit4:junit4]   2> 5618 T1520 oas.SolrTestCaseJ4.tearDown ###Ending test
[junit4:junit4]   2> 5624 T1520 C129 oasu.DirectUpdateHandler2.deleteAll [collection1] REMOVING ALL DOCUMENTS FROM INDEX
[junit4:junit4]   2> 5625 T1520 C129 UPDATE [collection1] webapp=null path=null params={} {deleteByQuery=*:*} 0 1
[junit4:junit4]   2> 5632 T1520 C129 oasu.DirectUpdateHandler2.commit start commit{flags=0,_version_=0,optimize=false,openSearcher=true,waitSearcher=true,expungeDeletes=false,softCommit=false}
[junit4:junit4]   2> 5633 T1520 C129 oasc.SolrDeletionPolicy.onCommit SolrDeletionPolicy.onCommit: commits:num=2
[junit4:junit4]   2> 		commit{dir=MockDirWrapper(org.apache.lucene.store.RAMDirectory@1cd8f8 lockFactory=org.apache.lucene.store.NativeFSLockFactory@1f3c5f8),segFN=segments_b,generation=11,filenames=[_5_nrm.cfe, _5_NestedPulsing_0.tip, _5_Pulsing41_1.tip, _5_Direct_0.tim, _5.fnm, _5.fdt, _5_NestedPulsing_0.tim, segments_b, _5_NestedPulsing_0.doc, _5_Pulsing41_1.tim, _5_Direct_0.doc, _5.si, _5_Pulsing41_1.doc, _5_Pulsing41_0.tim, _5_Pulsing41_0.pos, _5_nrm.cfs, _5_Direct_0.pos, _5.fdx, _5_Pulsing41_1.pos, _5_Pulsing41_0.doc, _5_Direct_0.tip, _5_Pulsing41_0.tip, _5_NestedPulsing_0.pos]
[junit4:junit4]   2> 		commit{dir=MockDirWrapper(org.apache.lucene.store.RAMDirectory@1cd8f8 lockFactory=org.apache.lucene.store.NativeFSLockFactory@1f3c5f8),segFN=segments_c,generation=12,filenames=[segments_c]
[junit4:junit4]   2> 5633 T1520 C129 oasc.SolrDeletionPolicy.updateCommits newest commit = 12[segments_c]
[junit4:junit4]   2> 5634 T1520 C129 oasc.CachingDirectoryFactory.close Releasing directory:C:\Users\JenkinsSlave\workspace\Lucene-Solr-trunk-Windows\solr\build\solr-core\test\J0\.\solrtest-SpellCheckComponentTest-1356216184679
[junit4:junit4]   2> 5635 T1520 C129 oass.SolrIndexSearcher.<init> Opening Searcher@1a46088 main
[junit4:junit4]   2> 5635 T1521 oashc.SpellCheckComponent$SpellCheckerListener.buildSpellIndex Building spell index for spell checker: default
[junit4:junit4]   2> 5635 T1520 C129 oasu.DirectUpdateHandler2.commit end_commit_flush
[junit4:junit4]   2> 5681 T1521 oashc.SpellCheckComponent$SpellCheckerListener.buildSpellIndex Building spell index for spell checker: default_teststop
[junit4:junit4]   2> 5698 T1521 oashc.SpellCheckComponent$SpellCheckerListener.buildSpellIndex Building spell index for spell checker: threshold
[junit4:junit4]   2> 5748 T1521 oashc.SpellCheckComponent$SpellCheckerListener.buildSpellIndex Building spell index for spell checker: threshold_direct
[junit4:junit4]   2> 5748 T1521 oashc.SpellCheckComponent$SpellCheckerListener.buildSpellIndex Building spell index for spell checker: multipleFields
[junit4:junit4]   2> 5799 T1521 oashc.SpellCheckComponent$SpellCheckerListener.buildSpellIndex Building spell index for spell checker: freq
[junit4:junit4]   2> 5843 T1521 oashc.SpellCheckComponent$SpellCheckerListener.buildSpellIndex Building spell index for spell checker: fqcn
[junit4:junit4]   2> 5888 T1521 oasc.SolrCore.registerSearcher [collection1] Registered new searcher Searcher@1a46088 main{StandardDirectoryReader(segments_c:18)}
[junit4:junit4]   2> 5888 T1521 oasc.CachingDirectoryFactory.close Releasing directory:C:\Users\JenkinsSlave\workspace\Lucene-Solr-trunk-Windows\solr\build\solr-core\test\J0\.\solrtest-SpellCheckComponentTest-1356216184679\index
[junit4:junit4]   2> 5889 T1520 C129 UPDATE [collection1] webapp=null path=null params={} {commit=} 0 257
[junit4:junit4]   2> 5899 T1520 oas.SolrTestCaseJ4.setUp ###Starting testCorrectSpelling
[junit4:junit4]   2> 5905 T1520 C129 UPDATE [collection1] webapp=null path=null params={} {add=[0]} 0 1
[junit4:junit4]   2> 5912 T1520 C129 UPDATE [collection1] webapp=null path=null params={} {add=[1]} 0 1
[junit4:junit4]   2> 5918 T1520 C129 UPDATE [collection1] webapp=null path=null params={} {add=[2]} 0 0
[junit4:junit4]   2> 5925 T1520 C129 UPDATE [collection1] webapp=null path=null params={} {add=[3]} 0 0
[junit4:junit4]   2> 5933 T1520 C129 UPDATE [collection1] webapp=null path=null params={} {add=[4]} 0 1
[junit4:junit4]   2> 5940 T1520 C129 UPDATE [collection1] webapp=null path=null params={} {add=[5]} 0 0
[junit4:junit4]   2> 5947 T1520 C129 UPDATE [collection1] webapp=null path=null params={} {add=[6]} 0 0
[junit4:junit4]   2> 5955 T1520 C129 UPDATE [collection1] webapp=null path=null params={} {add=[7]} 0 0
[junit4:junit4]   2> 5962 T1520 C129 UPDATE [collection1] webapp=null path=null params={} {add=[8]} 0 0
[junit4:junit4]   2> 5969 T1520 C129 UPDATE [collection1] webapp=null path=null params={} {add=[9]} 0 0
[junit4:junit4]   2> 5976 T1520 C129 oasu.DirectUpdateHandler2.commit start commit{flags=0,_version_=0,optimize=false,openSearcher=true,waitSearcher=true,expungeDeletes=false,softCommit=false}
[junit4:junit4]   2> 5979 T1520 C129 oasc.SolrDeletionPolicy.onCommit SolrDeletionPolicy.onCommit: commits:num=2
[junit4:junit4]   2> 		commit{dir=MockDirWrapper(org.apache.lucene.store.RAMDirectory@1cd8f8 lockFactory=org.apache.lucene.store.NativeFSLockFactory@1f3c5f8),segFN=segments_c,generation=12,filenames=[segments_c]
[junit4:junit4]   2> 		commit{dir=MockDirWrapper(org.apache.lucene.store.RAMDirectory@1cd8f8 lockFactory=org.apache.lucene.store.NativeFSLockFactory@1f3c5f8),segFN=segments_d,generation=13,filenames=[_6_Pulsing41_1.tim, segments_d, _6_nrm.cfe, _6_Pulsing41_0.tim, _6_Direct_0.pos, _6.fdx, _6_Pulsing41_0.tip, _6_Direct_0.tip, _6_Direct_0.tim, _6_Pulsing41_1.tip, _6_Pulsing41_0.doc, _6_nrm.cfs, _6_Pulsing41_1.pos, _6_Pulsing41_0.pos, _6_NestedPulsing_0.doc, _6_NestedPulsing_0.tip, _6.si, _6_Pulsing41_1.doc, _6.fnm, _6.fdt, _6_NestedPulsing_0.pos, _6_NestedPulsing_0.tim, _6_Direct_0.doc]
[junit4:junit4]   2> 5979 T1520 C129 oasc.SolrDeletionPolicy.updateCommits newest commit = 13[_6_Pulsing41_1.tim, segments_d, _6_nrm.cfe, _6_Pulsing41_0.tim, _6_Direct_0.pos, _6.fdx, _6_Pulsing41_0.tip, _6_Direct_0.tip, _6_Direct_0.tim, _6_Pulsing41_1.tip, _6_Pulsing41_0.doc, _6_nrm.cfs, _6_Pulsing41_1.pos, _6_Pulsing41_0.pos, _6_NestedPulsing_0.doc, _6_NestedPulsing_0.tip, _6.si, _6_Pulsing41_1.doc, _6.fnm, _6.fdt, _6_NestedPulsing_0.pos, _6_NestedPulsing_0.tim, _6_Direct_0.doc]
[junit4:junit4]   2> 5980 T1520 C129 oasc.CachingDirectoryFactory.close Releasing directory:C:\Users\JenkinsSlave\workspace\Lucene-Solr-trunk-Windows\solr\build\solr-core\test\J0\.\solrtest-SpellCheckComponentTest-1356216184679
[junit4:junit4]   2> 5982 T1520 C129 oass.SolrIndexSearcher.<init> Opening Searcher@580f21 main
[junit4:junit4]   2> 5982 T1521 oashc.SpellCheckComponent$SpellCheckerListener.buildSpellIndex Building spell index for spell checker: default
[junit4:junit4]   2> 5982 T1520 C129 oasu.DirectUpdateHandler2.commit end_commit_flush
[junit4:junit4]   2> 6037 T1521 oashc.SpellCheckComponent$SpellCheckerListener.buildSpellIndex Building spell index for spell checker: default_teststop
[junit4:junit4]   2> 6055 T1521 oashc.SpellCheckComponent$SpellCheckerListener.buildSpellIndex Building spell index for spell checker: threshold
[junit4:junit4]   2> 6102 T1521 oashc.SpellCheckComponent$SpellCheckerListener.buildSpellIndex Building spell index for spell checker: threshold_direct
[junit4:junit4]   2> 6102 T1521 oashc.SpellCheckComponent$SpellCheckerListener.buildSpellIndex Building spell index for spell checker: multipleFields
[junit4:junit4]   2> 6157 T1521 oashc.SpellCheckComponent$SpellCheckerListener.buildSpellIndex Building spell index for spell checker: freq
[junit4:junit4]   2> 6211 T1521 oashc.SpellCheckComponent$SpellCheckerListener.buildSpellIndex Building spell index for spell checker: fqcn
[junit4:junit4]   2> 6263 T1521 oasc.SolrCore.registerSearcher [collection1] Registered new searcher Searcher@580f21 main{StandardDirectoryReader(segments_d:20 _6(5.0):C10)}
[junit4:junit4]   2> 6264 T1521 oasc.CachingDirectoryFactory.close Releasing directory:C:\Users\JenkinsSlave\workspace\Lucene-Solr-trunk-Windows\solr\build\solr-core\test\J0\.\solrtest-SpellCheckComponentTest-1356216184679\index
[junit4:junit4]   2> 6264 T1520 C129 UPDATE [collection1] webapp=null path=null params={} {commit=} 0 288
[junit4:junit4]   2> 6271 T1520 C129 REQ [collection1] webapp=null path=null params={spellcheck=true&spellcheck.extendedResults=true&q=lowerfilt:lazy+lowerfilt:brown&json.nl=map&qt=spellCheckCompRH} hits=1 status=0 QTime=1 
[junit4:junit4]   2> 6273 T1520 C129 REQ [collection1] webapp=null path=null params={spellcheck=true&spellcheck.extendedResults=true&q=lowerfilt:lazy+lowerfilt:brown&spellcheck.dictionary=direct_lowerfilt&json.nl=map&qt=spellCheckCompRH} hits=1 status=0 QTime=1 
[junit4:junit4]   2> 6283 T1520 C129 REQ [collection1] webapp=null path=null params={spellcheck=true&spellcheck.extendedResults=true&q=lakkle&spellcheck.dictionary=direct_lowerfilt&json.nl=map&qt=spellCheckCompRH} hits=0 status=0 QTime=10 
[junit4:junit4]   2> 6284 T1520 oas.SolrTestCaseJ4.tearDown ###Ending testCorrectSpelling
[junit4:junit4]   2> 6288 T1520 C129 oasu.DirectUpdateHandler2.deleteAll [collection1] REMOVING ALL DOCUMENTS FROM INDEX
[junit4:junit4]   2> 6289 T1520 C129 UPDATE [collection1] webapp=null path=null params={} {deleteByQuery=*:*} 0 1
[junit4:junit4]   2> 6297 T1520 C129 oasu.DirectUpdateHandler2.commit start commit{flags=0,_version_=0,optimize=false,openSearcher=true,waitSearcher=true,expungeDeletes=false,softCommit=false}
[junit4:junit4]   2> 6297 T1520 C129 oasc.SolrDeletionPolicy.onCommit SolrDeletionPolicy.onCommit: commits:num=2
[junit4:junit4]   2> 		commit{dir=MockDirWrapper(org.apache.lucene.store.RAMDirectory@1cd8f8 lockFactory=org.apache.lucene.store.NativeFSLockFactory@1f3c5f8),segFN=segments_d,generation=13,filenames=[_6_Pulsing41_1.tim, segments_d, _6_nrm.cfe, _6_Pulsing41_0.tim, _6_Direct_0.pos, _6.fdx, _6_Pulsing41_0.tip, _6_Direct_0.tip, _6_Direct_0.tim, _6_Pulsing41_1.tip, _6_Pulsing41_0.doc, _6_nrm.cfs, _6_Pulsing41_1.pos, _6_Pulsing41_0.pos, _6_NestedPulsing_0.doc, _6_NestedPulsing_0.tip, _6.si, _6_Pulsing41_1.doc, _6.fnm, _6.fdt, _6_NestedPulsing_0.pos, _6_NestedPulsing_0.tim, _6_Direct_0.doc]
[junit4:junit4]   2> 		commit{dir=MockDirWrapper(org.apache.lucene.store.RAMDirectory@1cd8f8 lockFactory=org.apache.lucene.store.NativeFSLockFactory@1f3c5f8),segFN=segments_e,generation=14,filenames=[segments_e]
[junit4:junit4]   2> 6298 T1520 C129 oasc.SolrDeletionPolicy.updateCommits newest commit = 14[segments_e]
[junit4:junit4]   2> 6298 T1520 C129 oasc.CachingDirectoryFactory.close Releasing directory:C:\Users\JenkinsSlave\workspace\Lucene-Solr-trunk-Windows\solr\build\solr-core\test\J0\.\solrtest-SpellCheckComponentTest-1356216184679
[junit4:junit4]   2> 6299 T1520 C129 oass.SolrIndexSearcher.<init> Opening Searcher@2a293 main
[junit4:junit4]   2> 6300 T1521 oashc.SpellCheckComponent$SpellCheckerListener.buildSpellIndex Building spell index for spell checker: default
[junit4:junit4]   2> 6300 T1520 C129 oasu.DirectUpdateHandler2.commit end_commit_flush
[junit4:junit4]   2> 6346 T1521 oashc.SpellCheckComponent$SpellCheckerListener.buildSpellIndex Building spell index for spell checker: default_teststop
[junit4:junit4]   2> 6361 T1521 oashc.SpellCheckComponent$SpellCheckerListener.buildSpellIndex Building spell index for spell checker: threshold
[junit4:junit4]   2> 6406 T1521 oashc.SpellCheckComponent$SpellCheckerListener.buildSpellIndex Building spell index for spell checker: threshold_direct
[junit4:junit4]   2> 6407 T1521 oashc.SpellCheckComponent$SpellCheckerListener.buildSpellIndex Building spell index for spell checker: multipleFields
[junit4:junit4]   2> 6451 T1521 oashc.SpellCheckComponent$SpellCheckerListener.buildSpellIndex Building spell index for spell checker: freq
[junit4:junit4]   2> 6500 T1521 oashc.SpellCheckComponent$SpellCheckerListener.buildSpellIndex Building spell index for spell checker: fqcn
[junit4:junit4]   2> 6548 T1521 oasc.SolrCore.registerSearcher [collection1] Registered new searcher Searcher@2a293 main{StandardDirectoryReader(segments_e:21)}
[junit4:junit4]   2> 6548 T1521 oasc.CachingDirectoryFactory.close Releasing directory:C:\Users\JenkinsSlave\workspace\Lucene-Solr-trunk-Windows\solr\build\solr-core\test\J0\.\solrtest-SpellCheckComponentTest-1356216184679\index
[junit4:junit4]   2> 6549 T1520 C129 UPDATE [collection1] webapp=null path=null params={} {commit=} 0 254
[junit4:junit4]   2> 6558 T1520 oas.SolrTestCaseJ4.setUp ###Starting testReloadOnStart
[junit4:junit4]   2> 6563 T1520 C129 UPDATE [collection1] webapp=null path=null params={} {add=[0]} 0 0
[junit4:junit4]   2> 6573 T1520 C129 UPDATE [collection1] webapp=null path=null params={} {add=[1]} 0 0
[junit4:junit4]   2> 6581 T1520 C129 UPDATE [collection1] webapp=null path=null params={} {add=[2]} 0 0
[junit4:junit4]   2> 6588 T1520 C129 UPDATE [collection1] webapp=null path=null params={} {add=[3]} 0 1
[junit4:junit4]   2> 6597 T1520 C129 UPDATE [collection1] webapp=null path=null params={} {add=[4]} 0 1
[junit4:junit4]   2> 6605 T1520 C129 UPDATE [collection1] webapp=null path=null params={} {add=[5]} 0 1
[junit4:junit4]   2> 6612 T1520 C129 UPDATE [collection1] webapp=null path=null params={} {add=[6]} 0 1
[junit4:junit4]   2> 6618 T1520 C129 UPDATE [collection1] webapp=null path=null params={} {add=[7]} 0 0
[junit4:junit4]   2> 6625 T1520 C129 UPDATE [collection1] webapp=null path=null params={} {add=[8]} 0 0
[junit4:junit4]   2> 6632 T1520 C129 UPDATE [collection1] webapp=null path=null params={} {add=[9]} 0 1
[junit4:junit4]   2> 6639 T1520 C129 oasu.DirectUpdateHandler2.commit start commit{flags=0,_version_=0,optimize=false,openSearcher=true,waitSearcher=true,expungeDeletes=false,softCommit=false}
[junit4:junit4]   2> 6640 T1520 C129 oasc.SolrDeletionPolicy.onCommit SolrDeletionPolicy.onCommit: commits:num=2
[junit4:junit4]   2> 		commit{dir=MockDirWrapper(org.apache.lucene.store.RAMDirectory@1cd8f8 lockFactory=org.apache.lucene.store.NativeFSLockFactory@1f3c5f8),segFN=segments_e,generation=14,filenames=[segments_e]
[junit4:junit4]   2> 		commit{dir=MockDirWrapper(org.apache.lucene.store.RAMDirectory@1cd8f8 lockFactory=org.apache.lucene.store.NativeFSLockFactory@1f3c5f8),segFN=segments_f,generation=15,filenames=[segments_f, _7_nrm.cfe, _7_Direct_0.doc, _7_Pulsing41_1.pos, _7_Pulsing41_1.tip, _7.si, _7.fdx, _7_Pulsing41_1.tim, _7_Pulsing41_0.pos, _7.fdt, _7_NestedPulsing_0.doc, _7_Pulsing41_0.tip, _7.fnm, _7_NestedPulsing_0.pos, _7_nrm.cfs, _7_Direct_0.tim, _7_NestedPulsing_0.tim, _7_Pulsing41_0.doc, _7_Direct_0.tip, _7_Direct_0.pos, _7_Pulsing41_0.tim, _7_NestedPulsing_0.tip, _7_Pulsing41_1.doc]
[junit4:junit4]   2> 6641 T1520 C129 oasc.SolrDeletionPolicy.updateCommits newest commit = 15[segments_f, _7_nrm.cfe, _7_Direct_0.doc, _7_Pulsing41_1.pos, _7_Pulsing41_1.tip, _7.si, _7.fdx, _7_Pulsing41_1.tim, _7_Pulsing41_0.pos, _7.fdt, _7_NestedPulsing_0.doc, _7_Pulsing41_0.tip, _7.fnm, _7_NestedPulsing_0.pos, _7_nrm.cfs, _7_Direct_0.tim, _7_NestedPulsing_0.tim, _7_Pulsing41_0.doc, _7_Direct_0.tip, _7_Direct_0.pos, _7_Pulsing41_0.tim, _7_NestedPulsing_0.tip, _7_Pulsing41_1.doc]
[junit4:junit4]   2> 6641 T1520 C129 oasc.CachingDirectoryFactory.close Releasing directory:C:\Users\JenkinsSlave\workspace\Lucene-Solr-trunk-Windows\solr\build\solr-core\test\J0\.\solrtest-SpellCheckComponentTest-1356216184679
[junit4:junit4]   2> 6644 T1520 C129 oass.SolrIndexSearcher.<init> Opening Searcher@119289a main
[junit4:junit4]   2> 6644 T1521 oashc.SpellCheckComponent$SpellCheckerListener.buildSpellIndex Building spell index for spell checker: default
[junit4:junit4]   2> 6644 T1520 C129 oasu.DirectUpdateHandler2.commit end_commit_flush
[junit4:junit4]   2> 6703 T1521 oashc.SpellCheckComponent$SpellCheckerListener.buildSpellIndex Building spell index for spell checker: default_teststop
[junit4:junit4]   2> 6719 T1521 oashc.SpellCheckComponent$SpellCheckerListener.buildSpellIndex Building spell index for spell checker: threshold
[junit4:junit4]   2> 6781 T1521 oashc.SpellCheckComponent$SpellCheckerListener.buildSpellIndex Building spell index for spell checker: threshold_direct
[junit4:junit4]   2> 6781 T1521 oashc.SpellCheckComponent$SpellCheckerListener.buildSpellIndex Building spell index for spell checker: multipleFields
[junit4:junit4]   2> 6844 T1521 oashc.SpellCheckComponent$SpellCheckerListener.buildSpellIndex Building spell index for spell checker: freq
[junit4:junit4]   2> 6901 T1521 oashc.SpellCheckComponent$SpellCheckerListener.buildSpellIndex Building spell index for spell checker: fqcn
[junit4:junit4]   2> 6959 T1521 oasc.SolrCore.registerSearcher [collection1] Registered new searcher Searcher@119289a main{StandardDirectoryReader(segments_f:23 _7(5.0):C10)}
[junit4:junit4]   2> 6959 T1521 oasc.CachingDirectoryFactory.close Releasing directory:C:\Users\JenkinsSlave\workspace\Lucene-Solr-trunk-Windows\solr\build\solr-core\test\J0\.\solrtest-SpellCheckComponentTest-1356216184679\index
[junit4:junit4]   2> 6960 T1520 C129 UPDATE [collection1] webapp=null path=null params={} {commit=} 0 322
[junit4:junit4]   2> 6972 T1520 C129 UPDATE [collection1] webapp=null path=null params={} {add=[0]} 0 1
[junit4:junit4]   2> 6980 T1520 C129 oasu.DirectUpdateHandler2.commit start commit{flags=0,_version_=0,optimize=false,openSearcher=true,waitSearcher=true,expungeDeletes=false,softCommit=false}
[junit4:junit4]   2> 6984 T1520 C129 oasc.SolrDeletionPolicy.onCommit SolrDeletionPolicy.onCommit: commits:num=2
[junit4:junit4]   2> 		commit{dir=MockDirWrapper(org.apache.lucene.store.RAMDirectory@1cd8f8 lockFactory=org.apache.lucene.store.NativeFSLockFactory@1f3c5f8),segFN=segments_f,generation=15,filenames=[segments_f, _7_nrm.cfe, _7_Direct_0.doc, _7_Pulsing41_1.pos, _7_Pulsing41_1.tip, _7.si, _7.fdx, _7_Pulsing41_1.tim, _7_Pulsing41_0.pos, _7.fdt, _7_NestedPulsing_0.doc, _7_Pulsing41_0.tip, _7.fnm, _7_NestedPulsing_0.pos, _7_nrm.cfs, _7_Direct_0.tim, _7_NestedPulsing_0.tim, _7_Pulsing41_0.doc, _7_Direct_0.tip, _7_Direct_0.pos, _7_Pulsing41_0.tim, _7_NestedPulsing_0.tip, _7_Pulsing41_1.doc]
[junit4:junit4]   2> 		commit{dir=MockDirWrapper(org.apache.lucene.store.RAMDirectory@1cd8f8 lockFactory=org.apache.lucene.store.NativeFSLockFactory@1f3c5f8),segFN=segments_g,generation=16,filenames=[_7_1.del, _8_Pulsing41_1.pos, _8_nrm.cfe, _8_Pulsing41_1.tim, _7_Direct_0.doc, _8_Direct_0.doc, _8_Pulsing41_1.tip, _8_Pulsing41_0.pos, _8_NestedPulsing_0.doc, _7.si, _8.si, _7_NestedPulsing_0.doc, _8_Pulsing41_0.tim, _7.fnm, _8_Pulsing41_0.tip, _7_NestedPulsing_0.pos, _7_nrm.cfs, _7_Direct_0.tim, _7_Pulsing41_0.doc, _7_Direct_0.pos, _7_Direct_0.tip, _7_Pulsing41_1.doc, _8_NestedPulsing_0.pos, _7_nrm.cfe, _7_Pulsing41_1.pos, _8_Direct_0.pos, _7_Pulsing41_1.tip, _7.fdx, _7_Pulsing41_0.pos, _7_Pulsing41_1.tim, _7.fdt, segments_g, _8_nrm.cfs, _7_Pulsing41_0.tip, _8.fnm, _8_Pulsing41_1.doc, _7_NestedPulsing_0.tim, _8_Direct_0.tim, _8.fdx, _8_NestedPulsing_0.tip, _8_Direct_0.tip, _7_NestedPulsing_0.tip, _7_Pulsing41_0.tim, _8_Pulsing41_0.doc, _8.fdt, _8_NestedPulsing_0.tim]
[junit4:junit4]   2> 6985 T1520 C129 oasc.SolrDeletionPolicy.updateCommits newest commit = 16[_7_1.del, _8_Pulsing41_1.pos, _8_nrm.cfe, _8_Pulsing41_1.tim, _7_Direct_0.doc, _8_Direct_0.doc, _8_Pulsing41_1.tip, _8_Pulsing41_0.pos, _8_NestedPulsing_0.doc, _7.si, _8.si, _7_NestedPulsing_0.doc, _8_Pulsing41_0.tim, _7.fnm, _8_Pulsing41_0.tip, _7_NestedPulsing_0.pos, _7_nrm.cfs, _7_Direct_0.tim, _7_Pulsing41_0.doc, _7_Direct_0.pos, _7_Direct_0.tip, _7_Pulsing41_1.doc, _8_NestedPulsing_0.pos, _7_nrm.cfe, _7_Pulsing41_1.pos, _8_Direct_0.pos, _7_Pulsing41_1.tip, _7.fdx, _7_Pulsing41_0.pos, _7_Pulsing41_1.tim, _7.fdt, segments_g, _8_nrm.cfs, _7_Pulsing41_0.tip, _8.fnm, _8_Pulsing41_1.doc, _7_NestedPulsing_0.tim, _8_Direct_0.tim, _8.fdx, _8_NestedPulsing_0.tip, _8_Direct_0.tip, _7_NestedPulsing_0.tip, _7_Pulsing41_0.tim, _8_Pulsing41_0.doc, _8.fdt, _8_NestedPulsing_0.tim]
[junit4:junit4]   2> 6985 T1520 C129 oasc.CachingDirectoryFactory.close Releasing directory:C:\Users\JenkinsSlave\workspace\Lucene-Solr-trunk-Windows\solr\build\solr-core\test\J0\.\solrtest-SpellCheckComponentTest-1356216184679
[junit4:junit4]   2> 6988 T1520 C129 oass.SolrIndexSearcher.<init> Opening Searcher@1b355d6 main
[junit4:junit4]   2> 6989 T1521 oashc.SpellCheckComponent$SpellCheckerListener.buildSpellIndex Building spell index for spell checker: default
[junit4:junit4]   2> 6989 T1520 C129 oasu.DirectUpdateHandler2.commit end_commit_flush
[junit4:junit4]   2> 7090 T1521 oashc.SpellCheckComponent$SpellCheckerListener.buildSpellIndex Building spell index for spell checker: default_teststop
[junit4:junit4]   2> 7146 T1521 oashc.SpellCheckComponent$SpellCheckerListener.buildSpellIndex Building spell index for spell checker: threshold
[junit4:junit4]   2> 7242 T1521 oashc.SpellCheckComponent$SpellCheckerListener.buildSpellIndex Building spell index for spell checker: threshold_direct
[junit4:junit4]   2> 7244 T1521 oashc.SpellCheckComponent$SpellCheckerListener.buildSpellIndex Building spell index for spell checker: multipleFields
[junit4:junit4]   2> 7478 T1521 oashc.SpellCheckComponent$SpellCheckerListener.buildSpellIndex Building spell index for spell checker: freq
[junit4:junit4]   2> 7600 T1521 oashc.SpellCheckComponent$SpellCheckerListener.buildSpellIndex Building spell index for spell checker: fqcn
[junit4:junit4]   2> 7723 T1521 oasc.SolrCore.registerSearcher [collection1] Registered new searcher Searcher@1b355d6 main{StandardDirectoryReader(segments_g:26 _7(5.0):C10/1 _8(5.0):C1)}
[junit4:junit4]   2> 7723 T1521 oasc.CachingDirectoryFactory.close Releasing directory:C:\Users\JenkinsSlave\workspace\Lucene-Solr-trunk-Windows\solr\build\solr-core\test\J0\.\solrtest-SpellCheckComponentTest-1356216184679\index
[junit4:junit4]   2> 7724 T1520 C129 UPDATE [collection1] webapp=null path=null params={} {commit=} 0 744
[junit4:junit4]   2> 7833 T1520 C129 REQ [collection1] webapp=null path=null params={spellcheck=true&q=*:*&spellcheck.q=ttle&spellcheck.dictionary=default&qt=spellCheckCompRH&spellcheck.build=true} hits=10 status=0 QTime=102 
[junit4:junit4]   2> 7840 T1520 oashc.SpellCheckComponent.inform Initializing spell checkers
[junit4:junit4]   2> 7854 T1520 oas.SolrTestCaseJ4.tearDown ###Ending testReloadOnStart
[junit4:junit4]   2> 7860 T1520 C129 oasu.DirectUpdateHandler2.deleteAll [collection1] REMOVING ALL DOCUMENTS FROM INDEX
[junit4:junit4]   2> 7860 T1520 C129 UPDATE [collection1] webapp=null path=null params={} {deleteByQuery=*:*} 0 1
[junit4:junit4]   2> 7868 T1520 C129 oasu.DirectUpdateHandler2.commit start commit{flags=0,_version_=0,optimize=false,openSearcher=true,waitSearcher=true,expungeDeletes=false,softCommit=false}
[junit4:junit4]   2> 7868 T1520 C129 oasc.SolrDeletionPolicy.onCommit SolrDeletionPolicy.onCommit: commits:num=2
[junit4:junit4]   2> 		commit{dir=MockDirWrapper(org.apache.lucene.store.RAMDirectory@1cd8f8 lockFactory=org.apache.lucene.store.NativeFSLockFactory@1f3c5f8),segFN=segments_g,generation=16,filenames=[_7_1.del, _8_Pulsing41_1.pos, _8_nrm.cfe, _8_Pulsing41_1.tim, _7_Direct_0.doc, _8_Direct_0.doc, _8_Pulsing41_1.tip, _8_Pulsing41_0.pos, _8_NestedPulsing_0.doc, _7.si, _8.si, _7_NestedPulsing_0.doc, _8_Pulsing41_0.tim, _7.fnm, _8_Pulsing41_0.tip, _7_NestedPulsing_0.pos, _7_nrm.cfs, _7_Direct_0.tim, _7_Pulsing41_0.doc, _7_Direct_0.pos, _7_Direct_0.tip, _7_Pulsing41_1.doc, _8_NestedPulsing_0.pos, _7_nrm.cfe, _7_Pulsing41_1.pos, _8_Direct_0.pos, _7_Pulsing41_1.tip, _7.fdx, _7_Pulsing41_0.pos, _7_Pulsing41_1.tim, _7.fdt, segments_g, _8_nrm.cfs, _7_Pulsing41_0.tip, _8.fnm, _8_Pulsing41_1.doc, _7_NestedPulsing_0.tim, _8_Direct_0.tim, _8.fdx, _8_NestedPulsing_0.tip, _8_Direct_0.tip, _7_NestedPulsing_0.tip, _7_Pulsing41_0.tim, _8_Pulsing41_0.doc, _8.fdt, _8_NestedPulsing_0.tim]
[junit4:junit4]   2> 		commit{dir=MockDirWrapper(org.apache.lucene.store.RAMDirectory@1cd8f8 lockFactory=org.apache.lucene.store.NativeFSLockFactory@1f3c5f8),segFN=segments_h,generation=17,filenames=[segments_h]
[junit4:junit4]   2> 7869 T1520 C129 oasc.SolrDeletionPolicy.updateCommits newest commit = 17[segments_h]
[junit4:junit4]   2> 7870 T1520 C129 oasc.CachingDirectoryFactory.close Releasing directory:C:\Users\JenkinsSlave\workspace\Lucene-Solr-trunk-Windows\solr\build\solr-core\test\J0\.\solrtest-SpellCheckComponentTest-1356216184679
[junit4:junit4]   2> 7870 T1520 C129 oass.SolrIndexSearcher.<init> Opening Searcher@1385225 main
[junit4:junit4]   2> 7872 T1521 oashc.SpellCheckComponent$SpellCheckerListener.buildSpellIndex Building spell index for spell checker: default
[junit4:junit4]   2> 7872 T1520 C129 oasu.DirectUpdateHandler2.commit end_commit_flush
[junit4:junit4]   2> 7942 T1521 oashc.SpellCheckComponent$SpellCheckerListener.buildSpellIndex Building spell index for spell checker: default_teststop
[junit4:junit4]   2> 7967 T1521 oashc.SpellCheckComponent$SpellCheckerListener.buildSpellIndex Building spell index for spell checker: threshold
[junit4:junit4]   2> 8023 T1521 oashc.SpellCheckComponent$SpellCheckerListener.buildSpellIndex Building spell index for spell checker: threshold_direct
[junit4:junit4]   2> 8023 T1521 oashc.SpellCheckComponent$SpellCheckerListener.buildSpellIndex Building spell index for spell checker: multipleFields
[junit4:junit4]   2> 8075 T1521 oashc.SpellCheckComponent$SpellCheckerListener.buildSpellIndex Building spell index for spell checker: freq
[junit4:junit4]   2> 8129 T1521 oashc.SpellCheckComponent$SpellCheckerListener.buildSpellIndex Building spell index for spell checker: fqcn
[junit4:junit4]   2> 8195 T1521 oasc.SolrCore.registerSearcher [collection1] Registered new searcher Searcher@1385225 main{StandardDirectoryReader(segments_h:27)}
[junit4:junit4]   2> 8195 T1521 oasc.CachingDirectoryFactory.close Releasing directory:C:\Users\JenkinsSlave\workspace\Lucene-Solr-trunk-Windows\solr\build\solr-core\test\J0\.\solrtest-SpellCheckComponentTest-1356216184679\index
[junit4:junit4]   2> 8196 T1520 C129 UPDATE [collection1] webapp=null path=null params={} {commit=} 0 329
[junit4:junit4]   2> 8207 T1520 oas.SolrTestCaseJ4.setUp ###Starting testRelativeIndexDirLocation
[junit4:junit4]   2> 8215 T1520 C129 UPDATE [collection1] webapp=null path=null params={} {add=[0]} 0 1
[junit4:junit4]   2> 8223 T1520 C129 UPDATE [collection1] webapp=null path=null params={} {add=[1]} 0 2
[junit4:junit4]   2> 8231 T1520 C129 UPDATE [collection1] webapp=null path=null params={} {add=[2]} 0 1
[junit4:junit4]   2> 8241 T1520 C129 UPDATE [collection1] webapp=null path=null params={} {add=[3]} 0 1
[junit4:junit4]   2> 8250 T1520 C129 UPDATE [collection1] webapp=null path=null params={} {add=[4]} 0 1
[junit4:junit4]   2> 8259 T1520 C129 UPDATE [collection1] webapp=null path=null params={} {add=[5]} 0 0
[junit4:junit4]   2> 8267 T1520 C129 UPDATE [collection1] webapp=null path=null params={} {add=[6]} 0 1
[junit4:junit4]   2> 8277 T1520 C129 UPDATE [collection1] webapp=null path=null params={} {add=[7]} 0 1
[junit4:junit4]   2> 8288 T1520 C129 UPDATE [collection1] webapp=null path=null params={} {add=[8]} 0 0
[junit4:junit4]   2> 8300 T1520 C129 UPDATE [collection1] webapp=null path=null params={} {add=[9]} 0 0
[junit4:junit4]   2> 8312 T1520 C129 oasu.DirectUpdateHandler2.commit start commit{flags=0,_version_=0,optimize=false,openSearcher=true,waitSearcher=true,expungeDeletes=false,softCommit=false}
[junit4:junit4]   2> 8317 T1520 C129 oasc.SolrDeletionPolicy.onCommit SolrDeletionPolicy.onCommit: commits:num=2
[junit4:junit4]   2> 		commit{dir=MockDirWrapper(org.apache.lucene.store.RAMDirectory@1cd8f8 lockFactory=org.apache.lucene.store.NativeFSLockFactory@1f3c5f8),segFN=segments_h,generation=17,filenames=[segments_h]
[junit4:junit4]   2> 		commit{dir=MockDirWrapper(org.apache.lucene.store.RAMDirectory@1cd8f8 lockFactory=org.apache.lucene.store.NativeFSLockFactory@1f3c5f8),segFN=segments_i,generation=18,filenames=[_9_Pulsing41_0.pos, _9_nrm.cfe, _9.fnm, _9_Direct_0.pos, _9.fdt, _9_Pulsing41_0.tip, _9_Pulsing41_1.pos, segments_i, _9_NestedPulsing_0.doc, _9_Pulsing41_0.tim, _9.fdx, _9_Pulsing41_1.tip, _9_Pulsing41_0.doc, _9_NestedPulsing_0.tip, _9_Pulsing41_1.tim, _9_nrm.cfs, _9_NestedPulsing_0.tim, _9.si, _9_Pulsing41_1.doc, _9_Direct_0.tim, _9_NestedPulsing_0.pos, _9_Direct_0.doc, _9_Direct_0.tip]
[junit4:junit4]   2> 8317 T1520 C129 oasc.SolrDeletionPolicy.updateCommits newest commit = 18[_9_Pulsing41_0.pos, _9_nrm.cfe, _9.fnm, _9_Direct_0.pos, _9.fdt, _9_Pulsing41_0.tip, _9_Pulsing41_1.pos, segments_i, _9_NestedPulsing_0.doc, _9_Pulsing41_0.tim, _9.fdx, _9_Pulsing41_1.tip, _9_Pulsing41_0.doc, _9_NestedPulsing_0.tip, _9_Pulsing41_1.tim, _9_nrm.cfs, _9_NestedPulsing_0.tim, _9.si, _9_Pulsing41_1.doc, _9_Direct_0.tim, _9_NestedPulsing_0.pos, _9_Direct_0.doc, _9_Direct_0.tip]
[junit4:junit4]   2> 8318 T1520 C129 oasc.CachingDirectoryFactory.close Releasing directory:C:\Users\JenkinsSlave\workspace\Lucene-Solr-trunk-Windows\solr\build\solr-core\test\J0\.\solrtest-SpellCheckComponentTest-1356216184679
[junit4:junit4]   2> 8322 T1520 C129 oass.SolrIndexSearcher.<init> Opening Searcher@1febc07 main
[junit4:junit4]   2> 8323 T1521 oashc.SpellCheckComponent$SpellCheckerListener.buildSpellIndex Building spell index for spell checker: default
[junit4:junit4]   2> 8323 T1520 C129 oasu.DirectUpdateHandler2.commit end_commit_flush
[junit4:junit4]   2> 8456 T1521 oashc.SpellCheckComponent$SpellCheckerListener.buildSpellIndex Building spell index for spell checker: default_teststop
[junit4:junit4]   2> 8487 T1521 oashc.SpellCheckComponent$SpellCheckerListener.buildSpellIndex Building spell index for spell checker: threshold
[junit4:junit4]   2> 8546 T1521 oashc.SpellCheckComponent$SpellCheckerListener.buildSpellIndex Building spell index for spell checker: threshold_direct
[junit4:junit4]   2> 8546 T1521 oashc.SpellCheckComponent$SpellCheckerListener.buildSpellIndex Building spell index for spell checker: multipleFields
[junit4:junit4]   2> 8604 T1521 oashc.SpellCheckComponent$SpellCheckerListener.buildSpellIndex Building spell index for spell checker: freq
[junit4:junit4]   2> 8670 T1521 oashc.SpellCheckComponent$SpellCheckerListener.buildSpellIndex Building spell index for spell checker: fqcn
[junit4:junit4]   2> 8741 T1521 oasc.SolrCore.registerSearcher [collection1] Registered new searcher Searcher@1febc07 main{StandardDirectoryReader(segments_i:29 _9(5.0):C10)}
[junit4:junit4]   2> 8741 T1521 oasc.CachingDirectoryFactory.close Releasing directory:C:\Users\JenkinsSlave\workspace\Lucene-Solr-trunk-Windows\solr\build\solr-core\test\J0\.\solrtest-SpellCheckComponentTest-1356216184679\index
[junit4:junit4]   2> 8742 T1520 C129 UPDATE [collection1] webapp=null path=null params={} {commit=} 0 430
[junit4:junit4]   2> 8755 T1520 oas.SolrTestCaseJ4.tearDown ###Ending testRelativeIndexDirLocation
[junit4:junit4]   2> 8762 T1520 C129 oasu.DirectUpdateHandler2.deleteAll [collection1] REMOVING ALL DOCUMENTS FROM INDEX
[junit4:junit4]   2> 8763 T1520 C129 UPDATE [collection1] webapp=null path=null params={} {deleteByQuery=*:*} 0 2
[junit4:junit4]   2> 8772 T1520 C129 oasu.DirectUpdateHandler2.commit start commit{flags=0,_version_=0,optimize=false,openSearcher=true,waitSearcher=true,expungeDeletes=false,softCommit=false}
[junit4:junit4]   2> 8773 T1520 C129 oasc.SolrDeletionPolicy.onCommit SolrDeletionPolicy.onCommit: commits:num=2
[junit4:junit4]   2> 		commit{dir=MockDirWrapper(org.apache.lucene.store.RAMDirectory@1cd8f8 lockFactory=org.apache.lucene.store.NativeFSLockFactory@1f3c5f8),segFN=segments_i,generation=18,filenames=[_9_Pulsing41_0.pos, _9_nrm.cfe, _9.fnm, _9_Direct_0.pos, _9.fdt, _9_Pulsing41_0.tip, _9_Pulsing41_1.pos, segments_i, _9_NestedPulsing_0.doc, _9_Pulsing41_0.tim, _9.fdx, _9_Pulsing41_1.tip, _9_Pulsing41_0.doc, _9_NestedPulsing_0.tip, _9_Pulsing41_1.tim, _9_nrm.cfs, _9_NestedPulsing_0.tim, _9.si, _9_Pulsing41_1.doc, _9_Direct_0.tim, _9_NestedPulsing_0.pos, _9_Direct_0.doc, _9_Direct_0.tip]
[junit4:junit4]   2> 		commit{dir=MockDirWrapper(org.apache.lucene.store.RAMDirectory@1cd8f8 lockFactory=org.apache.lucene.store.NativeFSLockFactory@1f3c5f8),segFN=segments_j,generation=19,filenames=[segments_j]
[junit4:junit4]   2> 8773 T1520 C129 oasc.SolrDeletionPolicy.updateCommits newest commit = 19[segments_j]
[junit4:junit4]   2> 8774 T1520 C129 oasc.CachingDirectoryFactory.close Releasing directory:C:\Users\JenkinsSlave\workspace\Lucene-Solr-trunk-Windows\solr\build\solr-core\test\J0\.\solrtest-SpellCheckComponentTest-1356216184679
[junit4:junit4]   2> 8775 T1520 C129 oass.SolrIndexSearcher.<init> Opening Searcher@8c6649 main
[junit4:junit4]   2> 8777 T1521 oashc.SpellCheckComponent$SpellCheckerListener.buildSpellIndex Building spell index for spell checker: default
[junit4:junit4]   2> 8777 T1520 C129 oasu.DirectUpdateHandler2.commit end_commit_flush
[junit4:junit4]   2> 8910 T1521 oashc.SpellCheckComponent$SpellCheckerListener.buildSpellIndex Building spell index for spell checker: default_teststop
[junit4:junit4]   2> 8935 T1521 oashc.SpellCheckComponent$SpellCheckerListener.buildSpellIndex Building spell index for spell checker: threshold
[junit4:junit4]   2> 9009 T1521 oashc.SpellCheckComponent$SpellCheckerListener.buildSpellIndex Building spell index for spell checker: threshold_direct
[junit4:junit4]   2> 9010 T1521 oashc.SpellCheckComponent$SpellCheckerListener.buildSpellIndex Building spell index for spell checker: multipleFields
[junit4:junit4]   2> 9084 T1521 oashc.SpellCheckComponent$SpellCheckerListener.buildSpellIndex Building spell index for spell checker: freq
[junit4:junit4]   2> 9149 T1521 oashc.SpellCheckComponent$SpellCheckerListener.buildSpellIndex Building spell index for spell checker: fqcn
[junit4:junit4]   2> 9198 T1521 oasc.SolrCore.registerSearcher [collection1] Registered new searcher Searcher@8c6649 main{StandardDirectoryReader(segments_j:30)}
[junit4:junit4]   2> 9199 T1521 oasc.CachingDirectoryFactory.close Releasing directory:C:\Users\JenkinsSlave\workspace\Lucene-Solr-trunk-Windows\solr\build\solr-core\test\J0\.\solrtest-SpellCheckComponentTest-1356216184679\index
[junit4:junit4]   2> 9200 T1520 C129 UPDATE [collection1] webapp=null path=null params={} {commit=} 0 429
[junit4:junit4]   2> 9212 T1520 oas.SolrTestCaseJ4.setUp ###Starting testExtendedResultsCount
[junit4:junit4]   2> 9217 T1520 C129 UPDATE [collection1] webapp=null path=null params={} {add=[0]} 0 0
[junit4:junit4]   2> 9226 T1520 C129 UPDATE [collection1] webapp=null path=null params={} {add=[1]} 0 1
[junit4:junit4]   2> 9233 T1520 C129 UPDATE [collection1] webapp=null path=null params={} {add=[2]} 0 0
[junit4:junit4]   2> 9240 T1520 C129 UPDATE [collection1] webapp=null path=null params={} {add=[3]} 0 0
[junit4:junit4]   2> 9248 T1520 C129 UPDATE [collection1] webapp=null path=null params={} {add=[4]} 0 0
[junit4:junit4]   2> 9256 T1520 C129 UPDATE [collection1] webapp=null path=null params={} {add=[5]} 0 1
[junit4:junit4]   2> 9264 T1520 C129 UPDATE [collection1] webapp=null path=null params={} {add=[6]} 0 1
[junit4:junit4]   2> 9272 T1520 C129 UPDATE [collection1] webapp=null path=null params={} {add=[7]} 0 0
[junit4:junit4]   2> 9279 T1520 C129 UPDATE [collection1] webapp=null path=null params={} {add=[8]} 0 0
[junit4:junit4]   2> 9287 T1520 C129 UPDATE [collection1] webapp=null path=null params={} {add=[9]} 0 0
[junit4:junit4]   2> 9295 T1520 C129 oasu.DirectUpdateHandler2.commit start commit{flags=0,_version_=0,optimize=false,openSearcher=true,waitSearcher=true,expungeDeletes=false,softCommit=false}
[junit4:junit4]   2> 9297 T1520 C129 oasc.SolrDeletionPolicy.onCommit SolrDeletionPolicy.onCommit: commits:num=2
[junit4:junit4]   2> 		commit{dir=MockDirWrapper(org.apache.lucene.store.RAMDirectory@1cd8f8 lockFactory=org.apache.lucene.store.NativeFSLockFactory@1f3c5f8),segFN=segments_j,generation=19,filenames=[segments_j]
[junit4:junit4]   2> 		commit{dir=MockDirWrapper(org.apache.lucene.store.RAMDirectory@1cd8f8 lockFactory=org.apache.lucene.store.NativeFSLockFactory@1f3c5f8),segFN=segments_k,generation=20,filenames=[_a_Pulsing41_1.tip, _a_nrm.cfe, _a_NestedPulsing_0.tim, _a_Pulsing41_1.tim, _a_Pulsing41_0.pos, _a_Pulsing41_1.doc, segments_k, _a.fdt, _a_NestedPulsing_0.doc, _a_Pulsing41_1.pos, _a.si, _a_nrm.cfs, _a_Pulsing41_0.doc, _a.fdx, _a_Direct_0.tip, _a_Direct_0.doc, _a_Direct_0.pos, _a_Direct_0.tim, _a_NestedPulsing_0.pos, _a_NestedPulsing_0.tip, _a_Pulsing41_0.tim, _a_Pulsing41_0.tip, _a.fnm]
[junit4:junit4]   2> 9298 T1520 C129 oasc.SolrDeletionPolicy.updateCommits newest commit = 20[_a_Pulsing41_1.tip, _a_nrm.cfe, _a_NestedPulsing_0.tim, _a_Pulsing41_1.tim, _a_Pulsing41_0.pos, _a_Pulsing41_1.doc, segments_k, _a.fdt, _a_NestedPulsing_0.doc, _a_Pulsing41_1.pos, _a.si, _a_nrm.cfs, _a_Pulsing41_0.doc, _a.fdx, _a_Direct_0.tip, _a_Direct_0.doc, _a_Direct_0.pos, _a_Direct_0.tim, _a_NestedPulsing_0.pos, _a_NestedPulsing_0.tip, _a_Pulsing41_0.tim, _a_Pulsing41_0.tip, _a.fnm]
[junit4:junit4]   2> 9298 T1520 C129 oasc.CachingDirectoryFactory.close Releasing directory:C:\Users\JenkinsSlave\workspace\Lucene-Solr-trunk-Windows\solr\build\solr-core\test\J0\.\solrtest-SpellCheckComponentTest-1356216184679
[junit4:junit4]   2> 9301 T1520 C129 oass.SolrIndexSearcher.<init> Opening Searcher@149084f main
[junit4:junit4]   2> 9302 T1521 oashc.SpellCheckComponent$SpellCheckerListener.buildSpellIndex Building spell index for spell checker: default
[junit4:junit4]   2> 9302 T1520 C129 oasu.DirectUpdateHandler2.commit end_commit_flush
[junit4:junit4]   2> 9415 T1521 oashc.SpellCheckComponent$SpellCheckerListener.buildSpellIndex Building spell index for spell checker: default_teststop
[junit4:junit4]   2> 9432 T1521 oashc.SpellCheckComponent$SpellCheckerListener.buildSpellIndex Building spell index for spell checker: threshold
[junit4:junit4]   2> 9486 T1521 oashc.SpellCheckComponent$SpellCheckerListener.buildSpellIndex Building spell index for spell checker: threshold_direct
[junit4:junit4]   2> 9486 T1521 oashc.SpellCheckComponent$SpellCheckerListener.buildSpellIndex Building spell index for spell checker: multipleFields
[junit4:junit4]   2> 9542 T1521 oashc.SpellCheckComponent$SpellCheckerListener.buildSpellIndex Building spell index for spell checker: freq
[junit4:junit4]   2> 9595 T1521 oashc.SpellCheckComponent$SpellCheckerListener.buildSpellIndex Building spell index for spell checker: fqcn
[junit4:junit4]   2> 9653 T1521 oasc.SolrCore.registerSearcher [collection1] Registered new searcher Searcher@149084f main{StandardDirectoryReader(segments_k:32 _a(5.0):C10)}
[junit4:junit4]   2> 9655 T1521 oasc.CachingDirectoryFactory.close Releasing directory:C:\Users\JenkinsSlave\workspace\Lucene-Solr-trunk-Windows\solr\build\solr-core\test\J0\.\solrtest-SpellCheckComponentTest-1356216184679\index
[junit4:junit4]   2> 9655 T1520 C129 UPDATE [collection1] webapp=null path=null params={} {commit=} 0 360
[junit4:junit4]   2> 9885 T1520 C129 REQ [collection1] webapp=null path=null params={spellcheck=true&spellcheck.extendedResults=false&q=bluo&spellcheck.count=5&qt=spellCheckCompRH&spellcheck.build=true} hits=0 status=0 QTime=221 
[junit4:junit4]   2> 9888 T1520 C129 REQ [collection1] webapp=null path=null params={spellcheck=true&spellcheck.extendedResults=true&q=bluo&spellcheck.count=3&qt=spellCheckCompRH} hits=0 status=0 QTime=2 
[junit4:junit4]   2> 9889 T1520 oas.SolrTestCaseJ4.tearDown ###Ending testExtendedResultsCount
[junit4:junit4]   2> 9905 T1520 C129 oasu.DirectUpdateHandler2.deleteAll [collection1] REMOVING ALL DOCUMENTS FROM INDEX
[junit4:junit4]   2> 9906 T1520 C129 UPDATE [collection1] webapp=null path=null params={} {deleteByQuery=*:*} 0 1
[junit4:junit4]   2> 9917 T1520 C129 oasu.DirectUpdateHandler2.commit start commit{flags=0,_version_=0,optimize=false,openSearcher=true,waitSearcher=true,expungeDeletes=false,softCommit=false}
[junit4:junit4]   2> 9918 T1520 C129 oasc.SolrDeletionPolicy.onCommit SolrDeletionPolicy.onCommit: commits:num=2
[junit4:junit4]   2> 		commit{dir=MockDirWrapper(org.apache.lucene.store.RAMDirectory@1cd8f8 lockFactory=org.apache.lucene.store.NativeFSLockFactory@1f3c5f8),segFN=segments_k,generation=20,filenames=[_a_Pulsing41_1.tip, _a_nrm.cfe, _a_NestedPulsing_0.tim, _a_Pulsing41_1.tim, _a_Pulsing41_0.pos, _a_Pulsing41_1.doc, segments_k, _a.fdt, _a_NestedPulsing_0.doc, _a_Pulsing41_1.pos, _a.si, _a_nrm.cfs, _a_Pulsing41_0.doc, _a.fdx, _a_Direct_0.tip, _a_Direct_0.doc, _a_Direct_0.pos, _a_Direct_0.tim, _a_NestedPulsing_0.pos, _a_NestedPulsing_0.tip, _a_Pulsing41_0.tim, _a_Pulsing41_0.tip, _a.fnm]
[junit4:junit4]   2> 		commit{dir=MockDirWrapper(org.apache.lucene.store.RAMDirectory@1cd8f8 lockFactory=org.apache.lucene.store.NativeFSLockFactory@1f3c5f8),segFN=segments_l,generation=21,filenames=[segments_l]
[junit4:junit4]   2> 9919 T1520 C129 oasc.SolrDeletionPolicy.updateCommits newest commit = 21[segments_l]
[junit4:junit4]   2> 9920 T1520 C129 oasc.CachingDirectoryFactory.close Releasing directory:C:\Users\JenkinsSlave\workspace\Lucene-Solr-trunk-Windows\solr\build\solr-core\test\J0\.\solrtest-SpellCheckComponentTest-1356216184679
[junit4:junit4]   2> 9921 T1520 C129 oass.SolrIndexSearcher.<init> Opening Searcher@1c1732e main
[junit4:junit4]   2> 9922 T1520 C129 oasu.DirectUpdateHandler2.commit end_commit_flush
[junit4:junit4]   2> 9925 T1521 oashc.SpellCheckComponent$SpellCheckerListener.buildSpellIndex Building spell index for spell checker: default
[junit4:junit4]   2> 10079 T1521 oashc.SpellCheckComponent$SpellCheckerListener.buildSpellIndex Building spell index for spell checker: default_teststop
[junit4:junit4]   2> 10110 T1521 oashc.SpellCheckComponent$SpellCheckerListener.buildSpellIndex Building spell index for spell checker: threshold
[junit4:junit4]   2> 10185 T1521 oashc.SpellCheckComponent$SpellCheckerListener.buildSpellIndex Building spell index for spell checker: threshold_direct
[junit4:junit4]   2> 10185 T1521 oashc.SpellCheckComponent$SpellCheckerListener.buildSpellIndex Building spell index for spell checker: multipleFields
[junit4:junit4]   2> 10275 T1521 oashc.SpellCheckComponent$SpellCheckerListener.buildSpellIndex Building spell index for spell checker: freq
[junit4:junit4]   2> 10351 T1521 oashc.SpellCheckComponent$SpellCheckerListener.buildSpellIndex Building spell index for spell checker: fqcn
[junit4:junit4]   2> 10412 T1521 oasc.SolrCore.registerSearcher [collection1] Registered new searcher Searcher@1c1732e main{StandardDirectoryReader(segments_l:33)}
[junit4:junit4]   2> 10412 T1521 oasc.CachingDirectoryFactory.close Releasing directory:C:\Users\JenkinsSlave\workspace\Lucene-Solr-trunk-Windows\solr\build\solr-core\test\J0\.\solrtest-SpellCheckComponentTest-1356216184679\index
[junit4:junit4]   2> 10412 T1520 C129 UPDATE [collection1] webapp=null path=null params={} {commit=} 0 495
[junit4:junit4]   2> 10424 T1520 oas.SolrTestCaseJ4.deleteCore ###deleteCore
[junit4:junit4]   2> 10425 T1520 oasc.CoreContainer.shutdown Shutting down CoreContainer instance=6668608
[junit4:junit4]   2> 10426 T1520 oasc.SolrCore.close [collection1]  CLOSING SolrCore org.apache.solr.core.SolrCore@106bd17
[junit4:junit4]   2> 10426 T1520 oasu.DirectUpdateHandler2.close closing DirectUpdateHandler2{commits=20,autocommits=0,soft autocommits=0,optimizes=0,rollbacks=0,expungeDeletes=0,docsPending=0,adds=0,deletesById=0,deletesByQuery=0,errors=0,cumulative_adds=92,cumulative_deletesById=0,cumulative_deletesByQuery=9,cumulative_errors=0}
[junit4:junit4]   2> 10427 T1520 oasc.SolrCore.decrefSolrCoreState Closing SolrCoreState
[junit4:junit4]   2> 10427 T1520 oasu.DefaultSolrCoreState.closeIndexWriter SolrCoreState ref count has reached 0 - closing IndexWriter
[junit4:junit4]   2> 10427 T1520 oasu.DefaultSolrCoreState.closeIndexWriter closing IndexWriter with IndexWriterCloser
[junit4:junit4]   2> 10433 T1520 C129 oasc.CachingDirectoryFactory.close Releasing directory:C:\Users\JenkinsSlave\workspace\Lucene-Solr-trunk-Windows\solr\build\solr-core\test\J0\.\solrtest-SpellCheckComponentTest-1356216184679\index
[junit4:junit4]   2> 10434 T1520 oasc.SolrCore.closeSearcher [collection1] Closing main searcher on request.
[junit4:junit4]   2> 10434 T1520 oasc.CachingDirectoryFactory.close Releasing directory:C:\Users\JenkinsSlave\workspace\Lucene-Solr-trunk-Windows\solr\build\solr-core\test\J0\.\solrtest-SpellCheckComponentTest-1356216184679\index
[junit4:junit4]   2> 10435 T1520 oasc.CachingDirectoryFactory.close Closing directory when closing factory:C:\Users\JenkinsSlave\workspace\Lucene-Solr-trunk-Windows\solr\build\solr-core\test\J0\.\solrtest-SpellCheckComponentTest-1356216184679\index
[junit4:junit4]   2> 10435 T1520 oasc.CachingDirectoryFactory.closeDirectory Closing directory:C:\Users\JenkinsSlave\workspace\Lucene-Solr-trunk-Windows\solr\build\solr-core\test\J0\.\solrtest-SpellCheckComponentTest-1356216184679\index
[junit4:junit4]   2> 10435 T1520 oasc.CachingDirectoryFactory.close Closing directory when closing factory:C:\Users\JenkinsSlave\workspace\Lucene-Solr-trunk-Windows\solr\build\solr-core\test\J0\.\solrtest-SpellCheckComponentTest-1356216184679
[junit4:junit4]   2> 10435 T1520 oasc.CachingDirectoryFactory.closeDirectory Closing directory:C:\Users\JenkinsSlave\workspace\Lucene-Solr-trunk-Windows\solr\build\solr-core\test\J0\.\solrtest-SpellCheckComponentTest-1356216184679
[junit4:junit4]   2> !!!! WARNING: best effort to remove C:\Users\JenkinsSlave\workspace\Lucene-Solr-trunk-Windows\solr\build\solr-core\test\J0\.\solrtest-SpellCheckComponentTest-1356216184679\spellchecker1\_9.fdt FAILED !!!!!
[junit4:junit4]   2> !!!! WARNING: best effort to remove C:\Users\JenkinsSlave\workspace\Lucene-Solr-trunk-Windows\solr\build\solr-core\test\J0\.\solrtest-SpellCheckComponentTest-1356216184679\spellchecker1 FAILED !!!!!
[junit4:junit4]   2> !!!! WARNING: best effort to remove C:\Users\JenkinsSlave\workspace\Lucene-Solr-trunk-Windows\solr\build\solr-core\test\J0\.\solrtest-SpellCheckComponentTest-1356216184679 FAILED !!!!!
[junit4:junit4]   2> NOTE: test params are: codec=Lucene41: {range_facet_l=PostingsFormat(name=Direct), lowerfilt=Pulsing41(freqCutoff=4 minBlockSize=52 maxBlockSize=153), end4=PostingsFormat(name=NestedPulsing), lowerfilt1and2=Pulsing41(freqCutoff=4 minBlockSize=52 maxBlockSize=153), end3=Pulsing41(freqCutoff=4 minBlockSize=52 maxBlockSize=153), start1=PostingsFormat(name=NestedPulsing), end2=Pulsing41(freqCutoff=9 minBlockSize=52 maxBlockSize=153), end1=PostingsFormat(name=Direct), intDefault=PostingsFormat(name=Direct), id=Pulsing41(freqCutoff=9 minBlockSize=52 maxBlockSize=153), timestamp=PostingsFormat(name=Direct), range_facet_sl=PostingsFormat(name=NestedPulsing), range_facet_si=Pulsing41(freqCutoff=4 minBlockSize=52 maxBlockSize=153), start4=PostingsFormat(name=Direct), start2=Pulsing41(freqCutoff=4 minBlockSize=52 maxBlockSize=153), start3=Pulsing41(freqCutoff=9 minBlockSize=52 maxBlockSize=153), word=PostingsFormat(name=Direct), gram2=Pulsing41(freqCutoff=9 minBlockSize=52 maxBlockSize=153), gram1=PostingsFormat(name=Direct), multiDefault=Pulsing41(freqCutoff=4 minBlockSize=52 maxBlockSize=153), gram4=PostingsFormat(name=NestedPulsing), gram3=Pulsing41(freqCutoff=4 minBlockSize=52 maxBlockSize=153)}, sim=DefaultSimilarity, locale=en_IN, timezone=America/Indiana/Knox
[junit4:junit4]   2> NOTE: Windows 7 6.1 x86/Oracle Corporation 1.7.0_09 (32-bit)/cpus=2,threads=1,free=113118672,total=206569472
[junit4:junit4]   2> NOTE: All tests run in this JVM: [TestSolrJ, TestFuzzyAnalyzedSuggestions, TestXIncludeConfig, DOMUtilTest, DistributedTermsComponentTest, HighlighterConfigTest, ZkNodePropsTest, SOLR749Test, TestBinaryField, SuggesterTSTTest, SampleTest, SimpleFacetsTest, CoreContainerCoreInitFailuresTest, NumericFieldsTest, FieldMutatingUpdateProcessorTest, TestSystemIdResolver, TestFoldingMultitermQuery, TestHashPartitioner, TestOmitPositions, TermsComponentTest, PingRequestHandlerTest, TestArbitraryIndexDir, ScriptEngineTest, TestStressRecovery, SearchHandlerTest, RequiredFieldsTest, TestQueryUtils, TestDistributedSearch, ResourceLoaderTest, SolrCmdDistributorTest, TestReload, FileBasedSpellCheckerTest, TestFastLRUCache, DistributedQueryElevationComponentTest, PreAnalyzedFieldTest, TestJoin, TestStressReorder, TestStressVersions, TestCodecSupport, URLClassifyProcessorTest, DefaultValueUpdateProcessorTest, TestConfig, TestWordDelimiterFilterFactory, PluginInfoTest, BasicDistributedZkTest, ResponseLogComponentTest, TestPhraseSuggestions, DisMaxRequestHandlerTest, UpdateParamsTest, IndexBasedSpellCheckerTest, ConvertedLegacyTest, ExternalFileFieldSortTest, SuggesterFSTTest, StatsComponentTest, TestSolrCoreProperties, JSONWriterTest, TestCharFilters, TestDFRSimilarityFactory, TestSolrIndexConfig, CopyFieldTest, TestElisionMultitermQuery, LeaderElectionIntegrationTest, TestWriterPerf, SuggesterWFSTTest, TestLMDirichletSimilarityFactory, ZkSolrClientTest, TestFastOutputStream, BasicZkTest, ClusterStateTest, TestBM25SimilarityFactory, SolrCoreCheckLockOnStartupTest, TestFunctionQuery, BinaryUpdateRequestHandlerTest, OutputWriterTest, TestJmxIntegration, PolyFieldTest, SpellCheckComponentTest]
[junit4:junit4] Completed in 10.48s, 9 tests, 1 error <<< FAILURES!

[...truncated 501 lines...]
BUILD FAILED
C:\Users\JenkinsSlave\workspace\Lucene-Solr-trunk-Windows\build.xml:353: The following error occurred while executing this line:
C:\Users\JenkinsSlave\workspace\Lucene-Solr-trunk-Windows\build.xml:39: The following error occurred while executing this line:
C:\Users\JenkinsSlave\workspace\Lucene-Solr-trunk-Windows\solr\build.xml:178: The following error occurred while executing this line:
C:\Users\JenkinsSlave\workspace\Lucene-Solr-trunk-Windows\solr\common-build.xml:438: The following error occurred while executing this line:
C:\Users\JenkinsSlave\workspace\Lucene-Solr-trunk-Windows\lucene\common-build.xml:1175: The following error occurred while executing this line:
C:\Users\JenkinsSlave\workspace\Lucene-Solr-trunk-Windows\lucene\common-build.xml:840: There were test failures: 243 suites, 1009 tests, 1 error, 12 ignored (7 assumptions)

Total time: 47 minutes 41 seconds
Build step 'Invoke Ant' marked build as failure
Archiving artifacts
Recording test results
Description set: Java: 32bit/jdk1.7.0_09 -server -XX:+UseG1GC
Email was triggered for: Failure
Sending email for trigger: Failure



Mime
View raw message