lucene-dev mailing list archives

Site index · List index
Message view « Date » · « Thread »
Top « Date » · « Thread »
From Policeman Jenkins Server <jenk...@sd-datasolutions.de>
Subject [JENKINS] Lucene-Solr-4.x-Windows (32bit/jdk1.6.0_37) - Build # 2148 - Still Failing!
Date Wed, 12 Dec 2012 18:38:32 GMT
Build: http://jenkins.sd-datasolutions.de/job/Lucene-Solr-4.x-Windows/2148/
Java: 32bit/jdk1.6.0_37 -server -XX:+UseConcMarkSweepGC

3 tests failed.
FAILED:  org.apache.solr.cloud.SyncSliceTest.testDistribSearch

Error Message:
There are still nodes recoverying - waited for 180 seconds

Stack Trace:
java.lang.AssertionError: There are still nodes recoverying - waited for 180 seconds
	at __randomizedtesting.SeedInfo.seed([848089F871F9F43A:56607E006A69406]:0)
	at org.junit.Assert.fail(Assert.java:93)
	at org.apache.solr.cloud.AbstractDistribZkTestBase.waitForRecoveriesToFinish(AbstractDistribZkTestBase.java:165)
	at org.apache.solr.cloud.AbstractDistribZkTestBase.waitForRecoveriesToFinish(AbstractDistribZkTestBase.java:115)
	at org.apache.solr.cloud.AbstractDistribZkTestBase.waitForRecoveriesToFinish(AbstractDistribZkTestBase.java:110)
	at org.apache.solr.cloud.AbstractFullDistribZkTestBase.waitForRecoveriesToFinish(AbstractFullDistribZkTestBase.java:563)
	at org.apache.solr.cloud.SyncSliceTest.doTest(SyncSliceTest.java:224)
	at org.apache.solr.BaseDistributedSearchTestCase.testDistribSearch(BaseDistributedSearchTestCase.java:697)
	at sun.reflect.NativeMethodAccessorImpl.invoke0(Native Method)
	at sun.reflect.NativeMethodAccessorImpl.invoke(NativeMethodAccessorImpl.java:39)
	at sun.reflect.DelegatingMethodAccessorImpl.invoke(DelegatingMethodAccessorImpl.java:25)
	at java.lang.reflect.Method.invoke(Method.java:597)
	at com.carrotsearch.randomizedtesting.RandomizedRunner.invoke(RandomizedRunner.java:1559)
	at com.carrotsearch.randomizedtesting.RandomizedRunner.access$600(RandomizedRunner.java:79)
	at com.carrotsearch.randomizedtesting.RandomizedRunner$6.evaluate(RandomizedRunner.java:737)
	at com.carrotsearch.randomizedtesting.RandomizedRunner$7.evaluate(RandomizedRunner.java:773)
	at com.carrotsearch.randomizedtesting.RandomizedRunner$8.evaluate(RandomizedRunner.java:787)
	at com.carrotsearch.randomizedtesting.rules.SystemPropertiesRestoreRule$1.evaluate(SystemPropertiesRestoreRule.java:53)
	at org.apache.lucene.util.TestRuleSetupTeardownChained$1.evaluate(TestRuleSetupTeardownChained.java:50)
	at org.apache.lucene.util.TestRuleFieldCacheSanity$1.evaluate(TestRuleFieldCacheSanity.java:51)
	at org.apache.lucene.util.AbstractBeforeAfterRule$1.evaluate(AbstractBeforeAfterRule.java:46)
	at com.carrotsearch.randomizedtesting.rules.SystemPropertiesInvariantRule$1.evaluate(SystemPropertiesInvariantRule.java:55)
	at org.apache.lucene.util.TestRuleThreadAndTestName$1.evaluate(TestRuleThreadAndTestName.java:49)
	at org.apache.lucene.util.TestRuleIgnoreAfterMaxFailures$1.evaluate(TestRuleIgnoreAfterMaxFailures.java:70)
	at org.apache.lucene.util.TestRuleMarkFailure$1.evaluate(TestRuleMarkFailure.java:48)
	at com.carrotsearch.randomizedtesting.rules.StatementAdapter.evaluate(StatementAdapter.java:36)
	at com.carrotsearch.randomizedtesting.ThreadLeakControl$StatementRunner.run(ThreadLeakControl.java:358)
	at com.carrotsearch.randomizedtesting.ThreadLeakControl.forkTimeoutingTask(ThreadLeakControl.java:782)
	at com.carrotsearch.randomizedtesting.ThreadLeakControl$3.evaluate(ThreadLeakControl.java:442)
	at com.carrotsearch.randomizedtesting.RandomizedRunner.runSingleTest(RandomizedRunner.java:746)
	at com.carrotsearch.randomizedtesting.RandomizedRunner$3.evaluate(RandomizedRunner.java:648)
	at com.carrotsearch.randomizedtesting.RandomizedRunner$4.evaluate(RandomizedRunner.java:682)
	at com.carrotsearch.randomizedtesting.RandomizedRunner$5.evaluate(RandomizedRunner.java:693)
	at com.carrotsearch.randomizedtesting.rules.StatementAdapter.evaluate(StatementAdapter.java:36)
	at com.carrotsearch.randomizedtesting.rules.SystemPropertiesRestoreRule$1.evaluate(SystemPropertiesRestoreRule.java:53)
	at org.apache.lucene.util.AbstractBeforeAfterRule$1.evaluate(AbstractBeforeAfterRule.java:46)
	at org.apache.lucene.util.TestRuleStoreClassName$1.evaluate(TestRuleStoreClassName.java:42)
	at com.carrotsearch.randomizedtesting.rules.SystemPropertiesInvariantRule$1.evaluate(SystemPropertiesInvariantRule.java:55)
	at com.carrotsearch.randomizedtesting.rules.NoShadowingOrOverridesOnMethodsRule$1.evaluate(NoShadowingOrOverridesOnMethodsRule.java:39)
	at com.carrotsearch.randomizedtesting.rules.NoShadowingOrOverridesOnMethodsRule$1.evaluate(NoShadowingOrOverridesOnMethodsRule.java:39)
	at com.carrotsearch.randomizedtesting.rules.StatementAdapter.evaluate(StatementAdapter.java:36)
	at org.apache.lucene.util.TestRuleAssertionsRequired$1.evaluate(TestRuleAssertionsRequired.java:43)
	at org.apache.lucene.util.TestRuleMarkFailure$1.evaluate(TestRuleMarkFailure.java:48)
	at org.apache.lucene.util.TestRuleIgnoreAfterMaxFailures$1.evaluate(TestRuleIgnoreAfterMaxFailures.java:70)
	at org.apache.lucene.util.TestRuleIgnoreTestSuites$1.evaluate(TestRuleIgnoreTestSuites.java:55)
	at com.carrotsearch.randomizedtesting.rules.StatementAdapter.evaluate(StatementAdapter.java:36)
	at com.carrotsearch.randomizedtesting.ThreadLeakControl$StatementRunner.run(ThreadLeakControl.java:358)
	at java.lang.Thread.run(Thread.java:662)


FAILED:  org.apache.solr.cloud.BasicDistributedZk2Test.testDistribSearch

Error Message:
There are still nodes recoverying - waited for 180 seconds

Stack Trace:
java.lang.AssertionError: There are still nodes recoverying - waited for 180 seconds
	at __randomizedtesting.SeedInfo.seed([848089F871F9F43A:56607E006A69406]:0)
	at org.junit.Assert.fail(Assert.java:93)
	at org.apache.solr.cloud.AbstractDistribZkTestBase.waitForRecoveriesToFinish(AbstractDistribZkTestBase.java:165)
	at org.apache.solr.cloud.AbstractDistribZkTestBase.waitForRecoveriesToFinish(AbstractDistribZkTestBase.java:115)
	at org.apache.solr.cloud.AbstractDistribZkTestBase.waitForRecoveriesToFinish(AbstractDistribZkTestBase.java:110)
	at org.apache.solr.cloud.AbstractFullDistribZkTestBase.waitForRecoveriesToFinish(AbstractFullDistribZkTestBase.java:563)
	at org.apache.solr.cloud.BasicDistributedZk2Test.brindDownShardIndexSomeDocsAndRecover(BasicDistributedZk2Test.java:321)
	at org.apache.solr.cloud.BasicDistributedZk2Test.doTest(BasicDistributedZk2Test.java:83)
	at org.apache.solr.BaseDistributedSearchTestCase.testDistribSearch(BaseDistributedSearchTestCase.java:697)
	at sun.reflect.NativeMethodAccessorImpl.invoke0(Native Method)
	at sun.reflect.NativeMethodAccessorImpl.invoke(NativeMethodAccessorImpl.java:39)
	at sun.reflect.DelegatingMethodAccessorImpl.invoke(DelegatingMethodAccessorImpl.java:25)
	at java.lang.reflect.Method.invoke(Method.java:597)
	at com.carrotsearch.randomizedtesting.RandomizedRunner.invoke(RandomizedRunner.java:1559)
	at com.carrotsearch.randomizedtesting.RandomizedRunner.access$600(RandomizedRunner.java:79)
	at com.carrotsearch.randomizedtesting.RandomizedRunner$6.evaluate(RandomizedRunner.java:737)
	at com.carrotsearch.randomizedtesting.RandomizedRunner$7.evaluate(RandomizedRunner.java:773)
	at com.carrotsearch.randomizedtesting.RandomizedRunner$8.evaluate(RandomizedRunner.java:787)
	at com.carrotsearch.randomizedtesting.rules.SystemPropertiesRestoreRule$1.evaluate(SystemPropertiesRestoreRule.java:53)
	at org.apache.lucene.util.TestRuleSetupTeardownChained$1.evaluate(TestRuleSetupTeardownChained.java:50)
	at org.apache.lucene.util.TestRuleFieldCacheSanity$1.evaluate(TestRuleFieldCacheSanity.java:51)
	at org.apache.lucene.util.AbstractBeforeAfterRule$1.evaluate(AbstractBeforeAfterRule.java:46)
	at com.carrotsearch.randomizedtesting.rules.SystemPropertiesInvariantRule$1.evaluate(SystemPropertiesInvariantRule.java:55)
	at org.apache.lucene.util.TestRuleThreadAndTestName$1.evaluate(TestRuleThreadAndTestName.java:49)
	at org.apache.lucene.util.TestRuleIgnoreAfterMaxFailures$1.evaluate(TestRuleIgnoreAfterMaxFailures.java:70)
	at org.apache.lucene.util.TestRuleMarkFailure$1.evaluate(TestRuleMarkFailure.java:48)
	at com.carrotsearch.randomizedtesting.rules.StatementAdapter.evaluate(StatementAdapter.java:36)
	at com.carrotsearch.randomizedtesting.ThreadLeakControl$StatementRunner.run(ThreadLeakControl.java:358)
	at com.carrotsearch.randomizedtesting.ThreadLeakControl.forkTimeoutingTask(ThreadLeakControl.java:782)
	at com.carrotsearch.randomizedtesting.ThreadLeakControl$3.evaluate(ThreadLeakControl.java:442)
	at com.carrotsearch.randomizedtesting.RandomizedRunner.runSingleTest(RandomizedRunner.java:746)
	at com.carrotsearch.randomizedtesting.RandomizedRunner$3.evaluate(RandomizedRunner.java:648)
	at com.carrotsearch.randomizedtesting.RandomizedRunner$4.evaluate(RandomizedRunner.java:682)
	at com.carrotsearch.randomizedtesting.RandomizedRunner$5.evaluate(RandomizedRunner.java:693)
	at com.carrotsearch.randomizedtesting.rules.StatementAdapter.evaluate(StatementAdapter.java:36)
	at com.carrotsearch.randomizedtesting.rules.SystemPropertiesRestoreRule$1.evaluate(SystemPropertiesRestoreRule.java:53)
	at org.apache.lucene.util.AbstractBeforeAfterRule$1.evaluate(AbstractBeforeAfterRule.java:46)
	at org.apache.lucene.util.TestRuleStoreClassName$1.evaluate(TestRuleStoreClassName.java:42)
	at com.carrotsearch.randomizedtesting.rules.SystemPropertiesInvariantRule$1.evaluate(SystemPropertiesInvariantRule.java:55)
	at com.carrotsearch.randomizedtesting.rules.NoShadowingOrOverridesOnMethodsRule$1.evaluate(NoShadowingOrOverridesOnMethodsRule.java:39)
	at com.carrotsearch.randomizedtesting.rules.NoShadowingOrOverridesOnMethodsRule$1.evaluate(NoShadowingOrOverridesOnMethodsRule.java:39)
	at com.carrotsearch.randomizedtesting.rules.StatementAdapter.evaluate(StatementAdapter.java:36)
	at org.apache.lucene.util.TestRuleAssertionsRequired$1.evaluate(TestRuleAssertionsRequired.java:43)
	at org.apache.lucene.util.TestRuleMarkFailure$1.evaluate(TestRuleMarkFailure.java:48)
	at org.apache.lucene.util.TestRuleIgnoreAfterMaxFailures$1.evaluate(TestRuleIgnoreAfterMaxFailures.java:70)
	at org.apache.lucene.util.TestRuleIgnoreTestSuites$1.evaluate(TestRuleIgnoreTestSuites.java:55)
	at com.carrotsearch.randomizedtesting.rules.StatementAdapter.evaluate(StatementAdapter.java:36)
	at com.carrotsearch.randomizedtesting.ThreadLeakControl$StatementRunner.run(ThreadLeakControl.java:358)
	at java.lang.Thread.run(Thread.java:662)


FAILED:  org.apache.solr.cloud.BasicDistributedZkTest.testDistribSearch

Error Message:
Server at http://127.0.0.1:51149/solr returned non ok status:500, message:Server Error

Stack Trace:
org.apache.solr.common.SolrException: Server at http://127.0.0.1:51149/solr returned non ok status:500, message:Server Error
	at __randomizedtesting.SeedInfo.seed([848089F871F9F43A:56607E006A69406]:0)
	at org.apache.solr.client.solrj.impl.HttpSolrServer.request(HttpSolrServer.java:372)
	at org.apache.solr.client.solrj.impl.HttpSolrServer.request(HttpSolrServer.java:181)
	at org.apache.solr.client.solrj.request.CoreAdminRequest.process(CoreAdminRequest.java:429)
	at org.apache.solr.client.solrj.request.CoreAdminRequest.getStatus(CoreAdminRequest.java:472)
	at org.apache.solr.cloud.BasicDistributedZkTest.collectStartTimes(BasicDistributedZkTest.java:959)
	at org.apache.solr.cloud.BasicDistributedZkTest.testCollectionsAPI(BasicDistributedZkTest.java:795)
	at org.apache.solr.cloud.BasicDistributedZkTest.doTest(BasicDistributedZkTest.java:343)
	at org.apache.solr.BaseDistributedSearchTestCase.testDistribSearch(BaseDistributedSearchTestCase.java:697)
	at sun.reflect.NativeMethodAccessorImpl.invoke0(Native Method)
	at sun.reflect.NativeMethodAccessorImpl.invoke(NativeMethodAccessorImpl.java:39)
	at sun.reflect.DelegatingMethodAccessorImpl.invoke(DelegatingMethodAccessorImpl.java:25)
	at java.lang.reflect.Method.invoke(Method.java:597)
	at com.carrotsearch.randomizedtesting.RandomizedRunner.invoke(RandomizedRunner.java:1559)
	at com.carrotsearch.randomizedtesting.RandomizedRunner.access$600(RandomizedRunner.java:79)
	at com.carrotsearch.randomizedtesting.RandomizedRunner$6.evaluate(RandomizedRunner.java:737)
	at com.carrotsearch.randomizedtesting.RandomizedRunner$7.evaluate(RandomizedRunner.java:773)
	at com.carrotsearch.randomizedtesting.RandomizedRunner$8.evaluate(RandomizedRunner.java:787)
	at com.carrotsearch.randomizedtesting.rules.SystemPropertiesRestoreRule$1.evaluate(SystemPropertiesRestoreRule.java:53)
	at org.apache.lucene.util.TestRuleSetupTeardownChained$1.evaluate(TestRuleSetupTeardownChained.java:50)
	at org.apache.lucene.util.TestRuleFieldCacheSanity$1.evaluate(TestRuleFieldCacheSanity.java:51)
	at org.apache.lucene.util.AbstractBeforeAfterRule$1.evaluate(AbstractBeforeAfterRule.java:46)
	at com.carrotsearch.randomizedtesting.rules.SystemPropertiesInvariantRule$1.evaluate(SystemPropertiesInvariantRule.java:55)
	at org.apache.lucene.util.TestRuleThreadAndTestName$1.evaluate(TestRuleThreadAndTestName.java:49)
	at org.apache.lucene.util.TestRuleIgnoreAfterMaxFailures$1.evaluate(TestRuleIgnoreAfterMaxFailures.java:70)
	at org.apache.lucene.util.TestRuleMarkFailure$1.evaluate(TestRuleMarkFailure.java:48)
	at com.carrotsearch.randomizedtesting.rules.StatementAdapter.evaluate(StatementAdapter.java:36)
	at com.carrotsearch.randomizedtesting.ThreadLeakControl$StatementRunner.run(ThreadLeakControl.java:358)
	at com.carrotsearch.randomizedtesting.ThreadLeakControl.forkTimeoutingTask(ThreadLeakControl.java:782)
	at com.carrotsearch.randomizedtesting.ThreadLeakControl$3.evaluate(ThreadLeakControl.java:442)
	at com.carrotsearch.randomizedtesting.RandomizedRunner.runSingleTest(RandomizedRunner.java:746)
	at com.carrotsearch.randomizedtesting.RandomizedRunner$3.evaluate(RandomizedRunner.java:648)
	at com.carrotsearch.randomizedtesting.RandomizedRunner$4.evaluate(RandomizedRunner.java:682)
	at com.carrotsearch.randomizedtesting.RandomizedRunner$5.evaluate(RandomizedRunner.java:693)
	at com.carrotsearch.randomizedtesting.rules.StatementAdapter.evaluate(StatementAdapter.java:36)
	at com.carrotsearch.randomizedtesting.rules.SystemPropertiesRestoreRule$1.evaluate(SystemPropertiesRestoreRule.java:53)
	at org.apache.lucene.util.AbstractBeforeAfterRule$1.evaluate(AbstractBeforeAfterRule.java:46)
	at org.apache.lucene.util.TestRuleStoreClassName$1.evaluate(TestRuleStoreClassName.java:42)
	at com.carrotsearch.randomizedtesting.rules.SystemPropertiesInvariantRule$1.evaluate(SystemPropertiesInvariantRule.java:55)
	at com.carrotsearch.randomizedtesting.rules.NoShadowingOrOverridesOnMethodsRule$1.evaluate(NoShadowingOrOverridesOnMethodsRule.java:39)
	at com.carrotsearch.randomizedtesting.rules.NoShadowingOrOverridesOnMethodsRule$1.evaluate(NoShadowingOrOverridesOnMethodsRule.java:39)
	at com.carrotsearch.randomizedtesting.rules.StatementAdapter.evaluate(StatementAdapter.java:36)
	at org.apache.lucene.util.TestRuleAssertionsRequired$1.evaluate(TestRuleAssertionsRequired.java:43)
	at org.apache.lucene.util.TestRuleMarkFailure$1.evaluate(TestRuleMarkFailure.java:48)
	at org.apache.lucene.util.TestRuleIgnoreAfterMaxFailures$1.evaluate(TestRuleIgnoreAfterMaxFailures.java:70)
	at org.apache.lucene.util.TestRuleIgnoreTestSuites$1.evaluate(TestRuleIgnoreTestSuites.java:55)
	at com.carrotsearch.randomizedtesting.rules.StatementAdapter.evaluate(StatementAdapter.java:36)
	at com.carrotsearch.randomizedtesting.ThreadLeakControl$StatementRunner.run(ThreadLeakControl.java:358)
	at java.lang.Thread.run(Thread.java:662)




Build Log:
[...truncated 7965 lines...]
[junit4:junit4] Suite: org.apache.solr.cloud.BasicDistributedZk2Test
[junit4:junit4]   2> 3 T791 oas.SolrTestCaseJ4.setUp ###Starting testDistribSearch
[junit4:junit4]   2> Creating dataDir: C:\Users\JenkinsSlave\workspace\Lucene-Solr-4.x-Windows\solr\build\solr-core\test\J0\.\solrtest-BasicDistributedZk2Test-1355336156648
[junit4:junit4]   2> 8 T791 oasc.ZkTestServer.run STARTING ZK TEST SERVER
[junit4:junit4]   2> 9 T792 oasc.ZkTestServer$ZKServerMain.runFromConfig Starting server
[junit4:junit4]   2> 14 T792 oazs.ZooKeeperServer.setTickTime tickTime set to 1000
[junit4:junit4]   2> 14 T792 oazs.ZooKeeperServer.setMinSessionTimeout minSessionTimeout set to -1
[junit4:junit4]   2> 14 T792 oazs.ZooKeeperServer.setMaxSessionTimeout maxSessionTimeout set to -1
[junit4:junit4]   2> 15 T792 oazs.NIOServerCnxnFactory.configure binding to port 0.0.0.0/0.0.0.0:0
[junit4:junit4]   2> 17 T792 oazsp.FileTxnSnapLog.save Snapshotting: 0x0 to C:\Users\JenkinsSlave\workspace\Lucene-Solr-4.x-Windows\solr\build\solr-core\test\J0\.\org.apache.solr.cloud.BasicDistributedZk2Test-1355336156645\zookeeper\server1\data\version-2\snapshot.0
[junit4:junit4]   2> 110 T791 oasc.ZkTestServer.run start zk server on port:50794
[junit4:junit4]   2> 110 T791 oaz.ZooKeeper.<init> Initiating client connection, connectString=127.0.0.1:50794 sessionTimeout=10000 watcher=org.apache.solr.common.cloud.ConnectionManager@14e607a
[junit4:junit4]   2> 111 T791 oascc.ConnectionManager.waitForConnected Waiting for client to connect to ZooKeeper
[junit4:junit4]   2> 112 T797 oaz.ClientCnxn$SendThread.logStartConnect Opening socket connection to server 127.0.0.1/127.0.0.1:50794. Will not attempt to authenticate using SASL (access denied (javax.security.auth.AuthPermission getLoginConfiguration))
[junit4:junit4]   2> 112 T797 oaz.ClientCnxn$SendThread.primeConnection Socket connection established to 127.0.0.1/127.0.0.1:50794, initiating session
[junit4:junit4]   2> 112 T793 oazs.NIOServerCnxnFactory.run Accepted socket connection from /127.0.0.1:50797
[junit4:junit4]   2> 113 T793 oazs.ZooKeeperServer.processConnectRequest Client attempting to establish new session at /127.0.0.1:50797
[junit4:junit4]   2> 113 T795 oazsp.FileTxnLog.append Creating new log file: log.1
[junit4:junit4]   2> 122 T795 oazs.ZooKeeperServer.finishSessionInit Established session 0x13b905485f40000 with negotiated timeout 10000 for client /127.0.0.1:50797
[junit4:junit4]   2> 124 T797 oaz.ClientCnxn$SendThread.onConnected Session establishment complete on server 127.0.0.1/127.0.0.1:50794, sessionid = 0x13b905485f40000, negotiated timeout = 10000
[junit4:junit4]   2> 125 T798 oascc.ConnectionManager.process Watcher org.apache.solr.common.cloud.ConnectionManager@14e607a name:ZooKeeperConnection Watcher:127.0.0.1:50794 got event WatchedEvent state:SyncConnected type:None path:null path:null type:None
[junit4:junit4]   2> 125 T791 oascc.ConnectionManager.waitForConnected Client is connected to ZooKeeper
[junit4:junit4]   2> 126 T791 oascc.SolrZkClient.makePath makePath: /solr
[junit4:junit4]   2> 141 T796 oazs.PrepRequestProcessor.pRequest2Txn Processed session termination for sessionid: 0x13b905485f40000
[junit4:junit4]   2> 143 T791 oaz.ZooKeeper.close Session: 0x13b905485f40000 closed
[junit4:junit4]   2> 143 T793 oazs.NIOServerCnxn.doIO WARNING caught end of stream exception EndOfStreamException: Unable to read additional data from client sessionid 0x13b905485f40000, likely client has closed socket
[junit4:junit4]   2> 	at org.apache.zookeeper.server.NIOServerCnxn.doIO(NIOServerCnxn.java:220)
[junit4:junit4]   2> 	at org.apache.zookeeper.server.NIOServerCnxnFactory.run(NIOServerCnxnFactory.java:208)
[junit4:junit4]   2> 	at java.lang.Thread.run(Thread.java:662)
[junit4:junit4]   2> 
[junit4:junit4]   2> 144 T798 oaz.ClientCnxn$EventThread.run EventThread shut down
[junit4:junit4]   2> 146 T793 oazs.NIOServerCnxn.closeSock Closed socket connection for client /127.0.0.1:50797 which had sessionid 0x13b905485f40000
[junit4:junit4]   2> 143 T791 oaz.ZooKeeper.<init> Initiating client connection, connectString=127.0.0.1:50794/solr sessionTimeout=10000 watcher=org.apache.solr.common.cloud.ConnectionManager@469ca0
[junit4:junit4]   2> 147 T791 oascc.ConnectionManager.waitForConnected Waiting for client to connect to ZooKeeper
[junit4:junit4]   2> 148 T799 oaz.ClientCnxn$SendThread.logStartConnect Opening socket connection to server 127.0.0.1/127.0.0.1:50794. Will not attempt to authenticate using SASL (access denied (javax.security.auth.AuthPermission getLoginConfiguration))
[junit4:junit4]   2> 148 T799 oaz.ClientCnxn$SendThread.primeConnection Socket connection established to 127.0.0.1/127.0.0.1:50794, initiating session
[junit4:junit4]   2> 149 T793 oazs.NIOServerCnxnFactory.run Accepted socket connection from /127.0.0.1:50800
[junit4:junit4]   2> 149 T793 oazs.ZooKeeperServer.processConnectRequest Client attempting to establish new session at /127.0.0.1:50800
[junit4:junit4]   2> 151 T795 oazs.ZooKeeperServer.finishSessionInit Established session 0x13b905485f40001 with negotiated timeout 10000 for client /127.0.0.1:50800
[junit4:junit4]   2> 151 T799 oaz.ClientCnxn$SendThread.onConnected Session establishment complete on server 127.0.0.1/127.0.0.1:50794, sessionid = 0x13b905485f40001, negotiated timeout = 10000
[junit4:junit4]   2> 151 T800 oascc.ConnectionManager.process Watcher org.apache.solr.common.cloud.ConnectionManager@469ca0 name:ZooKeeperConnection Watcher:127.0.0.1:50794/solr got event WatchedEvent state:SyncConnected type:None path:null path:null type:None
[junit4:junit4]   2> 151 T791 oascc.ConnectionManager.waitForConnected Client is connected to ZooKeeper
[junit4:junit4]   2> 151 T791 oascc.SolrZkClient.makePath makePath: /collections/collection1
[junit4:junit4]   2> 158 T791 oascc.SolrZkClient.makePath makePath: /collections/collection1/shards
[junit4:junit4]   2> 163 T791 oascc.SolrZkClient.makePath makePath: /collections/control_collection
[junit4:junit4]   2> 166 T791 oascc.SolrZkClient.makePath makePath: /collections/control_collection/shards
[junit4:junit4]   2> 172 T791 oasc.AbstractZkTestCase.putConfig put C:\Users\JenkinsSlave\workspace\Lucene-Solr-4.x-Windows\solr\build\solr-core\test-files\solr\collection1\conf\solrconfig.xml to /configs/conf1/solrconfig.xml
[junit4:junit4]   2> 172 T791 oascc.SolrZkClient.makePath makePath: /configs/conf1/solrconfig.xml
[junit4:junit4]   2> 181 T791 oasc.AbstractZkTestCase.putConfig put C:\Users\JenkinsSlave\workspace\Lucene-Solr-4.x-Windows\solr\build\solr-core\test-files\solr\collection1\conf\schema.xml to /configs/conf1/schema.xml
[junit4:junit4]   2> 182 T791 oascc.SolrZkClient.makePath makePath: /configs/conf1/schema.xml
[junit4:junit4]   2> 192 T791 oasc.AbstractZkTestCase.putConfig put C:\Users\JenkinsSlave\workspace\Lucene-Solr-4.x-Windows\solr\build\solr-core\test-files\solr\collection1\conf\solrconfig.xml to /configs/conf1/solrconfig.xml
[junit4:junit4]   2> 193 T791 oascc.SolrZkClient.makePath makePath: /configs/conf1/solrconfig.xml
[junit4:junit4]   2> 199 T791 oasc.AbstractZkTestCase.putConfig put C:\Users\JenkinsSlave\workspace\Lucene-Solr-4.x-Windows\solr\build\solr-core\test-files\solr\collection1\conf\stopwords.txt to /configs/conf1/stopwords.txt
[junit4:junit4]   2> 200 T791 oascc.SolrZkClient.makePath makePath: /configs/conf1/stopwords.txt
[junit4:junit4]   2> 206 T791 oasc.AbstractZkTestCase.putConfig put C:\Users\JenkinsSlave\workspace\Lucene-Solr-4.x-Windows\solr\build\solr-core\test-files\solr\collection1\conf\protwords.txt to /configs/conf1/protwords.txt
[junit4:junit4]   2> 207 T791 oascc.SolrZkClient.makePath makePath: /configs/conf1/protwords.txt
[junit4:junit4]   2> 213 T791 oasc.AbstractZkTestCase.putConfig put C:\Users\JenkinsSlave\workspace\Lucene-Solr-4.x-Windows\solr\build\solr-core\test-files\solr\collection1\conf\currency.xml to /configs/conf1/currency.xml
[junit4:junit4]   2> 214 T791 oascc.SolrZkClient.makePath makePath: /configs/conf1/currency.xml
[junit4:junit4]   2> 221 T791 oasc.AbstractZkTestCase.putConfig put C:\Users\JenkinsSlave\workspace\Lucene-Solr-4.x-Windows\solr\build\solr-core\test-files\solr\collection1\conf\open-exchange-rates.json to /configs/conf1/open-exchange-rates.json
[junit4:junit4]   2> 222 T791 oascc.SolrZkClient.makePath makePath: /configs/conf1/open-exchange-rates.json
[junit4:junit4]   2> 230 T791 oasc.AbstractZkTestCase.putConfig put C:\Users\JenkinsSlave\workspace\Lucene-Solr-4.x-Windows\solr\build\solr-core\test-files\solr\collection1\conf\mapping-ISOLatin1Accent.txt to /configs/conf1/mapping-ISOLatin1Accent.txt
[junit4:junit4]   2> 231 T791 oascc.SolrZkClient.makePath makePath: /configs/conf1/mapping-ISOLatin1Accent.txt
[junit4:junit4]   2> 239 T791 oasc.AbstractZkTestCase.putConfig put C:\Users\JenkinsSlave\workspace\Lucene-Solr-4.x-Windows\solr\build\solr-core\test-files\solr\collection1\conf\old_synonyms.txt to /configs/conf1/old_synonyms.txt
[junit4:junit4]   2> 241 T791 oascc.SolrZkClient.makePath makePath: /configs/conf1/old_synonyms.txt
[junit4:junit4]   2> 251 T791 oasc.AbstractZkTestCase.putConfig put C:\Users\JenkinsSlave\workspace\Lucene-Solr-4.x-Windows\solr\build\solr-core\test-files\solr\collection1\conf\synonyms.txt to /configs/conf1/synonyms.txt
[junit4:junit4]   2> 252 T791 oascc.SolrZkClient.makePath makePath: /configs/conf1/synonyms.txt
[junit4:junit4]   2> 263 T796 oazs.PrepRequestProcessor.pRequest2Txn Processed session termination for sessionid: 0x13b905485f40001
[junit4:junit4]   2> 266 T800 oaz.ClientCnxn$EventThread.run EventThread shut down
[junit4:junit4]   2> 266 T793 oazs.NIOServerCnxn.doIO WARNING caught end of stream exception EndOfStreamException: Unable to read additional data from client sessionid 0x13b905485f40001, likely client has closed socket
[junit4:junit4]   2> 	at org.apache.zookeeper.server.NIOServerCnxn.doIO(NIOServerCnxn.java:220)
[junit4:junit4]   2> 	at org.apache.zookeeper.server.NIOServerCnxnFactory.run(NIOServerCnxnFactory.java:208)
[junit4:junit4]   2> 	at java.lang.Thread.run(Thread.java:662)
[junit4:junit4]   2> 
[junit4:junit4]   2> 266 T791 oaz.ZooKeeper.close Session: 0x13b905485f40001 closed
[junit4:junit4]   2> 267 T793 oazs.NIOServerCnxn.closeSock Closed socket connection for client /127.0.0.1:50800 which had sessionid 0x13b905485f40001
[junit4:junit4]   2> 644 T791 oejs.Server.doStart jetty-8.1.8.v20121106
[junit4:junit4]   2> 650 T791 oejs.AbstractConnector.doStart Started SelectChannelConnector@0.0.0.0:50801
[junit4:junit4]   2> 650 T791 oasc.SolrResourceLoader.locateSolrHome JNDI not configured for solr (NoInitialContextEx)
[junit4:junit4]   2> 651 T791 oasc.SolrResourceLoader.locateSolrHome using system property solr.solr.home: C:\Users\JenkinsSlave\workspace\Lucene-Solr-4.x-Windows\solr\build\solr-core\test\J0\.\org.apache.solr.cloud.BasicDistributedZk2Test-controljetty-1355336156911
[junit4:junit4]   2> 651 T791 oasc.SolrResourceLoader.<init> new SolrResourceLoader for deduced Solr Home: 'C:\Users\JenkinsSlave\workspace\Lucene-Solr-4.x-Windows\solr\build\solr-core\test\J0\.\org.apache.solr.cloud.BasicDistributedZk2Test-controljetty-1355336156911\'
[junit4:junit4]   2> 684 T791 oass.SolrDispatchFilter.init SolrDispatchFilter.init()
[junit4:junit4]   2> 684 T791 oasc.SolrResourceLoader.locateSolrHome JNDI not configured for solr (NoInitialContextEx)
[junit4:junit4]   2> 685 T791 oasc.SolrResourceLoader.locateSolrHome using system property solr.solr.home: C:\Users\JenkinsSlave\workspace\Lucene-Solr-4.x-Windows\solr\build\solr-core\test\J0\.\org.apache.solr.cloud.BasicDistributedZk2Test-controljetty-1355336156911
[junit4:junit4]   2> 686 T791 oasc.CoreContainer$Initializer.initialize looking for solr.xml: C:\Users\JenkinsSlave\workspace\Lucene-Solr-4.x-Windows\solr\build\solr-core\test\J0\.\org.apache.solr.cloud.BasicDistributedZk2Test-controljetty-1355336156911\solr.xml
[junit4:junit4]   2> 686 T791 oasc.CoreContainer.<init> New CoreContainer 29503151
[junit4:junit4]   2> 687 T791 oasc.CoreContainer.load Loading CoreContainer using Solr Home: 'C:\Users\JenkinsSlave\workspace\Lucene-Solr-4.x-Windows\solr\build\solr-core\test\J0\.\org.apache.solr.cloud.BasicDistributedZk2Test-controljetty-1355336156911\'
[junit4:junit4]   2> 687 T791 oasc.SolrResourceLoader.<init> new SolrResourceLoader for directory: 'C:\Users\JenkinsSlave\workspace\Lucene-Solr-4.x-Windows\solr\build\solr-core\test\J0\.\org.apache.solr.cloud.BasicDistributedZk2Test-controljetty-1355336156911\'
[junit4:junit4]   2> 709 T791 oasc.CoreContainer.load Registering Log Listener
[junit4:junit4]   2> 735 T791 oasc.CoreContainer.initZooKeeper Zookeeper client=127.0.0.1:50794/solr
[junit4:junit4]   2> 736 T791 oasc.ZkController.checkChrootPath zkHost includes chroot
[junit4:junit4]   2> 736 T791 oaz.ZooKeeper.<init> Initiating client connection, connectString=127.0.0.1:50794 sessionTimeout=60000 watcher=org.apache.solr.common.cloud.ConnectionManager@1923a8f
[junit4:junit4]   2> 737 T791 oascc.ConnectionManager.waitForConnected Waiting for client to connect to ZooKeeper
[junit4:junit4]   2> 738 T810 oaz.ClientCnxn$SendThread.logStartConnect Opening socket connection to server 127.0.0.1/127.0.0.1:50794. Will not attempt to authenticate using SASL (access denied (javax.security.auth.AuthPermission getLoginConfiguration))
[junit4:junit4]   2> 738 T810 oaz.ClientCnxn$SendThread.primeConnection Socket connection established to 127.0.0.1/127.0.0.1:50794, initiating session
[junit4:junit4]   2> 739 T793 oazs.NIOServerCnxnFactory.run Accepted socket connection from /127.0.0.1:50806
[junit4:junit4]   2> 739 T793 oazs.ZooKeeperServer.processConnectRequest Client attempting to establish new session at /127.0.0.1:50806
[junit4:junit4]   2> 749 T795 oazs.ZooKeeperServer.finishSessionInit Established session 0x13b905485f40002 with negotiated timeout 20000 for client /127.0.0.1:50806
[junit4:junit4]   2> 749 T810 oaz.ClientCnxn$SendThread.onConnected Session establishment complete on server 127.0.0.1/127.0.0.1:50794, sessionid = 0x13b905485f40002, negotiated timeout = 20000
[junit4:junit4]   2> 749 T811 oascc.ConnectionManager.process Watcher org.apache.solr.common.cloud.ConnectionManager@1923a8f name:ZooKeeperConnection Watcher:127.0.0.1:50794 got event WatchedEvent state:SyncConnected type:None path:null path:null type:None
[junit4:junit4]   2> 750 T791 oascc.ConnectionManager.waitForConnected Client is connected to ZooKeeper
[junit4:junit4]   2> 752 T796 oazs.PrepRequestProcessor.pRequest2Txn Processed session termination for sessionid: 0x13b905485f40002
[junit4:junit4]   2> 754 T793 oazs.NIOServerCnxn.closeSock Closed socket connection for client /127.0.0.1:50806 which had sessionid 0x13b905485f40002
[junit4:junit4]   2> 754 T811 oaz.ClientCnxn$EventThread.run EventThread shut down
[junit4:junit4]   2> 754 T791 oaz.ZooKeeper.close Session: 0x13b905485f40002 closed
[junit4:junit4]   2> 755 T791 oaz.ZooKeeper.<init> Initiating client connection, connectString=127.0.0.1:50794/solr sessionTimeout=8000 watcher=org.apache.solr.common.cloud.ConnectionManager@3696d0
[junit4:junit4]   2> 757 T791 oascc.ConnectionManager.waitForConnected Waiting for client to connect to ZooKeeper
[junit4:junit4]   2> 758 T812 oaz.ClientCnxn$SendThread.logStartConnect Opening socket connection to server 127.0.0.1/127.0.0.1:50794. Will not attempt to authenticate using SASL (access denied (javax.security.auth.AuthPermission getLoginConfiguration))
[junit4:junit4]   2> 758 T812 oaz.ClientCnxn$SendThread.primeConnection Socket connection established to 127.0.0.1/127.0.0.1:50794, initiating session
[junit4:junit4]   2> 759 T793 oazs.NIOServerCnxnFactory.run Accepted socket connection from /127.0.0.1:50809
[junit4:junit4]   2> 759 T793 oazs.ZooKeeperServer.processConnectRequest Client attempting to establish new session at /127.0.0.1:50809
[junit4:junit4]   2> 761 T795 oazs.ZooKeeperServer.finishSessionInit Established session 0x13b905485f40003 with negotiated timeout 8000 for client /127.0.0.1:50809
[junit4:junit4]   2> 761 T812 oaz.ClientCnxn$SendThread.onConnected Session establishment complete on server 127.0.0.1/127.0.0.1:50794, sessionid = 0x13b905485f40003, negotiated timeout = 8000
[junit4:junit4]   2> 761 T813 oascc.ConnectionManager.process Watcher org.apache.solr.common.cloud.ConnectionManager@3696d0 name:ZooKeeperConnection Watcher:127.0.0.1:50794/solr got event WatchedEvent state:SyncConnected type:None path:null path:null type:None
[junit4:junit4]   2> 761 T791 oascc.ConnectionManager.waitForConnected Client is connected to ZooKeeper
[junit4:junit4]   2> 764 T796 oazs.PrepRequestProcessor.pRequest Got user-level KeeperException when processing sessionid:0x13b905485f40003 type:create cxid:0x2 zxid:0x1b txntype:-1 reqpath:n/a Error Path:/solr/overseer Error:KeeperErrorCode = NodeExists for /solr/overseer
[junit4:junit4]   2> 766 T791 oascc.SolrZkClient.makePath makePath: /live_nodes
[junit4:junit4]   2> 770 T791 oasc.ZkController.createEphemeralLiveNode Register node as live in ZooKeeper:/live_nodes/127.0.0.1:50801_solr
[junit4:junit4]   2> 771 T796 oazs.PrepRequestProcessor.pRequest Got user-level KeeperException when processing sessionid:0x13b905485f40003 type:delete cxid:0x7 zxid:0x1d txntype:-1 reqpath:n/a Error Path:/solr/live_nodes/127.0.0.1:50801_solr Error:KeeperErrorCode = NoNode for /solr/live_nodes/127.0.0.1:50801_solr
[junit4:junit4]   2> 772 T791 oascc.SolrZkClient.makePath makePath: /live_nodes/127.0.0.1:50801_solr
[junit4:junit4]   2> 777 T791 oashc.HttpShardHandlerFactory.getParameter Setting socketTimeout to: 0
[junit4:junit4]   2> 777 T791 oashc.HttpShardHandlerFactory.getParameter Setting urlScheme to: http://
[junit4:junit4]   2> 777 T791 oashc.HttpShardHandlerFactory.getParameter Setting connTimeout to: 0
[junit4:junit4]   2> 777 T791 oashc.HttpShardHandlerFactory.getParameter Setting maxConnectionsPerHost to: 20
[junit4:junit4]   2> 778 T791 oashc.HttpShardHandlerFactory.getParameter Setting corePoolSize to: 0
[junit4:junit4]   2> 778 T791 oashc.HttpShardHandlerFactory.getParameter Setting maximumPoolSize to: 2147483647
[junit4:junit4]   2> 779 T791 oashc.HttpShardHandlerFactory.getParameter Setting maxThreadIdleTime to: 5
[junit4:junit4]   2> 779 T791 oashc.HttpShardHandlerFactory.getParameter Setting sizeOfQueue to: -1
[junit4:junit4]   2> 779 T791 oashc.HttpShardHandlerFactory.getParameter Setting fairnessPolicy to: false
[junit4:junit4]   2> 780 T791 oascsi.HttpClientUtil.createClient Creating new http client, config:maxConnectionsPerHost=20&maxConnections=10000&socketTimeout=0&connTimeout=0&retry=false
[junit4:junit4]   2> 791 T791 oascc.SolrZkClient.makePath makePath: /overseer_elect/election
[junit4:junit4]   2> 800 T796 oazs.PrepRequestProcessor.pRequest Got user-level KeeperException when processing sessionid:0x13b905485f40003 type:delete cxid:0x15 zxid:0x22 txntype:-1 reqpath:n/a Error Path:/solr/overseer_elect/leader Error:KeeperErrorCode = NoNode for /solr/overseer_elect/leader
[junit4:junit4]   2> 802 T791 oascc.SolrZkClient.makePath makePath: /overseer_elect/leader
[junit4:junit4]   2> 807 T791 oasc.Overseer.start Overseer (id=88823310362869763-127.0.0.1:50801_solr-n_0000000000) starting
[junit4:junit4]   2> 807 T796 oazs.PrepRequestProcessor.pRequest Got user-level KeeperException when processing sessionid:0x13b905485f40003 type:create cxid:0x1a zxid:0x24 txntype:-1 reqpath:n/a Error Path:/solr/overseer Error:KeeperErrorCode = NodeExists for /solr/overseer
[junit4:junit4]   2> 809 T796 oazs.PrepRequestProcessor.pRequest Got user-level KeeperException when processing sessionid:0x13b905485f40003 type:create cxid:0x1b zxid:0x25 txntype:-1 reqpath:n/a Error Path:/solr/overseer Error:KeeperErrorCode = NodeExists for /solr/overseer
[junit4:junit4]   2> 812 T796 oazs.PrepRequestProcessor.pRequest Got user-level KeeperException when processing sessionid:0x13b905485f40003 type:create cxid:0x1c zxid:0x26 txntype:-1 reqpath:n/a Error Path:/solr/overseer Error:KeeperErrorCode = NodeExists for /solr/overseer
[junit4:junit4]   2> 814 T796 oazs.PrepRequestProcessor.pRequest Got user-level KeeperException when processing sessionid:0x13b905485f40003 type:create cxid:0x1d zxid:0x27 txntype:-1 reqpath:n/a Error Path:/solr/overseer Error:KeeperErrorCode = NodeExists for /solr/overseer
[junit4:junit4]   2> 816 T815 oasc.OverseerCollectionProcessor.run Process current queue of collection messages
[junit4:junit4]   2> 818 T791 oascc.SolrZkClient.makePath makePath: /clusterstate.json
[junit4:junit4]   2> 823 T791 oascc.ZkStateReader.createClusterStateWatchersAndUpdate Updating cluster state from ZooKeeper... 
[junit4:junit4]   2> 828 T814 oasc.Overseer$ClusterStateUpdater.run Starting to work on the main queue
[junit4:junit4]   2> 834 T816 oasc.CoreContainer.create Creating SolrCore 'collection1' using instanceDir: C:\Users\JenkinsSlave\workspace\Lucene-Solr-4.x-Windows\solr\build\solr-core\test\J0\.\org.apache.solr.cloud.BasicDistributedZk2Test-controljetty-1355336156911\collection1
[junit4:junit4]   2> 834 T816 oasc.ZkController.createCollectionZkNode Check for collection zkNode:control_collection
[junit4:junit4]   2> 835 T816 oasc.ZkController.createCollectionZkNode Collection zkNode exists
[junit4:junit4]   2> 835 T816 oasc.ZkController.readConfigName Load collection config from:/collections/control_collection
[junit4:junit4]   2> 840 T816 oasc.SolrResourceLoader.<init> new SolrResourceLoader for directory: 'C:\Users\JenkinsSlave\workspace\Lucene-Solr-4.x-Windows\solr\build\solr-core\test\J0\.\org.apache.solr.cloud.BasicDistributedZk2Test-controljetty-1355336156911\collection1\'
[junit4:junit4]   2> 841 T816 oasc.SolrResourceLoader.replaceClassLoader Adding 'file:/C:/Users/JenkinsSlave/workspace/Lucene-Solr-4.x-Windows/solr/build/solr-core/test/J0/org.apache.solr.cloud.BasicDistributedZk2Test-controljetty-1355336156911/collection1/lib/classes/' to classloader
[junit4:junit4]   2> 842 T816 oasc.SolrResourceLoader.replaceClassLoader Adding 'file:/C:/Users/JenkinsSlave/workspace/Lucene-Solr-4.x-Windows/solr/build/solr-core/test/J0/org.apache.solr.cloud.BasicDistributedZk2Test-controljetty-1355336156911/collection1/lib/README' to classloader
[junit4:junit4]   2> 901 T816 oasc.SolrConfig.<init> Using Lucene MatchVersion: LUCENE_41
[junit4:junit4]   2> 986 T816 oasc.SolrConfig.<init> Loaded SolrConfig: solrconfig.xml
[junit4:junit4]   2> 987 T816 oass.IndexSchema.readSchema Reading Solr Schema
[junit4:junit4]   2> 993 T816 oass.IndexSchema.readSchema Schema name=test
[junit4:junit4]   2> 1784 T816 oass.OpenExchangeRatesOrgProvider.init Initialized with rates=open-exchange-rates.json, refreshInterval=1440.
[junit4:junit4]   2> 1802 T816 oass.IndexSchema.readSchema default search field in schema is text
[junit4:junit4]   2> 1807 T816 oass.IndexSchema.readSchema unique key field: id
[junit4:junit4]   2> 1831 T816 oass.FileExchangeRateProvider.reload Reloading exchange rates from file currency.xml
[junit4:junit4]   2> 1839 T816 oass.FileExchangeRateProvider.reload Reloading exchange rates from file currency.xml
[junit4:junit4]   2> 1845 T816 oass.OpenExchangeRatesOrgProvider.reload Reloading exchange rates from open-exchange-rates.json
[junit4:junit4]   2> 1847 T816 oass.OpenExchangeRatesOrgProvider.reload Reloading exchange rates from open-exchange-rates.json
[junit4:junit4]   2> 1849 T816 oasc.SolrCore.<init> [collection1] Opening new SolrCore at C:\Users\JenkinsSlave\workspace\Lucene-Solr-4.x-Windows\solr\build\solr-core\test\J0\.\org.apache.solr.cloud.BasicDistributedZk2Test-controljetty-1355336156911\collection1\, dataDir=.\org.apache.solr.cloud.BasicDistributedZk2Test-1355336156645/control/data\
[junit4:junit4]   2> 1849 T816 oasc.JmxMonitoredMap.<init> JMX monitoring is enabled. Adding Solr mbeans to JMX Server: com.sun.jmx.mbeanserver.JmxMBeanServer@c1a0eb
[junit4:junit4]   2> 1893 T816 oasc.SolrCore.getNewIndexDir New index directory detected: old=null new=.\org.apache.solr.cloud.BasicDistributedZk2Test-1355336156645/control/data\index/
[junit4:junit4]   2> 1894 T816 oasc.SolrCore.initIndex WARNING [collection1] Solr index directory '.\org.apache.solr.cloud.BasicDistributedZk2Test-1355336156645\control\data\index' doesn't exist. Creating new index...
[junit4:junit4]   2> 1894 T816 oasc.CachingDirectoryFactory.get return new directory for C:\Users\JenkinsSlave\workspace\Lucene-Solr-4.x-Windows\solr\build\solr-core\test\J0\.\org.apache.solr.cloud.BasicDistributedZk2Test-1355336156645\control\data\index forceNew:false
[junit4:junit4]   2> 1906 T816 oasc.SolrDeletionPolicy.onCommit SolrDeletionPolicy.onCommit: commits:num=1
[junit4:junit4]   2> 		commit{dir=RateLimitedDirectoryWrapper(org.apache.lucene.store.SimpleFSDirectory@C:\Users\JenkinsSlave\workspace\Lucene-Solr-4.x-Windows\solr\build\solr-core\test\J0\org.apache.solr.cloud.BasicDistributedZk2Test-1355336156645\control\data\index lockFactory=org.apache.lucene.store.NativeFSLockFactory@81b520),segFN=segments_1,generation=1,filenames=[segments_1]
[junit4:junit4]   2> 1906 T816 oasc.SolrDeletionPolicy.updateCommits newest commit = 1
[junit4:junit4]   2> 1908 T816 oasc.SolrCore.initWriters created xml: solr.XMLResponseWriter
[junit4:junit4]   2> 1909 T816 oasup.UpdateRequestProcessorChain.init inserting DistributedUpdateProcessorFactory into updateRequestProcessorChain "dedupe"
[junit4:junit4]   2> 1910 T816 oasup.UpdateRequestProcessorChain.init inserting DistributedUpdateProcessorFactory into updateRequestProcessorChain "dedupe-allfields"
[junit4:junit4]   2> 1910 T816 oasup.UpdateRequestProcessorChain.init inserting DistributedUpdateProcessorFactory into updateRequestProcessorChain "stored_sig"
[junit4:junit4]   2> 1910 T816 oasup.UpdateRequestProcessorChain.init inserting DistributedUpdateProcessorFactory into updateRequestProcessorChain "uniq-fields"
[junit4:junit4]   2> 1911 T816 oasup.UpdateRequestProcessorChain.init inserting DistributedUpdateProcessorFactory into updateRequestProcessorChain "distrib-dup-test-chain-implicit"
[junit4:junit4]   2> 1911 T816 oasc.RequestHandlers.initHandlersFromConfig adding lazy requestHandler: solr.ReplicationHandler
[junit4:junit4]   2> 1911 T816 oasc.RequestHandlers.initHandlersFromConfig created /replication: solr.ReplicationHandler
[junit4:junit4]   2> 1912 T816 oasc.RequestHandlers.initHandlersFromConfig created standard: solr.StandardRequestHandler
[junit4:junit4]   2> 1913 T816 oasc.RequestHandlers.initHandlersFromConfig created /get: solr.RealTimeGetHandler
[junit4:junit4]   2> 1914 T816 oasc.RequestHandlers.initHandlersFromConfig created dismax: solr.SearchHandler
[junit4:junit4]   2> 1915 T816 oasc.RequestHandlers.initHandlersFromConfig created mock: org.apache.solr.core.MockQuerySenderListenerReqHandler
[junit4:junit4]   2> 1915 T816 oasc.RequestHandlers.initHandlersFromConfig created /admin/: org.apache.solr.handler.admin.AdminHandlers
[junit4:junit4]   2> 1916 T816 oasc.RequestHandlers.initHandlersFromConfig created defaults: solr.StandardRequestHandler
[junit4:junit4]   2> 1916 T816 oasc.RequestHandlers.initHandlersFromConfig adding lazy requestHandler: solr.StandardRequestHandler
[junit4:junit4]   2> 1916 T816 oasc.RequestHandlers.initHandlersFromConfig created lazy: solr.StandardRequestHandler
[junit4:junit4]   2> 1917 T816 oasc.RequestHandlers.initHandlersFromConfig created /update: solr.UpdateRequestHandler
[junit4:junit4]   2> 1918 T816 oasc.RequestHandlers.initHandlersFromConfig created /terms: org.apache.solr.handler.component.SearchHandler
[junit4:junit4]   2> 1919 T816 oasc.RequestHandlers.initHandlersFromConfig created spellCheckCompRH: org.apache.solr.handler.component.SearchHandler
[junit4:junit4]   2> 1919 T816 oasc.RequestHandlers.initHandlersFromConfig created spellCheckCompRH_Direct: org.apache.solr.handler.component.SearchHandler
[junit4:junit4]   2> 1920 T816 oasc.RequestHandlers.initHandlersFromConfig created spellCheckWithWordbreak: org.apache.solr.handler.component.SearchHandler
[junit4:junit4]   2> 1921 T816 oasc.RequestHandlers.initHandlersFromConfig created spellCheckWithWordbreak_Direct: org.apache.solr.handler.component.SearchHandler
[junit4:junit4]   2> 1922 T816 oasc.RequestHandlers.initHandlersFromConfig created spellCheckCompRH1: org.apache.solr.handler.component.SearchHandler
[junit4:junit4]   2> 1923 T816 oasc.RequestHandlers.initHandlersFromConfig created tvrh: org.apache.solr.handler.component.SearchHandler
[junit4:junit4]   2> 1924 T816 oasc.RequestHandlers.initHandlersFromConfig created /mlt: solr.MoreLikeThisHandler
[junit4:junit4]   2> 1924 T816 oasc.RequestHandlers.initHandlersFromConfig created /debug/dump: solr.DumpRequestHandler
[junit4:junit4]   2> 1935 T816 oashl.XMLLoader.init xsltCacheLifetimeSeconds=60
[junit4:junit4]   2> 1941 T816 oasc.SolrCore.initDeprecatedSupport WARNING solrconfig.xml uses deprecated <admin/gettableFiles>, Please update your config to use the ShowFileRequestHandler.
[junit4:junit4]   2> 1943 T816 oasc.SolrCore.initDeprecatedSupport WARNING adding ShowFileRequestHandler with hidden files: [SCHEMA.XML, OLD_SYNONYMS.TXT, STOPWORDS.TXT, PROTWORDS.TXT, OPEN-EXCHANGE-RATES.JSON, SYNONYMS.TXT, CURRENCY.XML, MAPPING-ISOLATIN1ACCENT.TXT]
[junit4:junit4]   2> 1950 T816 oass.SolrIndexSearcher.<init> Opening Searcher@190c6f main
[junit4:junit4]   2> 1950 T816 oass.SolrIndexSearcher.getIndexDir WARNING WARNING: Directory impl does not support setting indexDir: org.apache.lucene.store.RateLimitedDirectoryWrapper
[junit4:junit4]   2> 1953 T816 oasu.CommitTracker.<init> Hard AutoCommit: disabled
[junit4:junit4]   2> 1954 T816 oasu.CommitTracker.<init> Soft AutoCommit: disabled
[junit4:junit4]   2> 1954 T816 oashc.SpellCheckComponent.inform Initializing spell checkers
[junit4:junit4]   2> 1968 T816 oass.DirectSolrSpellChecker.init init: {name=direct,classname=DirectSolrSpellChecker,field=lowerfilt,minQueryLength=3}
[junit4:junit4]   2> 2046 T817 oasc.SolrCore.registerSearcher [collection1] Registered new searcher Searcher@190c6f main{StandardDirectoryReader(segments_1:1)}
[junit4:junit4]   2> 2050 T816 oasc.ZkController.publish publishing core=collection1 state=down
[junit4:junit4]   2> 2050 T816 oasc.ZkController.publish numShards not found on descriptor - reading it from system property
[junit4:junit4]   2> 2056 T796 oazs.PrepRequestProcessor.pRequest Got user-level KeeperException when processing sessionid:0x13b905485f40003 type:create cxid:0x56 zxid:0x2a txntype:-1 reqpath:n/a Error Path:/solr/overseer/queue Error:KeeperErrorCode = NoNode for /solr/overseer/queue
[junit4:junit4]   2> 2063 T816 oasc.CoreContainer.register registering core: collection1
[junit4:junit4]   2> 2063 T816 oasc.ZkController.register Register shard - core:collection1 address:http://127.0.0.1:50801/solr shardId:control_shard
[junit4:junit4]   2> 2064 T816 oascc.SolrZkClient.makePath makePath: /collections/control_collection/leader_elect/control_shard/election
[junit4:junit4]   2> 2075 T796 oazs.PrepRequestProcessor.pRequest Got user-level KeeperException when processing sessionid:0x13b905485f40003 type:delete cxid:0x65 zxid:0x31 txntype:-1 reqpath:n/a Error Path:/solr/collections/control_collection/leaders Error:KeeperErrorCode = NoNode for /solr/collections/control_collection/leaders
[junit4:junit4]   2> 2077 T816 oasc.ShardLeaderElectionContext.runLeaderProcess Running the leader process.
[junit4:junit4]   2> 2077 T796 oazs.PrepRequestProcessor.pRequest Got user-level KeeperException when processing sessionid:0x13b905485f40003 type:create cxid:0x66 zxid:0x32 txntype:-1 reqpath:n/a Error Path:/solr/overseer Error:KeeperErrorCode = NodeExists for /solr/overseer
[junit4:junit4]   2> 2345 T814 oascc.ZkStateReader.updateClusterState Updating cloud state from ZooKeeper... 
[junit4:junit4]   2> 2347 T814 oasc.Overseer$ClusterStateUpdater.updateState Update state numShards=null message={
[junit4:junit4]   2> 	  "operation":"state",
[junit4:junit4]   2> 	  "numShards":null,
[junit4:junit4]   2> 	  "shard":"control_shard",
[junit4:junit4]   2> 	  "roles":null,
[junit4:junit4]   2> 	  "state":"down",
[junit4:junit4]   2> 	  "core":"collection1",
[junit4:junit4]   2> 	  "collection":"control_collection",
[junit4:junit4]   2> 	  "node_name":"127.0.0.1:50801_solr",
[junit4:junit4]   2> 	  "base_url":"http://127.0.0.1:50801/solr"}
[junit4:junit4]   2> 2349 T796 oazs.PrepRequestProcessor.pRequest Got user-level KeeperException when processing sessionid:0x13b905485f40003 type:create cxid:0x6d zxid:0x34 txntype:-1 reqpath:n/a Error Path:/solr/overseer/queue-work Error:KeeperErrorCode = NoNode for /solr/overseer/queue-work
[junit4:junit4]   2> 2383 T813 oascc.ZkStateReader$2.process A cluster state change has occurred - updating... (1)
[junit4:junit4]   2> 2582 T816 oasc.ShardLeaderElectionContext.waitForReplicasToComeUp Enough replicas found to continue.
[junit4:junit4]   2> 2582 T816 oasc.ShardLeaderElectionContext.runLeaderProcess I may be the new leader - try and sync
[junit4:junit4]   2> 2583 T816 oasc.SyncStrategy.sync Sync replicas to http://127.0.0.1:50801/solr/collection1/
[junit4:junit4]   2> 2583 T816 oasc.SyncStrategy.syncReplicas Sync Success - now sync replicas to me
[junit4:junit4]   2> 2584 T816 oasc.SyncStrategy.syncToMe http://127.0.0.1:50801/solr/collection1/ has no replicas
[junit4:junit4]   2> 2584 T816 oasc.ShardLeaderElectionContext.runLeaderProcess I am the new leader: http://127.0.0.1:50801/solr/collection1/
[junit4:junit4]   2> 2585 T816 oascc.SolrZkClient.makePath makePath: /collections/control_collection/leaders/control_shard
[junit4:junit4]   2> 2601 T796 oazs.PrepRequestProcessor.pRequest Got user-level KeeperException when processing sessionid:0x13b905485f40003 type:create cxid:0x8c zxid:0x3f txntype:-1 reqpath:n/a Error Path:/solr/overseer Error:KeeperErrorCode = NodeExists for /solr/overseer
[junit4:junit4]   2> 2903 T814 oascc.ZkStateReader.updateClusterState Updating cloud state from ZooKeeper... 
[junit4:junit4]   2> 2920 T813 oascc.ZkStateReader$2.process A cluster state change has occurred - updating... (1)
[junit4:junit4]   2> 2965 T816 oasc.ZkController.register We are http://127.0.0.1:50801/solr/collection1/ and leader is http://127.0.0.1:50801/solr/collection1/
[junit4:junit4]   2> 2965 T816 oasc.ZkController.register No LogReplay needed for core=collection1 baseURL=http://127.0.0.1:50801/solr
[junit4:junit4]   2> 2965 T816 oasc.ZkController.checkRecovery I am the leader, no recovery necessary
[junit4:junit4]   2> 2966 T816 oasc.ZkController.publish publishing core=collection1 state=active
[junit4:junit4]   2> 2966 T816 oasc.ZkController.publish numShards not found on descriptor - reading it from system property
[junit4:junit4]   2> 2972 T816 oascc.ZkStateReader.updateClusterState Updating cloud state from ZooKeeper... 
[junit4:junit4]   2> 2974 T791 oass.SolrDispatchFilter.init user.dir=C:\Users\JenkinsSlave\workspace\Lucene-Solr-4.x-Windows\solr\build\solr-core\test\J0
[junit4:junit4]   2> 2974 T791 oass.SolrDispatchFilter.init SolrDispatchFilter.init() done
[junit4:junit4]   2> 2976 T791 oascsi.HttpClientUtil.createClient Creating new http client, config:maxConnections=128&maxConnectionsPerHost=32&followRedirects=false
[junit4:junit4]   2> 3297 T791 oejs.Server.doStart jetty-8.1.8.v20121106
[junit4:junit4]   2> 3302 T791 oejs.AbstractConnector.doStart Started SelectChannelConnector@0.0.0.0:50810
[junit4:junit4]   2> 3302 T791 oasc.SolrResourceLoader.locateSolrHome JNDI not configured for solr (NoInitialContextEx)
[junit4:junit4]   2> 3303 T791 oasc.SolrResourceLoader.locateSolrHome using system property solr.solr.home: C:\Users\JenkinsSlave\workspace\Lucene-Solr-4.x-Windows\solr\build\solr-core\test\J0\.\solrtest-jetty1-1355336159639
[junit4:junit4]   2> 3303 T791 oasc.SolrResourceLoader.<init> new SolrResourceLoader for deduced Solr Home: 'C:\Users\JenkinsSlave\workspace\Lucene-Solr-4.x-Windows\solr\build\solr-core\test\J0\.\solrtest-jetty1-1355336159639\'
[junit4:junit4]   2> 3339 T791 oass.SolrDispatchFilter.init SolrDispatchFilter.init()
[junit4:junit4]   2> 3339 T791 oasc.SolrResourceLoader.locateSolrHome JNDI not configured for solr (NoInitialContextEx)
[junit4:junit4]   2> 3339 T791 oasc.SolrResourceLoader.locateSolrHome using system property solr.solr.home: C:\Users\JenkinsSlave\workspace\Lucene-Solr-4.x-Windows\solr\build\solr-core\test\J0\.\solrtest-jetty1-1355336159639
[junit4:junit4]   2> 3341 T791 oasc.CoreContainer$Initializer.initialize looking for solr.xml: C:\Users\JenkinsSlave\workspace\Lucene-Solr-4.x-Windows\solr\build\solr-core\test\J0\.\solrtest-jetty1-1355336159639\solr.xml
[junit4:junit4]   2> 3341 T791 oasc.CoreContainer.<init> New CoreContainer 12826714
[junit4:junit4]   2> 3341 T791 oasc.CoreContainer.load Loading CoreContainer using Solr Home: 'C:\Users\JenkinsSlave\workspace\Lucene-Solr-4.x-Windows\solr\build\solr-core\test\J0\.\solrtest-jetty1-1355336159639\'
[junit4:junit4]   2> 3342 T791 oasc.SolrResourceLoader.<init> new SolrResourceLoader for directory: 'C:\Users\JenkinsSlave\workspace\Lucene-Solr-4.x-Windows\solr\build\solr-core\test\J0\.\solrtest-jetty1-1355336159639\'
[junit4:junit4]   2> 3363 T791 oasc.CoreContainer.load Registering Log Listener
[junit4:junit4]   2> 3389 T791 oasc.CoreContainer.initZooKeeper Zookeeper client=127.0.0.1:50794/solr
[junit4:junit4]   2> 3390 T791 oasc.ZkController.checkChrootPath zkHost includes chroot
[junit4:junit4]   2> 3390 T791 oaz.ZooKeeper.<init> Initiating client connection, connectString=127.0.0.1:50794 sessionTimeout=60000 watcher=org.apache.solr.common.cloud.ConnectionManager@db8a9d
[junit4:junit4]   2> 3392 T791 oascc.ConnectionManager.waitForConnected Waiting for client to connect to ZooKeeper
[junit4:junit4]   2> 3392 T827 oaz.ClientCnxn$SendThread.logStartConnect Opening socket connection to server 127.0.0.1/127.0.0.1:50794. Will not attempt to authenticate using SASL (access denied (javax.security.auth.AuthPermission getLoginConfiguration))
[junit4:junit4]   2> 3393 T827 oaz.ClientCnxn$SendThread.primeConnection Socket connection established to 127.0.0.1/127.0.0.1:50794, initiating session
[junit4:junit4]   2> 3393 T793 oazs.NIOServerCnxnFactory.run Accepted socket connection from /127.0.0.1:50815
[junit4:junit4]   2> 3394 T793 oazs.ZooKeeperServer.processConnectRequest Client attempting to establish new session at /127.0.0.1:50815
[junit4:junit4]   2> 3403 T795 oazs.ZooKeeperServer.finishSessionInit Established session 0x13b905485f40004 with negotiated timeout 20000 for client /127.0.0.1:50815
[junit4:junit4]   2> 3403 T827 oaz.ClientCnxn$SendThread.onConnected Session establishment complete on server 127.0.0.1/127.0.0.1:50794, sessionid = 0x13b905485f40004, negotiated timeout = 20000
[junit4:junit4]   2> 3403 T828 oascc.ConnectionManager.process Watcher org.apache.solr.common.cloud.ConnectionManager@db8a9d name:ZooKeeperConnection Watcher:127.0.0.1:50794 got event WatchedEvent state:SyncConnected type:None path:null path:null type:None
[junit4:junit4]   2> 3403 T791 oascc.ConnectionManager.waitForConnected Client is connected to ZooKeeper
[junit4:junit4]   2> 3405 T796 oazs.PrepRequestProcessor.pRequest2Txn Processed session termination for sessionid: 0x13b905485f40004
[junit4:junit4]   2> 3406 T791 oaz.ZooKeeper.close Session: 0x13b905485f40004 closed
[junit4:junit4]   2> 3407 T828 oaz.ClientCnxn$EventThread.run EventThread shut down
[junit4:junit4]   2> 3407 T793 oazs.NIOServerCnxn.doIO WARNING caught end of stream exception EndOfStreamException: Unable to read additional data from client sessionid 0x13b905485f40004, likely client has closed socket
[junit4:junit4]   2> 	at org.apache.zookeeper.server.NIOServerCnxn.doIO(NIOServerCnxn.java:220)
[junit4:junit4]   2> 	at org.apache.zookeeper.server.NIOServerCnxnFactory.run(NIOServerCnxnFactory.java:208)
[junit4:junit4]   2> 	at java.lang.Thread.run(Thread.java:662)
[junit4:junit4]   2> 
[junit4:junit4]   2> 3407 T791 oaz.ZooKeeper.<init> Initiating client connection, connectString=127.0.0.1:50794/solr sessionTimeout=8000 watcher=org.apache.solr.common.cloud.ConnectionManager@97b8a3
[junit4:junit4]   2> 3408 T793 oazs.NIOServerCnxn.closeSock Closed socket connection for client /127.0.0.1:50815 which had sessionid 0x13b905485f40004
[junit4:junit4]   2> 3409 T791 oascc.ConnectionManager.waitForConnected Waiting for client to connect to ZooKeeper
[junit4:junit4]   2> 3410 T829 oaz.ClientCnxn$SendThread.logStartConnect Opening socket connection to server 127.0.0.1/127.0.0.1:50794. Will not attempt to authenticate using SASL (access denied (javax.security.auth.AuthPermission getLoginConfiguration))
[junit4:junit4]   2> 3410 T829 oaz.ClientCnxn$SendThread.primeConnection Socket connection established to 127.0.0.1/127.0.0.1:50794, initiating session
[junit4:junit4]   2> 3411 T793 oazs.NIOServerCnxnFactory.run Accepted socket connection from /127.0.0.1:50818
[junit4:junit4]   2> 3411 T793 oazs.ZooKeeperServer.processConnectRequest Client attempting to establish new session at /127.0.0.1:50818
[junit4:junit4]   2> 3413 T795 oazs.ZooKeeperServer.finishSessionInit Established session 0x13b905485f40005 with negotiated timeout 8000 for client /127.0.0.1:50818
[junit4:junit4]   2> 3413 T829 oaz.ClientCnxn$SendThread.onConnected Session establishment complete on server 127.0.0.1/127.0.0.1:50794, sessionid = 0x13b905485f40005, negotiated timeout = 8000
[junit4:junit4]   2> 3413 T830 oascc.ConnectionManager.process Watcher org.apache.solr.common.cloud.ConnectionManager@97b8a3 name:ZooKeeperConnection Watcher:127.0.0.1:50794/solr got event WatchedEvent state:SyncConnected type:None path:null path:null type:None
[junit4:junit4]   2> 3413 T791 oascc.ConnectionManager.waitForConnected Client is connected to ZooKeeper
[junit4:junit4]   2> 3414 T796 oazs.PrepRequestProcessor.pRequest Got user-level KeeperException when processing sessionid:0x13b905485f40005 type:create cxid:0x1 zxid:0x49 txntype:-1 reqpath:n/a Error Path:/solr/overseer Error:KeeperErrorCode = NodeExists for /solr/overseer
[junit4:junit4]   2> 3416 T796 oazs.PrepRequestProcessor.pRequest Got user-level KeeperException when processing sessionid:0x13b905485f40005 type:create cxid:0x2 zxid:0x4a txntype:-1 reqpath:n/a Error Path:/solr/overseer Error:KeeperErrorCode = NodeExists for /solr/overseer
[junit4:junit4]   2> 3418 T791 oasc.ZkController.createEphemeralLiveNode Register node as live in ZooKeeper:/live_nodes/127.0.0.1:50810_solr
[junit4:junit4]   2> 3419 T796 oazs.PrepRequestProcessor.pRequest Got user-level KeeperException when processing sessionid:0x13b905485f40005 type:delete cxid:0x4 zxid:0x4b txntype:-1 reqpath:n/a Error Path:/solr/live_nodes/127.0.0.1:50810_solr Error:KeeperErrorCode = NoNode for /solr/live_nodes/127.0.0.1:50810_solr
[junit4:junit4]   2> 3420 T791 oascc.SolrZkClient.makePath makePath: /live_nodes/127.0.0.1:50810_solr
[junit4:junit4]   2> 3425 T813 oascc.ZkStateReader$3.process Updating live nodes... (2)
[junit4:junit4]   2> 3426 T813 oascc.ZkStateReader$2.process A cluster state change has occurred - updating... (2)
[junit4:junit4]   2> 3426 T791 oashc.HttpShardHandlerFactory.getParameter Setting socketTimeout to: 0
[junit4:junit4]   2> 3426 T791 oashc.HttpShardHandlerFactory.getParameter Setting urlScheme to: http://
[junit4:junit4]   2> 3426 T791 oashc.HttpShardHandlerFactory.getParameter Setting connTimeout to: 0
[junit4:junit4]   2> 3427 T791 oashc.HttpShardHandlerFactory.getParameter Setting maxConnectionsPerHost to: 20
[junit4:junit4]   2> 3427 T791 oashc.HttpShardHandlerFactory.getParameter Setting corePoolSize to: 0
[junit4:junit4]   2> 3427 T791 oashc.HttpShardHandlerFactory.getParameter Setting maximumPoolSize to: 2147483647
[junit4:junit4]   2> 3427 T791 oashc.HttpShardHandlerFactory.getParameter Setting maxThreadIdleTime to: 5
[junit4:junit4]   2> 3429 T791 oashc.HttpShardHandlerFactory.getParameter Setting sizeOfQueue to: -1
[junit4:junit4]   2> 3429 T791 oashc.HttpShardHandlerFactory.getParameter Setting fairnessPolicy to: false
[junit4:junit4]   2> 3430 T791 oascsi.HttpClientUtil.createClient Creating new http client, config:maxConnectionsPerHost=20&maxConnections=10000&socketTimeout=0&connTimeout=0&retry=false
[junit4:junit4]   2> 3431 T814 oascc.ZkStateReader.updateClusterState Updating cloud state from ZooKeeper... 
[junit4:junit4]   2> 3433 T814 oasc.Overseer$ClusterStateUpdater.updateState Update state numShards=null message={
[junit4:junit4]   2> 	  "operation":"state",
[junit4:junit4]   2> 	  "numShards":null,
[junit4:junit4]   2> 	  "shard":"control_shard",
[junit4:junit4]   2> 	  "roles":null,
[junit4:junit4]   2> 	  "state":"active",
[junit4:junit4]   2> 	  "core":"collection1",
[junit4:junit4]   2> 	  "collection":"control_collection",
[junit4:junit4]   2> 	  "node_name":"127.0.0.1:50801_solr",
[junit4:junit4]   2> 	  "base_url":"http://127.0.0.1:50801/solr"}
[junit4:junit4]   2> 3441 T813 oascc.ZkStateReader$2.process A cluster state change has occurred - updating... (2)
[junit4:junit4]   2> 3444 T791 oascc.ZkStateReader.createClusterStateWatchersAndUpdate Updating cluster state from ZooKeeper... 
[junit4:junit4]   2> 3453 T831 oasc.CoreContainer.create Creating SolrCore 'collection1' using instanceDir: C:\Users\JenkinsSlave\workspace\Lucene-Solr-4.x-Windows\solr\build\solr-core\test\J0\.\solrtest-jetty1-1355336159639\collection1
[junit4:junit4]   2> 3453 T831 oasc.ZkController.createCollectionZkNode Check for collection zkNode:collection1
[junit4:junit4]   2> 3454 T831 oasc.ZkController.createCollectionZkNode Collection zkNode exists
[junit4:junit4]   2> 3454 T831 oasc.ZkController.readConfigName Load collection config from:/collections/collection1
[junit4:junit4]   2> 3457 T831 oasc.SolrResourceLoader.<init> new SolrResourceLoader for directory: 'C:\Users\JenkinsSlave\workspace\Lucene-Solr-4.x-Windows\solr\build\solr-core\test\J0\.\solrtest-jetty1-1355336159639\collection1\'
[junit4:junit4]   2> 3459 T831 oasc.SolrResourceLoader.replaceClassLoader Adding 'file:/C:/Users/JenkinsSlave/workspace/Lucene-Solr-4.x-Windows/solr/build/solr-core/test/J0/solrtest-jetty1-1355336159639/collection1/lib/classes/' to classloader
[junit4:junit4]   2> 3461 T831 oasc.SolrResourceLoader.replaceClassLoader Adding 'file:/C:/Users/JenkinsSlave/workspace/Lucene-Solr-4.x-Windows/solr/build/solr-core/test/J0/solrtest-jetty1-1355336159639/collection1/lib/README' to classloader
[junit4:junit4]   2> 3529 T831 oasc.SolrConfig.<init> Using Lucene MatchVersion: LUCENE_41
[junit4:junit4]   2> 3613 T831 oasc.SolrConfig.<init> Loaded SolrConfig: solrconfig.xml
[junit4:junit4]   2> 3615 T831 oass.IndexSchema.readSchema Reading Solr Schema
[junit4:junit4]   2> 3623 T831 oass.IndexSchema.readSchema Schema name=test
[junit4:junit4]   2> 4410 T831 oass.OpenExchangeRatesOrgProvider.init Initialized with rates=open-exchange-rates.json, refreshInterval=1440.
[junit4:junit4]   2> 4426 T831 oass.IndexSchema.readSchema default search field in schema is text
[junit4:junit4]   2> 4431 T831 oass.IndexSchema.readSchema unique key field: id
[junit4:junit4]   2> 4457 T831 oass.FileExchangeRateProvider.reload Reloading exchange rates from file currency.xml
[junit4:junit4]   2> 4463 T831 oass.FileExchangeRateProvider.reload Reloading exchange rates from file currency.xml
[junit4:junit4]   2> 4468 T831 oass.OpenExchangeRatesOrgProvider.reload Reloading exchange rates from open-exchange-rates.json
[junit4:junit4]   2> 4470 T831 oass.OpenExchangeRatesOrgProvider.reload Reloading exchange rates from open-exchange-rates.json
[junit4:junit4]   2> 4472 T831 oasc.SolrCore.<init> [collection1] Opening new SolrCore at C:\Users\JenkinsSlave\workspace\Lucene-Solr-4.x-Windows\solr\build\solr-core\test\J0\.\solrtest-jetty1-1355336159639\collection1\, dataDir=.\org.apache.solr.cloud.BasicDistributedZk2Test-1355336156645/jetty1\
[junit4:junit4]   2> 4472 T831 oasc.JmxMonitoredMap.<init> JMX monitoring is enabled. Adding Solr mbeans to JMX Server: com.sun.jmx.mbeanserver.JmxMBeanServer@c1a0eb
[junit4:junit4]   2> 4473 T831 oasc.SolrCore.getNewIndexDir New index directory detected: old=null new=.\org.apache.solr.cloud.BasicDistributedZk2Test-1355336156645/jetty1\index/
[junit4:junit4]   2> 4474 T831 oasc.SolrCore.initIndex WARNING [collection1] Solr index directory '.\org.apache.solr.cloud.BasicDistributedZk2Test-1355336156645\jetty1\index' doesn't exist. Creating new index...
[junit4:junit4]   2> 4475 T831 oasc.CachingDirectoryFactory.get return new directory for C:\Users\JenkinsSlave\workspace\Lucene-Solr-4.x-Windows\solr\build\solr-core\test\J0\.\org.apache.solr.cloud.BasicDistributedZk2Test-1355336156645\jetty1\index forceNew:false
[junit4:junit4]   2> 4486 T831 oasc.SolrDeletionPolicy.onCommit SolrDeletionPolicy.onCommit: commits:num=1
[junit4:junit4]   2> 		commit{dir=RateLimitedDirectoryWrapper(org.apache.lucene.store.SimpleFSDirectory@C:\Users\JenkinsSlave\workspace\Lucene-Solr-4.x-Windows\solr\build\solr-core\test\J0\org.apache.solr.cloud.BasicDistributedZk2Test-1355336156645\jetty1\index lockFactory=org.apache.lucene.store.NativeFSLockFactory@18ca735),segFN=segments_1,generation=1,filenames=[segments_1]
[junit4:junit4]   2> 4486 T831 oasc.SolrDeletionPolicy.updateCommits newest commit = 1
[junit4:junit4]   2> 4487 T831 oasc.SolrCore.initWriters created xml: solr.XMLResponseWriter
[junit4:junit4]   2> 4489 T831 oasup.UpdateRequestProcessorChain.init inserting DistributedUpdateProcessorFactory into updateRequestProcessorChain "dedupe"
[junit4:junit4]   2> 4489 T831 oasup.UpdateRequestProcessorChain.init inserting DistributedUpdateProcessorFactory into updateRequestProcessorChain "dedupe-allfields"
[junit4:junit4]   2> 4489 T831 oasup.UpdateRequestProcessorChain.init inserting DistributedUpdateProcessorFactory into updateRequestProcessorChain "stored_sig"
[junit4:junit4]   2> 4491 T831 oasup.UpdateRequestProcessorChain.init inserting DistributedUpdateProcessorFactory into updateRequestProcessorChain "uniq-fields"
[junit4:junit4]   2> 4491 T831 oasup.UpdateRequestProcessorChain.init inserting DistributedUpdateProcessorFactory into updateRequestProcessorChain "distrib-dup-test-chain-implicit"
[junit4:junit4]   2> 4492 T831 oasc.RequestHandlers.initHandlersFromConfig adding lazy requestHandler: solr.ReplicationHandler
[junit4:junit4]   2> 4492 T831 oasc.RequestHandlers.initHandlersFromConfig created /replication: solr.ReplicationHandler
[junit4:junit4]   2> 4494 T831 oasc.RequestHandlers.initHandlersFromConfig created standard: solr.StandardRequestHandler
[junit4:junit4]   2> 4495 T831 oasc.RequestHandlers.initHandlersFromConfig created /get: solr.RealTimeGetHandler
[junit4:junit4]   2> 4497 T831 oasc.RequestHandlers.initHandlersFromConfig created dismax: solr.SearchHandler
[junit4:junit4]   2> 4498 T831 oasc.RequestHandlers.initHandlersFromConfig created mock: org.apache.solr.core.MockQuerySenderListenerReqHandler
[junit4:junit4]   2> 4498 T831 oasc.RequestHandlers.initHandlersFromConfig created /admin/: org.apache.solr.handler.admin.AdminHandlers
[junit4:junit4]   2> 4499 T831 oasc.RequestHandlers.initHandlersFromConfig created defaults: solr.StandardRequestHandler
[junit4:junit4]   2> 4499 T831 oasc.RequestHandlers.initHandlersFromConfig adding lazy requestHandler: solr.StandardRequestHandler
[junit4:junit4]   2> 4499 T831 oasc.RequestHandlers.initHandlersFromConfig created lazy: solr.StandardRequestHandler
[junit4:junit4]   2> 4500 T831 oasc.RequestHandlers.initHandlersFromConfig created /update: solr.UpdateRequestHandler
[junit4:junit4]   2> 4501 T831 oasc.RequestHandlers.initHandlersFromConfig created /terms: org.apache.solr.handler.component.SearchHandler
[junit4:junit4]   2> 4501 T831 oasc.RequestHandlers.initHandlersFromConfig created spellCheckCompRH: org.apache.solr.handler.component.SearchHandler
[junit4:junit4]   2> 4503 T831 oasc.RequestHandlers.initHandlersFromConfig created spellCheckCompRH_Direct: org.apache.solr.handler.component.SearchHandler
[junit4:junit4]   2> 4503 T831 oasc.RequestHandlers.initHandlersFromConfig created spellCheckWithWordbreak: org.apache.solr.handler.component.SearchHandler
[junit4:junit4]   2> 4504 T831 oasc.RequestHandlers.initHandlersFromConfig created spellCheckWithWordbreak_Direct: org.apache.solr.handler.component.SearchHandler
[junit4:junit4]   2> 4505 T831 oasc.RequestHandlers.initHandlersFromConfig created spellCheckCompRH1: org.apache.solr.handler.component.SearchHandler
[junit4:junit4]   2> 4506 T831 oasc.RequestHandlers.initHandlersFromConfig created tvrh: org.apache.solr.handler.component.SearchHandler
[junit4:junit4]   2> 4507 T831 oasc.RequestHandlers.initHandlersFromConfig created /mlt: solr.MoreLikeThisHandler
[junit4:junit4]   2> 4508 T831 oasc.RequestHandlers.initHandlersFromConfig created /debug/dump: solr.DumpRequestHandler
[junit4:junit4]   2> 4517 T831 oashl.XMLLoader.init xsltCacheLifetimeSeconds=60
[junit4:junit4]   2> 4523 T831 oasc.SolrCore.initDeprecatedSupport WARNING solrconfig.xml uses deprecated <admin/gettableFiles>, Please update your config to use the ShowFileRequestHandler.
[junit4:junit4]   2> 4530 T831 oasc.SolrCore.initDeprecatedSupport WARNING adding ShowFileRequestHandler with hidden files: [SCHEMA.XML, OLD_SYNONYMS.TXT, STOPWORDS.TXT, PROTWORDS.TXT, OPEN-EXCHANGE-RATES.JSON, SYNONYMS.TXT, CURRENCY.XML, MAPPING-ISOLATIN1ACCENT.TXT]
[junit4:junit4]   2> 4535 T831 oass.SolrIndexSearcher.<init> Opening Searcher@fd4727 main
[junit4:junit4]   2> 4535 T831 oass.SolrIndexSearcher.getIndexDir WARNING WARNING: Directory impl does not support setting indexDir: org.apache.lucene.store.RateLimitedDirectoryWrapper
[junit4:junit4]   2> 4537 T831 oasu.CommitTracker.<init> Hard AutoCommit: disabled
[junit4:junit4]   2> 4537 T831 oasu.CommitTracker.<init> Soft AutoCommit: disabled
[junit4:junit4]   2> 4538 T831 oashc.SpellCheckComponent.inform Initializing spell checkers
[junit4:junit4]   2> 4552 T831 oass.DirectSolrSpellChecker.init init: {name=direct,classname=DirectSolrSpellChecker,field=lowerfilt,minQueryLength=3}
[junit4:junit4]   2> 4620 T832 oasc.SolrCore.registerSearcher [collection1] Registered new searcher Searcher@fd4727 main{StandardDirectoryReader(segments_1:1)}
[junit4:junit4]   2> 4636 T831 oasc.ZkController.publish publishing core=collection1 state=down
[junit4:junit4]   2> 4636 T831 oasc.ZkController.publish numShards not found on descriptor - reading it from system property
[junit4:junit4]   2> 4964 T814 oascc.ZkStateReader.updateClusterState Updating cloud state from ZooKeeper... 
[junit4:junit4]   2> 4966 T814 oasc.Overseer$ClusterStateUpdater.updateState Update state numShards=2 message={
[junit4:junit4]   2> 	  "operation":"state",
[junit4:junit4]   2> 	  "numShards":"2",
[junit4:junit4]   2> 	  "shard":null,
[junit4:junit4]   2> 	  "roles":null,
[junit4:junit4]   2> 	  "state":"down",
[junit4:junit4]   2> 	  "core":"collection1",
[junit4:junit4]   2> 	  "collection":"collection1",
[junit4:junit4]   2> 	  "node_name":"127.0.0.1:50810_solr",
[junit4:junit4]   2> 	  "base_url":"http://127.0.0.1:50810/solr"}
[junit4:junit4]   2> 4966 T814 oasc.Overseer$ClusterStateUpdater.createCollection Create collection collection1 with numShards 2
[junit4:junit4]   2> 4968 T814 oasc.Overseer$ClusterStateUpdater.updateState Assigning new node to shard shard=shard1
[junit4:junit4]   2> 4984 T830 oascc.ZkStateReader$2.process A cluster state change has occurred - updating... (2)
[junit4:junit4]   2> 4985 T813 oascc.ZkStateReader$2.process A cluster state change has occurred - updating... (2)
[junit4:junit4]   2> 5139 T831 oasc.CoreContainer.register registering core: collection1
[junit4:junit4]   2> 5139 T831 oasc.ZkController.register Register shard - core:collection1 address:http://127.0.0.1:50810/solr shardId:shard1
[junit4:junit4]   2> 5142 T831 oascc.SolrZkClient.makePath makePath: /collections/collection1/leader_elect/shard1/election
[junit4:junit4]   2> 5167 T796 oazs.PrepRequestProcessor.pRequest Got user-level KeeperException when processing sessionid:0x13b905485f40005 type:delete cxid:0x43 zxid:0x5b txntype:-1 reqpath:n/a Error Path:/solr/collections/collection1/leaders Error:KeeperErrorCode = NoNode for /solr/collections/collection1/leaders
[junit4:junit4]   2> 5170 T831 oasc.ShardLeaderElectionContext.runLeaderProcess Running the leader process.
[junit4:junit4]   2> 5171 T796 oazs.PrepRequestProcessor.pRequest Got user-level KeeperException when processing sessionid:0x13b905485f40005 type:create cxid:0x44 zxid:0x5c txntype:-1 reqpath:n/a Error Path:/solr/overseer Error:KeeperErrorCode = NodeExists for /solr/overseer
[junit4:junit4]   2> 5180 T831 oasc.ShardLeaderElectionContext.waitForReplicasToComeUp Enough replicas found to continue.
[junit4:junit4]   2> 5181 T831 oasc.ShardLeaderElectionContext.runLeaderProcess I may be the new leader - try and sync
[junit4:junit4]   2> 5181 T831 oasc.SyncStrategy.sync Sync replicas to http://127.0.0.1:50810/solr/collection1/
[junit4:junit4]   2> 5182 T831 oasc.SyncStrategy.syncReplicas Sync Success - now sync replicas to me
[junit4:junit4]   2> 5182 T831 oasc.SyncStrategy.syncToMe http://127.0.0.1:50810/solr/collection1/ has no replicas
[junit4:junit4]   2> 5183 T831 oasc.ShardLeaderElectionContext.runLeaderProcess I am the new leader: http://127.0.0.1:50810/solr/collection1/
[junit4:junit4]   2> 5183 T831 oascc.SolrZkClient.makePath makePath: /collections/collection1/leaders/shard1
[junit4:junit4]   2> 5198 T796 oazs.PrepRequestProcessor.pRequest Got user-level KeeperException when processing sessionid:0x13b905485f40005 type:create cxid:0x4e zxid:0x60 txntype:-1 reqpath:n/a Error Path:/solr/overseer Error:KeeperErrorCode = NodeExists for /solr/overseer
[junit4:junit4]   2> 5499 T814 oascc.ZkStateReader.updateClusterState Updating cloud state from ZooKeeper... 
[junit4:junit4]   2> 5545 T813 oascc.ZkStateReader$2.process A cluster state change has occurred - updating... (2)
[junit4:junit4]   2> 5545 T830 oascc.ZkStateReader$2.process A cluster state change has occurred - updating... (2)
[junit4:junit4]   2> 5563 T831 oasc.ZkController.register We are http://127.0.0.1:50810/solr/collection1/ and leader is http://127.0.0.1:50810/solr/collection1/
[junit4:junit4]   2> 5563 T831 oasc.ZkController.register No LogReplay needed for core=collection1 baseURL=http://127.0.0.1:50810/solr
[junit4:junit4]   2> 5564 T831 oasc.ZkController.checkRecovery I am the leader, no recovery necessary
[junit4:junit4]   2> 5565 T831 oasc.ZkController.publish publishing core=collection1 state=active
[junit4:junit4]   2> 5566 T831 oasc.ZkController.publish numShards not found on descriptor - reading it from system property
[junit4:junit4]   2> 5570 T831 oascc.ZkStateReader.updateClusterState Updating cloud state from ZooKeeper... 
[junit4:junit4]   2> 5573 T791 oass.SolrDispatchFilter.init user.dir=C:\Users\JenkinsSlave\workspace\Lucene-Solr-4.x-Windows\solr\build\solr-core\test\J0
[junit4:junit4]   2> 5573 T791 oass.SolrDispatchFilter.init SolrDispatchFilter.init() done
[junit4:junit4]   2> 5574 T791 oascsi.HttpClientUtil.createClient Creating new http client, config:maxConnections=128&maxConnectionsPerHost=32&followRedirects=false
[junit4:junit4]   2> 5919 T791 oejs.Server.doStart jetty-8.1.8.v20121106
[junit4:junit4]   2> 5924 T791 oejs.AbstractConnector.doStart Started SelectChannelConnector@0.0.0.0:50819
[junit4:junit4]   2> 5924 T791 oasc.SolrResourceLoader.locateSolrHome JNDI not configured for solr (NoInitialContextEx)
[junit4:junit4]   2> 5925 T791 oasc.SolrResourceLoader.locateSolrHome using system property solr.solr.home: C:\Users\JenkinsSlave\workspace\Lucene-Solr-4.x-Windows\solr\build\solr-core\test\J0\.\solrtest-jetty2-1355336162237
[junit4:junit4]   2> 5925 T791 oasc.SolrResourceLoader.<init> new SolrResourceLoader for deduced Solr Home: 'C:\Users\JenkinsSlave\workspace\Lucene-Solr-4.x-Windows\solr\build\solr-core\test\J0\.\solrtest-jetty2-1355336162237\'
[junit4:junit4]   2> 5957 T791 oass.SolrDispatchFilter.init SolrDispatchFilter.init()
[junit4:junit4]   2> 5958 T791 oasc.SolrResourceLoader.locateSolrHome JNDI not configured for solr (NoInitialContextEx)
[junit4:junit4]   2> 5958 T791 oasc.SolrResourceLoader.locateSolrHome using system property solr.solr.home: C:\Users\JenkinsSlave\workspace\Lucene-Solr-4.x-Windows\solr\build\solr-core\test\J0\.\solrtest-jetty2-1355336162237
[junit4:junit4]   2> 5959 T791 oasc.CoreContainer$Initializer.initialize looking for solr.xml: C:\Users\JenkinsSlave\workspace\Lucene-Solr-4.x-Windows\solr\build\solr-core\test\J0\.\solrtest-jetty2-1355336162237\solr.xml
[junit4:junit4]   2> 5959 T791 oasc.CoreContainer.<init> New CoreContainer 25907997
[junit4:junit4]   2> 5959 T791 oasc.CoreContainer.load Loading CoreContainer using Solr Home: 'C:\Users\JenkinsSlave\workspace\Lucene-Solr-4.x-Windows\solr\build\solr-core\test\J0\.\solrtest-jetty2-1355336162237\'
[junit4:junit4]   2> 5960 T791 oasc.SolrResourceLoader.<init> new SolrResourceLoader for directory: 'C:\Users\JenkinsSlave\workspace\Lucene-Solr-4.x-Windows\solr\build\solr-core\test\J0\.\solrtest-jetty2-1355336162237\'
[junit4:junit4]   2> 5981 T791 oasc.CoreContainer.load Registering Log Listener
[junit4:junit4]   2> 6009 T791 oasc.CoreContainer.initZooKeeper Zookeeper client=127.0.0.1:50794/solr
[junit4:junit4]   2> 6010 T791 oasc.ZkController.checkChrootPath zkHost includes chroot
[junit4:junit4]   2> 6010 T791 oaz.ZooKeeper.<init> Initiating client connection, connectString=127.0.0.1:50794 sessionTimeout=60000 watcher=org.apache.solr.common.cloud.ConnectionManager@6abc19
[junit4:junit4]   2> 6012 T791 oascc.ConnectionManager.waitForConnected Waiting for client to connect to ZooKeeper
[junit4:junit4]   2> 6013 T842 oaz.ClientCnxn$SendThread.logStartConnect Opening socket connection to server 127.0.0.1/127.0.0.1:50794. Will not attempt to authenticate using SASL (access denied (javax.security.auth.AuthPermission getLoginConfiguration))
[junit4:junit4]   2> 6014 T842 oaz.ClientCnxn$SendThread.primeConnection Socket connection established to 127.0.0.1/127.0.0.1:50794, initiating session
[junit4:junit4]   2> 6014 T793 oazs.NIOServerCnxnFactory.run Accepted socket connection from /127.0.0.1:50824
[junit4:junit4]   2> 6015 T793 oazs.ZooKeeperServer.processConnectRequest Client attempting to establish new session at /127.0.0.1:50824
[junit4:junit4]   2> 6025 T795 oazs.ZooKeeperServer.finishSessionInit Established session 0x13b905485f40006 with negotiated timeout 20000 for client /127.0.0.1:50824
[junit4:junit4]   2> 6025 T842 oaz.ClientCnxn$SendThread.onConnected Session establishment complete on server 127.0.0.1/127.0.0.1:50794, sessionid = 0x13b905485f40006, negotiated timeout = 20000
[junit4:junit4]   2> 6026 T843 oascc.ConnectionManager.process Watcher org.apache.solr.common.cloud.ConnectionManager@6abc19 name:ZooKeeperConnection Watcher:127.0.0.1:50794 got event WatchedEvent state:SyncConnected type:None path:null path:null type:None
[junit4:junit4]   2> 6026 T791 oascc.ConnectionManager.waitForConnected Client is connected to ZooKeeper
[junit4:junit4]   2> 6027 T796 oazs.PrepRequestProcessor.pRequest2Txn Processed session termination for sessionid: 0x13b905485f40006
[junit4:junit4]   2> 6029 T791 oaz.ZooKeeper.close Session: 0x13b905485f40006 closed
[junit4:junit4]   2> 6029 T793 oazs.NIOServerCnxn.closeSock Closed socket connection for client /127.0.0.1:50824 which had sessionid 0x13b905485f40006
[junit4:junit4]   2> 6029 T843 oaz.ClientCnxn$EventThread.run EventThread shut down
[junit4:junit4]   2> 6029 T791 oaz.ZooKeeper.<init> Initiating client connection, connectString=127.0.0.1:50794/solr sessionTimeout=8000 watcher=org.apache.solr.common.cloud.ConnectionManager@1dec174
[junit4:junit4]   2> 6031 T791 oascc.ConnectionManager.waitForConnected Waiting for client to connect to ZooKeeper
[junit4:junit4]   2> 6032 T844 oaz.ClientCnxn$SendThread.logStartConnect Opening socket connection to server 127.0.0.1/127.0.0.1:50794. Will not attempt to authenticate using SASL (access denied (javax.security.auth.AuthPermission getLoginConfiguration))
[junit4:junit4]   2> 6032 T844 oaz.ClientCnxn$SendThread.primeConnection Socket connection established to 127.0.0.1/127.0.0.1:50794, initiating session
[junit4:junit4]   2> 6032 T793 oazs.NIOServerCnxnFactory.run Accepted socket connection from /127.0.0.1:50827
[junit4:junit4]   2> 6033 T793 oazs.ZooKeeperServer.processConnectRequest Client attempting to establish new session at /127.0.0.1:50827
[junit4:junit4]   2> 6035 T795 oazs.ZooKeeperServer.finishSessionInit Established session 0x13b905485f40007 with negotiated timeout 8000 for client /127.0.0.1:50827
[junit4:junit4]   2> 6035 T844 oaz.ClientCnxn$SendThread.onConnected Session establishment complete on server 127.0.0.1/127.0.0.1:50794, sessionid = 0x13b905485f40007, negotiated timeout = 8000
[junit4:junit4]   2> 6036 T845 oascc.ConnectionManager.process Watcher org.apache.solr.common.cloud.ConnectionManager@1dec174 name:ZooKeeperConnection Watcher:127.0.0.1:50794/solr got event WatchedEvent state:SyncConnected type:None path:null path:null type:None
[junit4:junit4]   2> 6036 T791 oascc.ConnectionManager.waitForConnected Client is connected to ZooKeeper
[junit4:junit4]   2> 6037 T796 oazs.PrepRequestProcessor.pRequest Got user-level KeeperException when processing sessionid:0x13b905485f40007 type:create cxid:0x1 zxid:0x6d txntype:-1 reqpath:n/a Error Path:/solr/overseer Error:KeeperErrorCode = NodeExists for /solr/overseer
[junit4:junit4]   2> 6040 T796 oazs.PrepRequestProcessor.pRequest Got user-level KeeperException when processing sessionid:0x13b905485f40007 type:create cxid:0x2 zxid:0x6e txntype:-1 reqpath:n/a Error Path:/solr/overseer Error:KeeperErrorCode = NodeExists for /solr/overseer
[junit4:junit4]   2> 6041 T791 oasc.ZkController.createEphemeralLiveNode Register node as live in ZooKeeper:/live_nodes/127.0.0.1:50819_solr
[junit4:junit4]   2> 6042 T796 oazs.PrepRequestProcessor.pRequest Got user-level KeeperException when processing sessionid:0x13b905485f40007 type:delete cxid:0x4 zxid:0x6f txntype:-1 reqpath:n/a Error Path:/solr/live_nodes/127.0.0.1:50819_solr Error:KeeperErrorCode = NoNode for /solr/live_nodes/127.0.0.1:50819_solr
[junit4:junit4]   2> 6044 T791 oascc.SolrZkClient.makePath makePath: /live_nodes/127.0.0.1:50819_solr
[junit4:junit4]   2> 6048 T830 oascc.ZkStateReader$2.process A cluster state change has occurred - updating... (2)
[junit4:junit4]   2> 6049 T813 oascc.ZkStateReader$3.process Updating live nodes... (3)
[junit4:junit4]   2> 6049 T813 oascc.ZkStateReader$2.process A cluster state change has occurred - updating... (3)
[junit4:junit4]   2> 6050 T791 oashc.HttpShardHandlerFactory.getParameter Setting socketTimeout to: 0
[junit4:junit4]   2> 6052 T791 oashc.HttpShardHandlerFactory.getParameter Setting urlScheme to: http://
[junit4:junit4]   2> 6050 T830 oascc.ZkStateReader$3.process Updating live nodes... (3)
[junit4:junit4]   2> 6052 T791 oashc.HttpShardHandlerFactory.getParameter Setting connTimeout to: 0
[junit4:junit4]   2> 6052 T791 oashc.HttpShardHandlerFactory.getParameter Setting maxConnectionsPerHost to: 20
[junit4:junit4]   2> 6052 T791 oashc.HttpShardHandlerFactory.getParameter Setting corePoolSize to: 0
[junit4:junit4]   2> 6053 T791 oashc.HttpShardHandlerFactory.getParameter Setting maximumPoolSize to: 2147483647
[junit4:junit4]   2> 6053 T791 oashc.HttpShardHandlerFactory.getParameter Setting maxThreadIdleTime to: 5
[junit4:junit4]   2> 6053 T791 oashc.HttpShardHandlerFactory.getParameter Setting sizeOfQueue to: -1
[junit4:junit4]   2> 6053 T791 oashc.HttpShardHandlerFactory.getParameter Setting fairnessPolicy to: false
[junit4:junit4]   2> 6055 T791 oascsi.HttpClientUtil.createClient Creating new http client, config:maxConnectionsPerHost=20&maxConnections=10000&socketTimeout=0&connTimeout=0&retry=false
[junit4:junit4]   2> 6066 T814 oascc.ZkStateReader.updateClusterState Updating cloud state from ZooKeeper... 
[junit4:junit4]   2> 6068 T814 oasc.Overseer$ClusterStateUpdater.updateState Update state numShards=2 message={
[junit4:junit4]   2> 	  "operation":"state",
[junit4:junit4]   2> 	  "numShards":"2",
[junit4:junit4]   2> 	  "shard":"shard1",
[junit4:junit4]   2> 	  "roles":null,
[junit4:junit4]   2> 	  "state":"active",
[junit4:junit4]   2> 	  "core":"collection1",
[junit4:junit4]   2> 	  "collection":"collection1",
[junit4:junit4]   2> 	  "node_name":"127.0.0.1:50810_solr",
[junit4:junit4]   2> 	  "base_url":"http://127.0.0.1:50810/solr"}
[junit4:junit4]   2> 6069 T791 oascc.ZkStateReader.createClusterStateWatchersAndUpdate Updating cluster state from ZooKeeper... 
[junit4:junit4]   2> 6077 T813 oascc.ZkStateReader$2.process A cluster state change has occurred - updating... (3)
[junit4:junit4]   2> 6077 T845 oascc.ZkStateReader$2.process A cluster state change has occurred - updating... (3)
[junit4:junit4]   2> 6078 T830 oascc.ZkStateReader$2.process A cluster state change has occurred - updating... (3)
[junit4:junit4]   2> 6083 T846 oasc.CoreContainer.create Creating SolrCore 'collection1' using instanceDir: C:\Users\JenkinsSlave\workspace\Lucene-Solr-4.x-Windows\solr\build\solr-core\test\J0\.\solrtest-jetty2-1355336162237\collection1
[junit4:junit4]   2> 6083 T846 oasc.ZkController.createCollectionZkNode Check for collection zkNode:collection1
[junit4:junit4]   2> 6084 T846 oasc.ZkController.createCollectionZkNode Collection zkNode exists
[junit4:junit4]   2> 6084 T846 oasc.ZkController.readConfigName Load collection config from:/collections/collection1
[junit4:junit4]   2> 6087 T846 oasc.SolrResourceLoader.<init> new SolrResourceLoader for directory: 'C:\Users\JenkinsSlave\workspace\Lucene-Solr-4.x-Windows\solr\build\solr-core\test\J0\.\solrtest-jetty2-1355336162237\collection1\'
[junit4:junit4]   2> 6089 T846 oasc.SolrResourceLoader.replaceClassLoader Adding 'file:/C:/Users/JenkinsSlave/workspace/Lucene-Solr-4.x-Windows/solr/build/solr-core/test/J0/solrtest-jetty2-1355336162237/collection1/lib/classes/' to classloader
[junit4:junit4]   2> 6089 T846 oasc.SolrResourceLoader.replaceClassLoader Adding 'file:/C:/Users/JenkinsSlave/workspace/Lucene-Solr-4.x-Windows/solr/build/solr-core/test/J0/solrtest-jetty2-1355336162237/collection1/lib/README' to classloader
[junit4:junit4]   2> 6153 T846 oasc.SolrConfig.<init> Using Lucene MatchVersion: LUCENE_41
[junit4:junit4]   2> 6241 T846 oasc.SolrConfig.<init> Loaded SolrConfig: solrconfig.xml
[junit4:junit4]   2> 6242 T846 oass.IndexSchema.readSchema Reading Solr Schema
[junit4:junit4]   2> 6253 T846 oass.IndexSchema.readSchema Schema name=test
[junit4:junit4]   2> 7002 T846 oass.OpenExchangeRatesOrgProvider.init Initialized with rates=open-exchange-rates.json, refreshInterval=1440.
[junit4:junit4]   2> 7017 T846 oass.IndexSchema.readSchema default search field in schema is text
[junit4:junit4]   2> 7021 T846 oass.IndexSchema.readSchema unique key field: id
[junit4:junit4]   2> 7042 T846 oass.FileExchangeRateProvider.reload Reloading exchange rates from file currency.xml
[junit4:junit4]   2> 7052 T846 oass.FileExchangeRateProvider.reload Reloading exchange rates from file currency.xml
[junit4:junit4]   2> 7060 T846 oass.OpenExchangeRatesOrgProvider.reload Reloading exchange rates from open-exchange-rates.json
[junit4:junit4]   2> 7061 T846 oass.OpenExchangeRatesOrgProvider.reload Reloading exchange rates from open-exchange-rates.json
[junit4:junit4]   2> 7063 T846 oasc.SolrCore.<init> [collection1] Opening new SolrCore at C:\Users\JenkinsSlave\workspace\Lucene-Solr-4.x-Windows\solr\build\solr-core\test\J0\.\solrtest-jetty2-1355336162237\collection1\, dataDir=.\org.apache.solr.cloud.BasicDistributedZk2Test-1355336156645/jetty2\
[junit4:junit4]   2> 7064 T846 oasc.JmxMonitoredMap.<init> JMX monitoring is enabled. Adding Solr mbeans to JMX Server: com.sun.jmx.mbeanserver.JmxMBeanServer@c1a0eb
[junit4:junit4]   2> 7065 T846 oasc.SolrCore.getNewIndexDir New index directory detected: old=null new=.\org.apache.solr.cloud.BasicDistributedZk2Test-1355336156645/jetty2\index/
[junit4:junit4]   2> 7066 T846 oasc.SolrCore.initIndex WARNING [collection1] Solr index directory '.\org.apache.solr.cloud.BasicDistributedZk2Test-1355336156645\jetty2\index' doesn't exist. Creating new index...
[junit4:junit4]   2> 7066 T846 oasc.CachingDirectoryFactory.get return new directory for C:\Users\JenkinsSlave\workspace\Lucene-Solr-4.x-Windows\solr\build\solr-core\test\J0\.\org.apache.solr.cloud.BasicDistributedZk2Test-1355336156645\jetty2\index forceNew:false
[junit4:junit4]   2> 7075 T846 oasc.SolrDeletionPolicy.onCommit SolrDeletionPolicy.onCommit: commits:num=1
[junit4:junit4]   2> 		commit{dir=RateLimitedDirectoryWrapper(org.apache.lucene.store.SimpleFSDirectory@C:\Users\JenkinsSlave\workspace\Lucene-Solr-4.x-Windows\solr\build\solr-core\test\J0\org.apache.solr.cloud.BasicDistributedZk2Test-1355336156645\jetty2\index lockFactory=org.apache.lucene.store.NativeFSLockFactory@3af348),segFN=segments_1,generation=1,filenames=[segments_1]
[junit4:junit4]   2> 7075 T846 oasc.SolrDeletionPolicy.updateCommits newest commit = 1
[junit4:junit4]   2> 7076 T846 oasc.SolrCore.initWriters created xml: solr.XMLResponseWriter
[junit4:junit4]   2> 7078 T846 oasup.UpdateRequestProcessorChain.init inserting DistributedUpdateProcessorFactory into updateRequestProcessorChain "dedupe"
[junit4:junit4]   2> 7078 T846 oasup.UpdateRequestProcessorChain.init inserting DistributedUpdateProcessorFactory into updateRequestProcessorChain "dedupe-allfields"
[junit4:junit4]   2> 7078 T846 oasup.UpdateRequestProcessorChain.init inserting DistributedUpdateProcessorFactory into updateRequestProcessorChain "stored_sig"
[junit4:junit4]   2> 7078 T846 oasup.UpdateRequestProcessorChain.init inserting DistributedUpdateProcessorFactory into updateRequestProcessorChain "uniq-fields"
[junit4:junit4]   2> 7078 T846 oasup.UpdateRequestProcessorChain.init inserting DistributedUpdateProcessorFactory into updateRequestProcessorChain "distrib-dup-test-chain-implicit"
[junit4:junit4]   2> 7079 T846 oasc.RequestHandlers.initHandlersFromConfig adding lazy requestHandler: solr.ReplicationHandler
[junit4:junit4]   2> 7079 T846 oasc.RequestHandlers.initHandlersFromConfig created /replication: solr.ReplicationHandler
[junit4:junit4]   2> 7080 T846 oasc.RequestHandlers.initHandlersFromConfig created standard: solr.StandardRequestHandler
[junit4:junit4]   2> 7081 T846 oasc.RequestHandlers.initHandlersFromConfig created /get: solr.RealTimeGetHandler
[junit4:junit4]   2> 7082 T846 oasc.RequestHandlers.initHandlersFromConfig created dismax: solr.SearchHandler
[junit4:junit4]   2> 7083 T846 oasc.RequestHandlers.initHandlersFromConfig created mock: org.apache.solr.core.MockQuerySenderListenerReqHandler
[junit4:junit4]   2> 7083 T846 oasc.RequestHandlers.initHandlersFromConfig created /admin/: org.apache.solr.handler.admin.AdminHandlers
[junit4:junit4]   2> 7083 T846 oasc.RequestHandlers.initHandlersFromConfig created defaults: solr.StandardRequestHandler
[junit4:junit4]   2> 7083 T846 oasc.RequestHandlers.initHandlersFromConfig adding lazy requestHandler: solr.StandardRequestHandler
[junit4:junit4]   2> 7083 T846 oasc.RequestHandlers.initHandlersFromConfig created lazy: solr.StandardRequestHandler
[junit4:junit4]   2> 7085 T846 oasc.RequestHandlers.initHandlersFromConfig created /update: solr.UpdateRequestHandler
[junit4:junit4]   2> 7087 T846 oasc.RequestHandlers.initHandlersFromConfig created /terms: org.apache.solr.handler.component.SearchHandler
[junit4:junit4]   2> 7087 T846 oasc.RequestHandlers.initHandlersFromConfig created spellCheckCompRH: org.apache.solr.handler.component.SearchHandler
[junit4:junit4]   2> 7089 T846 oasc.RequestHandlers.initHandlersFromConfig created spellCheckCompRH_Direct: org.apache.solr.handler.component.SearchHandler
[junit4:junit4]   2> 7089 T846 oasc.RequestHandlers.initHandlersFromConfig created spellCheckWithWordbreak: org.apache.solr.handler.component.SearchHandler
[junit4:junit4]   2> 7091 T846 oasc.RequestHandlers.initHandlersFromConfig created spellCheckWithWordbreak_Direct: org.apache.solr.handler.component.SearchHandler
[junit4:junit4]   2> 7092 T846 oasc.RequestHandlers.initHandlersFromConfig created spellCheckCompRH1: org.apache.solr.handler.component.SearchHandler
[junit4:junit4]   2> 7092 T846 oasc.RequestHandlers.initHandlersFromConfig created tvrh: org.apache.solr.handler.component.SearchHandler
[junit4:junit4]   2> 7094 T846 oasc.RequestHandlers.initHandlersFromConfig created /mlt: solr.MoreLikeThisHandler
[junit4:junit4]   2> 7095 T846 oasc.RequestHandlers.initHandlersFromConfig created /debug/dump: solr.DumpRequestHandler
[junit4:junit4]   2> 7104 T846 oashl.XMLLoader.init xsltCacheLifetimeSeconds=60
[junit4:junit4]   2> 7109 T846 oasc.SolrCore.initDeprecatedSupport WARNING solrconfig.xml uses deprecated <admin/gettableFiles>, Please update your config to use the ShowFileRequestHandler.
[junit4:junit4]   2> 7111 T846 oasc.SolrCore.initDeprecatedSupport WARNING adding ShowFileRequestHandler with hidden files: [SCHEMA.XML, OLD_SYNONYMS.TXT, STOPWORDS.TXT, PROTWORDS.TXT, OPEN-EXCHANGE-RATES.JSON, SYNONYMS.TXT, CURRENCY.XML, MAPPING-ISOLATIN1ACCENT.TXT]
[junit4:junit4]   2> 7115 T846 oass.SolrIndexSearcher.<init> Opening Searcher@bb4830 main
[junit4:junit4]   2> 7115 T846 oass.SolrIndexSearcher.getIndexDir WARNING WARNING: Directory impl does not support setting indexDir: org.apache.lucene.store.RateLimitedDirectoryWrapper
[junit4:junit4]   2> 7117 T846 oasu.CommitTracker.<init> Hard AutoCommit: disabled
[junit4:junit4]   2> 7117 T846 oasu.CommitTracker.<init> Soft AutoCommit: disabled
[junit4:junit4]   2> 7117 T846 oashc.SpellCheckComponent.inform Initializing spell checkers
[junit4:junit4]   2> 7129 T846 oass.DirectSolrSpellChecker.init init: {name=direct,classname=DirectSolrSpellChecker,field=lowerfilt,minQueryLength=3}
[junit4:junit4]   2> 7191 T847 oasc.SolrCore.registerSearcher [collection1] Registered new searcher Searcher@bb4830 main{StandardDirectoryReader(segments_1:1)}
[junit4:junit4]   2> 7200 T846 oasc.ZkController.publish publishing core=collection1 state=down
[junit4:junit4]   2> 7201 T846 oasc.ZkController.publish numShards not found on descriptor - reading it from system property
[junit4:junit4]   2> 7595 T814 oascc.ZkStateReader.updateClusterState Updating cloud state from ZooKeeper... 
[junit4:junit4]   2> 7597 T814 oasc.Overseer$ClusterStateUpdater.updateState Update state numShards=2 message={
[junit4:junit4]   2> 	  "operation":"state",
[junit4:junit4]   2> 	  "numShards":"2",
[junit4:junit4]   2> 	  "shard":null,
[junit4:junit4]   2> 	  "roles":null,
[junit4:junit4]   2> 	  "state":"down",
[junit4:junit4]   2> 	  "core":"collection1",
[junit4:junit4]   2> 	  "collection":"collection1",
[junit4:junit4]   2> 	  "node_name":"127.0.0.1:50819_solr",
[junit4:junit4]   2> 	  "base_url":"http://127.0.0.1:50819/solr"}
[junit4:junit4]   2> 7598 T814 oasc.Overseer$ClusterStateUpdater.updateState Collection already exists with numShards=2
[junit4:junit4]   2> 7599 T814 oasc.Overseer$ClusterStateUpdater.updateState Assigning new node to shard shard=shard2
[junit4:junit4]   2> 7618 T830 oascc.ZkStateReader$2.process A cluster state change has occurred - updating... (3)
[junit4:junit4]   2> 7619 T845 oascc.ZkStateReader$2.process A cluster state change has occurred - updating... (3)
[junit4:junit4]   2> 7618 T813 oascc.ZkStateReader$2.process A cluster state change has occurred - updating... (3)
[junit4:junit4]   2> 7702 T846 oasc.CoreContainer.register registering core: collection1
[junit4:junit4]   2> 7702 T846 oasc.ZkController.register Register shard - core:collection1 address:http://127.0.0.1:50819/solr shardId:shard2
[junit4:junit4]   2> 7704 T846 oascc.SolrZkClient.makePath makePath: /collections/collection1/leader_elect/shard2/election
[junit4:junit4]   2> 7720 T796 oazs.PrepRequestProcessor.pRequest Got user-level KeeperException when processing sessionid:0x13b905485f40007 type:delete cxid:0x44 zxid:0x7e txntype:-1 reqpath:n/a Error Path:/solr/collections/collection1/leaders/shard2 Error:KeeperErrorCode = NoNode for /solr/collections/collection1/leaders/shard2
[junit4:junit4]   2> 7722 T846 oasc.ShardLeaderElectionContext.runLeaderProcess Running the leader process.
[junit4:junit4]   2> 7722 T796 oazs.PrepRequestProcessor.pRequest Got user-level KeeperException when processing sessionid:0x13b905485f40007 type:create cxid:0x45 zxid:0x7f txntype:-1 reqpath:n/a Error Path:/solr/overseer Error:KeeperErrorCode = NodeExists for /solr/overseer
[junit4:junit4]   2> 7727 T846 oasc.ShardLeaderElectionContext.waitForReplicasToComeUp Enough replicas found to continue.
[junit4:junit4]   2> 7727 T846 oasc.ShardLeaderElectionContext.runLeaderProcess I may be the new leader - try and sync
[junit4:junit4]   2> 7727 T846 oasc.SyncStrategy.sync Sync replicas to http://127.0.0.1:50819/solr/collection1/
[junit4:junit4]   2> 7727 T846 oasc.SyncStrategy.syncReplicas Sync Success - now sync replicas to me
[junit4:junit4]   2> 7727 T846 oasc.SyncStrategy.syncToMe http://127.0.0.1:50819/solr/collection1/ has no replicas
[junit4:junit4]   2> 7728 T846 oasc.ShardLeaderElectionContext.runLeaderProcess I am the new leader: http://127.0.0.1:50819/solr/collection1/
[junit4:junit4]   2> 7728 T846 oascc.SolrZkClient.makePath makePath: /collections/collection1/leaders/shard2
[junit4:junit4]   2> 7734 T796 oazs.PrepRequestProcessor.pRequest Got user-level KeeperException when processing sessionid:0x13b905485f40007 type:create cxid:0x4e zxid:0x82 txntype:-1 reqpath:n/a Error Path:/solr/overseer Error:KeeperErrorCode = NodeExists for /solr/overseer
[junit4:junit4]   2> 8135 T814 oascc.ZkStateReader.updateClusterState Updating cloud state from ZooKeeper... 
[junit4:junit4]   2> 8172 T830 oascc.ZkStateReader$2.process A cluster state change has occurred - updating... (3)
[junit4:junit4]   2> 8173 T813 oascc.ZkStateReader$2.process A cluster state change has occurred - updating... (3)
[junit4:junit4]   2> 8174 T845 oascc.ZkStateReader$2.process A cluster state change has occurred - updating... (3)
[junit4:junit4]   2> 8194 T846 oasc.ZkController.register We are http://127.0.0.1:50819/solr/collection1/ and leader is http://127.0.0.1:50819/solr/collection1/
[junit4:junit4]   2> 8194 T846 oasc.ZkController.register No LogReplay needed for core=collection1 baseURL=http://127.0.0.1:50819/solr
[junit4:junit4]   2> 8194 T846 oasc.ZkController.checkRecovery I am the leader, no recovery necessary
[junit4:junit4]   2> 8194 T846 oasc.ZkController.publish publishing core=collection1 state=active
[junit4:junit4]   2> 8194 T846 oasc.ZkController.publish numShards not found on descriptor - reading it from system property
[junit4:junit4]   2> 8197 T846 oascc.ZkStateReader.updateClusterState Updating cloud state from ZooKeeper... 
[junit4:junit4]   2> 8199 T791 oass.SolrDispatchFilter.init user.dir=C:\Users\JenkinsSlave\workspace\Lucene-Solr-4.x-Windows\solr\build\solr-core\test\J0
[junit4:junit4]   2> 8199 T791 oass.SolrDispatchFilter.init SolrDispatchFilter.init() done
[junit4:junit4]   2> 8199 T791 oascsi.HttpClientUtil.createClient Creating new http client, config:maxConnections=128&maxConnectionsPerHost=32&followRedirects=false
[junit4:junit4]   2> 8550 T791 oejs.Server.doStart jetty-8.1.8.v20121106
[junit4:junit4]   2> 8553 T791 oejs.AbstractConnector.doStart Started SelectChannelConnector@0.0.0.0:50828
[junit4:junit4]   2> 8555 T791 oasc.SolrResourceLoader.locateSolrHome JNDI not configured for solr (NoInitialContextEx)
[junit4:junit4]   2> 8556 T791 oasc.SolrResourceLoader.locateSolrHome using system property solr.solr.home: C:\Users\JenkinsSlave\workspace\Lucene-Solr-4.x-Windows\solr\build\solr-core\test\J0\.\solrtest-jetty3-1355336164858
[junit4:junit4]   2> 8556 T791 oasc.SolrResourceLoader.<init> new SolrResourceLoader for deduced Solr Home: 'C:\Users\JenkinsSlave\workspace\Lucene-Solr-4.x-Windows\solr\build\solr-core\test\J0\.\solrtest-jetty3-1355336164858\'
[junit4:junit4]   2> 8595 T791 oass.SolrDispatchFilter.init SolrDispatchFilter.init()
[junit4:junit4]   2> 8595 T791 oasc.SolrResourceLoader.locateSolrHome JNDI not configured for solr (NoInitialContextEx)
[junit4:junit4]   2> 8596 T791 oasc.SolrResourceLoader.locateSolrHome using system property solr.solr.home: C:\Users\JenkinsSlave\workspace\Lucene-Solr-4.x-Windows\solr\build\solr-core\test\J0\.\solrtest-jetty3-1355336164858
[junit4:junit4]   2> 8596 T791 oasc.CoreContainer$Initializer.initialize looking for solr.xml: C:\Users\JenkinsSlave\workspace\Lucene-Solr-4.x-Windows\solr\build\solr-core\test\J0\.\solrtest-jetty3-1355336164858\solr.xml
[junit4:junit4]   2> 8596 T791 oasc.CoreContainer.<init> New CoreContainer 14399020
[junit4:junit4]   2> 8597 T791 oasc.CoreContainer.load Loading CoreContainer using Solr Home: 'C:\Users\JenkinsSlave\workspace\Lucene-Solr-4.x-Windows\solr\build\solr-core\test\J0\.\solrtest-jetty3-1355336164858\'
[junit4:junit4]   2> 8597 T791 oasc.SolrResourceLoader.<init> new SolrResourceLoader for directory: 'C:\Users\JenkinsSlave\workspace\Lucene-Solr-4.x-Windows\solr\build\solr-core\test\J0\.\solrtest-jetty3-1355336164858\'
[junit4:junit4]   2> 8622 T791 oasc.CoreContainer.load Registering Log Listener
[junit4:junit4]   2> 8645 T791 oasc.CoreContainer.initZooKeeper Zookeeper client=127.0.0.1:50794/solr
[junit4:junit4]   2> 8647 T791 oasc.ZkController.checkChrootPath zkHost includes chroot
[junit4:junit4]   2> 8647 T791 oaz.ZooKeeper.<init> Initiating client connection, connectString=127.0.0.1:50794 sessionTimeout=60000 watcher=org.apache.solr.common.cloud.ConnectionManager@13b4609
[junit4:junit4]   2> 8648 T791 oascc.ConnectionManager.waitForConnected Waiting for client to connect to ZooKeeper
[junit4:junit4]   2> 8650 T857 oaz.ClientCnxn$SendThread.logStartConnect Opening socket connection to server 127.0.0.1/127.0.0.1:50794. Will not attempt to authenticate using SASL (access denied (javax.security.auth.AuthPermission getLoginConfiguration))
[junit4:junit4]   2> 8650 T857 oaz.ClientCnxn$SendThread.primeConnection Socket connection established to 127.0.0.1/127.0.0.1:50794, initiating session
[junit4:junit4]   2> 8650 T793 oazs.NIOServerCnxnFactory.run Accepted socket connection from /127.0.0.1:50833
[junit4:junit4]   2> 8651 T793 oazs.ZooKeeperServer.processConnectRequest Client attempting to establish new session at /127.0.0.1:50833
[junit4:junit4]   2> 8668 T795 oazs.ZooKeeperServer.finishSessionInit Established session 0x13b905485f40008 with negotiated timeout 20000 for client /127.0.0.1:50833
[junit4:junit4]   2> 8668 T857 oaz.ClientCnxn$SendThread.onConnected Session establishment complete on server 127.0.0.1/127.0.0.1:50794, sessionid = 0x13b905485f40008, negotiated timeout = 20000
[junit4:junit4]   2> 8669 T858 oascc.ConnectionManager.process Watcher org.apache.solr.common.cloud.ConnectionManager@13b4609 name:ZooKeeperConnection Watcher:127.0.0.1:50794 got event WatchedEvent state:SyncConnected type:None path:null path:null type:None
[junit4:junit4]   2> 8670 T791 oascc.ConnectionManager.waitForConnected Client is connected to ZooKeeper
[junit4:junit4]   2> 8673 T796 oazs.PrepRequestProcessor.pRequest2Txn Processed session termination for sessionid: 0x13b905485f40008
[junit4:junit4]   2> 8674 T858 oaz.ClientCnxn$EventThread.run EventThread shut down
[junit4:junit4]   2> 8674 T793 oazs.NIOServerCnxn.closeSock Closed socket connection for client /127.0.0.1:50833 which had sessionid 0x13b905485f40008
[junit4:junit4]   2> 8674 T791 oaz.ZooKeeper.close Session: 0x13b905485f40008 closed
[junit4:junit4]   2> 8677 T791 oaz.ZooKeeper.<init> Initiating client connection, connectString=127.0.0.1:50794/solr sessionTimeout=8000 watcher=org.apache.solr.common.cloud.ConnectionManager@30f202
[junit4:junit4]   2> 8680 T791 oascc.ConnectionManager.waitForConnected Waiting for client to connect to ZooKeeper
[junit4:junit4]   2> 8682 T859 oaz.ClientCnxn$SendThread.logStartConnect Opening socket connection to server 127.0.0.1/127.0.0.1:50794. Will not attempt to authenticate using SASL (access denied (javax.security.auth.AuthPermission getLoginConfiguration))
[junit4:junit4]   2> 8682 T859 oaz.ClientCnxn$SendThread.primeConnection Socket connection established to 127.0.0.1/127.0.0.1:50794, initiating session
[junit4:junit4]   2> 8683 T793 oazs.NIOServerCnxnFactory.run Accepted socket connection from /127.0.0.1:50836
[junit4:junit4]   2> 8683 T793 oazs.ZooKeeperServer.processConnectRequest Client attempting to establish new session at /127.0.0.1:50836
[junit4:junit4]   2> 8685 T795 oazs.ZooKeeperServer.finishSessionInit Established session 0x13b905485f40009 with negotiated timeout 8000 for client /127.0.0.1:50836
[junit4:junit4]   2> 8685 T859 oaz.ClientCnxn$SendThread.onConnected Session establishment complete on server 127.0.0.1/127.0.0.1:50794, sessionid = 0x13b905485f40009, negotiated timeout = 8000
[junit4:junit4]   2> 8686 T860 oascc.ConnectionManager.process Watcher org.apache.solr.common.cloud.ConnectionManager@30f202 name:ZooKeeperConnection Watcher:127.0.0.1:50794/solr got event WatchedEvent state:SyncConnected type:None path:null path:null type:None
[junit4:junit4]   2> 8686 T791 oascc.ConnectionManager.waitForConnected Client is connected to ZooKeeper
[junit4:junit4]   2> 8687 T814 oascc.ZkStateReader.updateClusterState Updating cloud state from ZooKeeper... 
[junit4:junit4]   2> 8687 T796 oazs.PrepRequestProcessor.pRequest Got user-level KeeperException when processing sessionid:0x13b905485f40009 type:create cxid:0x1 zxid:0x8f txntype:-1 reqpath:n/a Error Path:/solr/overseer Error:KeeperErrorCode = NodeExists for /solr/overseer
[junit4:junit4]   2> 8689 T796 oazs.PrepRequestProcessor.pRequest Got user-level KeeperException when processing sessionid:0x13b905485f40009 type:create cxid:0x2 zxid:0x90 txntype:-1 reqpath:n/a Error Path:/solr/overseer Error:KeeperErrorCode = NodeExists for /solr/overseer
[junit4:junit4]   2> 8690 T814 oasc.Overseer$ClusterStateUpdater.updateState Update state numShards=2 message={
[junit4:junit4]   2> 	  "operation":"state",
[junit4:junit4]   2> 	  "numShards":"2",
[junit4:junit4]   2> 	  "shard":"shard2",
[junit4:junit4]   2> 	  "roles":null,
[junit4:junit4]   2> 	  "state":"active",
[junit4:junit4]   2> 	  "core":"collection1",
[junit4:junit4]   2> 	  "collection":"collection1",
[junit4:junit4]   2> 	  "node_name":"127.0.0.1:50819_solr",
[junit4:junit4]   2> 	  "base_url":"http://127.0.0.1:50819/solr"}
[junit4:junit4]   2> 8694 T791 oasc.ZkController.createEphemeralLiveNode Register node as live in ZooKeeper:/live_nodes/127.0.0.1:50828_solr
[junit4:junit4]   2> 8694 T796 oazs.PrepRequestProcessor.pRequest Got user-level KeeperException when processing sessionid:0x13b905485f40009 type:delete cxid:0x4 zxid:0x92 txntype:-1 reqpath:n/a Error Path:/solr/live_nodes/127.0.0.1:50828_solr Error:KeeperErrorCode = NoNode for /solr/live_nodes/127.0.0.1:50828_solr
[junit4:junit4]   2> 8695 T791 oascc.SolrZkClient.makePath makePath: /live_nodes/127.0.0.1:50828_solr
[junit4:junit4]   2> 8699 T830 oascc.ZkStateReader$2.process A cluster state change has occurred - updating... (3)
[junit4:junit4]   2> 8700 T845 oascc.ZkStateReader$2.process A cluster state change has occurred - updating... (3)
[junit4:junit4]   2> 8703 T791 oashc.HttpShardHandlerFactory.getParameter Setting socketTimeout to: 0
[junit4:junit4]   2> 8703 T791 oashc.HttpShardHandlerFactory.getParameter Setting urlScheme to: http://
[junit4:junit4]   2> 8704 T791 oashc.HttpShardHandlerFactory.getParameter Setting connTimeout to: 0
[junit4:junit4]   2> 8704 T791 oashc.HttpShardHandlerFactory.getParameter Setting maxConnectionsPerHost to: 20
[junit4:junit4]   2> 8705 T791 oashc.HttpShardHandlerFactory.getParameter Setting corePoolSize to: 0
[junit4:junit4]   2> 8705 T791 oashc.HttpShardHandlerFactory.getParameter Setting maximumPoolSize to: 2147483647
[junit4:junit4]   2> 8705 T845 oascc.ZkStateReader$3.process Updating live nodes... (4)
[junit4:junit4]   2> 8705 T791 oashc.HttpShardHandlerFactory.getParameter Setting maxThreadIdleTime to: 5
[junit4:junit4]   2> 8705 T845 oascc.ZkStateReader$2.process A cluster state change has occurred - updating... (4)
[junit4:junit4]   2> 8705 T791 oashc.HttpShardHandlerFactory.getParameter Setting sizeOfQueue to: -1
[junit4:junit4]   2> 8706 T791 oashc.HttpShardHandlerFactory.getParameter Setting fairnessPolicy to: false
[junit4:junit4]   2> 8706 T791 oascsi.HttpClientUtil.createClient Creating new http client, config:maxConnectionsPerHost=20&maxConnections=10000&socketTimeout=0&connTimeout=0&retry=false
[junit4:junit4]   2> 8707 T830 oascc.ZkStateReader$3.process Updating live nodes... (4)
[junit4:junit4]   2> 8708 T830 oascc.ZkStateReader$2.process A cluster state change has occurred - updating... (4)
[junit4:junit4]   2> 8713 T813 oascc.ZkStateReader$3.process Updating live nodes... (4)
[junit4:junit4]   2> 8713 T813 oascc.ZkStateReader$2.process A cluster state change has occurred - updating... (4)
[junit4:junit4]   2> 8715 T813 oascc.ZkStateReader$2.process A cluster state change has occurred - updating... (4)
[junit4:junit4]   2> 8720 T791 oascc.ZkStateReader.createClusterStateWatchersAndUpdate Updating cluster state from ZooKeeper... 
[junit4:junit4]   2> 8729 T861 oasc.CoreContainer.create Creating SolrCore 'collection1' using instanceDir: C:\Users\JenkinsSlave\workspace\Lucene-Solr-4.x-Windows\solr\build\solr-core\test\J0\.\solrtest-jetty3-1355336164858\collection1
[junit4:junit4]   2> 8729 T861 oasc.ZkController.createCollectionZkNode Check for collection zkNode:collection1
[junit4:junit4]   2> 8730 T861 oasc.ZkController.createCollectionZkNode Collection zkNode exists
[junit4:junit4]   2> 8731 T861 oasc.ZkController.readConfigName Load collection config from:/collections/collection1
[junit4:junit4]   2> 8734 T861 oasc.SolrResourceLoader.<init> new SolrResourceLoader for directory: 'C:\Users\JenkinsSlave\workspace\Lucene-Solr-4.x-Windows\solr\build\solr-core\test\J0\.\solrtest-jetty3-1355336164858\collection1\'
[junit4:junit4]   2> 8735 T861 oasc.SolrResourceLoader.replaceClassLoader Adding 'file:/C:/Users/JenkinsSlave/workspace/Lucene-Solr-4.x-Windows/solr/build/solr-core/test/J0/solrtest-jetty3-1355336164858/collection1/lib/classes/' to classloader
[junit4:junit4]   2> 8736 T861 oasc.SolrResourceLoader.replaceClassLoader Adding 'file:/C:/Users/JenkinsSlave/workspace/Lucene-Solr-4.x-Windows/solr/build/solr-core/test/J0/solrtest-jetty3-1355336164858/collection1/lib/README' to classloader
[junit4:junit4]   2> 8804 T861 oasc.SolrConfig.<init> Using Lucene MatchVersion: LUCENE_41
[junit4:junit4]   2> 8894 T861 oasc.SolrConfig.<init> Loaded SolrConfig: solrconfig.xml
[junit4:junit4]   2> 8895 T861 oass.IndexSchema.readSchema Reading Solr Schema
[junit4:junit4]   2> 8901 T861 oass.IndexSchema.readSchema Schema name=test
[junit4:junit4]   2> 9664 T861 oass.OpenExchangeRatesOrgProvider.init Initialized with rates=open-exchange-rates.json, refreshInterval=1440.
[junit4:junit4]   2> 9677 T861 oass.IndexSchema.readSchema default search field in schema is text
[junit4:junit4]   2> 9681 T861 oass.IndexSchema.readSchema unique key field: id
[junit4:junit4]   2> 9711 T861 oass.FileExchangeRateProvider.reload Reloading exchange rates from file currency.xml
[junit4:junit4]   2> 9718 T861 oass.FileExchangeRateProvider.reload Reloading exchange rates from file currency.xml
[junit4:junit4]   2> 9723 T861 oass.OpenExchangeRatesOrgProvider.reload Reloading exchange rates from open-exchange-rates.json
[junit4:junit4]   2> 9726 T861 oass.OpenExchangeRatesOrgProvider.reload Reloading exchange rates from open-exchange-rates.json
[junit4:junit4]   2> 9728 T861 oasc.SolrCore.<init> [collection1] Opening new SolrCore at C:\Users\JenkinsSlave\workspace\Lucene-Solr-4.x-Windows\solr\build\solr-core\test\J0\.\solrtest-jetty3-1355336164858\collection1\, dataDir=.\org.apache.solr.cloud.BasicDistributedZk2Test-1355336156645/jetty3\
[junit4:junit4]   2> 9728 T861 oasc.JmxMonitoredMap.<init> JMX monitoring is enabled. Adding Solr mbeans to JMX Server: com.sun.jmx.mbeanserver.JmxMBeanServer@c1a0eb
[junit4:junit4]   2> 9729 T861 oasc.SolrCore.getNewIndexDir New index directory detected: old=null new=.\org.apache.solr.cloud.BasicDistributedZk2Test-1355336156645/jetty3\index/
[junit4:junit4]   2> 9730 T861 oasc.SolrCore.initIndex WARNING [collection1] Solr index directory '.\org.apache.solr.cloud.BasicDistributedZk2Test-1355336156645\jetty3\index' doesn't exist. Creating new index...
[junit4:junit4]   2> 9731 T861 oasc.CachingDirectoryFactory.get return new directory for C:\Users\JenkinsSlave\workspace\Lucene-Solr-4.x-Windows\solr\build\solr-core\test\J0\.\org.apache.solr.cloud.BasicDistributedZk2Test-1355336156645\jetty3\index forceNew:false
[junit4:junit4]   2> 9766 T861 oasc.SolrDeletionPolicy.onCommit SolrDeletionPolicy.onCommit: commits:num=1
[junit4:junit4]   2> 		commit{dir=RateLimitedDirectoryWrapper(org.apache.lucene.store.SimpleFSDirectory@C:\Users\JenkinsSlave\workspace\Lucene-Solr-4.x-Windows\solr\build\solr-core\test\J0\org.apache.solr.cloud.BasicDistributedZk2Test-1355336156645\jetty3\index lockFactory=org.apache.lucene.store.NativeFSLockFactory@a6eba7),segFN=segments_1,generation=1,filenames=[segments_1]
[junit4:junit4]   2> 9766 T861 oasc.SolrDeletionPolicy.updateCommits newest commit = 1
[junit4:junit4]   2> 9767 T861 oasc.SolrCore.initWriters created xml: solr.XMLResponseWriter
[junit4:junit4]   2> 9768 T861 oasup.UpdateRequestProcessorChain.init inserting DistributedUpdateProcessorFactory into updateRequestProcessorChain "dedupe"
[junit4:junit4]   2> 9768 T861 oasup.UpdateRequestProcessorChain.init inserting DistributedUpdateProcessorFactory into updateRequestProcessorChain "dedupe-allfields"
[junit4:junit4]   2> 9768 T861 oasup.UpdateRequestProcessorChain.init inserting DistributedUpdateProcessorFactory into updateRequestProcessorChain "stored_sig"
[junit4:junit4]   2> 9769 T861 oasup.UpdateRequestProcessorChain.init inserting DistributedUpdateProcessorFactory into updateRequestProcessorChain "uniq-fields"
[junit4:junit4]   2> 9770 T861 oasup.UpdateRequestProcessorChain.init inserting DistributedUpdateProcessorFactory into updateRequestProcessorChain "distrib-dup-test-chain-implicit"
[junit4:junit4]   2> 9770 T861 oasc.RequestHandlers.initHandlersFromConfig adding lazy requestHandler: solr.ReplicationHandler
[junit4:junit4]   2> 9770 T861 oasc.RequestHandlers.initHandlersFromConfig created /replication: solr.ReplicationHandler
[junit4:junit4]   2> 9771 T861 oasc.RequestHandlers.initHandlersFromConfig created standard: solr.StandardRequestHandler
[junit4:junit4]   2> 9772 T861 oasc.RequestHandlers.initHandlersFromConfig created /get: solr.RealTimeGetHandler
[junit4:junit4]   2> 9772 T861 oasc.RequestHandlers.initHandlersFromConfig created dismax: solr.SearchHandler
[junit4:junit4]   2> 9773 T861 oasc.RequestHandlers.initHandlersFromConfig created mock: org.apache.solr.core.MockQuerySenderListenerReqHandler
[junit4:junit4]   2> 9773 T861 oasc.RequestHandlers.initHandlersFromConfig created /admin/: org.apache.solr.handler.admin.AdminHandlers
[junit4:junit4]   2> 9775 T861 oasc.RequestHandlers.initHandlersFromConfig created defaults: solr.StandardRequestHandler
[junit4:junit4]   2> 9775 T861 oasc.RequestHandlers.initHandlersFromConfig adding lazy requestHandler: solr.StandardRequestHandler
[junit4:junit4]   2> 9775 T861 oasc.RequestHandlers.initHandlersFromConfig created lazy: solr.StandardRequestHandler
[junit4:junit4]   2> 9776 T861 oasc.RequestHandlers.initHandlersFromConfig created /update: solr.UpdateRequestHandler
[junit4:junit4]   2> 9777 T861 oasc.RequestHandlers.initHandlersFromConfig created /terms: org.apache.solr.handler.component.SearchHandler
[junit4:junit4]   2> 9777 T861 oasc.RequestHandlers.initHandlersFromConfig created spellCheckCompRH: org.apache.solr.handler.component.SearchHandler
[junit4:junit4]   2> 9777 T861 oasc.RequestHandlers.initHandlersFromConfig created spellCheckCompRH_Direct: org.apache.solr.handler.component.SearchHandler
[junit4:junit4]   2> 9778 T861 oasc.RequestHandlers.initHandlersFromConfig created spellCheckWithWordbreak: org.apache.solr.handler.component.SearchHandler
[junit4:junit4]   2> 9778 T861 oasc.RequestHandlers.initHandlersFromConfig created spellCheckWithWordbreak_Direct: org.apache.solr.handler.component.SearchHandler
[junit4:junit4]   2> 9780 T861 oasc.RequestHandlers.initHandlersFromConfig created spellCheckCompRH1: org.apache.solr.handler.component.SearchHandler
[junit4:junit4]   2> 9780 T861 oasc.RequestHandlers.initHandlersFromConfig created tvrh: org.apache.solr.handler.component.SearchHandler
[junit4:junit4]   2> 9781 T861 oasc.RequestHandlers.initHandlersFromConfig created /mlt: solr.MoreLikeThisHandler
[junit4:junit4]   2> 9781 T861 oasc.RequestHandlers.initHandlersFromConfig created /debug/dump: solr.DumpRequestHandler
[junit4:junit4]   2> 9790 T861 oashl.XMLLoader.init xsltCacheLifetimeSeconds=60
[junit4:junit4]   2> 9796 T861 oasc.SolrCore.initDeprecatedSupport WARNING solrconfig.xml uses deprecated <admin/gettableFiles>, Please update your config to use the ShowFileRequestHandler.
[junit4:junit4]   2> 9798 T861 oasc.SolrCore.initDeprecatedSupport WARNING adding ShowFileRequestHandler with hidden files: [SCHEMA.XML, OLD_SYNONYMS.TXT, STOPWORDS.TXT, PROTWORDS.TXT, OPEN-EXCHANGE-RATES.JSON, SYNONYMS.TXT, CURRENCY.XML, MAPPING-ISOLATIN1ACCENT.TXT]
[junit4:junit4]   2> 9803 T861 oass.SolrIndexSearcher.<init> Opening Searcher@13d874e main
[junit4:junit4]   2> 9803 T861 oass.SolrIndexSearcher.getIndexDir WARNING WARNING: Directory impl does not support setting indexDir: org.apache.lucene.store.RateLimitedDirectoryWrapper
[junit4:junit4]   2> 9805 T861 oasu.CommitTracker.<init> Hard AutoCommit: disabled
[junit4:junit4]   2> 9805 T861 oasu.CommitTracker.<init> Soft AutoCommit: disabled
[junit4:junit4]   2> 9805 T861 oashc.SpellCheckComponent.inform Initializing spell checkers
[junit4:junit4]   2> 9817 T861 oass.DirectSolrSpellChecker.init init: {name=direct,classname=DirectSolrSpellChecker,field=lowerfilt,minQueryLength=3}
[junit4:junit4]   2> 9876 T862 oasc.SolrCore.registerSearcher [collection1] Registered new searcher Searcher@13d874e main{StandardDirectoryReader(segments_1:1)}
[junit4:junit4]   2> 9881 T861 oasc.ZkController.publish publishing core=collection1 state=down
[junit4:junit4]   2> 9881 T861 oasc.ZkController.publish numShards not found on descriptor - reading it from system property
[junit4:junit4]   2> 10220 T814 oascc.ZkStateReader.updateClusterState Updating cloud state from ZooKeeper... 
[junit4:junit4]   2> 10221 T814 oasc.Overseer$ClusterStateUpdater.updateState Update state numShards=2 message={
[junit4:junit4]   2> 	  "operation":"state",
[junit4:junit4]   2> 	  "numShards":"2",
[junit4:junit4]   2> 	  "shard":null,
[junit4:junit4]   2> 	  "roles":null,
[junit4:junit4]   2> 	  "state":"down",
[junit4:junit4]   2> 	  "core":"collection1",
[junit4:junit4]   2> 	  "collection":"collection1",
[junit4:junit4]   2> 	  "node_name":"127.0.0.1:50828_solr",
[junit4:junit4]   2> 	  "base_url":"http://127.0.0.1:50828/solr"}
[junit4:junit4]   2> 10221 T814 oasc.Overseer$ClusterStateUpdater.updateState Collection already exists with numShards=2
[junit4:junit4]   2> 10221 T814 oasc.Overseer$ClusterStateUpdater.updateState Assigning new node to shard shard=shard1
[junit4:junit4]   2> 10231 T830 oascc.ZkStateReader$2.process A cluster state change has occurred - updating... (4)
[junit4:junit4]   2> 10232 T860 oascc.ZkStateReader$2.process A cluster state change has occurred - updating... (4)
[junit4:junit4]   2> 10232 T845 oascc.ZkStateReader$2.process A cluster state change has occurred - updating... (4)
[junit4:junit4]   2> 10232 T813 oascc.ZkStateReader$2.process A cluster state change has occurred - updating... (4)
[junit4:junit4]   2> 10384 T861 oasc.CoreContainer.register registering core: collection1
[junit4:junit4]   2> 10384 T861 oasc.ZkController.register Register shard - core:collection1 address:http://127.0.0.1:50828/solr shardId:shard1
[junit4:junit4]   2> 10389 T861 oasc.ZkController.register We are http://127.0.0.1:50828/solr/collection1/ and leader is http://127.0.0.1:50810/solr/collection1/
[junit4:junit4]   2> 10389 T861 oasc.ZkController.register No LogReplay needed for core=collection1 baseURL=http://127.0.0.1:50828/solr
[junit4:junit4]   2> 10390 T861 oasc.ZkController.checkRecovery Core needs to recover:collection1
[junit4:junit4]   2> 10390 T861 oasu.DefaultSolrCoreState.doRecovery Running recovery - first canceling any ongoing recovery
[junit4:junit4]   2> ASYNC  NEW_CORE C69 name=collection1 org.apache.solr.core.SolrCore@37acad url=http://127.0.0.1:50828/solr/collection1 node=127.0.0.1:50828_solr
[junit4:junit4]   2> 10396 T863 C69 P50828 oasc.RecoveryStrategy.run Starting recovery process.  core=collection1 recoveringAfterStartup=true
[junit4:junit4]   2> 10397 T863 C69 P50828 oasc.RecoveryStrategy.doRecovery ###### startupVersions=[]
[junit4:junit4]   2> 10397 T861 oascc.ZkStateReader.updateClusterState Updating cloud state from ZooKeeper... 
[junit4:junit4]   2> 10397 T863 C69 P50828 oasc.ZkController.publish publishing core=collection1 state=recovering
[junit4:junit4]   2> 10397 T863 C69 P50828 oasc.ZkController.publish numShards not found on descriptor - reading it from system property
[junit4:junit4]   2> 10398 T791 oass.SolrDispatchFilter.init user.dir=C:\Users\JenkinsSlave\workspace\Lucene-Solr-4.x-Windows\solr\build\solr-core\test\J0
[junit4:junit4]   2> 10398 T791 oass.SolrDispatchFilter.init SolrDispatchFilter.init() done
[junit4:junit4]   2> 10399 T791 oascsi.HttpClientUtil.createClient Creating new http client, config:maxConnections=128&maxConnectionsPerHost=32&followRedirects=false
[junit4:junit4]   2> 10400 T863 C69 P50828 oasc.RecoveryStrategy.doRecovery Attempting to PeerSync from http://127.0.0.1:50810/solr/collection1/ core=collection1 - recoveringAfterStartup=true
[junit4:junit4]   2> 10408 T863 C69 P50828 oascsi.HttpClientUtil.createClient Creating new http client, config:maxConnectionsPerHost=20&maxConnections=10000&connTimeout=30000&socketTimeout=30000&retry=false
[junit4:junit4]   2> 10419 T863 C69 P50828 oasu.PeerSync.sync PeerSync: core=collection1 url=http://127.0.0.1:50828/solr START replicas=[http://127.0.0.1:50810/solr/collection1/] nUpdates=100
[junit4:junit4]   2> 10420 T863 C69 P50828 oasu.PeerSync.sync WARNING no frame of reference to tell of we've missed updates
[junit4:junit4]   2> 10421 T863 C69 P50828 oasc.RecoveryStrategy.doRecovery PeerSync Recovery was not successful - trying replication. core=collection1
[junit4:junit4]   2> 10421 T863 C69 P50828 oasc.RecoveryStrategy.doRecovery Starting Replication Recovery. core=collection1
[junit4:junit4]   2> 10421 T863 C69 P50828 oascsi.HttpClientUtil.createClient Creating new http client, config:maxConnections=128&maxConnectionsPerHost=32&followRedirects=false
[junit4:junit4]   2> ASYNC  NEW_CORE C70 name=collection1 org.apache.solr.core.SolrCore@1b222d2 url=http://127.0.0.1:50810/solr/collection1 node=127.0.0.1:50810_solr
[junit4:junit4]   2> 10440 T821 C70 P50810 REQ /get {distrib=false&qt=/get&wt=javabin&version=2&getVersions=100} status=0 QTime=1 
[junit4:junit4]   2> 10741 T814 oascc.ZkStateReader.updateClusterState Updating cloud state from ZooKeeper... 
[junit4:junit4]   2> 10743 T814 oasc.Overseer$ClusterStateUpdater.updateState Update state numShards=2 message={
[junit4:junit4]   2> 	  "operation":"state",
[junit4:junit4]   2> 	  "numShards":"2",
[junit4:junit4]   2> 	  "shard":"shard1",
[junit4:junit4]   2> 	  "roles":null,
[junit4:junit4]   2> 	  "state":"recovering",
[junit4:junit4]   2> 	  "core":"collection1",
[junit4:junit4]   2> 	  "collection":"collection1",
[junit4:junit4]   2> 	  "node_name":"127.0.0.1:50828_solr",
[junit4:junit4]   2> 	  "base_url":"http://127.0.0.1:50828/solr"}
[junit4:junit4]   2> 10752 T791 oejs.Server.doStart jetty-8.1.8.v20121106
[junit4:junit4]   2> 10755 T791 oejs.AbstractConnector.doStart Started SelectChannelConnector@0.0.0.0:50839
[junit4:junit4]   2> 10756 T791 oasc.SolrResourceLoader.locateSolrHome JNDI not configured for solr (NoInitialContextEx)
[junit4:junit4]   2> 10757 T791 oasc.SolrResourceLoader.locateSolrHome using system property solr.solr.home: C:\Users\JenkinsSlave\workspace\Lucene-Solr-4.x-Windows\solr\build\solr-core\test\J0\.\solrtest-jetty4-1355336167052
[junit4:junit4]   2> 10758 T791 oasc.SolrResourceLoader.<init> new SolrResourceLoader for deduced Solr Home: 'C:\Users\JenkinsSlave\workspace\Lucene-Solr-4.x-Windows\solr\build\solr-core\test\J0\.\solrtest-jetty4-1355336167052\'
[junit4:junit4]   2> 10768 T830 oascc.ZkStateReader$2.process A cluster state change has occurred - updating... (4)
[junit4:junit4]   2> 10768 T845 oascc.ZkStateReader$2.process A cluster state change has occurred - updating... (4)
[junit4:junit4]   2> 10768 T860 oascc.ZkStateReader$2.process A cluster state change has occurred - updating... (4)
[junit4:junit4]   2> 10768 T813 oascc.ZkStateReader$2.process A cluster state change has occurred - updating... (4)
[junit4:junit4]   2> 10801 T791 oass.SolrDispatchFilter.init SolrDispatchFilter.init()
[junit4:junit4]   2> 10801 T791 oasc.SolrResourceLoader.locateSolrHome JNDI not configured for solr (NoInitialContextEx)
[junit4:junit4]   2> 10801 T791 oasc.SolrResourceLoader.locateSolrHome using system property solr.solr.home: C:\Users\JenkinsSlave\workspace\Lucene-Solr-4.x-Windows\solr\build\solr-core\test\J0\.\solrtest-jetty4-1355336167052
[junit4:junit4]   2> 10802 T791 oasc.CoreContainer$Initializer.initialize looking for solr.xml: C:\Users\JenkinsSlave\workspace\Lucene-Solr-4.x-Windows\solr\build\solr-core\test\J0\.\solrtest-jetty4-1355336167052\solr.xml
[junit4:junit4]   2> 10802 T791 oasc.CoreContainer.<init> New CoreContainer 33252199
[junit4:junit4]   2> 10803 T791 oasc.CoreContainer.load Loading CoreContainer using Solr Home: 'C:\Users\JenkinsSlave\workspace\Lucene-Solr-4.x-Windows\solr\build\solr-core\test\J0\.\solrtest-jetty4-1355336167052\'
[junit4:junit4]   2> 10804 T791 oasc.SolrResourceLoader.<init> new SolrResourceLoader for directory: 'C:\Users\JenkinsSlave\workspace\Lucene-Solr-4.x-Windows\solr\build\solr-core\test\J0\.\solrtest-jetty4-1355336167052\'
[junit4:junit4]   2> 10838 T791 oasc.CoreContainer.load Registering Log Listener
[junit4:junit4]   2> 10864 T791 oasc.CoreContainer.initZooKeeper Zookeeper client=127.0.0.1:50794/solr
[junit4:junit4]   2> 10865 T791 oasc.ZkController.checkChrootPath zkHost includes chroot
[junit4:junit4]   2> 10865 T791 oaz.ZooKeeper.<init> Initiating client connection, connectString=127.0.0.1:50794 sessionTimeout=60000 watcher=org.apache.solr.common.cloud.ConnectionManager@1682a2c
[junit4:junit4]   2> 10868 T791 oascc.ConnectionManager.waitForConnected Waiting for client to connect to ZooKeeper
[junit4:junit4]   2> 10868 T874 oaz.ClientCnxn$SendThread.logStartConnect Opening socket connection to server 127.0.0.1/127.0.0.1:50794. Will not attempt to authenticate using SASL (access denied (javax.security.auth.AuthPermission getLoginConfiguration))
[junit4:junit4]   2> 10869 T874 oaz.ClientCnxn$SendThread.primeConnection Socket connection established to 127.0.0.1/127.0.0.1:50794, initiating session
[junit4:junit4]   2> 10869 T793 oazs.NIOServerCnxnFactory.run Accepted socket connection from /127.0.0.1:50844
[junit4:junit4]   2> 10870 T793 oazs.ZooKeeperServer.processConnectRequest Client attempting to establish new session at /127.0.0.1:50844
[junit4:junit4]   2> 10872 T795 oazs.ZooKeeperServer.finishSessionInit Established session 0x13b905485f4000a with negotiated timeout 20000 for client /127.0.0.1:50844
[junit4:junit4]   2> 10872 T874 oaz.ClientCnxn$SendThread.onConnected Session establishment complete on server 127.0.0.1/127.0.0.1:50794, sessionid = 0x13b905485f4000a, negotiated timeout = 20000
[junit4:junit4]   2> 10872 T875 oascc.ConnectionManager.process Watcher org.apache.solr.common.cloud.ConnectionManager@1682a2c name:ZooKeeperConnection Watcher:127.0.0.1:50794 got event WatchedEvent state:SyncConnected type:None path:null path:null type:None
[junit4:junit4]   2> 10873 T791 oascc.ConnectionManager.waitForConnected Client is connected to ZooKeeper
[junit4:junit4]   2> 10875 T796 oazs.PrepRequestProcessor.pRequest2Txn Processed session termination for sessionid: 0x13b905485f4000a
[junit4:junit4]   2> 10879 T793 oazs.NIOServerCnxn.closeSock Closed socket connection for client /127.0.0.1:50844 which had sessionid 0x13b905485f4000a
[junit4:junit4]   2> 10880 T875 oaz.ClientCnxn$EventThread.run EventThread shut down
[junit4:junit4]   2> 10880 T791 oaz.ZooKeeper.close Session: 0x13b905485f4000a closed
[junit4:junit4]   2> 10881 T791 oaz.ZooKeeper.<init> Initiating client connection, connectString=127.0.0.1:50794/solr sessionTimeout=8000 watcher=org.apache.solr.common.cloud.ConnectionManager@8d54de
[junit4:junit4]   2> 10883 T791 oascc.ConnectionManager.waitForConnected Waiting for client to connect to ZooKeeper
[junit4:junit4]   2> 10883 T876 oaz.ClientCnxn$SendThread.logStartConnect Opening socket connection to server 127.0.0.1/127.0.0.1:50794. Will not attempt to authenticate using SASL (access denied (javax.security.auth.AuthPermission getLoginConfiguration))
[junit4:junit4]   2> 10884 T876 oaz.ClientCnxn$SendThread.primeConnection Socket connection established to 127.0.0.1/127.0.0.1:50794, initiating session
[junit4:junit4]   2> 10884 T793 oazs.NIOServerCnxnFactory.run Accepted socket connection from /127.0.0.1:50847
[junit4:junit4]   2> 10885 T793 oazs.ZooKeeperServer.processConnectRequest Client attempting to establish new session at /127.0.0.1:50847
[junit4:junit4]   2> 10886 T795 oazs.ZooKeeperServer.finishSessionInit Established session 0x13b905485f4000b with negotiated timeout 8000 for client /127.0.0.1:50847
[junit4:junit4]   2> 10886 T876 oaz.ClientCnxn$SendThread.onConnected Session establishment complete on server 127.0.0.1/127.0.0.1:50794, sessionid = 0x13b905485f4000b, negotiated timeout = 8000
[junit4:junit4]   2> 10887 T877 oascc.ConnectionManager.process Watcher org.apache.solr.common.cloud.ConnectionManager@8d54de name:ZooKeeperConnection Watcher:127.0.0.1:50794/solr got event WatchedEvent state:SyncConnected type:None path:null path:null type:None
[junit4:junit4]   2> 10887 T791 oascc.ConnectionManager.waitForConnected Client is connected to ZooKeeper
[junit4:junit4]   2> 10888 T796 oazs.PrepRequestProcessor.pRequest Got user-level KeeperException when processing sessionid:0x13b905485f4000b type:create cxid:0x1 zxid:0xa6 txntype:-1 reqpath:n/a Error Path:/solr/overseer Error:KeeperErrorCode = NodeExists for /solr/overseer
[junit4:junit4]   2> 10890 T796 oazs.PrepRequestProcessor.pRequest Got user-level KeeperException when processing sessionid:0x13b905485f4000b type:create cxid:0x2 zxid:0xa7 txntype:-1 reqpath:n/a Error Path:/solr/overseer Error:KeeperErrorCode = NodeExists for /solr/overseer
[junit4:junit4]   2> 10892 T791 oasc.ZkController.createEphemeralLiveNode Register node as live in ZooKeeper:/live_nodes/127.0.0.1:50839_solr
[junit4:junit4]   2> 10893 T796 oazs.PrepRequestProcessor.pRequest Got user-level KeeperException when processing sessionid:0x13b905485f4000b type:delete cxid:0x4 zxid:0xa8 txntype:-1 reqpath:n/a Error Path:/solr/live_nodes/127.0.0.1:50839_solr Error:KeeperErrorCode = NoNode for /solr/live_nodes/127.0.0.1:50839_solr
[junit4:junit4]   2> 10895 T791 oascc.SolrZkClient.makePath makePath: /live_nodes/127.0.0.1:50839_solr
[junit4:junit4]   2> 10898 T845 oascc.ZkStateReader$2.process A cluster state change has occurred - updating... (4)
[junit4:junit4]   2> 10898 T830 oascc.ZkStateReader$2.process A cluster state change has occurred - updating... (4)
[junit4:junit4]   2> 10899 T813 oascc.ZkStateReader$3.process Updating live nodes... (5)
[junit4:junit4]   2> 10899 T813 oascc.ZkStateReader$2.process A cluster state change has occurred - updating... (5)
[junit4:junit4]   2> 10900 T860 oascc.ZkStateReader$3.process Updating live nodes... (5)
[junit4:junit4]   2> 10900 T860 oascc.ZkStateReader$2.process A cluster state change has occurred - updating... (5)
[junit4:junit4]   2> 10902 T791 oashc.HttpShardHandlerFactory.getParameter Setting socketTimeout to: 0
[junit4:junit4]   2> 10902 T830 oascc.ZkStateReader$3.process Updating live nodes... (5)
[junit4:junit4]   2> 10902 T791 oashc.HttpShardHandlerFactory.getParameter Setting urlScheme to: http://
[junit4:junit4]   2> 10902 T845 oascc.ZkStateReader$3.process Updating live nodes... (5)
[junit4:junit4]   2> 10902 T791 oashc.HttpShardHandlerFactory.getParameter Setting connTimeout to: 0
[junit4:junit4]   2> 10902 T791 oashc.HttpShardHandlerFactory.getParameter Setting maxConnectionsPerHost to: 20
[junit4:junit4]   2> 10903 T791 oashc.HttpShardHandlerFactory.getParameter Setting corePoolSize to: 0
[junit4:junit4]   2> 10903 T791 oashc.HttpShardHandlerFactory.getParameter Setting maximumPoolSize to: 2147483647
[junit4:junit4]   2> 10903 T791 oashc.HttpShardHandlerFactory.getParameter Setting maxThreadIdleTime to: 5
[junit4:junit4]   2> 10903 T791 oashc.HttpShardHandlerFactory.getParameter Setting sizeOfQueue to: -1
[junit4:junit4]   2> 10905 T791 oashc.HttpShardHandlerFactory.getParameter Setting fairnessPolicy to: false
[junit4:junit4]   2> 10905 T791 oascsi.HttpClientUtil.createClient Creating new http client, config:maxConnectionsPerHost=20&maxConnections=10000&socketTimeout=0&connTimeout=0&retry=false
[junit4:junit4]   2> 10943 T791 oascc.ZkStateReader.createClusterStateWatchersAndUpdate Updating cluster state from ZooKeeper... 
[junit4:junit4]   2> 10969 T878 oasc.CoreContainer.create Creating SolrCore 'collection1' using instanceDir: C:\Users\JenkinsSlave\workspace\Lucene-Solr-4.x-Windows\solr\build\solr-core\test\J0\.\solrtest-jetty4-1355336167052\collection1
[junit4:junit4]   2> 10969 T878 oasc.ZkController.createCollectionZkNode Check for collection zkNode:collection1
[junit4:junit4]   2> 10970 T878 oasc.ZkController.createCollectionZkNode Collection zkNode exists
[junit4:junit4]   2> 10970 T878 oasc.ZkController.readConfigName Load collection config from:/collections/collection1
[junit4:junit4]   2> 10973 T878 oasc.SolrResourceLoader.<init> new SolrResourceLoader for directory: 'C:\Users\JenkinsSlave\workspace\Lucene-Solr-4.x-Windows\solr\build\solr-core\test\J0\.\solrtest-jetty4-1355336167052\collection1\'
[junit4:junit4]   2> 10974 T878 oasc.SolrResourceLoader.replaceClassLoader Adding 'file:/C:/Users/JenkinsSlave/workspace/Lucene-Solr-4.x-Windows/solr/build/solr-core/test/J0/solrtest-jetty4-1355336167052/collection1/lib/classes/' to classloader
[junit4:junit4]   2> 10975 T878 oasc.SolrResourceLoader.replaceClassLoader Adding 'file:/C:/Users/JenkinsSlave/workspace/Lucene-Solr-4.x-Windows/solr/build/solr-core/test/J0/solrtest-jetty4-1355336167052/collection1/lib/README' to classloader
[junit4:junit4]   2> 11032 T878 oasc.SolrConfig.<init> Using Lucene MatchVersion: LUCENE_41
[junit4:junit4]   2> 11116 T878 oasc.SolrConfig.<init> Loaded SolrConfig: solrconfig.xml
[junit4:junit4]   2> 11119 T878 oass.IndexSchema.readSchema Reading Solr Schema
[junit4:junit4]   2> 11123 T878 oass.IndexSchema.readSchema Schema name=test
[junit4:junit4]   2> 11937 T878 oass.OpenExchangeRatesOrgProvider.init Initialized with rates=open-exchange-rates.json, refreshInterval=1440.
[junit4:junit4]   2> 11949 T878 oass.IndexSchema.readSchema default search field in schema is text
[junit4:junit4]   2> 11954 T878 oass.IndexSchema.readSchema unique key field: id
[junit4:junit4]   2> 11974 T878 oass.FileExchangeRateProvider.reload Reloading exchange rates from file currency.xml
[junit4:junit4]   2> 11979 T878 oass.FileExchangeRateProvider.reload Reloading exchange rates from file currency.xml
[junit4:junit4]   2> 11984 T878 oass.OpenExchangeRatesOrgProvider.reload Reloading exchange rates from open-exchange-rates.json
[junit4:junit4]   2> 11986 T878 oass.OpenExchangeRatesOrgProvider.reload Reloading exchange rates from open-exchange-rates.json
[junit4:junit4]   2> 11986 T878 oasc.SolrCore.<init> [collection1] Opening new SolrCore at C:\Users\JenkinsSlave\workspace\Lucene-Solr-4.x-Windows\solr\build\solr-core\test\J0\.\solrtest-jetty4-1355336167052\collection1\, dataDir=.\org.apache.solr.cloud.BasicDistributedZk2Test-1355336156645/jetty4\
[junit4:junit4]   2> 11987 T878 oasc.JmxMonitoredMap.<init> JMX monitoring is enabled. Adding Solr mbeans to JMX Server: com.sun.jmx.mbeanserver.JmxMBeanServer@c1a0eb
[junit4:junit4]   2> 11988 T878 oasc.SolrCore.getNewIndexDir New index directory detected: old=null new=.\org.apache.solr.cloud.BasicDistributedZk2Test-1355336156645/jetty4\index/
[junit4:junit4]   2> 11988 T878 oasc.SolrCore.initIndex WARNING [collection1] Solr index directory '.\org.apache.solr.cloud.BasicDistributedZk2Test-1355336156645\jetty4\index' doesn't exist. Creating new index...
[junit4:junit4]   2> 11989 T878 oasc.CachingDirectoryFactory.get return new directory for C:\Users\JenkinsSlave\workspace\Lucene-Solr-4.x-Windows\solr\build\solr-core\test\J0\.\org.apache.solr.cloud.BasicDistributedZk2Test-1355336156645\jetty4\index forceNew:false
[junit4:junit4]   2> 12002 T878 oasc.SolrDeletionPolicy.onCommit SolrDeletionPolicy.onCommit: commits:num=1
[junit4:junit4]   2> 		commit{dir=RateLimitedDirectoryWrapper(org.apache.lucene.store.SimpleFSDirectory@C:\Users\JenkinsSlave\workspace\Lucene-Solr-4.x-Windows\solr\build\solr-core\test\J0\org.apache.solr.cloud.BasicDistributedZk2Test-1355336156645\jetty4\index lockFactory=org.apache.lucene.store.NativeFSLockFactory@85ce81),segFN=segments_1,generation=1,filenames=[segments_1]
[junit4:junit4]   2> 12003 T878 oasc.SolrDeletionPolicy.updateCommits newest commit = 1
[junit4:junit4]   2> 12003 T878 oasc.SolrCore.initWriters created xml: solr.XMLResponseWriter
[junit4:junit4]   2> 12005 T878 oasup.UpdateRequestProcessorChain.init inserting DistributedUpdateProcessorFactory into updateRequestProcessorChain "dedupe"
[junit4:junit4]   2> 12005 T878 oasup.UpdateRequestProcessorChain.init inserting DistributedUpdateProcessorFactory into updateRequestProcessorChain "dedupe-allfields"
[junit4:junit4]   2> 12006 T878 oasup.UpdateRequestProcessorChain.init inserting DistributedUpdateProcessorFactory into updateRequestProcessorChain "stored_sig"
[junit4:junit4]   2> 12006 T878 oasup.UpdateRequestProcessorChain.init inserting DistributedUpdateProcessorFactory into updateRequestProcessorChain "uniq-fields"
[junit4:junit4]   2> 12006 T878 oasup.UpdateRequestProcessorChain.init inserting DistributedUpdateProcessorFactory into updateRequestProcessorChain "distrib-dup-test-chain-implicit"
[junit4:junit4]   2> 12007 T878 oasc.RequestHandlers.initHandlersFromConfig adding lazy requestHandler: solr.ReplicationHandler
[junit4:junit4]   2> 12007 T878 oasc.RequestHandlers.initHandlersFromConfig created /replication: solr.ReplicationHandler
[junit4:junit4]   2> 12007 T878 oasc.RequestHandlers.initHandlersFromConfig created standard: solr.StandardRequestHandler
[junit4:junit4]   2> 12009 T878 oasc.RequestHandlers.initHandlersFromConfig created /get: solr.RealTimeGetHandler
[junit4:junit4]   2> 12009 T878 oasc.RequestHandlers.initHandlersFromConfig created dismax: solr.SearchHandler
[junit4:junit4]   2> 12011 T878 oasc.RequestHandlers.initHandlersFromConfig created mock: org.apache.solr.core.MockQuerySenderListenerReqHandler
[junit4:junit4]   2> 12011 T878 oasc.RequestHandlers.initHandlersFromConfig created /admin/: org.apache.solr.handler.admin.AdminHandlers
[junit4:junit4]   2> 12012 T878 oasc.RequestHandlers.initHandlersFromConfig created defaults: solr.StandardRequestHandler
[junit4:junit4]   2> 12012 T878 oasc.RequestHandlers.initHandlersFromConfig adding lazy requestHandler: solr.StandardRequestHandler
[junit4:junit4]   2> 12012 T878 oasc.RequestHandlers.initHandlersFromConfig created lazy: solr.StandardRequestHandler
[junit4:junit4]   2> 12013 T878 oasc.RequestHandlers.initHandlersFromConfig created /update: solr.UpdateRequestHandler
[junit4:junit4]   2> 12014 T878 oasc.RequestHandlers.initHandlersFromConfig created /terms: org.apache.solr.handler.component.SearchHandler
[junit4:junit4]   2> 12016 T878 oasc.RequestHandlers.initHandlersFromConfig created spellCheckCompRH: org.apache.solr.handler.component.SearchHandler
[junit4:junit4]   2> 12017 T878 oasc.RequestHandlers.initHandlersFromConfig created spellCheckCompRH_Direct: org.apache.solr.handler.component.SearchHandler
[junit4:junit4]   2> 12017 T878 oasc.RequestHandlers.initHandlersFromConfig created spellCheckWithWordbreak: org.apache.solr.handler.component.SearchHandler
[junit4:junit4]   2> 12018 T878 oasc.RequestHandlers.initHandlersFromConfig created spellCheckWithWordbreak_Direct: org.apache.solr.handler.component.SearchHandler
[junit4:junit4]   2> 12019 T878 oasc.RequestHandlers.initHandlersFromConfig created spellCheckCompRH1: org.apache.solr.handler.component.SearchHandler
[junit4:junit4]   2> 12019 T878 oasc.RequestHandlers.initHandlersFromConfig created tvrh: org.apache.solr.handler.component.SearchHandler
[junit4:junit4]   2> 12021 T878 oasc.RequestHandlers.initHandlersFromConfig created /mlt: solr.MoreLikeThisHandler
[junit4:junit4]   2> 12022 T878 oasc.RequestHandlers.initHandlersFromConfig created /debug/dump: solr.DumpRequestHandler
[junit4:junit4]   2> 12029 T878 oashl.XMLLoader.init xsltCacheLifetimeSeconds=60
[junit4:junit4]   2> 12035 T878 oasc.SolrCore.initDeprecatedSupport WARNING solrconfig.xml uses deprecated <admin/gettableFiles>, Please update your config to use the ShowFileRequestHandler.
[junit4:junit4]   2> 12040 T878 oasc.SolrCore.initDeprecatedSupport WARNING adding ShowFileRequestHandler with hidden files: [SCHEMA.XML, OLD_SYNONYMS.TXT, STOPWORDS.TXT, PROTWORDS.TXT, OPEN-EXCHANGE-RATES.JSON, SYNONYMS.TXT, CURRENCY.XML, MAPPING-ISOLATIN1ACCENT.TXT]
[junit4:junit4]   2> 12045 T878 oass.SolrIndexSearcher.<init> Opening Searcher@bc16c5 main
[junit4:junit4]   2> 12045 T878 oass.SolrIndexSearcher.getIndexDir WARNING WARNING: Directory impl does not support setting indexDir: org.apache.lucene.store.RateLimitedDirectoryWrapper
[junit4:junit4]   2> 12047 T878 oasu.CommitTracker.<init> Hard AutoCommit: disabled
[junit4:junit4]   2> 12047 T878 oasu.CommitTracker.<init> Soft AutoCommit: disabled
[junit4:junit4]   2> 12048 T878 oashc.SpellCheckComponent.inform Initializing spell checkers
[junit4:junit4]   2> 12058 T878 oass.DirectSolrSpellChecker.init init: {name=direct,classname=DirectSolrSpellChecker,field=lowerfilt,minQueryLength=3}
[junit4:junit4]   2> 12124 T879 oasc.SolrCore.registerSearcher [collection1] Registered new searcher Searcher@bc16c5 main{StandardDirectoryReader(segments_1:1)}
[junit4:junit4]   2> 12129 T878 oasc.ZkController.publish publishing core=collection1 state=down
[junit4:junit4]   2> 12129 T878 oasc.ZkController.publish numShards not found on descriptor - reading it from system property
[junit4:junit4]   2> 12287 T814 oascc.ZkStateReader.updateClusterState Updating cloud state from ZooKeeper... 
[junit4:junit4]   2> 12289 T814 oasc.Overseer$ClusterStateUpdater.updateState Update state numShards=2 message={
[junit4:junit4]   2> 	  "operation":"state",
[junit4:junit4]   2> 	  "numShards":"2",
[junit4:junit4]   2> 	  "shard":null,
[junit4:junit4]   2> 	  "roles":null,
[junit4:junit4]   2> 	  "state":"down",
[junit4:junit4]   2> 	  "core":"collection1",
[junit4:junit4]   2> 	  "collection":"collection1",
[junit4:junit4]   2> 	  "node_name":"127.0.0.1:50839_solr",
[junit4:junit4]   2> 	  "base_url":"http://127.0.0.1:50839/solr"}
[junit4:junit4]   2> 12289 T814 oasc.Overseer$ClusterStateUpdater.updateState Collection already exists with numShards=2
[junit4:junit4]   2> 12289 T814 oasc.Overseer$ClusterStateUpdater.updateState Assigning new node to shard shard=shard2
[junit4:junit4]   2> 12308 T830 oascc.ZkStateReader$2.process A cluster state change has occurred - updating... (5)
[junit4:junit4]   2> 12309 T813 oascc.ZkStateReader$2.process A cluster state change has occurred - updating... (5)
[junit4:junit4]   2> 12311 T877 oascc.ZkStateReader$2.process A cluster state change has occurred - updating... (5)
[junit4:junit4]   2> 12309 T845 oascc.ZkStateReader$2.process A cluster state change has occurred - updating... (5)
[junit4:junit4]   2> 12309 T860 oascc.ZkStateReader$2.process A cluster state change has occurred - updating... (5)
[junit4:junit4]   2> 12632 T878 oasc.CoreContainer.register registering core: collection1
[junit4:junit4]   2> 12632 T878 oasc.ZkController.register Register shard - core:collection1 address:http://127.0.0.1:50839/solr shardId:shard2
[junit4:junit4]   2> 12647 T878 oasc.ZkController.register We are http://127.0.0.1:50839/solr/collection1/ and leader is http://127.0.0.1:50819/solr/collection1/
[junit4:junit4]   2> 12647 T878 oasc.ZkController.register No LogReplay needed for core=collection1 baseURL=http://127.0.0.1:50839/solr
[junit4:junit4]   2> 12647 T878 oasc.ZkController.checkRecovery Core needs to recover:collection1
[junit4:junit4]   2> 12648 T878 oasu.DefaultSolrCoreState.doRecovery Running recovery - first canceling any ongoing recovery
[junit4:junit4]   2> ASYNC  NEW_CORE C71 name=collection1 org.apache.solr.core.SolrCore@1351a4 url=http://127.0.0.1:50839/solr/collection1 node=127.0.0.1:50839_solr
[junit4:junit4]   2> 12651 T880 C71 P50839 oasc.RecoveryStrategy.run Starting recovery process.  core=collection1 recoveringAfterStartup=true
[junit4:junit4]   2> 12652 T880 C71 P50839 oasc.RecoveryStrategy.doRecovery ###### startupVersions=[]
[junit4:junit4]   2> 12652 T880 C71 P50839 oasc.ZkController.publish publishing core=collection1 state=recovering
[junit4:junit4]   2> 12653 T880 C71 P50839 oasc.ZkController.publish numShards not found on descriptor - reading it from system property
[junit4:junit4]   2> 12653 T878 oascc.ZkStateReader.updateClusterState Updating cloud state from ZooKeeper... 
[junit4:junit4]   2> 12658 T880 C71 P50839 oasc.RecoveryStrategy.doRecovery Attempting to PeerSync from http://127.0.0.1:50819/solr/collection1/ core=collection1 - recoveringAfterStartup=true
[junit4:junit4]   2> 12658 T880 C71 P50839 oasu.PeerSync.sync PeerSync: core=collection1 url=http://127.0.0.1:50839/solr START replicas=[http://127.0.0.1:50819/solr/collection1/] nUpdates=100
[junit4:junit4]   2> 12661 T880 C71 P50839 oasu.PeerSync.sync WARNING no frame of reference to tell of we've missed updates
[junit4:junit4]   2> 12663 T880 C71 P50839 oasc.RecoveryStrategy.doRecovery PeerSync Recovery was not successful - trying replication. core=collection1
[junit4:junit4]   2> 12663 T880 C71 P50839 oasc.RecoveryStrategy.doRecovery Starting Replication Recovery. core=collection1
[junit4:junit4]   2> 12663 T880 C71 P50839 oascsi.HttpClientUtil.createClient Creating new http client, config:maxConnections=128&maxConnectionsPerHost=32&followRedirects=false
[junit4:junit4]   2> 12670 T791 oass.SolrDispatchFilter.init user.dir=C:\Users\JenkinsSlave\workspace\Lucene-Solr-4.x-Windows\solr\build\solr-core\test\J0
[junit4:junit4]   2> 12671 T791 oass.SolrDispatchFilter.init SolrDispatchFilter.init() done
[junit4:junit4]   2> 12672 T791 oascsi.HttpClientUtil.createClient Creating new http client, config:maxConnections=128&maxConnectionsPerHost=32&followRedirects=false
[junit4:junit4]   2> 12690 T791 oaz.ZooKeeper.<init> Initiating client connection, connectString=127.0.0.1:50794/solr sessionTimeout=10000 watcher=org.apache.solr.common.cloud.ConnectionManager@3bc634
[junit4:junit4]   2> 12692 T791 oascc.ConnectionManager.waitForConnected Waiting for client to connect to ZooKeeper
[junit4:junit4]   2> 12693 T882 oaz.ClientCnxn$SendThread.logStartConnect Opening socket connection to server 127.0.0.1/127.0.0.1:50794. Will not attempt to authenticate using SASL (access denied (javax.security.auth.AuthPermission getLoginConfiguration))
[junit4:junit4]   2> ASYNC  NEW_CORE C72 name=collection1 org.apache.solr.core.SolrCore@16d21f1 url=http://127.0.0.1:50819/solr/collection1 node=127.0.0.1:50819_solr
[junit4:junit4]   2> 12692 T840 C72 P50819 REQ /get {distrib=false&qt=/get&wt=javabin&version=2&getVersions=100} status=0 QTime=1 
[junit4:junit4]   2> 12693 T882 oaz.ClientCnxn$SendThread.primeConnection Socket connection established to 127.0.0.1/127.0.0.1:50794, initiating session
[junit4:junit4]   2> 12693 T793 oazs.NIOServerCnxnFactory.run Accepted socket connection from /127.0.0.1:50852
[junit4:junit4]   2> 12694 T793 oazs.ZooKeeperServer.processConnectRequest Client attempting to establish new session at /127.0.0.1:50852
[junit4:junit4]   2> 12695 T795 oazs.ZooKeeperServer.finishSessionInit Established session 0x13b905485f4000c with negotiated timeout 10000 for client /127.0.0.1:50852
[junit4:junit4]   2> 12695 T882 oaz.ClientCnxn$SendThread.onConnected Session establishment complete on server 127.0.0.1/127.0.0.1:50794, sessionid = 0x13b905485f4000c, negotiated timeout = 10000
[junit4:junit4]   2> 12695 T883 oascc.ConnectionManager.process Watcher org.apache.solr.common.cloud.ConnectionManager@3bc634 name:ZooKeeperConnection Watcher:127.0.0.1:50794/solr got event WatchedEvent state:SyncConnected type:None path:null path:null type:None
[junit4:junit4]   2> 12695 T791 oascc.ConnectionManager.waitForConnected Client is connected to ZooKeeper
[junit4:junit4]   2> 12697 T791 oascc.ZkStateReader.createClusterStateWatchersAndUpdate Updating cluster state from ZooKeeper... 
[junit4:junit4]   2> 12701 T791 oasc.ChaosMonkey.monkeyLog monkey: init - expire sessions:true cause connection loss:true
[junit4:junit4]   2> 12701 T791 oascsi.HttpClientUtil.createClient Creating new http client, config:
[junit4:junit4]   2> 12707 T791 oascc.ZkStateReader.updateClusterState Updating cloud state from ZooKeeper... 
[junit4:junit4]   2> ASYNC  NEW_CORE C73 name=collection1 org.apache.solr.core.SolrCore@3dac34 url=http://127.0.0.1:50801/solr/collection1 node=127.0.0.1:50801_solr
[junit4:junit4]   2> 12723 T804 C73 P50801 oasc.SolrDeletionPolicy.onInit SolrDeletionPolicy.onInit: commits:num=1
[junit4:junit4]   2> 		commit{dir=RateLimitedDirectoryWrapper(org.apache.lucene.store.SimpleFSDirectory@C:\Users\JenkinsSlave\workspace\Lucene-Solr-4.x-Windows\solr\build\solr-core\test\J0\org.apache.solr.cloud.BasicDistributedZk2Test-1355336156645\control\data\index lockFactory=org.apache.lucene.store.NativeFSLockFactory@81b520),segFN=segments_1,generation=1,filenames=[segments_1]
[junit4:junit4]   2> 12725 T804 C73 P50801 oasc.SolrDeletionPolicy.updateCommits newest commit = 1
[junit4:junit4]   2> 12733 T804 C73 P50801 /update {wt=javabin&version=2} {add=[1 (1421172979120734208)]} 0 16
[junit4:junit4]   2> 12733 T791 oaz.ZooKeeper.<init> Initiating client connection, connectString=127.0.0.1:50794/solr sessionTimeout=10000 watcher=org.apache.solr.common.cloud.ConnectionManager@1ad8ab4
[junit4:junit4]   2> 12736 T791 oascc.ConnectionManager.waitForConnected Waiting for client to connect to ZooKeeper
[junit4:junit4]   2> 12736 T884 oaz.ClientCnxn$SendThread.logStartConnect Opening socket connection to server 127.0.0.1/127.0.0.1:50794. Will not attempt to authenticate using SASL (access denied (javax.security.auth.AuthPermission getLoginConfiguration))
[junit4:junit4]   2> 12737 T884 oaz.ClientCnxn$SendThread.primeConnection Socket connection established to 127.0.0.1/127.0.0.1:50794, initiating session
[junit4:junit4]   2> 12737 T793 oazs.NIOServerCnxnFactory.run Accepted socket connection from /127.0.0.1:50856
[junit4:junit4]   2> 12738 T793 oazs.ZooKeeperServer.processConnectRequest Client attempting to establish new session at /127.0.0.1:50856
[junit4:junit4]   2> 12741 T795 oazs.ZooKeeperServer.finishSessionInit Established session 0x13b905485f4000d with negotiated timeout 10000 for client /127.0.0.1:50856
[junit4:junit4]   2> 12741 T884 oaz.ClientCnxn$SendThread.onConnected Session establishment complete on server 127.0.0.1/127.0.0.1:50794, sessionid = 0x13b905485f4000d, negotiated timeout = 10000
[junit4:junit4]   2> 12741 T885 oascc.ConnectionManager.process Watcher org.apache.solr.common.cloud.ConnectionManager@1ad8ab4 name:ZooKeeperConnection Watcher:127.0.0.1:50794/solr got event WatchedEvent state:SyncConnected type:None path:null path:null type:None
[junit4:junit4]   2> 12742 T791 oascc.ConnectionManager.waitForConnected Client is connected to ZooKeeper
[junit4:junit4]   2> 12743 T791 oascc.ZkStateReader.createClusterStateWatchersAndUpdate Updating cluster state from ZooKeeper... 
[junit4:junit4]   2> 12813 T821 C70 P50810 oasc.SolrDeletionPolicy.onInit SolrDeletionPolicy.onInit: commits:num=1
[junit4:junit4]   2> 		commit{dir=RateLimitedDirectoryWrapper(org.apache.lucene.store.SimpleFSDirectory@C:\Users\JenkinsSlave\workspace\Lucene-Solr-4.x-Windows\solr\build\solr-core\test\J0\org.apache.solr.cloud.BasicDistributedZk2Test-1355336156645\jetty1\index lockFactory=org.apache.lucene.store.NativeFSLockFactory@18ca735),segFN=segments_1,generation=1,filenames=[segments_1]
[junit4:junit4]   2> 12814 T821 C70 P50810 oasc.SolrDeletionPolicy.updateCommits newest commit = 1
[junit4:junit4]   2> 12828 T814 oascc.ZkStateReader.updateClusterState Updating cloud state from ZooKeeper... 
[junit4:junit4]   2> 12831 T814 oasc.Overseer$ClusterStateUpdater.updateState Update state numShards=2 message={
[junit4:junit4]   2> 	  "operation":"state",
[junit4:junit4]   2> 	  "numShards":"2",
[junit4:junit4]   2> 	  "shard":"shard2",
[junit4:junit4]   2> 	  "roles":null,
[junit4:junit4]   2> 	  "state":"recovering",
[junit4:junit4]   2> 	  "core":"collection1",
[junit4:junit4]   2> 	  "collection":"collection1",
[junit4:junit4]   2> 	  "node_name":"127.0.0.1:50839_solr",
[junit4:junit4]   2> 	  "base_url":"http://127.0.0.1:50839/solr"}
[junit4:junit4]   2>  C69_STATE=coll:collection1 core:collection1 props:{shard=shard1, roles=null, state=recovering, core=collection1, collection=collection1, node_name=127.0.0.1:50828_solr, base_url=http://127.0.0.1:50828/solr}
[junit4:junit4]   2> 12840 T852 C69 P50828 oasc.SolrDeletionPolicy.onInit SolrDeletionPolicy.onInit: commits:num=1
[junit4:junit4]   2> 		commit{dir=RateLimitedDirectoryWrapper(org.apache.lucene.store.SimpleFSDirectory@C:\Users\JenkinsSlave\workspace\Lucene-Solr-4.x-Windows\solr\build\solr-core\test\J0\org.apache.solr.cloud.BasicDistributedZk2Test-1355336156645\jetty3\index lockFactory=org.apache.lucene.store.NativeFSLockFactory@a6eba7),segFN=segments_1,generation=1,filenames=[segments_1]
[junit4:junit4]   2> 12841 T852 C69 P50828 oasc.SolrDeletionPolicy.updateCommits newest commit = 1
[junit4:junit4]   2> 12843 T860 oascc.ZkStateReader$2.process A cluster state change has occurred - updating... (5)
[junit4:junit4]   2> 12843 T830 oascc.ZkStateReader$2.process A cluster state change has occurred - updating... (5)
[junit4:junit4]   2> 12844 T813 oascc.ZkStateReader$2.process A cluster state change has occurred - updating... (5)
[junit4:junit4]   2> 12844 T877 oascc.ZkStateReader$2.process A cluster state change has occurred - updating... (5)
[junit4:junit4]   2> 12844 T845 oascc.ZkStateReader$2.process A cluster state change has occurred - updating... (5)
[junit4:junit4]   2> 12844 T883 oascc.ZkStateReader$2.process A cluster state change has occurred - updating... (5)
[junit4:junit4]   2> 12847 T885 oascc.ZkStateReader$2.process A cluster state change has occurred - updating... (5)
[junit4:junit4]   2> 12848 T852 C69 P50828 REQ /update {distrib.from=http://127.0.0.1:50810/solr/collection1/&update.distrib=FROMLEADER&wt=javabin&version=2} status=0 QTime=17 
[junit4:junit4]   2> 12848 T821 C70 P50810 REQ /update {distrib.from=http://127.0.0.1:50819/solr/collection1/&update.distrib=TOLEADER&wt=javabin&version=2} status=0 QTime=42 
[junit4:junit4]   2> 12850 T836 C72 P50819 /update {wt=javabin&version=2} {add=[1]} 0 99
[junit4:junit4]   2> 12854 T805 C73 P50801 oasu.DirectUpdateHandler2.commit start commit{flags=0,_version_=0,optimize=false,openSearcher=true,waitSearcher=true,expungeDeletes=false,softCommit=false}
[junit4:junit4]   2> 12876 T805 C73 P50801 oasc.SolrDeletionPolicy.onCommit SolrDeletionPolicy.onCommit: commits:num=2
[junit4:junit4]   2> 		commit{dir=RateLimitedDirectoryWrapper(org.apache.lucene.store.SimpleFSDirectory@C:\Users\JenkinsSlave\workspace\Lucene-Solr-4.x-Windows\solr\build\solr-core\test\J0\org.apache.solr.cloud.BasicDistributedZk2Test-1355336156645\control\data\index lockFactory=org.apache.lucene.store.NativeFSLockFactory@81b520),segFN=segments_1,generation=1,filenames=[segments_1]
[junit4:junit4]   2> 		commit{dir=RateLimitedDirectoryWrapper(org.apache.lucene.store.SimpleFSDirectory@C:\Users\JenkinsSlave\workspace\Lucene-Solr-4.x-Windows\solr\build\solr-core\test\J0\org.apache.solr.cloud.BasicDistributedZk2Test-1355336156645\control\data\index lockFactory=org.apache.lucene.store.NativeFSLockFactory@81b520),segFN=segments_2,generation=2,filenames=[_0_Lucene40_0.tim, _0.fnm, _0_Lucene40_0.frq, _0_nrm.cfe, segments_2, _0.fdx, _0_nrm.cfs, _0.si, _0_Lucene40_0.prx, _0.fdt, _0_Lucene40_0.tip]
[junit4:junit4]   2> 12877 T805 C73 P50801 oasc.SolrDeletionPolicy.updateCommits newest commit = 2
[junit4:junit4]   2> 12887 T805 C73 P50801 oass.SolrIndexSearcher.<init> Opening Searcher@169b054 main
[junit4:junit4]   2> 12887 T805 C73 P50801 oass.SolrIndexSearcher.getIndexDir WARNING WARNING: Directory impl does not support setting indexDir: org.apache.lucene.store.RateLimitedDirectoryWrapper
[junit4:junit4]   2> 12888 T805 C73 P50801 oasu.DirectUpdateHandler2.commit end_commit_flush
[junit4:junit4]   2> 12889 T817 oasc.SolrCore.registerSearcher [collection1] Registered new searcher Searcher@169b054 main{StandardDirectoryReader(segments_2:3 _0(4.1):C1)}
[junit4:junit4]   2> 12889 T805 C73 P50801 /update {waitSearcher=true&wt=javabin&commit=true&softCommit=false&version=2} {commit=} 0 35
[junit4:junit4]   2> 12892 T822 C70 P50810 oasu.DirectUpdateHandler2.commit start commit{flags=0,_version_=0,optimize=false,openSearcher=true,waitSearcher=true,expungeDeletes=false,softCommit=false}
[junit4:junit4]   2> 12923 T822 C70 P50810 oasc.SolrDeletionPolicy.onCommit SolrDeletionPolicy.onCommit: commits:num=2
[junit4:junit4]   2> 		commit{dir=RateLimitedDirectoryWrapper(org.apache.lucene.store.SimpleFSDirectory@C:\Users\JenkinsSlave\workspace\Lucene-Solr-4.x-Windows\solr\build\solr-core\test\J0\org.apache.solr.cloud.BasicDistributedZk2Test-1355336156645\jetty1\index lockFactory=org.apache.lucene.store.NativeFSLockFactory@18ca735),segFN=segments_1,generation=1,filenames=[segments_1]
[junit4:junit4]   2> 		commit{dir=RateLimitedDirectoryWrapper(org.apache.lucene.store.SimpleFSDirectory@C:\Users\JenkinsSlave\workspace\Lucene-Solr-4.x-Windows\solr\build\solr-core\test\J0\org.apache.solr.cloud.BasicDistributedZk2Test-1355336156645\jetty1\index lockFactory=org.apache.lucene.store.NativeFSLockFactory@18ca735),segFN=segments_2,generation=2,filenames=[_0_Lucene40_0.tim, _0.fnm, _0_Lucene40_0.frq, _0_nrm.cfe, segments_2, _0.fdx, _0_nrm.cfs, _0.si, _0_Lucene40_0.prx, _0.fdt, _0_Lucene40_0.tip]
[junit4:junit4]   2> 12924 T822 C70 P50810 oasc.SolrDeletionPolicy.updateCommits newest commit = 2
[junit4:junit4]   2> 12943 T822 C70 P50810 oass.SolrIndexSearcher.<init> Opening Searcher@1dd0da2 main
[junit4:junit4]   2> 12943 T822 C70 P50810 oass.SolrIndexSearcher.getIndexDir WARNING WARNING: Directory impl does not support setting indexDir: org.apache.lucene.store.RateLimitedDirectoryWrapper
[junit4:junit4]   2> 12944 T822 C70 P50810 oasu.DirectUpdateHandler2.commit end_commit_flush
[junit4:junit4]   2> 12944 T832 oasc.SolrCore.registerSearcher [collection1] Registered new searcher Searcher@1dd0da2 main{StandardDirectoryReader(segments_2:3 _0(4.1):C1)}
[junit4:junit4]   2> 12945 T822 C70 P50810 oasu.SolrCmdDistributor.distribCommit Distrib commit to:[StdNode: http://127.0.0.1:50828/solr/collection1/, StdNode: http://127.0.0.1:50819/solr/collection1/, StdNode: http://127.0.0.1:50839/solr/collection1/] params:commit_end_point=true&commit=true&softCommit=false&waitSearcher=true&expungeDeletes=false
[junit4:junit4]   2> 12947 T853 C69 P50828 oasu.DirectUpdateHandler2.commit start commit{flags=0,_version_=0,optimize=false,openSearcher=true,waitSearcher=true,expungeDeletes=false,softCommit=false}
[junit4:junit4]   2> 12948 T838 C72 P50819 oasu.DirectUpdateHandler2.commit start commit{flags=0,_version_=0,optimize=false,openSearcher=true,waitSearcher=true,expungeDeletes=false,softCommit=false}
[junit4:junit4]   2>  C71_STATE=coll:collection1 core:collection1 props:{shard=shard2, roles=null, state=recovering, core=collection1, collection=collection1, node_name=127.0.0.1:50839_solr, base_url=http://127.0.0.1:50839/solr}
[junit4:junit4]   2> 12958 T871 C71 P50839 oasu.DirectUpdateHandler2.commit start commit{flags=0,_version_=0,optimize=false,openSearcher=true,waitSearcher=true,expungeDeletes=false,softCommit=false}
[junit4:junit4]   2> 12966 T871 C71 P50839 oasc.SolrDeletionPolicy.onInit SolrDeletionPolicy.onInit: commits:num=1
[junit4:junit4]   2> 		commit{dir=RateLimitedDirectoryWrapper(org.apache.lucene.store.SimpleFSDirectory@C:\Users\JenkinsSlave\workspace\Lucene-Solr-4.x-Windows\solr\build\solr-core\test\J0\org.apache.solr.cloud.BasicDistributedZk2Test-1355336156645\jetty4\index lockFactory=org.apache.lucene.store.NativeFSLockFactory@85ce81),segFN=segments_1,generation=1,filenames=[segments_1]
[junit4:junit4]   2> 12970 T871 C71 P50839 oasc.SolrDeletionPolicy.updateCommits newest commit = 1
[junit4:junit4]   2> 12971 T838 C72 P50819 oasc.SolrDeletionPolicy.onInit SolrDeletionPolicy.onInit: commits:num=1
[junit4:junit4]   2> 		commit{dir=RateLimitedDirectoryWrapper(org.apache.lucene.store.SimpleFSDirectory@C:\Users\JenkinsSlave\workspace\Lucene-Solr-4.x-Windows\solr\build\solr-core\test\J0\org.apache.solr.cloud.BasicDistributedZk2Test-1355336156645\jetty2\index lockFactory=org.apache.lucene.store.NativeFSLockFactory@3af348),segFN=segments_1,generation=1,filenames=[segments_1]
[junit4:junit4]   2> 12972 T838 C72 P50819 oasc.SolrDeletionPolicy.updateCommits newest commit = 1
[junit4:junit4]   2> 12978 T871 C71 P50839 oasc.SolrDeletionPolicy.onCommit SolrDeletionPolicy.onCommit: commits:num=2
[junit4:junit4]   2> 		commit{dir=RateLimitedDirectoryWrapper(org.apache.lucene.store.SimpleFSDirectory@C:\Users\JenkinsSlave\workspace\Lucene-Solr-4.x-Windows\solr\build\solr-core\test\J0\org.apache.solr.cloud.BasicDistributedZk2Test-1355336156645\jetty4\index lockFactory=org.apache.lucene.store.NativeFSLockFactory@85ce81),segFN=segments_1,generation=1,filenames=[segments_1]
[junit4:junit4]   2> 		commit{dir=RateLimitedDirectoryWrapper(org.apache.lucene.store.SimpleFSDirectory@C:\Users\JenkinsSlave\workspace\Lucene-Solr-4.x-Windows\solr\build\solr-core\test\J0\org.apache.solr.cloud.BasicDistributedZk2Test-1355336156645\jetty4\index lockFactory=org.apache.lucene.store.NativeFSLockFactory@85ce81),segFN=segments_2,generation=2,filenames=[segments_2]
[junit4:junit4]   2> 12979 T871 C71 P50839 oasc.SolrDeletionPolicy.updateCommits newest commit = 2
[junit4:junit4]   2> 12980 T838 C72 P50819 oasc.SolrDeletionPolicy.onCommit SolrDeletionPolicy.onCommit: commits:num=2
[junit4:junit4]   2> 		commit{dir=RateLimitedDirectoryWrapper(org.apache.lucene.store.SimpleFSDirectory@C:\Users\JenkinsSlave\workspace\Lucene-Solr-4.x-Windows\solr\build\solr-core\test\J0\org.apache.solr.cloud.BasicDistributedZk2Test-1355336156645\jetty2\index lockFactory=org.apache.lucene.store.NativeFSLockFactory@3af348),segFN=segments_1,generation=1,filenames=[segments_1]
[junit4:junit4]   2> 		commit{dir=RateLimitedDirectoryWrapper(org.apache.lucene.store.SimpleFSDirectory@C:\Users\JenkinsSlave\workspace\Lucene-Solr-4.x-Windows\solr\build\solr-core\test\J0\org.apache.solr.cloud.BasicDistributedZk2Test-1355336156645\jetty2\index lockFactory=org.apache.lucene.store.NativeFSLockFactory@3af348),segFN=segments_2,generation=2,filenames=[segments_2]
[junit4:junit4]   2> 12980 T838 C72 P50819 oasc.SolrDeletionPolicy.updateCommits newest commit = 2
[junit4:junit4]   2> 12985 T871 C71 P50839 oass.SolrIndexSearcher.<init> Opening Searcher@f554c0 main
[junit4:junit4]   2> 12985 T838 C72 P50819 oass.SolrIndexSearcher.<init> Opening Searcher@15c3cf8 main
[junit4:junit4]   2> 12985 T871 C71 P50839 oass.SolrIndexSearcher.getIndexDir WARNING WARNING: Directory impl does not support setting indexDir: org.apache.lucene.store.RateLimitedDirectoryWrapper
[junit4:junit4]   2> 12986 T838 C72 P50819 oass.SolrIndexSearcher.getIndexDir WARNING WARNING: Directory impl does not support setting indexDir: org.apache.lucene.store.RateLimitedDirectoryWrapper
[junit4:junit4]   2> 12986 T871 C71 P50839 oasu.DirectUpdateHandler2.commit end_commit_flush
[junit4:junit4]   2> 12987 T838 C72 P50819 oasu.DirectUpdateHandler2.commit end_commit_flush
[junit4:junit4]   2> 12987 T879 oasc.SolrCore.registerSearcher [collection1] Registered new searcher Searcher@f554c0 main{StandardDirectoryReader(segments_1:1)}
[junit4:junit4]   2> 12988 T847 oasc.SolrCore.registerSearcher [collection1] Registered new searcher Searcher@15c3cf8 main{StandardDirectoryReader(segments_1:1)}
[junit4:junit4]   2> 12988 T838 C72 P50819 /update {waitSearcher=true&commit=true&commit_end_point=true&expungeDeletes=false&wt=javabin&softCommit=false&version=2} {commit=} 0 40
[junit4:junit4]   2> 12988 T871 C71 P50839 /update {waitSearcher=true&commit=true&commit_end_point=true&expungeDeletes=false&wt=javabin&softCommit=false&version=2} {commit=} 0 30
[junit4:junit4]   2> 12996 T853 C69 P50828 oasc.SolrDeletionPolicy.onCommit SolrDeletionPolicy.onCommit: commits:num=2
[junit4:junit4]   2> 		commit{dir=RateLimitedDirectoryWrapper(org.apache.lucene.store.SimpleFSDirectory@C:\Users\JenkinsSlave\workspace\Lucene-Solr-4.x-Windows\solr\build\solr-core\test\J0\org.apache.solr.cloud.BasicDistributedZk2Test-1355336156645\jetty3\index lockFactory=org.apache.lucene.store.NativeFSLockFactory@a6eba7),segFN=segments_1,generation=1,filenames=[segments_1]
[junit4:junit4]   2> 		commit{dir=RateLimitedDirectoryWrapper(org.apache.lucene.store.SimpleFSDirectory@C:\Users\JenkinsSlave\workspace\Lucene-Solr-4.x-Windows\solr\build\solr-core\test\J0\org.apache.solr.cloud.BasicDistributedZk2Test-1355336156645\jetty3\index lockFactory=org.apache.lucene.store.NativeFSLockFactory@a6eba7),segFN=segments_2,generation=2,filenames=[_0_Lucene40_0.tim, _0.fnm, _0_Lucene40_0.frq, _0_nrm.cfe, segments_2, _0.fdx, _0_nrm.cfs, _0.si, _0_Lucene40_0.prx, _0.fdt, _0_Lucene40_0.tip]
[junit4:junit4]   2> 12997 T853 C69 P50828 oasc.SolrDeletionPolicy.updateCommits newest commit = 2
[junit4:junit4]   2> 13014 T853 C69 P50828 oass.SolrIndexSearcher.<init> Opening Searcher@1a213c0 main
[junit4:junit4]   2> 13014 T853 C69 P50828 oass.SolrIndexSearcher.getIndexDir WARNING WARNING: Directory impl does not support setting indexDir: org.apache.lucene.store.RateLimitedDirectoryWrapper
[junit4:junit4]   2> 13016 T853 C69 P50828 oasu.DirectUpdateHandler2.commit end_commit_flush
[junit4:junit4]   2> 13017 T862 oasc.SolrCore.registerSearcher [collection1] Registered new searcher Searcher@1a213c0 main{StandardDirectoryReader(segments_2:3 _0(4.1):C1)}
[junit4:junit4]   2> 13017 T853 C69 P50828 /update {waitSearcher=true&commit=true&commit_end_point=true&expungeDeletes=false&wt=javabin&softCommit=false&version=2} {commit=} 0 70
[junit4:junit4]   2> 13018 T822 C70 P50810 /update {waitSearcher=true&wt=javabin&commit=true&softCommit=false&version=2} {commit=} 0 126
[junit4:junit4]   2> 13018 T791 oasc.AbstractDistribZkTestBase.waitForRecoveriesToFinish Wait for recoveries to finish - collection: collection1 failOnTimeout:true timeout (sec):180
[junit4:junit4]   2> 13020 T791 oascc.ZkStateReader.updateClusterState Updating cloud state from ZooKeeper... 
[junit4:junit4]   2> 13430 T863 C69 P50828 oasc.RecoveryStrategy.doRecovery Begin buffering updates. core=collection1
[junit4:junit4]   2> 13430 T863 C69 P50828 oasu.UpdateLog.bufferUpdates Starting to buffer updates. FSUpdateLog{state=ACTIVE, tlog=null}
[junit4:junit4]   2> 13431 T863 C69 P50828 oasc.RecoveryStrategy.replicate Attempting to replicate from http://127.0.0.1:50810/solr/collection1/. core=collection1
[junit4:junit4]   2> 13431 T863 C69 P50828 oascsi.HttpClientUtil.createClient Creating new http client, config:maxConnections=128&maxConnectionsPerHost=32&followRedirects=false
[junit4:junit4]   2> 13455 T823 C70 P50810 oasu.DirectUpdateHandler2.commit start commit{flags=0,_version_=0,optimize=false,openSearcher=false,waitSearcher=true,expungeDeletes=false,softCommit=false}
[junit4:junit4]   2> 13465 T823 C70 P50810 oasc.SolrDeletionPolicy.onCommit SolrDeletionPolicy.onCommit: commits:num=2
[junit4:junit4]   2> 		commit{dir=RateLimitedDirectoryWrapper(org.apache.lucene.store.SimpleFSDirectory@C:\Users\JenkinsSlave\workspace\Lucene-Solr-4.x-Windows\solr\build\solr-core\test\J0\org.apache.solr.cloud.BasicDistributedZk2Test-1355336156645\jetty1\index lockFactory=org.apache.lucene.store.NativeFSLockFactory@18ca735),segFN=segments_2,generation=2,filenames=[_0_Lucene40_0.tim, _0.fnm, _0_Lucene40_0.frq, _0_nrm.cfe, segments_2, _0.fdx, _0_nrm.cfs, _0.si, _0_Lucene40_0.prx, _0.fdt, _0_Lucene40_0.tip]
[junit4:junit4]   2> 		commit{dir=RateLimitedDirectoryWrapper(org.apache.lucene.store.SimpleFSDirectory@C:\Users\JenkinsSlave\workspace\Lucene-Solr-4.x-Windows\solr\build\solr-core\test\J0\org.apache.solr.cloud.BasicDistributedZk2Test-1355336156645\jetty1\index lockFactory=org.apache.lucene.store.NativeFSLockFactory@18ca735),segFN=segments_3,generation=3,filenames=[_0_Lucene40_0.tim, _0.fnm, _0_Lucene40_0.frq, _0_nrm.cfe, _0.fdx, _0_nrm.cfs, _0.si, _0_Lucene40_0.prx, _0.fdt, segments_3, _0_Lucene40_0.tip]
[junit4:junit4]   2> 13466 T823 C70 P50810 oasc.SolrDeletionPolicy.updateCommits newest commit = 3
[junit4:junit4]   2> 13471 T823 C70 P50810 oass.SolrIndexSearcher.<init> Opening Searcher@1025aba realtime
[junit4:junit4]   2> 13472 T823 C70 P50810 oass.SolrIndexSearcher.getIndexDir WARNING WARNING: Directory impl does not support setting indexDir: org.apache.lucene.store.RateLimitedDirectoryWrapper
[junit4:junit4]   2> 13472 T823 C70 P50810 oasu.DirectUpdateHandler2.commit end_commit_flush
[junit4:junit4]   2> 13472 T823 C70 P50810 /update {waitSearcher=true&openSearcher=false&commit=true&commit_end_point=true&wt=javabin&softCommit=false&version=2} {commit=} 0 17
[junit4:junit4]   2> 13473 T863 C69 P50828 oash.ReplicationHandler.inform Commits will be reserved for  10000
[junit4:junit4]   2> 13474 T863 C69 P50828 oascsi.HttpClientUtil.createClient Creating new http client, config:connTimeout=5000&socketTimeout=20000&allowCompression=false&maxConnections=10000&maxConnectionsPerHost=10000
[junit4:junit4]   2> 13489 T863 C69 P50828 oash.SnapPuller.<init>  No value set for 'pollInterval'. Timer Task not started.
[junit4:junit4]   2> 13492 T824 C70 P50810 oash.ReplicationHandler.inform Commits will be reserved for  10000
[junit4:junit4]   2> 13492 T824 C70 P50810 REQ /replication {command=indexversion&wt=javabin&qt=/replication&version=2} status=0 QTime=1 
[junit4:junit4]   2> 13494 T863 C69 P50828 oash.SnapPuller.fetchLatestIndex Master's generation: 3
[junit4:junit4]   2> 13494 T863 C69 P50828 oash.SnapPuller.fetchLatestIndex Slave's generation: 2
[junit4:junit4]   2> 13494 T863 C69 P50828 oash.SnapPuller.fetchLatestIndex Starting replication process
[junit4:junit4]   2> 13499 T821 C70 P50810 REQ /replication {command=filelist&generation=3&wt=javabin&qt=/replication&version=2} status=0 QTime=3 
[junit4:junit4]   2> 13500 T863 C69 P50828 oash.SnapPuller.fetchLatestIndex Number of files in latest index in master: 11
[junit4:junit4]   2> 13506 T863 C69 P50828 oash.SnapPuller.fetchLatestIndex Starting download to .\org.apache.solr.cloud.BasicDistributedZk2Test-1355336156645\jetty3\index.20121213061610143 fullCopy=true
[junit4:junit4]   2> 13525 T822 C70 P50810 REQ /replication {file=_0_Lucene40_0.tim&command=filecontent&checksum=true&generation=3&qt=/replication&wt=filestream} status=0 QTime=9 
[junit4:junit4]   2> 13540 T826 C70 P50810 REQ /replication {file=_0.fnm&command=filecontent&checksum=true&generation=3&qt=/replication&wt=filestream} status=0 QTime=0 
[junit4:junit4]   2> 13547 T825 C70 P50810 REQ /replication {file=_0_Lucene40_0.frq&command=filecontent&checksum=true&generation=3&qt=/replication&wt=filestream} status=0 QTime=0 
[junit4:junit4]   2> 13552 T823 C70 P50810 REQ /replication {file=_0_nrm.cfe&command=filecontent&checksum=true&generation=3&qt=/replication&wt=filestream} status=0 QTime=0 
[junit4:junit4]   2> 13558 T824 C70 P50810 REQ /replication {file=_0.fdx&command=filecontent&checksum=true&generation=3&qt=/replication&wt=filestream} status=0 QTime=0 
[junit4:junit4]   2> 13570 T821 C70 P50810 REQ /replication {file=_0_nrm.cfs&command=filecontent&checksum=true&generation=3&qt=/replication&wt=filestream} status=0 QTime=0 
[junit4:junit4]   2> 13577 T822 C70 P50810 REQ /replication {file=_0_Lucene40_0.prx&command=filecontent&checksum=true&generation=3&qt=/replication&wt=filestream} status=0 QTime=0 
[junit4:junit4]   2> 13583 T826 C70 P50810 REQ /replication {file=_0.si&command=filecontent&checksum=true&generation=3&qt=/replication&wt=filestream} status=0 QTime=0 
[junit4:junit4]   2> 13589 T825 C70 P50810 REQ /replication {file=segments_3&command=filecontent&checksum=true&generation=3&qt=/replication&wt=filestream} status=0 QTime=0 
[junit4:junit4]   2> 13595 T823 C70 P50810 REQ /replication {file=_0.fdt&command=filecontent&checksum=true&generation=3&qt=/replication&wt=filestream} status=0 QTime=0 
[junit4:junit4]   2> 13600 T824 C70 P50810 REQ /replication {file=_0_Lucene40_0.tip&command=filecontent&checksum=true&generation=3&qt=/replication&wt=filestream} status=0 QTime=0 
[junit4:junit4]   2> 13604 T863 C69 P50828 oash.SnapPuller.fetchLatestIndex Total time taken for download : 0 secs
[junit4:junit4]   2> 13606 T863 C69 P50828 oash.SnapPuller.modifyIndexProps New index installed. Updating index properties... index=index.20121213061610143
[junit4:junit4]   2> 13611 T863 C69 P50828 oasu.DefaultSolrCoreState.newIndexWriter Creating new IndexWriter...
[junit4:junit4]   2> 13611 T863 C69 P50828 oasu.DefaultSolrCoreState.newIndexWriter Waiting until IndexWriter is unused... core=collection1
[junit4:junit4]   2> 13612 T863 C69 P50828 oasu.DefaultSolrCoreState.newIndexWriter Rollback old IndexWriter... core=collection1
[junit4:junit4]   2> 13618 T863 C69 P50828 oasc.SolrCore.getNewIndexDir New index directory detected: old=.\org.apache.solr.cloud.BasicDistributedZk2Test-1355336156645/jetty3\index/ new=.\org.apache.solr.cloud.BasicDistributedZk2Test-1355336156645/jetty3\index.20121213061610143
[junit4:junit4]   2> 13619 T863 C69 P50828 oasc.CachingDirectoryFactory.get return new directory for C:\Users\JenkinsSlave\workspace\Lucene-Solr-4.x-Windows\solr\build\solr-core\test\J0\.\org.apache.solr.cloud.BasicDistributedZk2Test-1355336156645\jetty3\index.20121213061610143 forceNew:true
[junit4:junit4]   2> 13626 T863 C69 P50828 oasc.SolrDeletionPolicy.onInit SolrDeletionPolicy.onInit: commits:num=1
[junit4:junit4]   2> 		commit{dir=RateLimitedDirectoryWrapper(org.apache.lucene.store.SimpleFSDirectory@C:\Users\JenkinsSlave\workspace\Lucene-Solr-4.x-Windows\solr\build\solr-core\test\J0\org.apache.solr.cloud.BasicDistributedZk2Test-1355336156645\jetty3\index.20121213061610143 lockFactory=org.apache.lucene.store.NativeFSLockFactory@630100),segFN=segments_3,generation=3,filenames=[_0_Lucene40_0.tim, _0.fnm, _0_Lucene40_0.frq, _0_nrm.cfe, _0.fdx, _0_nrm.cfs, _0_Lucene40_0.prx, _0.si, _0.fdt, segments_3, _0_Lucene40_0.tip]
[junit4:junit4]   2> 13627 T863 C69 P50828 oasc.SolrDeletionPolicy.updateCommits newest commit = 3
[junit4:junit4]   2> 13627 T863 C69 P50828 oasu.DefaultSolrCoreState.newIndexWriter New IndexWriter is ready to be used.
[junit4:junit4]   2> 13631 T863 C69 P50828 oass.SolrIndexSearcher.<init> Opening Searcher@f88ba0 main
[junit4:junit4]   2> 13632 T863 C69 P50828 oass.SolrIndexSearcher.getIndexDir WARNING WARNING: Directory impl does not support setting indexDir: org.apache.lucene.store.RateLimitedDirectoryWrapper
[junit4:junit4]   2> 13633 T862 oasc.SolrCore.registerSearcher [collection1] Registered new searcher Searcher@f88ba0 main{StandardDirectoryReader(segments_3:3:nrt _0(4.1):C1)}
[junit4:junit4]   2> 13634 T862 oasc.CachingDirectoryFactory.close Closing directory:C:\Users\JenkinsSlave\workspace\Lucene-Solr-4.x-Windows\solr\build\solr-core\test\J0\.\org.apache.solr.cloud.BasicDistributedZk2Test-1355336156645\jetty3\index
[junit4:junit4]   2> 13634 T862 oash.SnapPuller$2.onClose removing old index directory .\org.apache.solr.cloud.BasicDistributedZk2Test-1355336156645\jetty3\index
[junit4:junit4]   2> 13655 T863 C69 P50828 oasu.DirectUpdateHandler2.commit start commit{flags=0,_version_=0,optimize=false,openSearcher=false,waitSearcher=false,expungeDeletes=false,softCommit=false}
[junit4:junit4]   2> 13661 T863 C69 P50828 oasc.SolrDeletionPolicy.onCommit SolrDeletionPolicy.onCommit: commits:num=2
[junit4:junit4]   2> 		commit{dir=RateLimitedDirectoryWrapper(org.apache.lucene.store.SimpleFSDirectory@C:\Users\JenkinsSlave\workspace\Lucene-Solr-4.x-Windows\solr\build\solr-core\test\J0\org.apache.solr.cloud.BasicDistributedZk2Test-1355336156645\jetty3\index.20121213061610143 lockFactory=org.apache.lucene.store.NativeFSLockFactory@630100),segFN=segments_3,generation=3,filenames=[_0_Lucene40_0.tim, _0.fnm, _0_Lucene40_0.frq, _0_nrm.cfe, _0.fdx, _0_nrm.cfs, _0_Lucene40_0.prx, _0.si, _0.fdt, segments_3, _0_Lucene40_0.tip]
[junit4:junit4]   2> 		commit{dir=RateLimitedDirectoryWrapper(org.apache.lucene.store.SimpleFSDirectory@C:\Users\JenkinsSlave\workspace\Lucene-Solr-4.x-Windows\solr\build\solr-core\test\J0\org.apache.solr.cloud.BasicDistributedZk2Test-1355336156645\jetty3\index.20121213061610143 lockFactory=org.apache.lucene.store.NativeFSLockFactory@630100),segFN=segments_4,generation=4,filenames=[_0_Lucene40_0.tim, _0.fnm, _0_Lucene40_0.frq, _0_nrm.cfe, _0.fdx, _0_nrm.cfs, _0_Lucene40_0.prx, _0.si, _0.fdt, _0_Lucene40_0.tip, segments_4]
[junit4:junit4]   2> 13662 T863 C69 P50828 oasc.SolrDeletionPolicy.updateCommits newest commit = 4
[junit4:junit4]   2> 13664 T863 C69 P50828 oasu.DirectUpdateHandler2.commit end_commit_flush
[junit4:junit4]   2> 13664 T863 C69 P50828 oasc.RecoveryStrategy.replay No replay needed. core=collection1
[junit4:junit4]   2> 13664 T863 C69 P50828 oasc.RecoveryStrategy.doRecovery Replication Recovery was successful - registering as Active. core=collection1
[junit4:junit4]   2> 13664 T863 C69 P50828 oasc.ZkController.publish publishing core=collection1 state=active
[junit4:junit4]   2> 13664 T863 C69 P50828 oasc.ZkController.publish numShards not found on descriptor - reading it from system property
[junit4:junit4]   2> 13667 T863 C69 P50828 oasc.RecoveryStrategy.doRecovery Finished recovery process. core=collection1
[junit4:junit4]   2> 13866 T814 oascc.ZkStateReader.updateClusterState Updating cloud state from ZooKeeper... 
[junit4:junit4]   2> 13869 T814 oasc.Overseer$ClusterStateUpdater.updateState Update state numShards=2 message={
[junit4:junit4]   2> 	  "operation":"state",
[junit4:junit4]   2> 	  "numShards":"2",
[junit4:junit4]   2> 	  "shard":"shard1",
[junit4:junit4]   2> 	  "roles":null,
[junit4:junit4]   2> 	  "state":"active",
[junit4:junit4]   2> 	  "core":"collection1",
[junit4:junit4]   2> 	  "collection":"collection1",
[junit4:junit4]   2> 	  "node_name":"127.0.0.1:50828_solr",
[junit4:junit4]   2> 	  "base_url":"http://127.0.0.1:50828/solr"}
[junit4:junit4]   2> 13887 T860 oascc.ZkStateReader$2.process A cluster state change has occurred - updating... (5)
[junit4:junit4]   2> 13888 T813 oascc.ZkStateReader$2.process A cluster state change has occurred - updating... (5)
[junit4:junit4]   2> 13889 T877 oascc.ZkStateReader$2.process A cluster state change has occurred - updating... (5)
[junit4:junit4]   2> 13889 T845 oascc.ZkStateReader$2.process A cluster state change has occurred - updating... (5)
[junit4:junit4]   2> 13890 T883 oascc.ZkStateReader$2.process A cluster state change has occurred - updating... (5)
[junit4:junit4]   2> 13890 T885 oascc.ZkStateReader$2.process A cluster state change has occurred - updating... (5)
[junit4:junit4]   2> 13888 T830 oascc.ZkStateReader$2.process A cluster state change has occurred - updating... (5)
[junit4:junit4]   2> 14023 T791 oascc.ZkStateReader.updateClusterState Updating cloud state from ZooKeeper... 
[junit4:junit4]   2> 15026 T791 oascc.ZkStateReader.updateClusterState Updating cloud state from ZooKeeper... 
[junit4:junit4]   2> 15691 T880 C71 P50839 oasc.RecoveryStrategy.doRecovery Begin buffering updates. core=collection1
[junit4:junit4]   2> 15691 T880 C71 P50839 oasu.UpdateLog.bufferUpdates Starting to buffer updates. FSUpdateLog{state=ACTIVE, tlog=null}
[junit4:junit4]   2> 15692 T880 C71 P50839 oasc.RecoveryStrategy.replicate Attempting to replicate from http://127.0.0.1:50819/solr/collection1/. core=collection1
[junit4:junit4]   2> 15693 T880 C71 P50839 oascsi.HttpClientUtil.createClient Creating new http client, config:maxConnections=128&maxConnectionsPerHost=32&followRedirects=false
[junit4:junit4]   2> 15704 T839 C72 P50819 oasu.DirectUpdateHandler2.commit start commit{flags=0,_version_=0,optimize=false,openSearcher=false,waitSearcher=true,expungeDeletes=false,softCommit=false}
[junit4:junit4]   2> 15714 T839 C72 P50819 oasc.SolrDeletionPolicy.onCommit SolrDeletionPolicy.onCommit: commits:num=2
[junit4:junit4]   2> 		commit{dir=RateLimitedDirectoryWrapper(org.apache.lucene.store.SimpleFSDirectory@C:\Users\JenkinsSlave\workspace\Lucene-Solr-4.x-Windows\solr\build\solr-core\test\J0\org.apache.solr.cloud.BasicDistributedZk2Test-1355336156645\jetty2\index lockFactory=org.apache.lucene.store.NativeFSLockFactory@3af348),segFN=segments_2,generation=2,filenames=[segments_2]
[junit4:junit4]   2> 		commit{dir=RateLimitedDirectoryWrapper(org.apache.lucene.store.SimpleFSDirectory@C:\Users\JenkinsSlave\workspace\Lucene-Solr-4.x-Windows\solr\build\solr-core\test\J0\org.apache.solr.cloud.BasicDistributedZk2Test-1355336156645\jetty2\index lockFactory=org.apache.lucene.store.NativeFSLockFactory@3af348),segFN=segments_3,generation=3,filenames=[segments_3]
[junit4:junit4]   2> 15714 T839 C72 P50819 oasc.SolrDeletionPolicy.updateCommits newest commit = 3
[junit4:junit4]   2> 15717 T839 C72 P50819 oass.SolrIndexSearcher.<init> Opening Searcher@9948fd realtime
[junit4:junit4]   2> 15717 T839 C72 P50819 oass.SolrIndexSearcher.getIndexDir WARNING WARNING: Directory impl does not support setting indexDir: org.apache.lucene.store.RateLimitedDirectoryWrapper
[junit4:junit4]   2> 15718 T839 C72 P50819 oasu.DirectUpdateHandler2.commit end_commit_flush
[junit4:junit4]   2> 15718 T839 C72 P50819 /update {waitSearcher=true&openSearcher=false&commit=true&commit_end_point=true&wt=javabin&softCommit=false&version=2} {commit=} 0 14
[junit4:junit4]   2> 15719 T880 C71 P50839 oash.ReplicationHandler.inform Commits will be reserved for  10000
[junit4:junit4]   2> 15719 T880 C71 P50839 oash.SnapPuller.<init>  No value set for 'pollInterval'. Timer Task not started.
[junit4:junit4]   2> 15722 T840 C72 P50819 oash.ReplicationHandler.inform Commits will be reserved for  10000
[junit4:junit4]   2> 15722 T840 C72 P50819 REQ /replication {command=indexversion&wt=javabin&qt=/replication&version=2} status=0 QTime=1 
[junit4:junit4]   2> 15724 T880 C71 P50839 oash.SnapPuller.fetchLatestIndex Master's generation: 3
[junit4:junit4]   2> 15724 T880 C71 P50839 oash.SnapPuller.fetchLatestIndex Slave's generation: 1
[junit4:junit4]   2> 15724 T880 C71 P50839 oash.SnapPuller.fetchLatestIndex Starting replication process
[junit4:junit4]   2> 15727 T836 C72 P50819 REQ /replication {command=filelist&generation=3&wt=javabin&qt=/replication&version=2} status=0 QTime=1 
[junit4:junit4]   2> 15728 T880 C71 P50839 oash.SnapPuller.fetchLatestIndex Number of files in latest index in master: 1
[junit4:junit4]   2> 15731 T880 C71 P50839 oash.SnapPuller.fetchLatestIndex Starting download to .\org.apache.solr.cloud.BasicDistributedZk2Test-1355336156645\jetty4\index.20121213061612370 fullCopy=true
[junit4:junit4]   2> 15736 T837 C72 P50819 REQ /replication {file=segments_3&command=filecontent&checksum=true&generation=3&qt=/replication&wt=filestream} status=0 QTime=0 
[junit4:junit4]   2> 15739 T880 C71 P50839 oash.SnapPuller.fetchLatestIndex Total time taken for download : 0 secs
[junit4:junit4]   2> 15740 T880 C71 P50839 oash.SnapPuller.modifyIndexProps New index installed. Updating index properties... index=index.20121213061612370
[junit4:junit4]   2> 15743 T880 C71 P50839 oasu.DefaultSolrCoreState.newIndexWriter Creating new IndexWriter...
[junit4:junit4]   2> 15743 T880 C71 P50839 oasu.DefaultSolrCoreState.newIndexWriter Waiting until IndexWriter is unused... core=collection1
[junit4:junit4]   2> 15743 T880 C71 P50839 oasu.DefaultSolrCoreState.newIndexWriter Rollback old IndexWriter... core=collection1
[junit4:junit4]   2> 15748 T880 C71 P50839 oasc.SolrCore.getNewIndexDir New index directory detected: old=.\org.apache.solr.cloud.BasicDistributedZk2Test-1355336156645/jetty4\index/ new=.\org.apache.solr.cloud.BasicDistributedZk2Test-1355336156645/jetty4\index.20121213061612370
[junit4:junit4]   2> 15748 T880 C71 P50839 oasc.CachingDirectoryFactory.get return new directory for C:\Users\JenkinsSlave\workspace\Lucene-Solr-4.x-Windows\solr\build\solr-core\test\J0\.\org.apache.solr.cloud.BasicDistributedZk2Test-1355336156645\jetty4\index.20121213061612370 forceNew:true
[junit4:junit4]   2> 15752 T880 C71 P50839 oasc.SolrDeletionPolicy.onInit SolrDeletionPolicy.onInit: commits:num=1
[junit4:junit4]   2> 		commit{dir=RateLimitedDirectoryWrapper(org.apache.lucene.store.SimpleFSDirectory@C:\Users\JenkinsSlave\workspace\Lucene-Solr-4.x-Windows\solr\build\solr-core\test\J0\org.apache.solr.cloud.BasicDistributedZk2Test-1355336156645\jetty4\index.20121213061612370 lockFactory=org.apache.lucene.store.NativeFSLockFactory@12eddba),segFN=segments_3,generation=3,filenames=[segments_3]
[junit4:junit4]   2> 15753 T880 C71 P50839 oasc.SolrDeletionPolicy.updateCommits newest commit = 3
[junit4:junit4]   2> 15753 T880 C71 P50839 oasu.DefaultSolrCoreState.newIndexWriter New IndexWriter is ready to be used.
[junit4:junit4]   2> 15754 T880 C71 P50839 oass.SolrIndexSearcher.<init> Opening Searcher@10bb3e6 main
[junit4:junit4]   2> 15754 T880 C71 P50839 oass.SolrIndexSearcher.getIndexDir WARNING WARNING: Directory impl does not support setting indexDir: org.apache.lucene.store.RateLimitedDirectoryWrapper
[junit4:junit4]   2> 15755 T879 oasc.SolrCore.registerSearcher [collection1] Registered new searcher Searcher@10bb3e6 main{StandardDirectoryReader(segments_3:1:nrt)}
[junit4:junit4]   2> 15756 T879 oasc.CachingDirectoryFactory.close Closing directory:C:\Users\JenkinsSlave\workspace\Lucene-Solr-4.x-Windows\solr\build\solr-core\test\J0\.\org.apache.solr.cloud.BasicDistributedZk2Test-1355336156645\jetty4\index
[junit4:junit4]   2> 15756 T879 oash.SnapPuller$2.onClose removing old index directory .\org.apache.solr.cloud.BasicDistributedZk2Test-1355336156645\jetty4\index
[junit4:junit4]   2> 15760 T880 C71 P50839 oasu.DirectUpdateHandler2.commit start commit{flags=0,_version_=0,optimize=false,openSearcher=false,waitSearcher=false,expungeDeletes=false,softCommit=false}
[junit4:junit4]   2> 15767 T880 C71 P50839 oasc.SolrDeletionPolicy.onCommit SolrDeletionPolicy.onCommit: commits:num=2
[junit4:junit4]   2> 		commit{dir=RateLimitedDirectoryWrapper(org.apache.lucene.store.SimpleFSDirectory@C:\Users\JenkinsSlave\workspace\Lucene-Solr-4.x-Windows\solr\build\solr-core\test\J0\org.apache.solr.cloud.BasicDistributedZk2Test-1355336156645\jetty4\index.20121213061612370 lockFactory=org.apache.lucene.store.NativeFSLockFactory@12eddba),segFN=segments_3,generation=3,filenames=[segments_3]
[junit4:junit4]   2> 		commit{dir=RateLimitedDirectoryWrapper(org.apache.lucene.store.SimpleFSDirectory@C:\Users\JenkinsSlave\workspace\Lucene-Solr-4.x-Windows\solr\build\solr-core\test\J0\org.apache.solr.cloud.BasicDistributedZk2Test-1355336156645\jetty4\index.20121213061612370 lockFactory=org.apache.lucene.store.NativeFSLockFactory@12eddba),segFN=segments_4,generation=4,filenames=[segments_4]
[junit4:junit4]   2> 15767 T880 C71 P50839 oasc.SolrDeletionPolicy.updateCommits newest commit = 4
[junit4:junit4]   2> 15769 T880 C71 P50839 oasu.DirectUpdateHandler2.commit end_commit_flush
[junit4:junit4]   2> 15769 T880 C71 P50839 oasc.RecoveryStrategy.replay No replay needed. core=collection1
[junit4:junit4]   2> 15769 T880 C71 P50839 oasc.RecoveryStrategy.doRecovery Replication Recovery was successful - registering as Active. core=collection1
[junit4:junit4]   2> 15769 T880 C71 P50839 oasc.ZkController.publish publishing core=collection1 state=active
[junit4:junit4]   2> 15769 T880 C71 P50839 oasc.ZkController.publish numShards not found on descriptor - reading it from system property
[junit4:junit4]   2> 15772 T880 C71 P50839 oasc.RecoveryStrategy.doRecovery Finished recovery process. core=collection1
[junit4:junit4]   2> 15923 T814 oascc.ZkStateReader.updateClusterState Updating cloud state from ZooKeeper... 
[junit4:junit4]   2> 15926 T814 oasc.Overseer$ClusterStateUpdater.updateState Update state numShards=2 message={
[junit4:junit4]   2> 	  "operation":"state",
[junit4:junit4]   2> 	  "numShards":"2",

[...truncated too long message...]

luate(SystemPropertiesRestoreRule.java:53)
[junit4:junit4]    > 	at org.apache.lucene.util.TestRuleSetupTeardownChained$1.evaluate(TestRuleSetupTeardownChained.java:50)
[junit4:junit4]    > 	at org.apache.lucene.util.TestRuleFieldCacheSanity$1.evaluate(TestRuleFieldCacheSanity.java:51)
[junit4:junit4]    > 	at org.apache.lucene.util.AbstractBeforeAfterRule$1.evaluate(AbstractBeforeAfterRule.java:46)
[junit4:junit4]    > 	at com.carrotsearch.randomizedtesting.rules.SystemPropertiesInvariantRule$1.evaluate(SystemPropertiesInvariantRule.java:55)
[junit4:junit4]    > 	at org.apache.lucene.util.TestRuleThreadAndTestName$1.evaluate(TestRuleThreadAndTestName.java:49)
[junit4:junit4]    > 	at org.apache.lucene.util.TestRuleIgnoreAfterMaxFailures$1.evaluate(TestRuleIgnoreAfterMaxFailures.java:70)
[junit4:junit4]    > 	at org.apache.lucene.util.TestRuleMarkFailure$1.evaluate(TestRuleMarkFailure.java:48)
[junit4:junit4]    > 	at com.carrotsearch.randomizedtesting.rules.StatementAdapter.evaluate(StatementAdapter.java:36)
[junit4:junit4]    > 	at com.carrotsearch.randomizedtesting.ThreadLeakControl$StatementRunner.run(ThreadLeakControl.java:358)
[junit4:junit4]    > 	at com.carrotsearch.randomizedtesting.ThreadLeakControl.forkTimeoutingTask(ThreadLeakControl.java:782)
[junit4:junit4]    > 	at com.carrotsearch.randomizedtesting.ThreadLeakControl$3.evaluate(ThreadLeakControl.java:442)
[junit4:junit4]    > 	at com.carrotsearch.randomizedtesting.RandomizedRunner.runSingleTest(RandomizedRunner.java:746)
[junit4:junit4]    > 	at com.carrotsearch.randomizedtesting.RandomizedRunner$3.evaluate(RandomizedRunner.java:648)
[junit4:junit4]    > 	at com.carrotsearch.randomizedtesting.RandomizedRunner$4.evaluate(RandomizedRunner.java:682)
[junit4:junit4]    > 	at com.carrotsearch.randomizedtesting.RandomizedRunner$5.evaluate(RandomizedRunner.java:693)
[junit4:junit4]    > 	at com.carrotsearch.randomizedtesting.rules.StatementAdapter.evaluate(StatementAdapter.java:36)
[junit4:junit4]    > 	at com.carrotsearch.randomizedtesting.rules.SystemPropertiesRestoreRule$1.evaluate(SystemPropertiesRestoreRule.java:53)
[junit4:junit4]    > 	at org.apache.lucene.util.AbstractBeforeAfterRule$1.evaluate(AbstractBeforeAfterRule.java:46)
[junit4:junit4]    > 	at org.apache.lucene.util.TestRuleStoreClassName$1.evaluate(TestRuleStoreClassName.java:42)
[junit4:junit4]    > 	at com.carrotsearch.randomizedtesting.rules.SystemPropertiesInvariantRule$1.evaluate(SystemPropertiesInvariantRule.java:55)
[junit4:junit4]    > 	at com.carrotsearch.randomizedtesting.rules.NoShadowingOrOverridesOnMethodsRule$1.evaluate(NoShadowingOrOverridesOnMethodsRule.java:39)
[junit4:junit4]    > 	at com.carrotsearch.randomizedtesting.rules.NoShadowingOrOverridesOnMethodsRule$1.evaluate(NoShadowingOrOverridesOnMethodsRule.java:39)
[junit4:junit4]    > 	at com.carrotsearch.randomizedtesting.rules.StatementAdapter.evaluate(StatementAdapter.java:36)
[junit4:junit4]    > 	at org.apache.lucene.util.TestRuleAssertionsRequired$1.evaluate(TestRuleAssertionsRequired.java:43)
[junit4:junit4]    > 	at org.apache.lucene.util.TestRuleMarkFailure$1.evaluate(TestRuleMarkFailure.java:48)
[junit4:junit4]    > 	at org.apache.lucene.util.TestRuleIgnoreAfterMaxFailures$1.evaluate(TestRuleIgnoreAfterMaxFailures.java:70)
[junit4:junit4]    > 	at org.apache.lucene.util.TestRuleIgnoreTestSuites$1.evaluate(TestRuleIgnoreTestSuites.java:55)
[junit4:junit4]    > 	at com.carrotsearch.randomizedtesting.rules.StatementAdapter.evaluate(StatementAdapter.java:36)
[junit4:junit4]    > 	at com.carrotsearch.randomizedtesting.ThreadLeakControl$StatementRunner.run(ThreadLeakControl.java:358)
[junit4:junit4]    > 	at java.lang.Thread.run(Thread.java:662)
[junit4:junit4]   2> 235454 T3775 oas.SolrTestCaseJ4.deleteCore ###deleteCore
[junit4:junit4]   2> NOTE: test params are: codec=SimpleText, sim=DefaultSimilarity, locale=ar_SA, timezone=Etc/GMT-12
[junit4:junit4]   2> NOTE: Windows 7 6.1 x86/Sun Microsystems Inc. 1.6.0_37 (32-bit)/cpus=2,threads=1,free=40804064,total=340418560
[junit4:junit4]   2> NOTE: All tests run in this JVM: [TestPropInjectDefaults, TestSystemIdResolver, MinimalSchemaTest, UpdateParamsTest, HighlighterConfigTest, ClusterStateTest, TestStressReorder, CSVRequestHandlerTest, TestDocSet, TestSolrXMLSerializer, TestExtendedDismaxParser, DistanceFunctionTest, SortByFunctionTest, TermVectorComponentDistributedTest, TestLRUCache, TestSolrCoreProperties, DirectSolrSpellCheckerTest, SolrCoreTest, CurrencyFieldTest, AnalysisAfterCoreReloadTest, TestCSVLoader, TestPluginEnable, OpenExchangeRatesOrgProviderTest, TestJmxIntegration, SimpleFacetsTest, TestFiltering, HighlighterTest, TestValueSourceCache, TestCharFilters, LeaderElectionTest, IndexBasedSpellCheckerTest, PrimUtilsTest, TestCSVResponseWriter, TestDistributedSearch, BasicZkTest, SuggesterWFSTTest, DateMathParserTest, TestWriterPerf, ZkControllerTest, StandardRequestHandlerTest, TestSolrDeletionPolicy1, ResourceLoaderTest, SpatialFilterTest, TestUtils, TestDocumentBuilder, CopyFieldTest, ShowFileRequestHandlerTest, TestFuzzyAnalyzedSuggestions, PolyFieldTest, UUIDFieldTest, TestQueryUtils, QueryEqualityTest, CircularListTest, TestQueryTypes, TestQuerySenderNoQuery, OutputWriterTest, AlternateDirectoryTest, TestDefaultSimilarityFactory, OverseerCollectionProcessorTest, SampleTest, ClusterStateUpdateTest, FieldMutatingUpdateProcessorTest, BasicDistributedZk2Test, PluginInfoTest, IndexReaderFactoryTest, TestCoreContainer, TestGroupingSearch, SearchHandlerTest, UpdateRequestProcessorFactoryTest, CacheHeaderTest, TestIndexingPerformance, DistributedTermsComponentTest, MoreLikeThisHandlerTest, TestLMJelinekMercerSimilarityFactory, TestIndexSearcher, URLClassifyProcessorTest, PingRequestHandlerTest, TestJoin, TestStressLucene, ExternalFileFieldSortTest, SimplePostToolTest, TestStressRecovery, TestPropInject, SolrCmdDistributorTest, BasicFunctionalityTest, TestRealTimeGet, XmlUpdateRequestHandlerTest, JsonLoaderTest, NumericFieldsTest, TestReversedWildcardFilterFactory, PrimitiveFieldTypeTest, PathHierarchyTokenizerFactoryTest, FileBasedSpellCheckerTest, FastVectorHighlighterTest, SolrPluginUtilsTest, SolrInfoMBeanTest, BadComponentTest, LoggingHandlerTest, TestRemoteStreaming, SuggesterTest, BasicDistributedZkTest, SolrRequestParserTest, TestMergePolicyConfig, DOMUtilTest, LukeRequestHandlerTest, TestSuggestSpellingConverter, IndexSchemaRuntimeFieldTest, TestCodecSupport, XsltUpdateRequestHandlerTest, TestLFUCache, SystemInfoHandlerTest, ConvertedLegacyTest, DocumentAnalysisRequestHandlerTest, UniqFieldsUpdateProcessorFactoryTest, TermVectorComponentTest, SignatureUpdateProcessorFactoryTest, TestXIncludeConfig, DebugComponentTest, OverseerTest, RecoveryZkTest, SpellCheckComponentTest, FullSolrCloudDistribCmdsTest, TestReplicationHandler, LeaderElectionIntegrationTest, DistributedSpellCheckComponentTest, TestDistributedGrouping, TestRandomFaceting, SpellCheckCollatorTest, SoftAutoCommitTest, AutoCommitTest, ZkSolrClientTest, TestFaceting, WordBreakSolrSpellCheckerTest, TestHashPartitioner, StatsComponentTest, TestRecovery, TestRangeQuery, DirectUpdateHandlerTest, TestMultiCoreConfBootstrap, TestSort, PeerSyncTest, QueryElevationComponentTest, TestBinaryResponseWriter, CoreAdminHandlerTest, TestFunctionQuery, TestTrie, DirectSolrConnectionTest, TestWordDelimiterFilterFactory, DocumentBuilderTest, MBeansHandlerTest, DistributedQueryElevationComponentTest, TestPseudoReturnFields, DisMaxRequestHandlerTest, IndexSchemaTest, BinaryUpdateRequestHandlerTest, QueryParsingTest, TermsComponentTest, TestPHPSerializedResponseWriter, FieldAnalysisRequestHandlerTest, TestSurroundQueryParser, DirectUpdateHandlerOptimizeTest, TestSolrQueryParser, JSONWriterTest, ReturnFieldsTest, RequestHandlersTest, RequiredFieldsTest, TestOmitPositions, SuggesterFSTTest, TestArbitraryIndexDir, SuggesterTSTTest, TestSearchPerf, NotRequiredUniqueKeyTest, BadIndexSchemaTest, TestFoldingMultitermQuery, SolrCoreCheckLockOnStartupTest, TestLuceneMatchVersion, NoCacheHeaderTest, TestUpdate, TestBinaryField, TestSolrDeletionPolicy2, SOLR749Test, DefaultValueUpdateProcessorTest, TestQuerySenderListener, TestCollationField, SolrIndexConfigTest, TestNumberUtils, MultiTermTest, TestJmxMonitoredMap, TestConfig, EchoParamsTest, SpellPossibilityIteratorTest, TestBM25SimilarityFactory, TestPhraseSuggestions, TestLMDirichletSimilarityFactory, TestPerFieldSimilarity, LegacyHTMLStripCharFilterTest, TestDFRSimilarityFactory, TestIBSimilarityFactory, TimeZoneUtilsTest, TestFastLRUCache, FileUtilsTest, DateFieldTest, SpellingQueryConverterTest, TestBadConfig, RAMDirectoryFactoryTest, PreAnalyzedFieldTest, ZkNodePropsTest, TestCollationKeyRangeQueries, SyncSliceTest]
[junit4:junit4] Completed in 235.51s, 1 test, 1 failure <<< FAILURES!

[...truncated 69 lines...]
BUILD FAILED
C:\Users\JenkinsSlave\workspace\Lucene-Solr-4.x-Windows\build.xml:352: The following error occurred while executing this line:
C:\Users\JenkinsSlave\workspace\Lucene-Solr-4.x-Windows\build.xml:39: The following error occurred while executing this line:
C:\Users\JenkinsSlave\workspace\Lucene-Solr-4.x-Windows\solr\build.xml:178: The following error occurred while executing this line:
C:\Users\JenkinsSlave\workspace\Lucene-Solr-4.x-Windows\solr\common-build.xml:438: The following error occurred while executing this line:
C:\Users\JenkinsSlave\workspace\Lucene-Solr-4.x-Windows\lucene\common-build.xml:1175: The following error occurred while executing this line:
C:\Users\JenkinsSlave\workspace\Lucene-Solr-4.x-Windows\lucene\common-build.xml:839: There were test failures: 239 suites, 994 tests, 1 error, 2 failures, 12 ignored (7 assumptions)

Total time: 47 minutes 20 seconds
Build step 'Invoke Ant' marked build as failure
Archiving artifacts
Recording test results
Description set: Java: 32bit/jdk1.6.0_37 -server -XX:+UseConcMarkSweepGC
Email was triggered for: Failure
Sending email for trigger: Failure



Mime
View raw message