lucene-dev mailing list archives

Site index · List index
Message view « Date » · « Thread »
Top « Date » · « Thread »
From Policeman Jenkins Server <jenk...@sd-datasolutions.de>
Subject [JENKINS] Lucene-Solr-4.x-Windows (32bit/jdk1.6.0_37) - Build # 2147 - Still Failing!
Date Wed, 12 Dec 2012 17:02:10 GMT
Build: http://jenkins.sd-datasolutions.de/job/Lucene-Solr-4.x-Windows/2147/
Java: 32bit/jdk1.6.0_37 -client -XX:+UseConcMarkSweepGC

3 tests failed.
REGRESSION:  org.apache.solr.cloud.SyncSliceTest.testDistribSearch

Error Message:
There are still nodes recoverying - waited for 180 seconds

Stack Trace:
java.lang.AssertionError: There are still nodes recoverying - waited for 180 seconds
	at __randomizedtesting.SeedInfo.seed([6F2A9D0729B2DA39:EECC131F5EEDBA05]:0)
	at org.junit.Assert.fail(Assert.java:93)
	at org.apache.solr.cloud.AbstractDistribZkTestBase.waitForRecoveriesToFinish(AbstractDistribZkTestBase.java:165)
	at org.apache.solr.cloud.AbstractDistribZkTestBase.waitForRecoveriesToFinish(AbstractDistribZkTestBase.java:115)
	at org.apache.solr.cloud.AbstractDistribZkTestBase.waitForRecoveriesToFinish(AbstractDistribZkTestBase.java:110)
	at org.apache.solr.cloud.AbstractFullDistribZkTestBase.waitForRecoveriesToFinish(AbstractFullDistribZkTestBase.java:563)
	at org.apache.solr.cloud.SyncSliceTest.doTest(SyncSliceTest.java:224)
	at org.apache.solr.BaseDistributedSearchTestCase.testDistribSearch(BaseDistributedSearchTestCase.java:697)
	at sun.reflect.NativeMethodAccessorImpl.invoke0(Native Method)
	at sun.reflect.NativeMethodAccessorImpl.invoke(NativeMethodAccessorImpl.java:39)
	at sun.reflect.DelegatingMethodAccessorImpl.invoke(DelegatingMethodAccessorImpl.java:25)
	at java.lang.reflect.Method.invoke(Method.java:597)
	at com.carrotsearch.randomizedtesting.RandomizedRunner.invoke(RandomizedRunner.java:1559)
	at com.carrotsearch.randomizedtesting.RandomizedRunner.access$600(RandomizedRunner.java:79)
	at com.carrotsearch.randomizedtesting.RandomizedRunner$6.evaluate(RandomizedRunner.java:737)
	at com.carrotsearch.randomizedtesting.RandomizedRunner$7.evaluate(RandomizedRunner.java:773)
	at com.carrotsearch.randomizedtesting.RandomizedRunner$8.evaluate(RandomizedRunner.java:787)
	at com.carrotsearch.randomizedtesting.rules.SystemPropertiesRestoreRule$1.evaluate(SystemPropertiesRestoreRule.java:53)
	at org.apache.lucene.util.TestRuleSetupTeardownChained$1.evaluate(TestRuleSetupTeardownChained.java:50)
	at org.apache.lucene.util.TestRuleFieldCacheSanity$1.evaluate(TestRuleFieldCacheSanity.java:51)
	at org.apache.lucene.util.AbstractBeforeAfterRule$1.evaluate(AbstractBeforeAfterRule.java:46)
	at com.carrotsearch.randomizedtesting.rules.SystemPropertiesInvariantRule$1.evaluate(SystemPropertiesInvariantRule.java:55)
	at org.apache.lucene.util.TestRuleThreadAndTestName$1.evaluate(TestRuleThreadAndTestName.java:49)
	at org.apache.lucene.util.TestRuleIgnoreAfterMaxFailures$1.evaluate(TestRuleIgnoreAfterMaxFailures.java:70)
	at org.apache.lucene.util.TestRuleMarkFailure$1.evaluate(TestRuleMarkFailure.java:48)
	at com.carrotsearch.randomizedtesting.rules.StatementAdapter.evaluate(StatementAdapter.java:36)
	at com.carrotsearch.randomizedtesting.ThreadLeakControl$StatementRunner.run(ThreadLeakControl.java:358)
	at com.carrotsearch.randomizedtesting.ThreadLeakControl.forkTimeoutingTask(ThreadLeakControl.java:782)
	at com.carrotsearch.randomizedtesting.ThreadLeakControl$3.evaluate(ThreadLeakControl.java:442)
	at com.carrotsearch.randomizedtesting.RandomizedRunner.runSingleTest(RandomizedRunner.java:746)
	at com.carrotsearch.randomizedtesting.RandomizedRunner$3.evaluate(RandomizedRunner.java:648)
	at com.carrotsearch.randomizedtesting.RandomizedRunner$4.evaluate(RandomizedRunner.java:682)
	at com.carrotsearch.randomizedtesting.RandomizedRunner$5.evaluate(RandomizedRunner.java:693)
	at com.carrotsearch.randomizedtesting.rules.StatementAdapter.evaluate(StatementAdapter.java:36)
	at com.carrotsearch.randomizedtesting.rules.SystemPropertiesRestoreRule$1.evaluate(SystemPropertiesRestoreRule.java:53)
	at org.apache.lucene.util.AbstractBeforeAfterRule$1.evaluate(AbstractBeforeAfterRule.java:46)
	at org.apache.lucene.util.TestRuleStoreClassName$1.evaluate(TestRuleStoreClassName.java:42)
	at com.carrotsearch.randomizedtesting.rules.SystemPropertiesInvariantRule$1.evaluate(SystemPropertiesInvariantRule.java:55)
	at com.carrotsearch.randomizedtesting.rules.NoShadowingOrOverridesOnMethodsRule$1.evaluate(NoShadowingOrOverridesOnMethodsRule.java:39)
	at com.carrotsearch.randomizedtesting.rules.NoShadowingOrOverridesOnMethodsRule$1.evaluate(NoShadowingOrOverridesOnMethodsRule.java:39)
	at com.carrotsearch.randomizedtesting.rules.StatementAdapter.evaluate(StatementAdapter.java:36)
	at org.apache.lucene.util.TestRuleAssertionsRequired$1.evaluate(TestRuleAssertionsRequired.java:43)
	at org.apache.lucene.util.TestRuleMarkFailure$1.evaluate(TestRuleMarkFailure.java:48)
	at org.apache.lucene.util.TestRuleIgnoreAfterMaxFailures$1.evaluate(TestRuleIgnoreAfterMaxFailures.java:70)
	at org.apache.lucene.util.TestRuleIgnoreTestSuites$1.evaluate(TestRuleIgnoreTestSuites.java:55)
	at com.carrotsearch.randomizedtesting.rules.StatementAdapter.evaluate(StatementAdapter.java:36)
	at com.carrotsearch.randomizedtesting.ThreadLeakControl$StatementRunner.run(ThreadLeakControl.java:358)
	at java.lang.Thread.run(Thread.java:662)


FAILED:  org.apache.solr.cloud.BasicDistributedZk2Test.testDistribSearch

Error Message:
There are still nodes recoverying - waited for 180 seconds

Stack Trace:
java.lang.AssertionError: There are still nodes recoverying - waited for 180 seconds
	at __randomizedtesting.SeedInfo.seed([6F2A9D0729B2DA39:EECC131F5EEDBA05]:0)
	at org.junit.Assert.fail(Assert.java:93)
	at org.apache.solr.cloud.AbstractDistribZkTestBase.waitForRecoveriesToFinish(AbstractDistribZkTestBase.java:165)
	at org.apache.solr.cloud.AbstractDistribZkTestBase.waitForRecoveriesToFinish(AbstractDistribZkTestBase.java:115)
	at org.apache.solr.cloud.AbstractDistribZkTestBase.waitForRecoveriesToFinish(AbstractDistribZkTestBase.java:110)
	at org.apache.solr.cloud.AbstractFullDistribZkTestBase.waitForRecoveriesToFinish(AbstractFullDistribZkTestBase.java:563)
	at org.apache.solr.cloud.BasicDistributedZk2Test.brindDownShardIndexSomeDocsAndRecover(BasicDistributedZk2Test.java:321)
	at org.apache.solr.cloud.BasicDistributedZk2Test.doTest(BasicDistributedZk2Test.java:83)
	at org.apache.solr.BaseDistributedSearchTestCase.testDistribSearch(BaseDistributedSearchTestCase.java:697)
	at sun.reflect.NativeMethodAccessorImpl.invoke0(Native Method)
	at sun.reflect.NativeMethodAccessorImpl.invoke(NativeMethodAccessorImpl.java:39)
	at sun.reflect.DelegatingMethodAccessorImpl.invoke(DelegatingMethodAccessorImpl.java:25)
	at java.lang.reflect.Method.invoke(Method.java:597)
	at com.carrotsearch.randomizedtesting.RandomizedRunner.invoke(RandomizedRunner.java:1559)
	at com.carrotsearch.randomizedtesting.RandomizedRunner.access$600(RandomizedRunner.java:79)
	at com.carrotsearch.randomizedtesting.RandomizedRunner$6.evaluate(RandomizedRunner.java:737)
	at com.carrotsearch.randomizedtesting.RandomizedRunner$7.evaluate(RandomizedRunner.java:773)
	at com.carrotsearch.randomizedtesting.RandomizedRunner$8.evaluate(RandomizedRunner.java:787)
	at com.carrotsearch.randomizedtesting.rules.SystemPropertiesRestoreRule$1.evaluate(SystemPropertiesRestoreRule.java:53)
	at org.apache.lucene.util.TestRuleSetupTeardownChained$1.evaluate(TestRuleSetupTeardownChained.java:50)
	at org.apache.lucene.util.TestRuleFieldCacheSanity$1.evaluate(TestRuleFieldCacheSanity.java:51)
	at org.apache.lucene.util.AbstractBeforeAfterRule$1.evaluate(AbstractBeforeAfterRule.java:46)
	at com.carrotsearch.randomizedtesting.rules.SystemPropertiesInvariantRule$1.evaluate(SystemPropertiesInvariantRule.java:55)
	at org.apache.lucene.util.TestRuleThreadAndTestName$1.evaluate(TestRuleThreadAndTestName.java:49)
	at org.apache.lucene.util.TestRuleIgnoreAfterMaxFailures$1.evaluate(TestRuleIgnoreAfterMaxFailures.java:70)
	at org.apache.lucene.util.TestRuleMarkFailure$1.evaluate(TestRuleMarkFailure.java:48)
	at com.carrotsearch.randomizedtesting.rules.StatementAdapter.evaluate(StatementAdapter.java:36)
	at com.carrotsearch.randomizedtesting.ThreadLeakControl$StatementRunner.run(ThreadLeakControl.java:358)
	at com.carrotsearch.randomizedtesting.ThreadLeakControl.forkTimeoutingTask(ThreadLeakControl.java:782)
	at com.carrotsearch.randomizedtesting.ThreadLeakControl$3.evaluate(ThreadLeakControl.java:442)
	at com.carrotsearch.randomizedtesting.RandomizedRunner.runSingleTest(RandomizedRunner.java:746)
	at com.carrotsearch.randomizedtesting.RandomizedRunner$3.evaluate(RandomizedRunner.java:648)
	at com.carrotsearch.randomizedtesting.RandomizedRunner$4.evaluate(RandomizedRunner.java:682)
	at com.carrotsearch.randomizedtesting.RandomizedRunner$5.evaluate(RandomizedRunner.java:693)
	at com.carrotsearch.randomizedtesting.rules.StatementAdapter.evaluate(StatementAdapter.java:36)
	at com.carrotsearch.randomizedtesting.rules.SystemPropertiesRestoreRule$1.evaluate(SystemPropertiesRestoreRule.java:53)
	at org.apache.lucene.util.AbstractBeforeAfterRule$1.evaluate(AbstractBeforeAfterRule.java:46)
	at org.apache.lucene.util.TestRuleStoreClassName$1.evaluate(TestRuleStoreClassName.java:42)
	at com.carrotsearch.randomizedtesting.rules.SystemPropertiesInvariantRule$1.evaluate(SystemPropertiesInvariantRule.java:55)
	at com.carrotsearch.randomizedtesting.rules.NoShadowingOrOverridesOnMethodsRule$1.evaluate(NoShadowingOrOverridesOnMethodsRule.java:39)
	at com.carrotsearch.randomizedtesting.rules.NoShadowingOrOverridesOnMethodsRule$1.evaluate(NoShadowingOrOverridesOnMethodsRule.java:39)
	at com.carrotsearch.randomizedtesting.rules.StatementAdapter.evaluate(StatementAdapter.java:36)
	at org.apache.lucene.util.TestRuleAssertionsRequired$1.evaluate(TestRuleAssertionsRequired.java:43)
	at org.apache.lucene.util.TestRuleMarkFailure$1.evaluate(TestRuleMarkFailure.java:48)
	at org.apache.lucene.util.TestRuleIgnoreAfterMaxFailures$1.evaluate(TestRuleIgnoreAfterMaxFailures.java:70)
	at org.apache.lucene.util.TestRuleIgnoreTestSuites$1.evaluate(TestRuleIgnoreTestSuites.java:55)
	at com.carrotsearch.randomizedtesting.rules.StatementAdapter.evaluate(StatementAdapter.java:36)
	at com.carrotsearch.randomizedtesting.ThreadLeakControl$StatementRunner.run(ThreadLeakControl.java:358)
	at java.lang.Thread.run(Thread.java:662)


FAILED:  org.apache.solr.cloud.BasicDistributedZkTest.testDistribSearch

Error Message:
Server at http://127.0.0.1:62879/solr returned non ok status:500, message:Server Error

Stack Trace:
org.apache.solr.common.SolrException: Server at http://127.0.0.1:62879/solr returned non ok status:500, message:Server Error
	at __randomizedtesting.SeedInfo.seed([6F2A9D0729B2DA39:EECC131F5EEDBA05]:0)
	at org.apache.solr.client.solrj.impl.HttpSolrServer.request(HttpSolrServer.java:372)
	at org.apache.solr.client.solrj.impl.HttpSolrServer.request(HttpSolrServer.java:181)
	at org.apache.solr.client.solrj.request.CoreAdminRequest.process(CoreAdminRequest.java:429)
	at org.apache.solr.client.solrj.request.CoreAdminRequest.getStatus(CoreAdminRequest.java:472)
	at org.apache.solr.cloud.BasicDistributedZkTest.collectStartTimes(BasicDistributedZkTest.java:959)
	at org.apache.solr.cloud.BasicDistributedZkTest.testCollectionsAPI(BasicDistributedZkTest.java:795)
	at org.apache.solr.cloud.BasicDistributedZkTest.doTest(BasicDistributedZkTest.java:343)
	at org.apache.solr.BaseDistributedSearchTestCase.testDistribSearch(BaseDistributedSearchTestCase.java:697)
	at sun.reflect.NativeMethodAccessorImpl.invoke0(Native Method)
	at sun.reflect.NativeMethodAccessorImpl.invoke(NativeMethodAccessorImpl.java:39)
	at sun.reflect.DelegatingMethodAccessorImpl.invoke(DelegatingMethodAccessorImpl.java:25)
	at java.lang.reflect.Method.invoke(Method.java:597)
	at com.carrotsearch.randomizedtesting.RandomizedRunner.invoke(RandomizedRunner.java:1559)
	at com.carrotsearch.randomizedtesting.RandomizedRunner.access$600(RandomizedRunner.java:79)
	at com.carrotsearch.randomizedtesting.RandomizedRunner$6.evaluate(RandomizedRunner.java:737)
	at com.carrotsearch.randomizedtesting.RandomizedRunner$7.evaluate(RandomizedRunner.java:773)
	at com.carrotsearch.randomizedtesting.RandomizedRunner$8.evaluate(RandomizedRunner.java:787)
	at com.carrotsearch.randomizedtesting.rules.SystemPropertiesRestoreRule$1.evaluate(SystemPropertiesRestoreRule.java:53)
	at org.apache.lucene.util.TestRuleSetupTeardownChained$1.evaluate(TestRuleSetupTeardownChained.java:50)
	at org.apache.lucene.util.TestRuleFieldCacheSanity$1.evaluate(TestRuleFieldCacheSanity.java:51)
	at org.apache.lucene.util.AbstractBeforeAfterRule$1.evaluate(AbstractBeforeAfterRule.java:46)
	at com.carrotsearch.randomizedtesting.rules.SystemPropertiesInvariantRule$1.evaluate(SystemPropertiesInvariantRule.java:55)
	at org.apache.lucene.util.TestRuleThreadAndTestName$1.evaluate(TestRuleThreadAndTestName.java:49)
	at org.apache.lucene.util.TestRuleIgnoreAfterMaxFailures$1.evaluate(TestRuleIgnoreAfterMaxFailures.java:70)
	at org.apache.lucene.util.TestRuleMarkFailure$1.evaluate(TestRuleMarkFailure.java:48)
	at com.carrotsearch.randomizedtesting.rules.StatementAdapter.evaluate(StatementAdapter.java:36)
	at com.carrotsearch.randomizedtesting.ThreadLeakControl$StatementRunner.run(ThreadLeakControl.java:358)
	at com.carrotsearch.randomizedtesting.ThreadLeakControl.forkTimeoutingTask(ThreadLeakControl.java:782)
	at com.carrotsearch.randomizedtesting.ThreadLeakControl$3.evaluate(ThreadLeakControl.java:442)
	at com.carrotsearch.randomizedtesting.RandomizedRunner.runSingleTest(RandomizedRunner.java:746)
	at com.carrotsearch.randomizedtesting.RandomizedRunner$3.evaluate(RandomizedRunner.java:648)
	at com.carrotsearch.randomizedtesting.RandomizedRunner$4.evaluate(RandomizedRunner.java:682)
	at com.carrotsearch.randomizedtesting.RandomizedRunner$5.evaluate(RandomizedRunner.java:693)
	at com.carrotsearch.randomizedtesting.rules.StatementAdapter.evaluate(StatementAdapter.java:36)
	at com.carrotsearch.randomizedtesting.rules.SystemPropertiesRestoreRule$1.evaluate(SystemPropertiesRestoreRule.java:53)
	at org.apache.lucene.util.AbstractBeforeAfterRule$1.evaluate(AbstractBeforeAfterRule.java:46)
	at org.apache.lucene.util.TestRuleStoreClassName$1.evaluate(TestRuleStoreClassName.java:42)
	at com.carrotsearch.randomizedtesting.rules.SystemPropertiesInvariantRule$1.evaluate(SystemPropertiesInvariantRule.java:55)
	at com.carrotsearch.randomizedtesting.rules.NoShadowingOrOverridesOnMethodsRule$1.evaluate(NoShadowingOrOverridesOnMethodsRule.java:39)
	at com.carrotsearch.randomizedtesting.rules.NoShadowingOrOverridesOnMethodsRule$1.evaluate(NoShadowingOrOverridesOnMethodsRule.java:39)
	at com.carrotsearch.randomizedtesting.rules.StatementAdapter.evaluate(StatementAdapter.java:36)
	at org.apache.lucene.util.TestRuleAssertionsRequired$1.evaluate(TestRuleAssertionsRequired.java:43)
	at org.apache.lucene.util.TestRuleMarkFailure$1.evaluate(TestRuleMarkFailure.java:48)
	at org.apache.lucene.util.TestRuleIgnoreAfterMaxFailures$1.evaluate(TestRuleIgnoreAfterMaxFailures.java:70)
	at org.apache.lucene.util.TestRuleIgnoreTestSuites$1.evaluate(TestRuleIgnoreTestSuites.java:55)
	at com.carrotsearch.randomizedtesting.rules.StatementAdapter.evaluate(StatementAdapter.java:36)
	at com.carrotsearch.randomizedtesting.ThreadLeakControl$StatementRunner.run(ThreadLeakControl.java:358)
	at java.lang.Thread.run(Thread.java:662)




Build Log:
[...truncated 7938 lines...]
[junit4:junit4] Suite: org.apache.solr.cloud.BasicDistributedZk2Test
[junit4:junit4]   2> 4 T845 oas.SolrTestCaseJ4.setUp ###Starting testDistribSearch
[junit4:junit4]   2> Creating dataDir: C:\Users\JenkinsSlave\workspace\Lucene-Solr-4.x-Windows\solr\build\solr-core\test\J0\.\solrtest-BasicDistributedZk2Test-1355330288759
[junit4:junit4]   2> 9 T845 oasc.ZkTestServer.run STARTING ZK TEST SERVER
[junit4:junit4]   2> 10 T846 oasc.ZkTestServer$ZKServerMain.runFromConfig Starting server
[junit4:junit4]   2> 18 T846 oazs.ZooKeeperServer.setTickTime tickTime set to 1000
[junit4:junit4]   2> 18 T846 oazs.ZooKeeperServer.setMinSessionTimeout minSessionTimeout set to -1
[junit4:junit4]   2> 18 T846 oazs.ZooKeeperServer.setMaxSessionTimeout maxSessionTimeout set to -1
[junit4:junit4]   2> 21 T846 oazs.NIOServerCnxnFactory.configure binding to port 0.0.0.0/0.0.0.0:0
[junit4:junit4]   2> 22 T846 oazsp.FileTxnSnapLog.save Snapshotting: 0x0 to C:\Users\JenkinsSlave\workspace\Lucene-Solr-4.x-Windows\solr\build\solr-core\test\J0\.\org.apache.solr.cloud.BasicDistributedZk2Test-1355330288757\zookeeper\server1\data\version-2\snapshot.0
[junit4:junit4]   2> 151 T845 oasc.ZkTestServer.run start zk server on port:62211
[junit4:junit4]   2> 151 T845 oaz.ZooKeeper.<init> Initiating client connection, connectString=127.0.0.1:62211 sessionTimeout=10000 watcher=org.apache.solr.common.cloud.ConnectionManager@ab39e5
[junit4:junit4]   2> 153 T845 oascc.ConnectionManager.waitForConnected Waiting for client to connect to ZooKeeper
[junit4:junit4]   2> 155 T851 oaz.ClientCnxn$SendThread.logStartConnect Opening socket connection to server 127.0.0.1/127.0.0.1:62211. Will not attempt to authenticate using SASL (access denied (javax.security.auth.AuthPermission getLoginConfiguration))
[junit4:junit4]   2> 155 T851 oaz.ClientCnxn$SendThread.primeConnection Socket connection established to 127.0.0.1/127.0.0.1:62211, initiating session
[junit4:junit4]   2> 156 T847 oazs.NIOServerCnxnFactory.run Accepted socket connection from /127.0.0.1:62214
[junit4:junit4]   2> 156 T847 oazs.ZooKeeperServer.processConnectRequest Client attempting to establish new session at /127.0.0.1:62214
[junit4:junit4]   2> 156 T849 oazsp.FileTxnLog.append Creating new log file: log.1
[junit4:junit4]   2> 166 T849 oazs.ZooKeeperServer.finishSessionInit Established session 0x13b8ffafc8a0000 with negotiated timeout 10000 for client /127.0.0.1:62214
[junit4:junit4]   2> 167 T851 oaz.ClientCnxn$SendThread.onConnected Session establishment complete on server 127.0.0.1/127.0.0.1:62211, sessionid = 0x13b8ffafc8a0000, negotiated timeout = 10000
[junit4:junit4]   2> 167 T852 oascc.ConnectionManager.process Watcher org.apache.solr.common.cloud.ConnectionManager@ab39e5 name:ZooKeeperConnection Watcher:127.0.0.1:62211 got event WatchedEvent state:SyncConnected type:None path:null path:null type:None
[junit4:junit4]   2> 169 T845 oascc.ConnectionManager.waitForConnected Client is connected to ZooKeeper
[junit4:junit4]   2> 169 T845 oascc.SolrZkClient.makePath makePath: /solr
[junit4:junit4]   2> 174 T850 oazs.PrepRequestProcessor.pRequest2Txn Processed session termination for sessionid: 0x13b8ffafc8a0000
[junit4:junit4]   2> 177 T845 oaz.ZooKeeper.close Session: 0x13b8ffafc8a0000 closed
[junit4:junit4]   2> 178 T847 oazs.NIOServerCnxn.closeSock Closed socket connection for client /127.0.0.1:62214 which had sessionid 0x13b8ffafc8a0000
[junit4:junit4]   2> 178 T845 oaz.ZooKeeper.<init> Initiating client connection, connectString=127.0.0.1:62211/solr sessionTimeout=10000 watcher=org.apache.solr.common.cloud.ConnectionManager@1bd2e90
[junit4:junit4]   2> 177 T852 oaz.ClientCnxn$EventThread.run EventThread shut down
[junit4:junit4]   2> 181 T845 oascc.ConnectionManager.waitForConnected Waiting for client to connect to ZooKeeper
[junit4:junit4]   2> 181 T853 oaz.ClientCnxn$SendThread.logStartConnect Opening socket connection to server 127.0.0.1/127.0.0.1:62211. Will not attempt to authenticate using SASL (access denied (javax.security.auth.AuthPermission getLoginConfiguration))
[junit4:junit4]   2> 182 T853 oaz.ClientCnxn$SendThread.primeConnection Socket connection established to 127.0.0.1/127.0.0.1:62211, initiating session
[junit4:junit4]   2> 182 T847 oazs.NIOServerCnxnFactory.run Accepted socket connection from /127.0.0.1:62217
[junit4:junit4]   2> 182 T847 oazs.ZooKeeperServer.processConnectRequest Client attempting to establish new session at /127.0.0.1:62217
[junit4:junit4]   2> 187 T849 oazs.ZooKeeperServer.finishSessionInit Established session 0x13b8ffafc8a0001 with negotiated timeout 10000 for client /127.0.0.1:62217
[junit4:junit4]   2> 187 T853 oaz.ClientCnxn$SendThread.onConnected Session establishment complete on server 127.0.0.1/127.0.0.1:62211, sessionid = 0x13b8ffafc8a0001, negotiated timeout = 10000
[junit4:junit4]   2> 187 T854 oascc.ConnectionManager.process Watcher org.apache.solr.common.cloud.ConnectionManager@1bd2e90 name:ZooKeeperConnection Watcher:127.0.0.1:62211/solr got event WatchedEvent state:SyncConnected type:None path:null path:null type:None
[junit4:junit4]   2> 188 T845 oascc.ConnectionManager.waitForConnected Client is connected to ZooKeeper
[junit4:junit4]   2> 188 T845 oascc.SolrZkClient.makePath makePath: /collections/collection1
[junit4:junit4]   2> 196 T845 oascc.SolrZkClient.makePath makePath: /collections/collection1/shards
[junit4:junit4]   2> 202 T845 oascc.SolrZkClient.makePath makePath: /collections/control_collection
[junit4:junit4]   2> 207 T845 oascc.SolrZkClient.makePath makePath: /collections/control_collection/shards
[junit4:junit4]   2> 214 T845 oasc.AbstractZkTestCase.putConfig put C:\Users\JenkinsSlave\workspace\Lucene-Solr-4.x-Windows\solr\build\solr-core\test-files\solr\collection1\conf\solrconfig.xml to /configs/conf1/solrconfig.xml
[junit4:junit4]   2> 216 T845 oascc.SolrZkClient.makePath makePath: /configs/conf1/solrconfig.xml
[junit4:junit4]   2> 228 T845 oasc.AbstractZkTestCase.putConfig put C:\Users\JenkinsSlave\workspace\Lucene-Solr-4.x-Windows\solr\build\solr-core\test-files\solr\collection1\conf\schema.xml to /configs/conf1/schema.xml
[junit4:junit4]   2> 229 T845 oascc.SolrZkClient.makePath makePath: /configs/conf1/schema.xml
[junit4:junit4]   2> 236 T845 oasc.AbstractZkTestCase.putConfig put C:\Users\JenkinsSlave\workspace\Lucene-Solr-4.x-Windows\solr\build\solr-core\test-files\solr\collection1\conf\solrconfig.xml to /configs/conf1/solrconfig.xml
[junit4:junit4]   2> 238 T845 oascc.SolrZkClient.makePath makePath: /configs/conf1/solrconfig.xml
[junit4:junit4]   2> 245 T845 oasc.AbstractZkTestCase.putConfig put C:\Users\JenkinsSlave\workspace\Lucene-Solr-4.x-Windows\solr\build\solr-core\test-files\solr\collection1\conf\stopwords.txt to /configs/conf1/stopwords.txt
[junit4:junit4]   2> 246 T845 oascc.SolrZkClient.makePath makePath: /configs/conf1/stopwords.txt
[junit4:junit4]   2> 251 T845 oasc.AbstractZkTestCase.putConfig put C:\Users\JenkinsSlave\workspace\Lucene-Solr-4.x-Windows\solr\build\solr-core\test-files\solr\collection1\conf\protwords.txt to /configs/conf1/protwords.txt
[junit4:junit4]   2> 253 T845 oascc.SolrZkClient.makePath makePath: /configs/conf1/protwords.txt
[junit4:junit4]   2> 260 T845 oasc.AbstractZkTestCase.putConfig put C:\Users\JenkinsSlave\workspace\Lucene-Solr-4.x-Windows\solr\build\solr-core\test-files\solr\collection1\conf\currency.xml to /configs/conf1/currency.xml
[junit4:junit4]   2> 260 T845 oascc.SolrZkClient.makePath makePath: /configs/conf1/currency.xml
[junit4:junit4]   2> 267 T845 oasc.AbstractZkTestCase.putConfig put C:\Users\JenkinsSlave\workspace\Lucene-Solr-4.x-Windows\solr\build\solr-core\test-files\solr\collection1\conf\open-exchange-rates.json to /configs/conf1/open-exchange-rates.json
[junit4:junit4]   2> 268 T845 oascc.SolrZkClient.makePath makePath: /configs/conf1/open-exchange-rates.json
[junit4:junit4]   2> 275 T845 oasc.AbstractZkTestCase.putConfig put C:\Users\JenkinsSlave\workspace\Lucene-Solr-4.x-Windows\solr\build\solr-core\test-files\solr\collection1\conf\mapping-ISOLatin1Accent.txt to /configs/conf1/mapping-ISOLatin1Accent.txt
[junit4:junit4]   2> 276 T845 oascc.SolrZkClient.makePath makePath: /configs/conf1/mapping-ISOLatin1Accent.txt
[junit4:junit4]   2> 282 T845 oasc.AbstractZkTestCase.putConfig put C:\Users\JenkinsSlave\workspace\Lucene-Solr-4.x-Windows\solr\build\solr-core\test-files\solr\collection1\conf\old_synonyms.txt to /configs/conf1/old_synonyms.txt
[junit4:junit4]   2> 283 T845 oascc.SolrZkClient.makePath makePath: /configs/conf1/old_synonyms.txt
[junit4:junit4]   2> 290 T845 oasc.AbstractZkTestCase.putConfig put C:\Users\JenkinsSlave\workspace\Lucene-Solr-4.x-Windows\solr\build\solr-core\test-files\solr\collection1\conf\synonyms.txt to /configs/conf1/synonyms.txt
[junit4:junit4]   2> 290 T845 oascc.SolrZkClient.makePath makePath: /configs/conf1/synonyms.txt
[junit4:junit4]   2> 297 T850 oazs.PrepRequestProcessor.pRequest2Txn Processed session termination for sessionid: 0x13b8ffafc8a0001
[junit4:junit4]   2> 298 T854 oaz.ClientCnxn$EventThread.run EventThread shut down
[junit4:junit4]   2> 298 T847 oazs.NIOServerCnxn.closeSock Closed socket connection for client /127.0.0.1:62217 which had sessionid 0x13b8ffafc8a0001
[junit4:junit4]   2> 298 T845 oaz.ZooKeeper.close Session: 0x13b8ffafc8a0001 closed
[junit4:junit4]   2> 813 T845 oejs.Server.doStart jetty-8.1.8.v20121106
[junit4:junit4]   2> 827 T845 oejs.AbstractConnector.doStart Started SelectChannelConnector@0.0.0.0:62218
[junit4:junit4]   2> 828 T845 oasc.SolrResourceLoader.locateSolrHome JNDI not configured for solr (NoInitialContextEx)
[junit4:junit4]   2> 828 T845 oasc.SolrResourceLoader.locateSolrHome using system property solr.solr.home: C:\Users\JenkinsSlave\workspace\Lucene-Solr-4.x-Windows\solr\build\solr-core\test\J0\.\org.apache.solr.cloud.BasicDistributedZk2Test-controljetty-1355330289053
[junit4:junit4]   2> 830 T845 oasc.SolrResourceLoader.<init> new SolrResourceLoader for deduced Solr Home: 'C:\Users\JenkinsSlave\workspace\Lucene-Solr-4.x-Windows\solr\build\solr-core\test\J0\.\org.apache.solr.cloud.BasicDistributedZk2Test-controljetty-1355330289053\'
[junit4:junit4]   2> 885 T845 oass.SolrDispatchFilter.init SolrDispatchFilter.init()
[junit4:junit4]   2> 886 T845 oasc.SolrResourceLoader.locateSolrHome JNDI not configured for solr (NoInitialContextEx)
[junit4:junit4]   2> 886 T845 oasc.SolrResourceLoader.locateSolrHome using system property solr.solr.home: C:\Users\JenkinsSlave\workspace\Lucene-Solr-4.x-Windows\solr\build\solr-core\test\J0\.\org.apache.solr.cloud.BasicDistributedZk2Test-controljetty-1355330289053
[junit4:junit4]   2> 888 T845 oasc.CoreContainer$Initializer.initialize looking for solr.xml: C:\Users\JenkinsSlave\workspace\Lucene-Solr-4.x-Windows\solr\build\solr-core\test\J0\.\org.apache.solr.cloud.BasicDistributedZk2Test-controljetty-1355330289053\solr.xml
[junit4:junit4]   2> 888 T845 oasc.CoreContainer.<init> New CoreContainer 4798608
[junit4:junit4]   2> 889 T845 oasc.CoreContainer.load Loading CoreContainer using Solr Home: 'C:\Users\JenkinsSlave\workspace\Lucene-Solr-4.x-Windows\solr\build\solr-core\test\J0\.\org.apache.solr.cloud.BasicDistributedZk2Test-controljetty-1355330289053\'
[junit4:junit4]   2> 889 T845 oasc.SolrResourceLoader.<init> new SolrResourceLoader for directory: 'C:\Users\JenkinsSlave\workspace\Lucene-Solr-4.x-Windows\solr\build\solr-core\test\J0\.\org.apache.solr.cloud.BasicDistributedZk2Test-controljetty-1355330289053\'
[junit4:junit4]   2> 925 T845 oasc.CoreContainer.load Registering Log Listener
[junit4:junit4]   2> 975 T845 oasc.CoreContainer.initZooKeeper Zookeeper client=127.0.0.1:62211/solr
[junit4:junit4]   2> 976 T845 oasc.ZkController.checkChrootPath zkHost includes chroot
[junit4:junit4]   2> 977 T845 oaz.ZooKeeper.<init> Initiating client connection, connectString=127.0.0.1:62211 sessionTimeout=60000 watcher=org.apache.solr.common.cloud.ConnectionManager@1cd1c75
[junit4:junit4]   2> 979 T845 oascc.ConnectionManager.waitForConnected Waiting for client to connect to ZooKeeper
[junit4:junit4]   2> 982 T864 oaz.ClientCnxn$SendThread.logStartConnect Opening socket connection to server 127.0.0.1/127.0.0.1:62211. Will not attempt to authenticate using SASL (access denied (javax.security.auth.AuthPermission getLoginConfiguration))
[junit4:junit4]   2> 983 T864 oaz.ClientCnxn$SendThread.primeConnection Socket connection established to 127.0.0.1/127.0.0.1:62211, initiating session
[junit4:junit4]   2> 983 T847 oazs.NIOServerCnxnFactory.run Accepted socket connection from /127.0.0.1:62223
[junit4:junit4]   2> 984 T847 oazs.ZooKeeperServer.processConnectRequest Client attempting to establish new session at /127.0.0.1:62223
[junit4:junit4]   2> 1002 T849 oazs.ZooKeeperServer.finishSessionInit Established session 0x13b8ffafc8a0002 with negotiated timeout 20000 for client /127.0.0.1:62223
[junit4:junit4]   2> 1002 T864 oaz.ClientCnxn$SendThread.onConnected Session establishment complete on server 127.0.0.1/127.0.0.1:62211, sessionid = 0x13b8ffafc8a0002, negotiated timeout = 20000
[junit4:junit4]   2> 1002 T865 oascc.ConnectionManager.process Watcher org.apache.solr.common.cloud.ConnectionManager@1cd1c75 name:ZooKeeperConnection Watcher:127.0.0.1:62211 got event WatchedEvent state:SyncConnected type:None path:null path:null type:None
[junit4:junit4]   2> 1004 T845 oascc.ConnectionManager.waitForConnected Client is connected to ZooKeeper
[junit4:junit4]   2> 1006 T850 oazs.PrepRequestProcessor.pRequest2Txn Processed session termination for sessionid: 0x13b8ffafc8a0002
[junit4:junit4]   2> 1009 T845 oaz.ZooKeeper.close Session: 0x13b8ffafc8a0002 closed
[junit4:junit4]   2> 1011 T845 oaz.ZooKeeper.<init> Initiating client connection, connectString=127.0.0.1:62211/solr sessionTimeout=8000 watcher=org.apache.solr.common.cloud.ConnectionManager@1458f36
[junit4:junit4]   2> 1011 T847 oazs.NIOServerCnxn.closeSock Closed socket connection for client /127.0.0.1:62223 which had sessionid 0x13b8ffafc8a0002
[junit4:junit4]   2> 1011 T865 oaz.ClientCnxn$EventThread.run EventThread shut down
[junit4:junit4]   2> 1013 T845 oascc.ConnectionManager.waitForConnected Waiting for client to connect to ZooKeeper
[junit4:junit4]   2> 1013 T866 oaz.ClientCnxn$SendThread.logStartConnect Opening socket connection to server 127.0.0.1/127.0.0.1:62211. Will not attempt to authenticate using SASL (access denied (javax.security.auth.AuthPermission getLoginConfiguration))
[junit4:junit4]   2> 1016 T866 oaz.ClientCnxn$SendThread.primeConnection Socket connection established to 127.0.0.1/127.0.0.1:62211, initiating session
[junit4:junit4]   2> 1016 T847 oazs.NIOServerCnxnFactory.run Accepted socket connection from /127.0.0.1:62226
[junit4:junit4]   2> 1017 T847 oazs.ZooKeeperServer.processConnectRequest Client attempting to establish new session at /127.0.0.1:62226
[junit4:junit4]   2> 1020 T849 oazs.ZooKeeperServer.finishSessionInit Established session 0x13b8ffafc8a0003 with negotiated timeout 8000 for client /127.0.0.1:62226
[junit4:junit4]   2> 1020 T866 oaz.ClientCnxn$SendThread.onConnected Session establishment complete on server 127.0.0.1/127.0.0.1:62211, sessionid = 0x13b8ffafc8a0003, negotiated timeout = 8000
[junit4:junit4]   2> 1022 T867 oascc.ConnectionManager.process Watcher org.apache.solr.common.cloud.ConnectionManager@1458f36 name:ZooKeeperConnection Watcher:127.0.0.1:62211/solr got event WatchedEvent state:SyncConnected type:None path:null path:null type:None
[junit4:junit4]   2> 1023 T845 oascc.ConnectionManager.waitForConnected Client is connected to ZooKeeper
[junit4:junit4]   2> 1027 T850 oazs.PrepRequestProcessor.pRequest Got user-level KeeperException when processing sessionid:0x13b8ffafc8a0003 type:create cxid:0x2 zxid:0x1b txntype:-1 reqpath:n/a Error Path:/solr/overseer Error:KeeperErrorCode = NodeExists for /solr/overseer
[junit4:junit4]   2> 1031 T845 oascc.SolrZkClient.makePath makePath: /live_nodes
[junit4:junit4]   2> 1037 T845 oasc.ZkController.createEphemeralLiveNode Register node as live in ZooKeeper:/live_nodes/127.0.0.1:62218_solr
[junit4:junit4]   2> 1038 T850 oazs.PrepRequestProcessor.pRequest Got user-level KeeperException when processing sessionid:0x13b8ffafc8a0003 type:delete cxid:0x7 zxid:0x1d txntype:-1 reqpath:n/a Error Path:/solr/live_nodes/127.0.0.1:62218_solr Error:KeeperErrorCode = NoNode for /solr/live_nodes/127.0.0.1:62218_solr
[junit4:junit4]   2> 1051 T845 oascc.SolrZkClient.makePath makePath: /live_nodes/127.0.0.1:62218_solr
[junit4:junit4]   2> 1059 T845 oashc.HttpShardHandlerFactory.getParameter Setting socketTimeout to: 0
[junit4:junit4]   2> 1059 T845 oashc.HttpShardHandlerFactory.getParameter Setting urlScheme to: http://
[junit4:junit4]   2> 1060 T845 oashc.HttpShardHandlerFactory.getParameter Setting connTimeout to: 0
[junit4:junit4]   2> 1060 T845 oashc.HttpShardHandlerFactory.getParameter Setting maxConnectionsPerHost to: 20
[junit4:junit4]   2> 1060 T845 oashc.HttpShardHandlerFactory.getParameter Setting corePoolSize to: 0
[junit4:junit4]   2> 1060 T845 oashc.HttpShardHandlerFactory.getParameter Setting maximumPoolSize to: 2147483647
[junit4:junit4]   2> 1062 T845 oashc.HttpShardHandlerFactory.getParameter Setting maxThreadIdleTime to: 5
[junit4:junit4]   2> 1062 T845 oashc.HttpShardHandlerFactory.getParameter Setting sizeOfQueue to: -1
[junit4:junit4]   2> 1062 T845 oashc.HttpShardHandlerFactory.getParameter Setting fairnessPolicy to: false
[junit4:junit4]   2> 1062 T845 oascsi.HttpClientUtil.createClient Creating new http client, config:maxConnectionsPerHost=20&maxConnections=10000&socketTimeout=0&connTimeout=0&retry=false
[junit4:junit4]   2> 1075 T845 oascc.SolrZkClient.makePath makePath: /overseer_elect/election
[junit4:junit4]   2> 1089 T850 oazs.PrepRequestProcessor.pRequest Got user-level KeeperException when processing sessionid:0x13b8ffafc8a0003 type:delete cxid:0x15 zxid:0x22 txntype:-1 reqpath:n/a Error Path:/solr/overseer_elect/leader Error:KeeperErrorCode = NoNode for /solr/overseer_elect/leader
[junit4:junit4]   2> 1092 T845 oascc.SolrZkClient.makePath makePath: /overseer_elect/leader
[junit4:junit4]   2> 1099 T845 oasc.Overseer.start Overseer (id=88822925805355011-127.0.0.1:62218_solr-n_0000000000) starting
[junit4:junit4]   2> 1100 T850 oazs.PrepRequestProcessor.pRequest Got user-level KeeperException when processing sessionid:0x13b8ffafc8a0003 type:create cxid:0x1a zxid:0x24 txntype:-1 reqpath:n/a Error Path:/solr/overseer Error:KeeperErrorCode = NodeExists for /solr/overseer
[junit4:junit4]   2> 1103 T850 oazs.PrepRequestProcessor.pRequest Got user-level KeeperException when processing sessionid:0x13b8ffafc8a0003 type:create cxid:0x1b zxid:0x25 txntype:-1 reqpath:n/a Error Path:/solr/overseer Error:KeeperErrorCode = NodeExists for /solr/overseer
[junit4:junit4]   2> 1106 T850 oazs.PrepRequestProcessor.pRequest Got user-level KeeperException when processing sessionid:0x13b8ffafc8a0003 type:create cxid:0x1c zxid:0x26 txntype:-1 reqpath:n/a Error Path:/solr/overseer Error:KeeperErrorCode = NodeExists for /solr/overseer
[junit4:junit4]   2> 1110 T850 oazs.PrepRequestProcessor.pRequest Got user-level KeeperException when processing sessionid:0x13b8ffafc8a0003 type:create cxid:0x1d zxid:0x27 txntype:-1 reqpath:n/a Error Path:/solr/overseer Error:KeeperErrorCode = NodeExists for /solr/overseer
[junit4:junit4]   2> 1113 T869 oasc.OverseerCollectionProcessor.run Process current queue of collection messages
[junit4:junit4]   2> 1114 T845 oascc.SolrZkClient.makePath makePath: /clusterstate.json
[junit4:junit4]   2> 1122 T845 oascc.ZkStateReader.createClusterStateWatchersAndUpdate Updating cluster state from ZooKeeper... 
[junit4:junit4]   2> 1128 T868 oasc.Overseer$ClusterStateUpdater.run Starting to work on the main queue
[junit4:junit4]   2> 1138 T870 oasc.CoreContainer.create Creating SolrCore 'collection1' using instanceDir: C:\Users\JenkinsSlave\workspace\Lucene-Solr-4.x-Windows\solr\build\solr-core\test\J0\.\org.apache.solr.cloud.BasicDistributedZk2Test-controljetty-1355330289053\collection1
[junit4:junit4]   2> 1138 T870 oasc.ZkController.createCollectionZkNode Check for collection zkNode:control_collection
[junit4:junit4]   2> 1140 T870 oasc.ZkController.createCollectionZkNode Collection zkNode exists
[junit4:junit4]   2> 1140 T870 oasc.ZkController.readConfigName Load collection config from:/collections/control_collection
[junit4:junit4]   2> 1144 T870 oasc.SolrResourceLoader.<init> new SolrResourceLoader for directory: 'C:\Users\JenkinsSlave\workspace\Lucene-Solr-4.x-Windows\solr\build\solr-core\test\J0\.\org.apache.solr.cloud.BasicDistributedZk2Test-controljetty-1355330289053\collection1\'
[junit4:junit4]   2> 1146 T870 oasc.SolrResourceLoader.replaceClassLoader Adding 'file:/C:/Users/JenkinsSlave/workspace/Lucene-Solr-4.x-Windows/solr/build/solr-core/test/J0/org.apache.solr.cloud.BasicDistributedZk2Test-controljetty-1355330289053/collection1/lib/classes/' to classloader
[junit4:junit4]   2> 1149 T870 oasc.SolrResourceLoader.replaceClassLoader Adding 'file:/C:/Users/JenkinsSlave/workspace/Lucene-Solr-4.x-Windows/solr/build/solr-core/test/J0/org.apache.solr.cloud.BasicDistributedZk2Test-controljetty-1355330289053/collection1/lib/README' to classloader
[junit4:junit4]   2> 1245 T870 oasc.SolrConfig.<init> Using Lucene MatchVersion: LUCENE_41
[junit4:junit4]   2> 1404 T870 oasc.SolrConfig.<init> Loaded SolrConfig: solrconfig.xml
[junit4:junit4]   2> 1411 T870 oass.IndexSchema.readSchema Reading Solr Schema
[junit4:junit4]   2> 1426 T870 oass.IndexSchema.readSchema Schema name=test
[junit4:junit4]   2> 2651 T870 oass.OpenExchangeRatesOrgProvider.init Initialized with rates=open-exchange-rates.json, refreshInterval=1440.
[junit4:junit4]   2> 2668 T870 oass.IndexSchema.readSchema default search field in schema is text
[junit4:junit4]   2> 2676 T870 oass.IndexSchema.readSchema unique key field: id
[junit4:junit4]   2> 2708 T870 oass.FileExchangeRateProvider.reload Reloading exchange rates from file currency.xml
[junit4:junit4]   2> 2714 T870 oass.FileExchangeRateProvider.reload Reloading exchange rates from file currency.xml
[junit4:junit4]   2> 2722 T870 oass.OpenExchangeRatesOrgProvider.reload Reloading exchange rates from open-exchange-rates.json
[junit4:junit4]   2> 2726 T870 oass.OpenExchangeRatesOrgProvider.reload Reloading exchange rates from open-exchange-rates.json
[junit4:junit4]   2> 2729 T870 oasc.SolrCore.<init> [collection1] Opening new SolrCore at C:\Users\JenkinsSlave\workspace\Lucene-Solr-4.x-Windows\solr\build\solr-core\test\J0\.\org.apache.solr.cloud.BasicDistributedZk2Test-controljetty-1355330289053\collection1\, dataDir=.\org.apache.solr.cloud.BasicDistributedZk2Test-1355330288757/control/data\
[junit4:junit4]   2> 2729 T870 oasc.JmxMonitoredMap.<init> JMX monitoring is enabled. Adding Solr mbeans to JMX Server: com.sun.jmx.mbeanserver.JmxMBeanServer@165b7e
[junit4:junit4]   2> 2730 T870 oasc.SolrCore.getNewIndexDir New index directory detected: old=null new=.\org.apache.solr.cloud.BasicDistributedZk2Test-1355330288757/control/data\index/
[junit4:junit4]   2> 2732 T870 oasc.SolrCore.initIndex WARNING [collection1] Solr index directory '.\org.apache.solr.cloud.BasicDistributedZk2Test-1355330288757\control\data\index' doesn't exist. Creating new index...
[junit4:junit4]   2> 2733 T870 oasc.CachingDirectoryFactory.get return new directory for C:\Users\JenkinsSlave\workspace\Lucene-Solr-4.x-Windows\solr\build\solr-core\test\J0\.\org.apache.solr.cloud.BasicDistributedZk2Test-1355330288757\control\data\index forceNew:false
[junit4:junit4]   2> 2751 T870 oasc.SolrDeletionPolicy.onCommit SolrDeletionPolicy.onCommit: commits:num=1
[junit4:junit4]   2> 		commit{dir=RateLimitedDirectoryWrapper(NRTCachingDirectory(org.apache.lucene.store.SimpleFSDirectory@C:\Users\JenkinsSlave\workspace\Lucene-Solr-4.x-Windows\solr\build\solr-core\test\J0\org.apache.solr.cloud.BasicDistributedZk2Test-1355330288757\control\data\index lockFactory=org.apache.lucene.store.NativeFSLockFactory@1208bc8; maxCacheMB=48.0 maxMergeSizeMB=4.0)),segFN=segments_1,generation=1,filenames=[segments_1]
[junit4:junit4]   2> 2751 T870 oasc.SolrDeletionPolicy.updateCommits newest commit = 1
[junit4:junit4]   2> 2755 T870 oasc.SolrCore.initWriters created xml: solr.XMLResponseWriter
[junit4:junit4]   2> 2758 T870 oasup.UpdateRequestProcessorChain.init inserting DistributedUpdateProcessorFactory into updateRequestProcessorChain "dedupe"
[junit4:junit4]   2> 2758 T870 oasup.UpdateRequestProcessorChain.init inserting DistributedUpdateProcessorFactory into updateRequestProcessorChain "dedupe-allfields"
[junit4:junit4]   2> 2758 T870 oasup.UpdateRequestProcessorChain.init inserting DistributedUpdateProcessorFactory into updateRequestProcessorChain "stored_sig"
[junit4:junit4]   2> 2758 T870 oasup.UpdateRequestProcessorChain.init inserting DistributedUpdateProcessorFactory into updateRequestProcessorChain "uniq-fields"
[junit4:junit4]   2> 2759 T870 oasup.UpdateRequestProcessorChain.init inserting DistributedUpdateProcessorFactory into updateRequestProcessorChain "distrib-dup-test-chain-implicit"
[junit4:junit4]   2> 2759 T870 oasc.RequestHandlers.initHandlersFromConfig adding lazy requestHandler: solr.ReplicationHandler
[junit4:junit4]   2> 2759 T870 oasc.RequestHandlers.initHandlersFromConfig created /replication: solr.ReplicationHandler
[junit4:junit4]   2> 2759 T870 oasc.RequestHandlers.initHandlersFromConfig created standard: solr.StandardRequestHandler
[junit4:junit4]   2> 2762 T870 oasc.RequestHandlers.initHandlersFromConfig created /get: solr.RealTimeGetHandler
[junit4:junit4]   2> 2763 T870 oasc.RequestHandlers.initHandlersFromConfig created dismax: solr.SearchHandler
[junit4:junit4]   2> 2763 T870 oasc.RequestHandlers.initHandlersFromConfig created mock: org.apache.solr.core.MockQuerySenderListenerReqHandler
[junit4:junit4]   2> 2765 T870 oasc.RequestHandlers.initHandlersFromConfig created /admin/: org.apache.solr.handler.admin.AdminHandlers
[junit4:junit4]   2> 2765 T870 oasc.RequestHandlers.initHandlersFromConfig created defaults: solr.StandardRequestHandler
[junit4:junit4]   2> 2765 T870 oasc.RequestHandlers.initHandlersFromConfig adding lazy requestHandler: solr.StandardRequestHandler
[junit4:junit4]   2> 2765 T870 oasc.RequestHandlers.initHandlersFromConfig created lazy: solr.StandardRequestHandler
[junit4:junit4]   2> 2767 T870 oasc.RequestHandlers.initHandlersFromConfig created /update: solr.UpdateRequestHandler
[junit4:junit4]   2> 2767 T870 oasc.RequestHandlers.initHandlersFromConfig created /terms: org.apache.solr.handler.component.SearchHandler
[junit4:junit4]   2> 2769 T870 oasc.RequestHandlers.initHandlersFromConfig created spellCheckCompRH: org.apache.solr.handler.component.SearchHandler
[junit4:junit4]   2> 2770 T870 oasc.RequestHandlers.initHandlersFromConfig created spellCheckCompRH_Direct: org.apache.solr.handler.component.SearchHandler
[junit4:junit4]   2> 2772 T870 oasc.RequestHandlers.initHandlersFromConfig created spellCheckWithWordbreak: org.apache.solr.handler.component.SearchHandler
[junit4:junit4]   2> 2773 T870 oasc.RequestHandlers.initHandlersFromConfig created spellCheckWithWordbreak_Direct: org.apache.solr.handler.component.SearchHandler
[junit4:junit4]   2> 2776 T870 oasc.RequestHandlers.initHandlersFromConfig created spellCheckCompRH1: org.apache.solr.handler.component.SearchHandler
[junit4:junit4]   2> 2776 T870 oasc.RequestHandlers.initHandlersFromConfig created tvrh: org.apache.solr.handler.component.SearchHandler
[junit4:junit4]   2> 2778 T870 oasc.RequestHandlers.initHandlersFromConfig created /mlt: solr.MoreLikeThisHandler
[junit4:junit4]   2> 2780 T870 oasc.RequestHandlers.initHandlersFromConfig created /debug/dump: solr.DumpRequestHandler
[junit4:junit4]   2> 2792 T870 oashl.XMLLoader.init xsltCacheLifetimeSeconds=60
[junit4:junit4]   2> 2799 T870 oasc.SolrCore.initDeprecatedSupport WARNING solrconfig.xml uses deprecated <admin/gettableFiles>, Please update your config to use the ShowFileRequestHandler.
[junit4:junit4]   2> 2803 T870 oasc.SolrCore.initDeprecatedSupport WARNING adding ShowFileRequestHandler with hidden files: [SCHEMA.XML, OLD_SYNONYMS.TXT, STOPWORDS.TXT, PROTWORDS.TXT, OPEN-EXCHANGE-RATES.JSON, SYNONYMS.TXT, CURRENCY.XML, MAPPING-ISOLATIN1ACCENT.TXT]
[junit4:junit4]   2> 2810 T870 oass.SolrIndexSearcher.<init> Opening Searcher@11aeef1 main
[junit4:junit4]   2> 2810 T870 oass.SolrIndexSearcher.getIndexDir WARNING WARNING: Directory impl does not support setting indexDir: org.apache.lucene.store.RateLimitedDirectoryWrapper
[junit4:junit4]   2> 2814 T870 oasu.CommitTracker.<init> Hard AutoCommit: disabled
[junit4:junit4]   2> 2814 T870 oasu.CommitTracker.<init> Soft AutoCommit: disabled
[junit4:junit4]   2> 2814 T870 oashc.SpellCheckComponent.inform Initializing spell checkers
[junit4:junit4]   2> 2828 T870 oass.DirectSolrSpellChecker.init init: {name=direct,classname=DirectSolrSpellChecker,field=lowerfilt,minQueryLength=3}
[junit4:junit4]   2> 2926 T871 oasc.SolrCore.registerSearcher [collection1] Registered new searcher Searcher@11aeef1 main{StandardDirectoryReader(segments_1:1)}
[junit4:junit4]   2> 2932 T870 oasc.ZkController.publish publishing core=collection1 state=down
[junit4:junit4]   2> 2932 T870 oasc.ZkController.publish numShards not found on descriptor - reading it from system property
[junit4:junit4]   2> 2933 T850 oazs.PrepRequestProcessor.pRequest Got user-level KeeperException when processing sessionid:0x13b8ffafc8a0003 type:create cxid:0x56 zxid:0x2a txntype:-1 reqpath:n/a Error Path:/solr/overseer/queue Error:KeeperErrorCode = NoNode for /solr/overseer/queue
[junit4:junit4]   2> 2941 T870 oasc.CoreContainer.register registering core: collection1
[junit4:junit4]   2> 2941 T870 oasc.ZkController.register Register shard - core:collection1 address:http://127.0.0.1:62218/solr shardId:control_shard
[junit4:junit4]   2> 2943 T870 oascc.SolrZkClient.makePath makePath: /collections/control_collection/leader_elect/control_shard/election
[junit4:junit4]   2> 2956 T850 oazs.PrepRequestProcessor.pRequest Got user-level KeeperException when processing sessionid:0x13b8ffafc8a0003 type:delete cxid:0x65 zxid:0x31 txntype:-1 reqpath:n/a Error Path:/solr/collections/control_collection/leaders Error:KeeperErrorCode = NoNode for /solr/collections/control_collection/leaders
[junit4:junit4]   2> 2959 T870 oasc.ShardLeaderElectionContext.runLeaderProcess Running the leader process.
[junit4:junit4]   2> 2961 T850 oazs.PrepRequestProcessor.pRequest Got user-level KeeperException when processing sessionid:0x13b8ffafc8a0003 type:create cxid:0x66 zxid:0x32 txntype:-1 reqpath:n/a Error Path:/solr/overseer Error:KeeperErrorCode = NodeExists for /solr/overseer
[junit4:junit4]   2> 3264 T868 oascc.ZkStateReader.updateClusterState Updating cloud state from ZooKeeper... 
[junit4:junit4]   2> 3266 T868 oasc.Overseer$ClusterStateUpdater.updateState Update state numShards=null message={
[junit4:junit4]   2> 	  "operation":"state",
[junit4:junit4]   2> 	  "numShards":null,
[junit4:junit4]   2> 	  "shard":"control_shard",
[junit4:junit4]   2> 	  "roles":null,
[junit4:junit4]   2> 	  "state":"down",
[junit4:junit4]   2> 	  "core":"collection1",
[junit4:junit4]   2> 	  "collection":"control_collection",
[junit4:junit4]   2> 	  "node_name":"127.0.0.1:62218_solr",
[junit4:junit4]   2> 	  "base_url":"http://127.0.0.1:62218/solr"}
[junit4:junit4]   2> 3268 T850 oazs.PrepRequestProcessor.pRequest Got user-level KeeperException when processing sessionid:0x13b8ffafc8a0003 type:create cxid:0x6d zxid:0x34 txntype:-1 reqpath:n/a Error Path:/solr/overseer/queue-work Error:KeeperErrorCode = NoNode for /solr/overseer/queue-work
[junit4:junit4]   2> 3296 T867 oascc.ZkStateReader$2.process A cluster state change has occurred - updating... (1)
[junit4:junit4]   2> 3673 T870 oasc.ShardLeaderElectionContext.waitForReplicasToComeUp Enough replicas found to continue.
[junit4:junit4]   2> 3673 T870 oasc.ShardLeaderElectionContext.runLeaderProcess I may be the new leader - try and sync
[junit4:junit4]   2> 3673 T870 oasc.SyncStrategy.sync Sync replicas to http://127.0.0.1:62218/solr/collection1/
[junit4:junit4]   2> 3673 T870 oasc.SyncStrategy.syncReplicas Sync Success - now sync replicas to me
[junit4:junit4]   2> 3673 T870 oasc.SyncStrategy.syncToMe http://127.0.0.1:62218/solr/collection1/ has no replicas
[junit4:junit4]   2> 3674 T870 oasc.ShardLeaderElectionContext.runLeaderProcess I am the new leader: http://127.0.0.1:62218/solr/collection1/
[junit4:junit4]   2> 3674 T870 oascc.SolrZkClient.makePath makePath: /collections/control_collection/leaders/control_shard
[junit4:junit4]   2> 3687 T850 oazs.PrepRequestProcessor.pRequest Got user-level KeeperException when processing sessionid:0x13b8ffafc8a0003 type:create cxid:0x8c zxid:0x3f txntype:-1 reqpath:n/a Error Path:/solr/overseer Error:KeeperErrorCode = NodeExists for /solr/overseer
[junit4:junit4]   2> 4016 T868 oascc.ZkStateReader.updateClusterState Updating cloud state from ZooKeeper... 
[junit4:junit4]   2> 4096 T867 oascc.ZkStateReader$2.process A cluster state change has occurred - updating... (1)
[junit4:junit4]   2> 4196 T870 oasc.ZkController.register We are http://127.0.0.1:62218/solr/collection1/ and leader is http://127.0.0.1:62218/solr/collection1/
[junit4:junit4]   2> 4196 T870 oasc.ZkController.register No LogReplay needed for core=collection1 baseURL=http://127.0.0.1:62218/solr
[junit4:junit4]   2> 4196 T870 oasc.ZkController.checkRecovery I am the leader, no recovery necessary
[junit4:junit4]   2> 4196 T870 oasc.ZkController.publish publishing core=collection1 state=active
[junit4:junit4]   2> 4196 T870 oasc.ZkController.publish numShards not found on descriptor - reading it from system property
[junit4:junit4]   2> 4222 T870 oascc.ZkStateReader.updateClusterState Updating cloud state from ZooKeeper... 
[junit4:junit4]   2> 4225 T845 oass.SolrDispatchFilter.init user.dir=C:\Users\JenkinsSlave\workspace\Lucene-Solr-4.x-Windows\solr\build\solr-core\test\J0
[junit4:junit4]   2> 4225 T845 oass.SolrDispatchFilter.init SolrDispatchFilter.init() done
[junit4:junit4]   2> 4225 T845 oascsi.HttpClientUtil.createClient Creating new http client, config:maxConnections=128&maxConnectionsPerHost=32&followRedirects=false
[junit4:junit4]   2> 4724 T845 oejs.Server.doStart jetty-8.1.8.v20121106
[junit4:junit4]   2> 4730 T845 oejs.AbstractConnector.doStart Started SelectChannelConnector@0.0.0.0:62227
[junit4:junit4]   2> 4731 T845 oasc.SolrResourceLoader.locateSolrHome JNDI not configured for solr (NoInitialContextEx)
[junit4:junit4]   2> 4733 T845 oasc.SolrResourceLoader.locateSolrHome using system property solr.solr.home: C:\Users\JenkinsSlave\workspace\Lucene-Solr-4.x-Windows\solr\build\solr-core\test\J0\.\solrtest-jetty1-1355330292998
[junit4:junit4]   2> 4734 T845 oasc.SolrResourceLoader.<init> new SolrResourceLoader for deduced Solr Home: 'C:\Users\JenkinsSlave\workspace\Lucene-Solr-4.x-Windows\solr\build\solr-core\test\J0\.\solrtest-jetty1-1355330292998\'
[junit4:junit4]   2> 4792 T845 oass.SolrDispatchFilter.init SolrDispatchFilter.init()
[junit4:junit4]   2> 4793 T845 oasc.SolrResourceLoader.locateSolrHome JNDI not configured for solr (NoInitialContextEx)
[junit4:junit4]   2> 4793 T845 oasc.SolrResourceLoader.locateSolrHome using system property solr.solr.home: C:\Users\JenkinsSlave\workspace\Lucene-Solr-4.x-Windows\solr\build\solr-core\test\J0\.\solrtest-jetty1-1355330292998
[junit4:junit4]   2> 4796 T845 oasc.CoreContainer$Initializer.initialize looking for solr.xml: C:\Users\JenkinsSlave\workspace\Lucene-Solr-4.x-Windows\solr\build\solr-core\test\J0\.\solrtest-jetty1-1355330292998\solr.xml
[junit4:junit4]   2> 4796 T845 oasc.CoreContainer.<init> New CoreContainer 7691279
[junit4:junit4]   2> 4798 T845 oasc.CoreContainer.load Loading CoreContainer using Solr Home: 'C:\Users\JenkinsSlave\workspace\Lucene-Solr-4.x-Windows\solr\build\solr-core\test\J0\.\solrtest-jetty1-1355330292998\'
[junit4:junit4]   2> 4798 T845 oasc.SolrResourceLoader.<init> new SolrResourceLoader for directory: 'C:\Users\JenkinsSlave\workspace\Lucene-Solr-4.x-Windows\solr\build\solr-core\test\J0\.\solrtest-jetty1-1355330292998\'
[junit4:junit4]   2> 4839 T845 oasc.CoreContainer.load Registering Log Listener
[junit4:junit4]   2> 4853 T868 oascc.ZkStateReader.updateClusterState Updating cloud state from ZooKeeper... 
[junit4:junit4]   2> 4856 T868 oasc.Overseer$ClusterStateUpdater.updateState Update state numShards=null message={
[junit4:junit4]   2> 	  "operation":"state",
[junit4:junit4]   2> 	  "numShards":null,
[junit4:junit4]   2> 	  "shard":"control_shard",
[junit4:junit4]   2> 	  "roles":null,
[junit4:junit4]   2> 	  "state":"active",
[junit4:junit4]   2> 	  "core":"collection1",
[junit4:junit4]   2> 	  "collection":"control_collection",
[junit4:junit4]   2> 	  "node_name":"127.0.0.1:62218_solr",
[junit4:junit4]   2> 	  "base_url":"http://127.0.0.1:62218/solr"}
[junit4:junit4]   2> 4898 T845 oasc.CoreContainer.initZooKeeper Zookeeper client=127.0.0.1:62211/solr
[junit4:junit4]   2> 4900 T845 oasc.ZkController.checkChrootPath zkHost includes chroot
[junit4:junit4]   2> 4900 T845 oaz.ZooKeeper.<init> Initiating client connection, connectString=127.0.0.1:62211 sessionTimeout=60000 watcher=org.apache.solr.common.cloud.ConnectionManager@16c5d93
[junit4:junit4]   2> 4904 T867 oascc.ZkStateReader$2.process A cluster state change has occurred - updating... (1)
[junit4:junit4]   2> 4905 T845 oascc.ConnectionManager.waitForConnected Waiting for client to connect to ZooKeeper
[junit4:junit4]   2> 4907 T881 oaz.ClientCnxn$SendThread.logStartConnect Opening socket connection to server 127.0.0.1/127.0.0.1:62211. Will not attempt to authenticate using SASL (access denied (javax.security.auth.AuthPermission getLoginConfiguration))
[junit4:junit4]   2> 4908 T881 oaz.ClientCnxn$SendThread.primeConnection Socket connection established to 127.0.0.1/127.0.0.1:62211, initiating session
[junit4:junit4]   2> 4909 T847 oazs.NIOServerCnxnFactory.run Accepted socket connection from /127.0.0.1:62232
[junit4:junit4]   2> 4909 T847 oazs.ZooKeeperServer.processConnectRequest Client attempting to establish new session at /127.0.0.1:62232
[junit4:junit4]   2> 4916 T849 oazs.ZooKeeperServer.finishSessionInit Established session 0x13b8ffafc8a0004 with negotiated timeout 20000 for client /127.0.0.1:62232
[junit4:junit4]   2> 4916 T881 oaz.ClientCnxn$SendThread.onConnected Session establishment complete on server 127.0.0.1/127.0.0.1:62211, sessionid = 0x13b8ffafc8a0004, negotiated timeout = 20000
[junit4:junit4]   2> 4918 T882 oascc.ConnectionManager.process Watcher org.apache.solr.common.cloud.ConnectionManager@16c5d93 name:ZooKeeperConnection Watcher:127.0.0.1:62211 got event WatchedEvent state:SyncConnected type:None path:null path:null type:None
[junit4:junit4]   2> 4918 T845 oascc.ConnectionManager.waitForConnected Client is connected to ZooKeeper
[junit4:junit4]   2> 4922 T850 oazs.PrepRequestProcessor.pRequest2Txn Processed session termination for sessionid: 0x13b8ffafc8a0004
[junit4:junit4]   2> 4926 T847 oazs.NIOServerCnxn.doIO WARNING caught end of stream exception EndOfStreamException: Unable to read additional data from client sessionid 0x13b8ffafc8a0004, likely client has closed socket
[junit4:junit4]   2> 	at org.apache.zookeeper.server.NIOServerCnxn.doIO(NIOServerCnxn.java:220)
[junit4:junit4]   2> 	at org.apache.zookeeper.server.NIOServerCnxnFactory.run(NIOServerCnxnFactory.java:208)
[junit4:junit4]   2> 	at java.lang.Thread.run(Thread.java:662)
[junit4:junit4]   2> 
[junit4:junit4]   2> 4926 T845 oaz.ZooKeeper.close Session: 0x13b8ffafc8a0004 closed
[junit4:junit4]   2> 4926 T882 oaz.ClientCnxn$EventThread.run EventThread shut down
[junit4:junit4]   2> 4927 T847 oazs.NIOServerCnxn.closeSock Closed socket connection for client /127.0.0.1:62232 which had sessionid 0x13b8ffafc8a0004
[junit4:junit4]   2> 4929 T845 oaz.ZooKeeper.<init> Initiating client connection, connectString=127.0.0.1:62211/solr sessionTimeout=8000 watcher=org.apache.solr.common.cloud.ConnectionManager@1556819
[junit4:junit4]   2> 4931 T845 oascc.ConnectionManager.waitForConnected Waiting for client to connect to ZooKeeper
[junit4:junit4]   2> 4931 T883 oaz.ClientCnxn$SendThread.logStartConnect Opening socket connection to server 127.0.0.1/127.0.0.1:62211. Will not attempt to authenticate using SASL (access denied (javax.security.auth.AuthPermission getLoginConfiguration))
[junit4:junit4]   2> 4933 T883 oaz.ClientCnxn$SendThread.primeConnection Socket connection established to 127.0.0.1/127.0.0.1:62211, initiating session
[junit4:junit4]   2> 4934 T847 oazs.NIOServerCnxnFactory.run Accepted socket connection from /127.0.0.1:62235
[junit4:junit4]   2> 4934 T847 oazs.ZooKeeperServer.processConnectRequest Client attempting to establish new session at /127.0.0.1:62235
[junit4:junit4]   2> 4938 T849 oazs.ZooKeeperServer.finishSessionInit Established session 0x13b8ffafc8a0005 with negotiated timeout 8000 for client /127.0.0.1:62235
[junit4:junit4]   2> 4938 T883 oaz.ClientCnxn$SendThread.onConnected Session establishment complete on server 127.0.0.1/127.0.0.1:62211, sessionid = 0x13b8ffafc8a0005, negotiated timeout = 8000
[junit4:junit4]   2> 4938 T884 oascc.ConnectionManager.process Watcher org.apache.solr.common.cloud.ConnectionManager@1556819 name:ZooKeeperConnection Watcher:127.0.0.1:62211/solr got event WatchedEvent state:SyncConnected type:None path:null path:null type:None
[junit4:junit4]   2> 4940 T845 oascc.ConnectionManager.waitForConnected Client is connected to ZooKeeper
[junit4:junit4]   2> 4942 T850 oazs.PrepRequestProcessor.pRequest Got user-level KeeperException when processing sessionid:0x13b8ffafc8a0005 type:create cxid:0x1 zxid:0x4d txntype:-1 reqpath:n/a Error Path:/solr/overseer Error:KeeperErrorCode = NodeExists for /solr/overseer
[junit4:junit4]   2> 4945 T850 oazs.PrepRequestProcessor.pRequest Got user-level KeeperException when processing sessionid:0x13b8ffafc8a0005 type:create cxid:0x2 zxid:0x4e txntype:-1 reqpath:n/a Error Path:/solr/overseer Error:KeeperErrorCode = NodeExists for /solr/overseer
[junit4:junit4]   2> 4948 T845 oasc.ZkController.createEphemeralLiveNode Register node as live in ZooKeeper:/live_nodes/127.0.0.1:62227_solr
[junit4:junit4]   2> 4949 T850 oazs.PrepRequestProcessor.pRequest Got user-level KeeperException when processing sessionid:0x13b8ffafc8a0005 type:delete cxid:0x4 zxid:0x4f txntype:-1 reqpath:n/a Error Path:/solr/live_nodes/127.0.0.1:62227_solr Error:KeeperErrorCode = NoNode for /solr/live_nodes/127.0.0.1:62227_solr
[junit4:junit4]   2> 4952 T845 oascc.SolrZkClient.makePath makePath: /live_nodes/127.0.0.1:62227_solr
[junit4:junit4]   2> 4959 T867 oascc.ZkStateReader$2.process A cluster state change has occurred - updating... (1)
[junit4:junit4]   2> 4962 T845 oashc.HttpShardHandlerFactory.getParameter Setting socketTimeout to: 0
[junit4:junit4]   2> 4963 T867 oascc.ZkStateReader$3.process Updating live nodes... (2)
[junit4:junit4]   2> 4963 T845 oashc.HttpShardHandlerFactory.getParameter Setting urlScheme to: http://
[junit4:junit4]   2> 4965 T845 oashc.HttpShardHandlerFactory.getParameter Setting connTimeout to: 0
[junit4:junit4]   2> 4965 T845 oashc.HttpShardHandlerFactory.getParameter Setting maxConnectionsPerHost to: 20
[junit4:junit4]   2> 4965 T845 oashc.HttpShardHandlerFactory.getParameter Setting corePoolSize to: 0
[junit4:junit4]   2> 4966 T845 oashc.HttpShardHandlerFactory.getParameter Setting maximumPoolSize to: 2147483647
[junit4:junit4]   2> 4966 T845 oashc.HttpShardHandlerFactory.getParameter Setting maxThreadIdleTime to: 5
[junit4:junit4]   2> 4967 T845 oashc.HttpShardHandlerFactory.getParameter Setting sizeOfQueue to: -1
[junit4:junit4]   2> 4967 T845 oashc.HttpShardHandlerFactory.getParameter Setting fairnessPolicy to: false
[junit4:junit4]   2> 4967 T845 oascsi.HttpClientUtil.createClient Creating new http client, config:maxConnectionsPerHost=20&maxConnections=10000&socketTimeout=0&connTimeout=0&retry=false
[junit4:junit4]   2> 4995 T845 oascc.ZkStateReader.createClusterStateWatchersAndUpdate Updating cluster state from ZooKeeper... 
[junit4:junit4]   2> 5016 T885 oasc.CoreContainer.create Creating SolrCore 'collection1' using instanceDir: C:\Users\JenkinsSlave\workspace\Lucene-Solr-4.x-Windows\solr\build\solr-core\test\J0\.\solrtest-jetty1-1355330292998\collection1
[junit4:junit4]   2> 5016 T885 oasc.ZkController.createCollectionZkNode Check for collection zkNode:collection1
[junit4:junit4]   2> 5018 T885 oasc.ZkController.createCollectionZkNode Collection zkNode exists
[junit4:junit4]   2> 5018 T885 oasc.ZkController.readConfigName Load collection config from:/collections/collection1
[junit4:junit4]   2> 5022 T885 oasc.SolrResourceLoader.<init> new SolrResourceLoader for directory: 'C:\Users\JenkinsSlave\workspace\Lucene-Solr-4.x-Windows\solr\build\solr-core\test\J0\.\solrtest-jetty1-1355330292998\collection1\'
[junit4:junit4]   2> 5024 T885 oasc.SolrResourceLoader.replaceClassLoader Adding 'file:/C:/Users/JenkinsSlave/workspace/Lucene-Solr-4.x-Windows/solr/build/solr-core/test/J0/solrtest-jetty1-1355330292998/collection1/lib/classes/' to classloader
[junit4:junit4]   2> 5024 T885 oasc.SolrResourceLoader.replaceClassLoader Adding 'file:/C:/Users/JenkinsSlave/workspace/Lucene-Solr-4.x-Windows/solr/build/solr-core/test/J0/solrtest-jetty1-1355330292998/collection1/lib/README' to classloader
[junit4:junit4]   2> 5154 T885 oasc.SolrConfig.<init> Using Lucene MatchVersion: LUCENE_41
[junit4:junit4]   2> 5314 T885 oasc.SolrConfig.<init> Loaded SolrConfig: solrconfig.xml
[junit4:junit4]   2> 5316 T885 oass.IndexSchema.readSchema Reading Solr Schema
[junit4:junit4]   2> 5326 T885 oass.IndexSchema.readSchema Schema name=test
[junit4:junit4]   2> 6514 T885 oass.OpenExchangeRatesOrgProvider.init Initialized with rates=open-exchange-rates.json, refreshInterval=1440.
[junit4:junit4]   2> 6534 T885 oass.IndexSchema.readSchema default search field in schema is text
[junit4:junit4]   2> 6541 T885 oass.IndexSchema.readSchema unique key field: id
[junit4:junit4]   2> 6571 T885 oass.FileExchangeRateProvider.reload Reloading exchange rates from file currency.xml
[junit4:junit4]   2> 6579 T885 oass.FileExchangeRateProvider.reload Reloading exchange rates from file currency.xml
[junit4:junit4]   2> 6588 T885 oass.OpenExchangeRatesOrgProvider.reload Reloading exchange rates from open-exchange-rates.json
[junit4:junit4]   2> 6590 T885 oass.OpenExchangeRatesOrgProvider.reload Reloading exchange rates from open-exchange-rates.json
[junit4:junit4]   2> 6592 T885 oasc.SolrCore.<init> [collection1] Opening new SolrCore at C:\Users\JenkinsSlave\workspace\Lucene-Solr-4.x-Windows\solr\build\solr-core\test\J0\.\solrtest-jetty1-1355330292998\collection1\, dataDir=.\org.apache.solr.cloud.BasicDistributedZk2Test-1355330288757/jetty1\
[junit4:junit4]   2> 6592 T885 oasc.JmxMonitoredMap.<init> JMX monitoring is enabled. Adding Solr mbeans to JMX Server: com.sun.jmx.mbeanserver.JmxMBeanServer@165b7e
[junit4:junit4]   2> 6594 T885 oasc.SolrCore.getNewIndexDir New index directory detected: old=null new=.\org.apache.solr.cloud.BasicDistributedZk2Test-1355330288757/jetty1\index/
[junit4:junit4]   2> 6596 T885 oasc.SolrCore.initIndex WARNING [collection1] Solr index directory '.\org.apache.solr.cloud.BasicDistributedZk2Test-1355330288757\jetty1\index' doesn't exist. Creating new index...
[junit4:junit4]   2> 6597 T885 oasc.CachingDirectoryFactory.get return new directory for C:\Users\JenkinsSlave\workspace\Lucene-Solr-4.x-Windows\solr\build\solr-core\test\J0\.\org.apache.solr.cloud.BasicDistributedZk2Test-1355330288757\jetty1\index forceNew:false
[junit4:junit4]   2> 6615 T885 oasc.SolrDeletionPolicy.onCommit SolrDeletionPolicy.onCommit: commits:num=1
[junit4:junit4]   2> 		commit{dir=RateLimitedDirectoryWrapper(NRTCachingDirectory(org.apache.lucene.store.SimpleFSDirectory@C:\Users\JenkinsSlave\workspace\Lucene-Solr-4.x-Windows\solr\build\solr-core\test\J0\org.apache.solr.cloud.BasicDistributedZk2Test-1355330288757\jetty1\index lockFactory=org.apache.lucene.store.NativeFSLockFactory@bfd73e; maxCacheMB=48.0 maxMergeSizeMB=4.0)),segFN=segments_1,generation=1,filenames=[segments_1]
[junit4:junit4]   2> 6615 T885 oasc.SolrDeletionPolicy.updateCommits newest commit = 1
[junit4:junit4]   2> 6618 T885 oasc.SolrCore.initWriters created xml: solr.XMLResponseWriter
[junit4:junit4]   2> 6621 T885 oasup.UpdateRequestProcessorChain.init inserting DistributedUpdateProcessorFactory into updateRequestProcessorChain "dedupe"
[junit4:junit4]   2> 6621 T885 oasup.UpdateRequestProcessorChain.init inserting DistributedUpdateProcessorFactory into updateRequestProcessorChain "dedupe-allfields"
[junit4:junit4]   2> 6622 T885 oasup.UpdateRequestProcessorChain.init inserting DistributedUpdateProcessorFactory into updateRequestProcessorChain "stored_sig"
[junit4:junit4]   2> 6622 T885 oasup.UpdateRequestProcessorChain.init inserting DistributedUpdateProcessorFactory into updateRequestProcessorChain "uniq-fields"
[junit4:junit4]   2> 6622 T885 oasup.UpdateRequestProcessorChain.init inserting DistributedUpdateProcessorFactory into updateRequestProcessorChain "distrib-dup-test-chain-implicit"
[junit4:junit4]   2> 6623 T885 oasc.RequestHandlers.initHandlersFromConfig adding lazy requestHandler: solr.ReplicationHandler
[junit4:junit4]   2> 6623 T885 oasc.RequestHandlers.initHandlersFromConfig created /replication: solr.ReplicationHandler
[junit4:junit4]   2> 6625 T885 oasc.RequestHandlers.initHandlersFromConfig created standard: solr.StandardRequestHandler
[junit4:junit4]   2> 6626 T885 oasc.RequestHandlers.initHandlersFromConfig created /get: solr.RealTimeGetHandler
[junit4:junit4]   2> 6628 T885 oasc.RequestHandlers.initHandlersFromConfig created dismax: solr.SearchHandler
[junit4:junit4]   2> 6628 T885 oasc.RequestHandlers.initHandlersFromConfig created mock: org.apache.solr.core.MockQuerySenderListenerReqHandler
[junit4:junit4]   2> 6629 T885 oasc.RequestHandlers.initHandlersFromConfig created /admin/: org.apache.solr.handler.admin.AdminHandlers
[junit4:junit4]   2> 6630 T885 oasc.RequestHandlers.initHandlersFromConfig created defaults: solr.StandardRequestHandler
[junit4:junit4]   2> 6630 T885 oasc.RequestHandlers.initHandlersFromConfig adding lazy requestHandler: solr.StandardRequestHandler
[junit4:junit4]   2> 6630 T885 oasc.RequestHandlers.initHandlersFromConfig created lazy: solr.StandardRequestHandler
[junit4:junit4]   2> 6632 T885 oasc.RequestHandlers.initHandlersFromConfig created /update: solr.UpdateRequestHandler
[junit4:junit4]   2> 6633 T885 oasc.RequestHandlers.initHandlersFromConfig created /terms: org.apache.solr.handler.component.SearchHandler
[junit4:junit4]   2> 6634 T885 oasc.RequestHandlers.initHandlersFromConfig created spellCheckCompRH: org.apache.solr.handler.component.SearchHandler
[junit4:junit4]   2> 6636 T885 oasc.RequestHandlers.initHandlersFromConfig created spellCheckCompRH_Direct: org.apache.solr.handler.component.SearchHandler
[junit4:junit4]   2> 6636 T885 oasc.RequestHandlers.initHandlersFromConfig created spellCheckWithWordbreak: org.apache.solr.handler.component.SearchHandler
[junit4:junit4]   2> 6637 T885 oasc.RequestHandlers.initHandlersFromConfig created spellCheckWithWordbreak_Direct: org.apache.solr.handler.component.SearchHandler
[junit4:junit4]   2> 6639 T885 oasc.RequestHandlers.initHandlersFromConfig created spellCheckCompRH1: org.apache.solr.handler.component.SearchHandler
[junit4:junit4]   2> 6641 T885 oasc.RequestHandlers.initHandlersFromConfig created tvrh: org.apache.solr.handler.component.SearchHandler
[junit4:junit4]   2> 6643 T885 oasc.RequestHandlers.initHandlersFromConfig created /mlt: solr.MoreLikeThisHandler
[junit4:junit4]   2> 6643 T885 oasc.RequestHandlers.initHandlersFromConfig created /debug/dump: solr.DumpRequestHandler
[junit4:junit4]   2> 6655 T885 oashl.XMLLoader.init xsltCacheLifetimeSeconds=60
[junit4:junit4]   2> 6663 T885 oasc.SolrCore.initDeprecatedSupport WARNING solrconfig.xml uses deprecated <admin/gettableFiles>, Please update your config to use the ShowFileRequestHandler.
[junit4:junit4]   2> 6666 T885 oasc.SolrCore.initDeprecatedSupport WARNING adding ShowFileRequestHandler with hidden files: [SCHEMA.XML, OLD_SYNONYMS.TXT, STOPWORDS.TXT, PROTWORDS.TXT, OPEN-EXCHANGE-RATES.JSON, SYNONYMS.TXT, CURRENCY.XML, MAPPING-ISOLATIN1ACCENT.TXT]
[junit4:junit4]   2> 6672 T885 oass.SolrIndexSearcher.<init> Opening Searcher@74f72b main
[junit4:junit4]   2> 6674 T885 oass.SolrIndexSearcher.getIndexDir WARNING WARNING: Directory impl does not support setting indexDir: org.apache.lucene.store.RateLimitedDirectoryWrapper
[junit4:junit4]   2> 6676 T885 oasu.CommitTracker.<init> Hard AutoCommit: disabled
[junit4:junit4]   2> 6676 T885 oasu.CommitTracker.<init> Soft AutoCommit: disabled
[junit4:junit4]   2> 6677 T885 oashc.SpellCheckComponent.inform Initializing spell checkers
[junit4:junit4]   2> 6694 T885 oass.DirectSolrSpellChecker.init init: {name=direct,classname=DirectSolrSpellChecker,field=lowerfilt,minQueryLength=3}
[junit4:junit4]   2> 6779 T886 oasc.SolrCore.registerSearcher [collection1] Registered new searcher Searcher@74f72b main{StandardDirectoryReader(segments_1:1)}
[junit4:junit4]   2> 6789 T885 oasc.ZkController.publish publishing core=collection1 state=down
[junit4:junit4]   2> 6789 T885 oasc.ZkController.publish numShards not found on descriptor - reading it from system property
[junit4:junit4]   2> 7048 T868 oascc.ZkStateReader.updateClusterState Updating cloud state from ZooKeeper... 
[junit4:junit4]   2> 7050 T868 oasc.Overseer$ClusterStateUpdater.updateState Update state numShards=2 message={
[junit4:junit4]   2> 	  "operation":"state",
[junit4:junit4]   2> 	  "numShards":"2",
[junit4:junit4]   2> 	  "shard":null,
[junit4:junit4]   2> 	  "roles":null,
[junit4:junit4]   2> 	  "state":"down",
[junit4:junit4]   2> 	  "core":"collection1",
[junit4:junit4]   2> 	  "collection":"collection1",
[junit4:junit4]   2> 	  "node_name":"127.0.0.1:62227_solr",
[junit4:junit4]   2> 	  "base_url":"http://127.0.0.1:62227/solr"}
[junit4:junit4]   2> 7050 T868 oasc.Overseer$ClusterStateUpdater.createCollection Create collection collection1 with numShards 2
[junit4:junit4]   2> 7055 T868 oasc.Overseer$ClusterStateUpdater.updateState Assigning new node to shard shard=shard1
[junit4:junit4]   2> 7066 T884 oascc.ZkStateReader$2.process A cluster state change has occurred - updating... (2)
[junit4:junit4]   2> 7066 T867 oascc.ZkStateReader$2.process A cluster state change has occurred - updating... (2)
[junit4:junit4]   2> 7519 T885 oasc.CoreContainer.register registering core: collection1
[junit4:junit4]   2> 7519 T885 oasc.ZkController.register Register shard - core:collection1 address:http://127.0.0.1:62227/solr shardId:shard1
[junit4:junit4]   2> 7520 T885 oascc.SolrZkClient.makePath makePath: /collections/collection1/leader_elect/shard1/election
[junit4:junit4]   2> 7538 T850 oazs.PrepRequestProcessor.pRequest Got user-level KeeperException when processing sessionid:0x13b8ffafc8a0005 type:delete cxid:0x43 zxid:0x5b txntype:-1 reqpath:n/a Error Path:/solr/collections/collection1/leaders Error:KeeperErrorCode = NoNode for /solr/collections/collection1/leaders
[junit4:junit4]   2> 7539 T885 oasc.ShardLeaderElectionContext.runLeaderProcess Running the leader process.
[junit4:junit4]   2> 7541 T850 oazs.PrepRequestProcessor.pRequest Got user-level KeeperException when processing sessionid:0x13b8ffafc8a0005 type:create cxid:0x44 zxid:0x5c txntype:-1 reqpath:n/a Error Path:/solr/overseer Error:KeeperErrorCode = NodeExists for /solr/overseer
[junit4:junit4]   2> 7547 T885 oasc.ShardLeaderElectionContext.waitForReplicasToComeUp Enough replicas found to continue.
[junit4:junit4]   2> 7547 T885 oasc.ShardLeaderElectionContext.runLeaderProcess I may be the new leader - try and sync
[junit4:junit4]   2> 7548 T885 oasc.SyncStrategy.sync Sync replicas to http://127.0.0.1:62227/solr/collection1/
[junit4:junit4]   2> 7548 T885 oasc.SyncStrategy.syncReplicas Sync Success - now sync replicas to me
[junit4:junit4]   2> 7548 T885 oasc.SyncStrategy.syncToMe http://127.0.0.1:62227/solr/collection1/ has no replicas
[junit4:junit4]   2> 7548 T885 oasc.ShardLeaderElectionContext.runLeaderProcess I am the new leader: http://127.0.0.1:62227/solr/collection1/
[junit4:junit4]   2> 7550 T885 oascc.SolrZkClient.makePath makePath: /collections/collection1/leaders/shard1
[junit4:junit4]   2> 7566 T850 oazs.PrepRequestProcessor.pRequest Got user-level KeeperException when processing sessionid:0x13b8ffafc8a0005 type:create cxid:0x4e zxid:0x60 txntype:-1 reqpath:n/a Error Path:/solr/overseer Error:KeeperErrorCode = NodeExists for /solr/overseer
[junit4:junit4]   2> 7819 T868 oascc.ZkStateReader.updateClusterState Updating cloud state from ZooKeeper... 
[junit4:junit4]   2> 7844 T884 oascc.ZkStateReader$2.process A cluster state change has occurred - updating... (2)
[junit4:junit4]   2> 7844 T867 oascc.ZkStateReader$2.process A cluster state change has occurred - updating... (2)
[junit4:junit4]   2> 7876 T885 oasc.ZkController.register We are http://127.0.0.1:62227/solr/collection1/ and leader is http://127.0.0.1:62227/solr/collection1/
[junit4:junit4]   2> 7876 T885 oasc.ZkController.register No LogReplay needed for core=collection1 baseURL=http://127.0.0.1:62227/solr
[junit4:junit4]   2> 7876 T885 oasc.ZkController.checkRecovery I am the leader, no recovery necessary
[junit4:junit4]   2> 7878 T885 oasc.ZkController.publish publishing core=collection1 state=active
[junit4:junit4]   2> 7878 T885 oasc.ZkController.publish numShards not found on descriptor - reading it from system property
[junit4:junit4]   2> 7882 T885 oascc.ZkStateReader.updateClusterState Updating cloud state from ZooKeeper... 
[junit4:junit4]   2> 7885 T845 oass.SolrDispatchFilter.init user.dir=C:\Users\JenkinsSlave\workspace\Lucene-Solr-4.x-Windows\solr\build\solr-core\test\J0
[junit4:junit4]   2> 7885 T845 oass.SolrDispatchFilter.init SolrDispatchFilter.init() done
[junit4:junit4]   2> 7887 T845 oascsi.HttpClientUtil.createClient Creating new http client, config:maxConnections=128&maxConnectionsPerHost=32&followRedirects=false
[junit4:junit4]   2> 8364 T845 oejs.Server.doStart jetty-8.1.8.v20121106
[junit4:junit4]   2> 8371 T845 oejs.AbstractConnector.doStart Started SelectChannelConnector@0.0.0.0:62236
[junit4:junit4]   2> 8373 T845 oasc.SolrResourceLoader.locateSolrHome JNDI not configured for solr (NoInitialContextEx)
[junit4:junit4]   2> 8374 T845 oasc.SolrResourceLoader.locateSolrHome using system property solr.solr.home: C:\Users\JenkinsSlave\workspace\Lucene-Solr-4.x-Windows\solr\build\solr-core\test\J0\.\solrtest-jetty2-1355330296654
[junit4:junit4]   2> 8374 T845 oasc.SolrResourceLoader.<init> new SolrResourceLoader for deduced Solr Home: 'C:\Users\JenkinsSlave\workspace\Lucene-Solr-4.x-Windows\solr\build\solr-core\test\J0\.\solrtest-jetty2-1355330296654\'
[junit4:junit4]   2> 8430 T845 oass.SolrDispatchFilter.init SolrDispatchFilter.init()
[junit4:junit4]   2> 8431 T845 oasc.SolrResourceLoader.locateSolrHome JNDI not configured for solr (NoInitialContextEx)
[junit4:junit4]   2> 8431 T845 oasc.SolrResourceLoader.locateSolrHome using system property solr.solr.home: C:\Users\JenkinsSlave\workspace\Lucene-Solr-4.x-Windows\solr\build\solr-core\test\J0\.\solrtest-jetty2-1355330296654
[junit4:junit4]   2> 8433 T845 oasc.CoreContainer$Initializer.initialize looking for solr.xml: C:\Users\JenkinsSlave\workspace\Lucene-Solr-4.x-Windows\solr\build\solr-core\test\J0\.\solrtest-jetty2-1355330296654\solr.xml
[junit4:junit4]   2> 8433 T845 oasc.CoreContainer.<init> New CoreContainer 42858
[junit4:junit4]   2> 8434 T845 oasc.CoreContainer.load Loading CoreContainer using Solr Home: 'C:\Users\JenkinsSlave\workspace\Lucene-Solr-4.x-Windows\solr\build\solr-core\test\J0\.\solrtest-jetty2-1355330296654\'
[junit4:junit4]   2> 8434 T845 oasc.SolrResourceLoader.<init> new SolrResourceLoader for directory: 'C:\Users\JenkinsSlave\workspace\Lucene-Solr-4.x-Windows\solr\build\solr-core\test\J0\.\solrtest-jetty2-1355330296654\'
[junit4:junit4]   2> 8472 T845 oasc.CoreContainer.load Registering Log Listener
[junit4:junit4]   2> 8515 T845 oasc.CoreContainer.initZooKeeper Zookeeper client=127.0.0.1:62211/solr
[junit4:junit4]   2> 8516 T845 oasc.ZkController.checkChrootPath zkHost includes chroot
[junit4:junit4]   2> 8516 T845 oaz.ZooKeeper.<init> Initiating client connection, connectString=127.0.0.1:62211 sessionTimeout=60000 watcher=org.apache.solr.common.cloud.ConnectionManager@1dc3fb0
[junit4:junit4]   2> 8521 T845 oascc.ConnectionManager.waitForConnected Waiting for client to connect to ZooKeeper
[junit4:junit4]   2> 8521 T896 oaz.ClientCnxn$SendThread.logStartConnect Opening socket connection to server 127.0.0.1/127.0.0.1:62211. Will not attempt to authenticate using SASL (access denied (javax.security.auth.AuthPermission getLoginConfiguration))
[junit4:junit4]   2> 8522 T896 oaz.ClientCnxn$SendThread.primeConnection Socket connection established to 127.0.0.1/127.0.0.1:62211, initiating session
[junit4:junit4]   2> 8522 T847 oazs.NIOServerCnxnFactory.run Accepted socket connection from /127.0.0.1:62241
[junit4:junit4]   2> 8524 T847 oazs.ZooKeeperServer.processConnectRequest Client attempting to establish new session at /127.0.0.1:62241
[junit4:junit4]   2> 8540 T849 oazs.ZooKeeperServer.finishSessionInit Established session 0x13b8ffafc8a0006 with negotiated timeout 20000 for client /127.0.0.1:62241
[junit4:junit4]   2> 8540 T896 oaz.ClientCnxn$SendThread.onConnected Session establishment complete on server 127.0.0.1/127.0.0.1:62211, sessionid = 0x13b8ffafc8a0006, negotiated timeout = 20000
[junit4:junit4]   2> 8541 T897 oascc.ConnectionManager.process Watcher org.apache.solr.common.cloud.ConnectionManager@1dc3fb0 name:ZooKeeperConnection Watcher:127.0.0.1:62211 got event WatchedEvent state:SyncConnected type:None path:null path:null type:None
[junit4:junit4]   2> 8541 T845 oascc.ConnectionManager.waitForConnected Client is connected to ZooKeeper
[junit4:junit4]   2> 8544 T850 oazs.PrepRequestProcessor.pRequest2Txn Processed session termination for sessionid: 0x13b8ffafc8a0006
[junit4:junit4]   2> 8547 T847 oazs.NIOServerCnxn.closeSock Closed socket connection for client /127.0.0.1:62241 which had sessionid 0x13b8ffafc8a0006
[junit4:junit4]   2> 8547 T845 oaz.ZooKeeper.close Session: 0x13b8ffafc8a0006 closed
[junit4:junit4]   2> 8547 T897 oaz.ClientCnxn$EventThread.run EventThread shut down
[junit4:junit4]   2> 8549 T845 oaz.ZooKeeper.<init> Initiating client connection, connectString=127.0.0.1:62211/solr sessionTimeout=8000 watcher=org.apache.solr.common.cloud.ConnectionManager@1e6d7b6
[junit4:junit4]   2> 8552 T845 oascc.ConnectionManager.waitForConnected Waiting for client to connect to ZooKeeper
[junit4:junit4]   2> 8553 T898 oaz.ClientCnxn$SendThread.logStartConnect Opening socket connection to server 127.0.0.1/127.0.0.1:62211. Will not attempt to authenticate using SASL (access denied (javax.security.auth.AuthPermission getLoginConfiguration))
[junit4:junit4]   2> 8554 T898 oaz.ClientCnxn$SendThread.primeConnection Socket connection established to 127.0.0.1/127.0.0.1:62211, initiating session
[junit4:junit4]   2> 8554 T847 oazs.NIOServerCnxnFactory.run Accepted socket connection from /127.0.0.1:62244
[junit4:junit4]   2> 8554 T847 oazs.ZooKeeperServer.processConnectRequest Client attempting to establish new session at /127.0.0.1:62244
[junit4:junit4]   2> 8557 T849 oazs.ZooKeeperServer.finishSessionInit Established session 0x13b8ffafc8a0007 with negotiated timeout 8000 for client /127.0.0.1:62244
[junit4:junit4]   2> 8557 T898 oaz.ClientCnxn$SendThread.onConnected Session establishment complete on server 127.0.0.1/127.0.0.1:62211, sessionid = 0x13b8ffafc8a0007, negotiated timeout = 8000
[junit4:junit4]   2> 8559 T899 oascc.ConnectionManager.process Watcher org.apache.solr.common.cloud.ConnectionManager@1e6d7b6 name:ZooKeeperConnection Watcher:127.0.0.1:62211/solr got event WatchedEvent state:SyncConnected type:None path:null path:null type:None
[junit4:junit4]   2> 8559 T845 oascc.ConnectionManager.waitForConnected Client is connected to ZooKeeper
[junit4:junit4]   2> 8560 T850 oazs.PrepRequestProcessor.pRequest Got user-level KeeperException when processing sessionid:0x13b8ffafc8a0007 type:create cxid:0x1 zxid:0x6d txntype:-1 reqpath:n/a Error Path:/solr/overseer Error:KeeperErrorCode = NodeExists for /solr/overseer
[junit4:junit4]   2> 8563 T850 oazs.PrepRequestProcessor.pRequest Got user-level KeeperException when processing sessionid:0x13b8ffafc8a0007 type:create cxid:0x2 zxid:0x6e txntype:-1 reqpath:n/a Error Path:/solr/overseer Error:KeeperErrorCode = NodeExists for /solr/overseer
[junit4:junit4]   2> 8566 T845 oasc.ZkController.createEphemeralLiveNode Register node as live in ZooKeeper:/live_nodes/127.0.0.1:62236_solr
[junit4:junit4]   2> 8568 T850 oazs.PrepRequestProcessor.pRequest Got user-level KeeperException when processing sessionid:0x13b8ffafc8a0007 type:delete cxid:0x4 zxid:0x6f txntype:-1 reqpath:n/a Error Path:/solr/live_nodes/127.0.0.1:62236_solr Error:KeeperErrorCode = NoNode for /solr/live_nodes/127.0.0.1:62236_solr
[junit4:junit4]   2> 8571 T845 oascc.SolrZkClient.makePath makePath: /live_nodes/127.0.0.1:62236_solr
[junit4:junit4]   2> 8576 T867 oascc.ZkStateReader$2.process A cluster state change has occurred - updating... (2)
[junit4:junit4]   2> 8578 T884 oascc.ZkStateReader$3.process Updating live nodes... (3)
[junit4:junit4]   2> 8578 T884 oascc.ZkStateReader$2.process A cluster state change has occurred - updating... (3)
[junit4:junit4]   2> 8582 T845 oashc.HttpShardHandlerFactory.getParameter Setting socketTimeout to: 0
[junit4:junit4]   2> 8584 T845 oashc.HttpShardHandlerFactory.getParameter Setting urlScheme to: http://
[junit4:junit4]   2> 8584 T845 oashc.HttpShardHandlerFactory.getParameter Setting connTimeout to: 0
[junit4:junit4]   2> 8585 T845 oashc.HttpShardHandlerFactory.getParameter Setting maxConnectionsPerHost to: 20
[junit4:junit4]   2> 8585 T867 oascc.ZkStateReader$3.process Updating live nodes... (3)
[junit4:junit4]   2> 8585 T845 oashc.HttpShardHandlerFactory.getParameter Setting corePoolSize to: 0
[junit4:junit4]   2> 8587 T845 oashc.HttpShardHandlerFactory.getParameter Setting maximumPoolSize to: 2147483647
[junit4:junit4]   2> 8587 T845 oashc.HttpShardHandlerFactory.getParameter Setting maxThreadIdleTime to: 5
[junit4:junit4]   2> 8587 T845 oashc.HttpShardHandlerFactory.getParameter Setting sizeOfQueue to: -1
[junit4:junit4]   2> 8587 T845 oashc.HttpShardHandlerFactory.getParameter Setting fairnessPolicy to: false
[junit4:junit4]   2> 8588 T845 oascsi.HttpClientUtil.createClient Creating new http client, config:maxConnectionsPerHost=20&maxConnections=10000&socketTimeout=0&connTimeout=0&retry=false
[junit4:junit4]   2> 8604 T845 oascc.ZkStateReader.createClusterStateWatchersAndUpdate Updating cluster state from ZooKeeper... 
[junit4:junit4]   2> 8609 T868 oascc.ZkStateReader.updateClusterState Updating cloud state from ZooKeeper... 
[junit4:junit4]   2> 8610 T868 oasc.Overseer$ClusterStateUpdater.updateState Update state numShards=2 message={
[junit4:junit4]   2> 	  "operation":"state",
[junit4:junit4]   2> 	  "numShards":"2",
[junit4:junit4]   2> 	  "shard":"shard1",
[junit4:junit4]   2> 	  "roles":null,
[junit4:junit4]   2> 	  "state":"active",
[junit4:junit4]   2> 	  "core":"collection1",
[junit4:junit4]   2> 	  "collection":"collection1",
[junit4:junit4]   2> 	  "node_name":"127.0.0.1:62227_solr",
[junit4:junit4]   2> 	  "base_url":"http://127.0.0.1:62227/solr"}
[junit4:junit4]   2> 8623 T900 oasc.CoreContainer.create Creating SolrCore 'collection1' using instanceDir: C:\Users\JenkinsSlave\workspace\Lucene-Solr-4.x-Windows\solr\build\solr-core\test\J0\.\solrtest-jetty2-1355330296654\collection1
[junit4:junit4]   2> 8623 T900 oasc.ZkController.createCollectionZkNode Check for collection zkNode:collection1
[junit4:junit4]   2> 8641 T867 oascc.ZkStateReader$2.process A cluster state change has occurred - updating... (3)
[junit4:junit4]   2> 8641 T899 oascc.ZkStateReader$2.process A cluster state change has occurred - updating... (3)
[junit4:junit4]   2> 8641 T884 oascc.ZkStateReader$2.process A cluster state change has occurred - updating... (3)
[junit4:junit4]   2> 8641 T900 oasc.ZkController.createCollectionZkNode Collection zkNode exists
[junit4:junit4]   2> 8642 T900 oasc.ZkController.readConfigName Load collection config from:/collections/collection1
[junit4:junit4]   2> 8657 T900 oasc.SolrResourceLoader.<init> new SolrResourceLoader for directory: 'C:\Users\JenkinsSlave\workspace\Lucene-Solr-4.x-Windows\solr\build\solr-core\test\J0\.\solrtest-jetty2-1355330296654\collection1\'
[junit4:junit4]   2> 8660 T900 oasc.SolrResourceLoader.replaceClassLoader Adding 'file:/C:/Users/JenkinsSlave/workspace/Lucene-Solr-4.x-Windows/solr/build/solr-core/test/J0/solrtest-jetty2-1355330296654/collection1/lib/classes/' to classloader
[junit4:junit4]   2> 8661 T900 oasc.SolrResourceLoader.replaceClassLoader Adding 'file:/C:/Users/JenkinsSlave/workspace/Lucene-Solr-4.x-Windows/solr/build/solr-core/test/J0/solrtest-jetty2-1355330296654/collection1/lib/README' to classloader
[junit4:junit4]   2> 8757 T900 oasc.SolrConfig.<init> Using Lucene MatchVersion: LUCENE_41
[junit4:junit4]   2> 8886 T900 oasc.SolrConfig.<init> Loaded SolrConfig: solrconfig.xml
[junit4:junit4]   2> 8888 T900 oass.IndexSchema.readSchema Reading Solr Schema
[junit4:junit4]   2> 8899 T900 oass.IndexSchema.readSchema Schema name=test
[junit4:junit4]   2> 10199 T900 oass.OpenExchangeRatesOrgProvider.init Initialized with rates=open-exchange-rates.json, refreshInterval=1440.
[junit4:junit4]   2> 10218 T900 oass.IndexSchema.readSchema default search field in schema is text
[junit4:junit4]   2> 10232 T900 oass.IndexSchema.readSchema unique key field: id
[junit4:junit4]   2> 10262 T900 oass.FileExchangeRateProvider.reload Reloading exchange rates from file currency.xml
[junit4:junit4]   2> 10270 T900 oass.FileExchangeRateProvider.reload Reloading exchange rates from file currency.xml
[junit4:junit4]   2> 10280 T900 oass.OpenExchangeRatesOrgProvider.reload Reloading exchange rates from open-exchange-rates.json
[junit4:junit4]   2> 10283 T900 oass.OpenExchangeRatesOrgProvider.reload Reloading exchange rates from open-exchange-rates.json
[junit4:junit4]   2> 10286 T900 oasc.SolrCore.<init> [collection1] Opening new SolrCore at C:\Users\JenkinsSlave\workspace\Lucene-Solr-4.x-Windows\solr\build\solr-core\test\J0\.\solrtest-jetty2-1355330296654\collection1\, dataDir=.\org.apache.solr.cloud.BasicDistributedZk2Test-1355330288757/jetty2\
[junit4:junit4]   2> 10286 T900 oasc.JmxMonitoredMap.<init> JMX monitoring is enabled. Adding Solr mbeans to JMX Server: com.sun.jmx.mbeanserver.JmxMBeanServer@165b7e
[junit4:junit4]   2> 10289 T900 oasc.SolrCore.getNewIndexDir New index directory detected: old=null new=.\org.apache.solr.cloud.BasicDistributedZk2Test-1355330288757/jetty2\index/
[junit4:junit4]   2> 10290 T900 oasc.SolrCore.initIndex WARNING [collection1] Solr index directory '.\org.apache.solr.cloud.BasicDistributedZk2Test-1355330288757\jetty2\index' doesn't exist. Creating new index...
[junit4:junit4]   2> 10292 T900 oasc.CachingDirectoryFactory.get return new directory for C:\Users\JenkinsSlave\workspace\Lucene-Solr-4.x-Windows\solr\build\solr-core\test\J0\.\org.apache.solr.cloud.BasicDistributedZk2Test-1355330288757\jetty2\index forceNew:false
[junit4:junit4]   2> 10311 T900 oasc.SolrDeletionPolicy.onCommit SolrDeletionPolicy.onCommit: commits:num=1
[junit4:junit4]   2> 		commit{dir=RateLimitedDirectoryWrapper(NRTCachingDirectory(org.apache.lucene.store.SimpleFSDirectory@C:\Users\JenkinsSlave\workspace\Lucene-Solr-4.x-Windows\solr\build\solr-core\test\J0\org.apache.solr.cloud.BasicDistributedZk2Test-1355330288757\jetty2\index lockFactory=org.apache.lucene.store.NativeFSLockFactory@1ac978a; maxCacheMB=48.0 maxMergeSizeMB=4.0)),segFN=segments_1,generation=1,filenames=[segments_1]
[junit4:junit4]   2> 10311 T900 oasc.SolrDeletionPolicy.updateCommits newest commit = 1
[junit4:junit4]   2> 10315 T900 oasc.SolrCore.initWriters created xml: solr.XMLResponseWriter
[junit4:junit4]   2> 10317 T900 oasup.UpdateRequestProcessorChain.init inserting DistributedUpdateProcessorFactory into updateRequestProcessorChain "dedupe"
[junit4:junit4]   2> 10317 T900 oasup.UpdateRequestProcessorChain.init inserting DistributedUpdateProcessorFactory into updateRequestProcessorChain "dedupe-allfields"
[junit4:junit4]   2> 10317 T900 oasup.UpdateRequestProcessorChain.init inserting DistributedUpdateProcessorFactory into updateRequestProcessorChain "stored_sig"
[junit4:junit4]   2> 10320 T900 oasup.UpdateRequestProcessorChain.init inserting DistributedUpdateProcessorFactory into updateRequestProcessorChain "uniq-fields"
[junit4:junit4]   2> 10320 T900 oasup.UpdateRequestProcessorChain.init inserting DistributedUpdateProcessorFactory into updateRequestProcessorChain "distrib-dup-test-chain-implicit"
[junit4:junit4]   2> 10320 T900 oasc.RequestHandlers.initHandlersFromConfig adding lazy requestHandler: solr.ReplicationHandler
[junit4:junit4]   2> 10320 T900 oasc.RequestHandlers.initHandlersFromConfig created /replication: solr.ReplicationHandler
[junit4:junit4]   2> 10322 T900 oasc.RequestHandlers.initHandlersFromConfig created standard: solr.StandardRequestHandler
[junit4:junit4]   2> 10324 T900 oasc.RequestHandlers.initHandlersFromConfig created /get: solr.RealTimeGetHandler
[junit4:junit4]   2> 10325 T900 oasc.RequestHandlers.initHandlersFromConfig created dismax: solr.SearchHandler
[junit4:junit4]   2> 10325 T900 oasc.RequestHandlers.initHandlersFromConfig created mock: org.apache.solr.core.MockQuerySenderListenerReqHandler
[junit4:junit4]   2> 10327 T900 oasc.RequestHandlers.initHandlersFromConfig created /admin/: org.apache.solr.handler.admin.AdminHandlers
[junit4:junit4]   2> 10328 T900 oasc.RequestHandlers.initHandlersFromConfig created defaults: solr.StandardRequestHandler
[junit4:junit4]   2> 10328 T900 oasc.RequestHandlers.initHandlersFromConfig adding lazy requestHandler: solr.StandardRequestHandler
[junit4:junit4]   2> 10328 T900 oasc.RequestHandlers.initHandlersFromConfig created lazy: solr.StandardRequestHandler
[junit4:junit4]   2> 10330 T900 oasc.RequestHandlers.initHandlersFromConfig created /update: solr.UpdateRequestHandler
[junit4:junit4]   2> 10333 T900 oasc.RequestHandlers.initHandlersFromConfig created /terms: org.apache.solr.handler.component.SearchHandler
[junit4:junit4]   2> 10333 T900 oasc.RequestHandlers.initHandlersFromConfig created spellCheckCompRH: org.apache.solr.handler.component.SearchHandler
[junit4:junit4]   2> 10334 T900 oasc.RequestHandlers.initHandlersFromConfig created spellCheckCompRH_Direct: org.apache.solr.handler.component.SearchHandler
[junit4:junit4]   2> 10336 T900 oasc.RequestHandlers.initHandlersFromConfig created spellCheckWithWordbreak: org.apache.solr.handler.component.SearchHandler
[junit4:junit4]   2> 10337 T900 oasc.RequestHandlers.initHandlersFromConfig created spellCheckWithWordbreak_Direct: org.apache.solr.handler.component.SearchHandler
[junit4:junit4]   2> 10339 T900 oasc.RequestHandlers.initHandlersFromConfig created spellCheckCompRH1: org.apache.solr.handler.component.SearchHandler
[junit4:junit4]   2> 10339 T900 oasc.RequestHandlers.initHandlersFromConfig created tvrh: org.apache.solr.handler.component.SearchHandler
[junit4:junit4]   2> 10343 T900 oasc.RequestHandlers.initHandlersFromConfig created /mlt: solr.MoreLikeThisHandler
[junit4:junit4]   2> 10344 T900 oasc.RequestHandlers.initHandlersFromConfig created /debug/dump: solr.DumpRequestHandler
[junit4:junit4]   2> 10358 T900 oashl.XMLLoader.init xsltCacheLifetimeSeconds=60
[junit4:junit4]   2> 10366 T900 oasc.SolrCore.initDeprecatedSupport WARNING solrconfig.xml uses deprecated <admin/gettableFiles>, Please update your config to use the ShowFileRequestHandler.
[junit4:junit4]   2> 10368 T900 oasc.SolrCore.initDeprecatedSupport WARNING adding ShowFileRequestHandler with hidden files: [SCHEMA.XML, OLD_SYNONYMS.TXT, STOPWORDS.TXT, PROTWORDS.TXT, OPEN-EXCHANGE-RATES.JSON, SYNONYMS.TXT, CURRENCY.XML, MAPPING-ISOLATIN1ACCENT.TXT]
[junit4:junit4]   2> 10374 T900 oass.SolrIndexSearcher.<init> Opening Searcher@17ec23b main
[junit4:junit4]   2> 10375 T900 oass.SolrIndexSearcher.getIndexDir WARNING WARNING: Directory impl does not support setting indexDir: org.apache.lucene.store.RateLimitedDirectoryWrapper
[junit4:junit4]   2> 10377 T900 oasu.CommitTracker.<init> Hard AutoCommit: disabled
[junit4:junit4]   2> 10377 T900 oasu.CommitTracker.<init> Soft AutoCommit: disabled
[junit4:junit4]   2> 10380 T900 oashc.SpellCheckComponent.inform Initializing spell checkers
[junit4:junit4]   2> 10396 T900 oass.DirectSolrSpellChecker.init init: {name=direct,classname=DirectSolrSpellChecker,field=lowerfilt,minQueryLength=3}
[junit4:junit4]   2> 10504 T901 oasc.SolrCore.registerSearcher [collection1] Registered new searcher Searcher@17ec23b main{StandardDirectoryReader(segments_1:1)}
[junit4:junit4]   2> 10528 T900 oasc.ZkController.publish publishing core=collection1 state=down
[junit4:junit4]   2> 10528 T900 oasc.ZkController.publish numShards not found on descriptor - reading it from system property
[junit4:junit4]   2> 10920 T868 oascc.ZkStateReader.updateClusterState Updating cloud state from ZooKeeper... 
[junit4:junit4]   2> 10922 T868 oasc.Overseer$ClusterStateUpdater.updateState Update state numShards=2 message={
[junit4:junit4]   2> 	  "operation":"state",
[junit4:junit4]   2> 	  "numShards":"2",
[junit4:junit4]   2> 	  "shard":null,
[junit4:junit4]   2> 	  "roles":null,
[junit4:junit4]   2> 	  "state":"down",
[junit4:junit4]   2> 	  "core":"collection1",
[junit4:junit4]   2> 	  "collection":"collection1",
[junit4:junit4]   2> 	  "node_name":"127.0.0.1:62236_solr",
[junit4:junit4]   2> 	  "base_url":"http://127.0.0.1:62236/solr"}
[junit4:junit4]   2> 10922 T868 oasc.Overseer$ClusterStateUpdater.updateState Collection already exists with numShards=2
[junit4:junit4]   2> 10922 T868 oasc.Overseer$ClusterStateUpdater.updateState Assigning new node to shard shard=shard2
[junit4:junit4]   2> 10933 T884 oascc.ZkStateReader$2.process A cluster state change has occurred - updating... (3)
[junit4:junit4]   2> 10935 T899 oascc.ZkStateReader$2.process A cluster state change has occurred - updating... (3)
[junit4:junit4]   2> 10933 T867 oascc.ZkStateReader$2.process A cluster state change has occurred - updating... (3)
[junit4:junit4]   2> 11282 T900 oasc.CoreContainer.register registering core: collection1
[junit4:junit4]   2> 11282 T900 oasc.ZkController.register Register shard - core:collection1 address:http://127.0.0.1:62236/solr shardId:shard2
[junit4:junit4]   2> 11283 T900 oascc.SolrZkClient.makePath makePath: /collections/collection1/leader_elect/shard2/election
[junit4:junit4]   2> 11300 T850 oazs.PrepRequestProcessor.pRequest Got user-level KeeperException when processing sessionid:0x13b8ffafc8a0007 type:delete cxid:0x44 zxid:0x7e txntype:-1 reqpath:n/a Error Path:/solr/collections/collection1/leaders/shard2 Error:KeeperErrorCode = NoNode for /solr/collections/collection1/leaders/shard2
[junit4:junit4]   2> 11301 T900 oasc.ShardLeaderElectionContext.runLeaderProcess Running the leader process.
[junit4:junit4]   2> 11302 T850 oazs.PrepRequestProcessor.pRequest Got user-level KeeperException when processing sessionid:0x13b8ffafc8a0007 type:create cxid:0x45 zxid:0x7f txntype:-1 reqpath:n/a Error Path:/solr/overseer Error:KeeperErrorCode = NodeExists for /solr/overseer
[junit4:junit4]   2> 11311 T900 oasc.ShardLeaderElectionContext.waitForReplicasToComeUp Enough replicas found to continue.
[junit4:junit4]   2> 11311 T900 oasc.ShardLeaderElectionContext.runLeaderProcess I may be the new leader - try and sync
[junit4:junit4]   2> 11311 T900 oasc.SyncStrategy.sync Sync replicas to http://127.0.0.1:62236/solr/collection1/
[junit4:junit4]   2> 11313 T900 oasc.SyncStrategy.syncReplicas Sync Success - now sync replicas to me
[junit4:junit4]   2> 11313 T900 oasc.SyncStrategy.syncToMe http://127.0.0.1:62236/solr/collection1/ has no replicas
[junit4:junit4]   2> 11313 T900 oasc.ShardLeaderElectionContext.runLeaderProcess I am the new leader: http://127.0.0.1:62236/solr/collection1/
[junit4:junit4]   2> 11314 T900 oascc.SolrZkClient.makePath makePath: /collections/collection1/leaders/shard2
[junit4:junit4]   2> 11330 T850 oazs.PrepRequestProcessor.pRequest Got user-level KeeperException when processing sessionid:0x13b8ffafc8a0007 type:create cxid:0x4e zxid:0x82 txntype:-1 reqpath:n/a Error Path:/solr/overseer Error:KeeperErrorCode = NodeExists for /solr/overseer
[junit4:junit4]   2> 11698 T868 oascc.ZkStateReader.updateClusterState Updating cloud state from ZooKeeper... 
[junit4:junit4]   2> 11720 T867 oascc.ZkStateReader$2.process A cluster state change has occurred - updating... (3)
[junit4:junit4]   2> 11720 T884 oascc.ZkStateReader$2.process A cluster state change has occurred - updating... (3)
[junit4:junit4]   2> 11720 T899 oascc.ZkStateReader$2.process A cluster state change has occurred - updating... (3)
[junit4:junit4]   2> 11793 T900 oasc.ZkController.register We are http://127.0.0.1:62236/solr/collection1/ and leader is http://127.0.0.1:62236/solr/collection1/
[junit4:junit4]   2> 11793 T900 oasc.ZkController.register No LogReplay needed for core=collection1 baseURL=http://127.0.0.1:62236/solr
[junit4:junit4]   2> 11793 T900 oasc.ZkController.checkRecovery I am the leader, no recovery necessary
[junit4:junit4]   2> 11793 T900 oasc.ZkController.publish publishing core=collection1 state=active
[junit4:junit4]   2> 11793 T900 oasc.ZkController.publish numShards not found on descriptor - reading it from system property
[junit4:junit4]   2> 11799 T900 oascc.ZkStateReader.updateClusterState Updating cloud state from ZooKeeper... 
[junit4:junit4]   2> 11800 T845 oass.SolrDispatchFilter.init user.dir=C:\Users\JenkinsSlave\workspace\Lucene-Solr-4.x-Windows\solr\build\solr-core\test\J0
[junit4:junit4]   2> 11800 T845 oass.SolrDispatchFilter.init SolrDispatchFilter.init() done
[junit4:junit4]   2> 11800 T845 oascsi.HttpClientUtil.createClient Creating new http client, config:maxConnections=128&maxConnectionsPerHost=32&followRedirects=false
[junit4:junit4]   2> 12298 T845 oejs.Server.doStart jetty-8.1.8.v20121106
[junit4:junit4]   2> 12304 T845 oejs.AbstractConnector.doStart Started SelectChannelConnector@0.0.0.0:62245
[junit4:junit4]   2> 12307 T845 oasc.SolrResourceLoader.locateSolrHome JNDI not configured for solr (NoInitialContextEx)
[junit4:junit4]   2> 12307 T845 oasc.SolrResourceLoader.locateSolrHome using system property solr.solr.home: C:\Users\JenkinsSlave\workspace\Lucene-Solr-4.x-Windows\solr\build\solr-core\test\J0\.\solrtest-jetty3-1355330300567
[junit4:junit4]   2> 12307 T845 oasc.SolrResourceLoader.<init> new SolrResourceLoader for deduced Solr Home: 'C:\Users\JenkinsSlave\workspace\Lucene-Solr-4.x-Windows\solr\build\solr-core\test\J0\.\solrtest-jetty3-1355330300567\'
[junit4:junit4]   2> 12367 T845 oass.SolrDispatchFilter.init SolrDispatchFilter.init()
[junit4:junit4]   2> 12367 T845 oasc.SolrResourceLoader.locateSolrHome JNDI not configured for solr (NoInitialContextEx)
[junit4:junit4]   2> 12367 T845 oasc.SolrResourceLoader.locateSolrHome using system property solr.solr.home: C:\Users\JenkinsSlave\workspace\Lucene-Solr-4.x-Windows\solr\build\solr-core\test\J0\.\solrtest-jetty3-1355330300567
[junit4:junit4]   2> 12369 T845 oasc.CoreContainer$Initializer.initialize looking for solr.xml: C:\Users\JenkinsSlave\workspace\Lucene-Solr-4.x-Windows\solr\build\solr-core\test\J0\.\solrtest-jetty3-1355330300567\solr.xml
[junit4:junit4]   2> 12369 T845 oasc.CoreContainer.<init> New CoreContainer 3426018
[junit4:junit4]   2> 12370 T845 oasc.CoreContainer.load Loading CoreContainer using Solr Home: 'C:\Users\JenkinsSlave\workspace\Lucene-Solr-4.x-Windows\solr\build\solr-core\test\J0\.\solrtest-jetty3-1355330300567\'
[junit4:junit4]   2> 12372 T845 oasc.SolrResourceLoader.<init> new SolrResourceLoader for directory: 'C:\Users\JenkinsSlave\workspace\Lucene-Solr-4.x-Windows\solr\build\solr-core\test\J0\.\solrtest-jetty3-1355330300567\'
[junit4:junit4]   2> 12410 T845 oasc.CoreContainer.load Registering Log Listener
[junit4:junit4]   2> 12457 T845 oasc.CoreContainer.initZooKeeper Zookeeper client=127.0.0.1:62211/solr
[junit4:junit4]   2> 12458 T845 oasc.ZkController.checkChrootPath zkHost includes chroot
[junit4:junit4]   2> 12460 T845 oaz.ZooKeeper.<init> Initiating client connection, connectString=127.0.0.1:62211 sessionTimeout=60000 watcher=org.apache.solr.common.cloud.ConnectionManager@b6a5f3
[junit4:junit4]   2> 12463 T845 oascc.ConnectionManager.waitForConnected Waiting for client to connect to ZooKeeper
[junit4:junit4]   2> 12464 T911 oaz.ClientCnxn$SendThread.logStartConnect Opening socket connection to server 127.0.0.1/127.0.0.1:62211. Will not attempt to authenticate using SASL (access denied (javax.security.auth.AuthPermission getLoginConfiguration))
[junit4:junit4]   2> 12465 T911 oaz.ClientCnxn$SendThread.primeConnection Socket connection established to 127.0.0.1/127.0.0.1:62211, initiating session
[junit4:junit4]   2> 12465 T847 oazs.NIOServerCnxnFactory.run Accepted socket connection from /127.0.0.1:62250
[junit4:junit4]   2> 12467 T847 oazs.ZooKeeperServer.processConnectRequest Client attempting to establish new session at /127.0.0.1:62250
[junit4:junit4]   2> 12489 T849 oazs.ZooKeeperServer.finishSessionInit Established session 0x13b8ffafc8a0008 with negotiated timeout 20000 for client /127.0.0.1:62250
[junit4:junit4]   2> 12489 T911 oaz.ClientCnxn$SendThread.onConnected Session establishment complete on server 127.0.0.1/127.0.0.1:62211, sessionid = 0x13b8ffafc8a0008, negotiated timeout = 20000
[junit4:junit4]   2> 12489 T912 oascc.ConnectionManager.process Watcher org.apache.solr.common.cloud.ConnectionManager@b6a5f3 name:ZooKeeperConnection Watcher:127.0.0.1:62211 got event WatchedEvent state:SyncConnected type:None path:null path:null type:None
[junit4:junit4]   2> 12490 T845 oascc.ConnectionManager.waitForConnected Client is connected to ZooKeeper
[junit4:junit4]   2> 12495 T850 oazs.PrepRequestProcessor.pRequest2Txn Processed session termination for sessionid: 0x13b8ffafc8a0008
[junit4:junit4]   2> 12498 T847 oazs.NIOServerCnxn.doIO WARNING caught end of stream exception EndOfStreamException: Unable to read additional data from client sessionid 0x13b8ffafc8a0008, likely client has closed socket
[junit4:junit4]   2> 	at org.apache.zookeeper.server.NIOServerCnxn.doIO(NIOServerCnxn.java:220)
[junit4:junit4]   2> 	at org.apache.zookeeper.server.NIOServerCnxnFactory.run(NIOServerCnxnFactory.java:208)
[junit4:junit4]   2> 	at java.lang.Thread.run(Thread.java:662)
[junit4:junit4]   2> 
[junit4:junit4]   2> 12498 T868 oascc.ZkStateReader.updateClusterState Updating cloud state from ZooKeeper... 
[junit4:junit4]   2> 12499 T847 oazs.NIOServerCnxn.closeSock Closed socket connection for client /127.0.0.1:62250 which had sessionid 0x13b8ffafc8a0008
[junit4:junit4]   2> 12498 T912 oaz.ClientCnxn$EventThread.run EventThread shut down
[junit4:junit4]   2> 12498 T845 oaz.ZooKeeper.close Session: 0x13b8ffafc8a0008 closed
[junit4:junit4]   2> 12501 T845 oaz.ZooKeeper.<init> Initiating client connection, connectString=127.0.0.1:62211/solr sessionTimeout=8000 watcher=org.apache.solr.common.cloud.ConnectionManager@1b5bf6f
[junit4:junit4]   2> 12504 T868 oasc.Overseer$ClusterStateUpdater.updateState Update state numShards=2 message={
[junit4:junit4]   2> 	  "operation":"state",
[junit4:junit4]   2> 	  "numShards":"2",
[junit4:junit4]   2> 	  "shard":"shard2",
[junit4:junit4]   2> 	  "roles":null,
[junit4:junit4]   2> 	  "state":"active",
[junit4:junit4]   2> 	  "core":"collection1",
[junit4:junit4]   2> 	  "collection":"collection1",
[junit4:junit4]   2> 	  "node_name":"127.0.0.1:62236_solr",
[junit4:junit4]   2> 	  "base_url":"http://127.0.0.1:62236/solr"}
[junit4:junit4]   2> 12504 T845 oascc.ConnectionManager.waitForConnected Waiting for client to connect to ZooKeeper
[junit4:junit4]   2> 12506 T913 oaz.ClientCnxn$SendThread.logStartConnect Opening socket connection to server 127.0.0.1/127.0.0.1:62211. Will not attempt to authenticate using SASL (access denied (javax.security.auth.AuthPermission getLoginConfiguration))
[junit4:junit4]   2> 12508 T913 oaz.ClientCnxn$SendThread.primeConnection Socket connection established to 127.0.0.1/127.0.0.1:62211, initiating session
[junit4:junit4]   2> 12508 T847 oazs.NIOServerCnxnFactory.run Accepted socket connection from /127.0.0.1:62253
[junit4:junit4]   2> 12509 T847 oazs.ZooKeeperServer.processConnectRequest Client attempting to establish new session at /127.0.0.1:62253
[junit4:junit4]   2> 12514 T849 oazs.ZooKeeperServer.finishSessionInit Established session 0x13b8ffafc8a0009 with negotiated timeout 8000 for client /127.0.0.1:62253
[junit4:junit4]   2> 12514 T913 oaz.ClientCnxn$SendThread.onConnected Session establishment complete on server 127.0.0.1/127.0.0.1:62211, sessionid = 0x13b8ffafc8a0009, negotiated timeout = 8000
[junit4:junit4]   2> 12515 T914 oascc.ConnectionManager.process Watcher org.apache.solr.common.cloud.ConnectionManager@1b5bf6f name:ZooKeeperConnection Watcher:127.0.0.1:62211/solr got event WatchedEvent state:SyncConnected type:None path:null path:null type:None
[junit4:junit4]   2> 12515 T845 oascc.ConnectionManager.waitForConnected Client is connected to ZooKeeper
[junit4:junit4]   2> 12518 T850 oazs.PrepRequestProcessor.pRequest Got user-level KeeperException when processing sessionid:0x13b8ffafc8a0009 type:create cxid:0x1 zxid:0x91 txntype:-1 reqpath:n/a Error Path:/solr/overseer Error:KeeperErrorCode = NodeExists for /solr/overseer
[junit4:junit4]   2> 12521 T850 oazs.PrepRequestProcessor.pRequest Got user-level KeeperException when processing sessionid:0x13b8ffafc8a0009 type:create cxid:0x2 zxid:0x92 txntype:-1 reqpath:n/a Error Path:/solr/overseer Error:KeeperErrorCode = NodeExists for /solr/overseer
[junit4:junit4]   2> 12524 T884 oascc.ZkStateReader$2.process A cluster state change has occurred - updating... (3)
[junit4:junit4]   2> 12524 T899 oascc.ZkStateReader$2.process A cluster state change has occurred - updating... (3)
[junit4:junit4]   2> 12524 T867 oascc.ZkStateReader$2.process A cluster state change has occurred - updating... (3)
[junit4:junit4]   2> 12527 T845 oasc.ZkController.createEphemeralLiveNode Register node as live in ZooKeeper:/live_nodes/127.0.0.1:62245_solr
[junit4:junit4]   2> 12528 T850 oazs.PrepRequestProcessor.pRequest Got user-level KeeperException when processing sessionid:0x13b8ffafc8a0009 type:delete cxid:0x4 zxid:0x94 txntype:-1 reqpath:n/a Error Path:/solr/live_nodes/127.0.0.1:62245_solr Error:KeeperErrorCode = NoNode for /solr/live_nodes/127.0.0.1:62245_solr
[junit4:junit4]   2> 12531 T845 oascc.SolrZkClient.makePath makePath: /live_nodes/127.0.0.1:62245_solr
[junit4:junit4]   2> 12539 T899 oascc.ZkStateReader$2.process A cluster state change has occurred - updating... (3)
[junit4:junit4]   2> 12539 T867 oascc.ZkStateReader$2.process A cluster state change has occurred - updating... (3)
[junit4:junit4]   2> 12539 T884 oascc.ZkStateReader$3.process Updating live nodes... (4)
[junit4:junit4]   2> 12540 T884 oascc.ZkStateReader$2.process A cluster state change has occurred - updating... (4)
[junit4:junit4]   2> 12543 T845 oashc.HttpShardHandlerFactory.getParameter Setting socketTimeout to: 0
[junit4:junit4]   2> 12543 T845 oashc.HttpShardHandlerFactory.getParameter Setting urlScheme to: http://
[junit4:junit4]   2> 12545 T845 oashc.HttpShardHandlerFactory.getParameter Setting connTimeout to: 0
[junit4:junit4]   2> 12545 T845 oashc.HttpShardHandlerFactory.getParameter Setting maxConnectionsPerHost to: 20
[junit4:junit4]   2> 12545 T845 oashc.HttpShardHandlerFactory.getParameter Setting corePoolSize to: 0
[junit4:junit4]   2> 12548 T845 oashc.HttpShardHandlerFactory.getParameter Setting maximumPoolSize to: 2147483647
[junit4:junit4]   2> 12548 T845 oashc.HttpShardHandlerFactory.getParameter Setting maxThreadIdleTime to: 5
[junit4:junit4]   2> 12548 T845 oashc.HttpShardHandlerFactory.getParameter Setting sizeOfQueue to: -1
[junit4:junit4]   2> 12548 T899 oascc.ZkStateReader$3.process Updating live nodes... (4)
[junit4:junit4]   2> 12549 T867 oascc.ZkStateReader$3.process Updating live nodes... (4)
[junit4:junit4]   2> 12548 T845 oashc.HttpShardHandlerFactory.getParameter Setting fairnessPolicy to: false
[junit4:junit4]   2> 12549 T845 oascsi.HttpClientUtil.createClient Creating new http client, config:maxConnectionsPerHost=20&maxConnections=10000&socketTimeout=0&connTimeout=0&retry=false
[junit4:junit4]   2> 12577 T845 oascc.ZkStateReader.createClusterStateWatchersAndUpdate Updating cluster state from ZooKeeper... 
[junit4:junit4]   2> 12599 T915 oasc.CoreContainer.create Creating SolrCore 'collection1' using instanceDir: C:\Users\JenkinsSlave\workspace\Lucene-Solr-4.x-Windows\solr\build\solr-core\test\J0\.\solrtest-jetty3-1355330300567\collection1
[junit4:junit4]   2> 12606 T915 oasc.ZkController.createCollectionZkNode Check for collection zkNode:collection1
[junit4:junit4]   2> 12608 T915 oasc.ZkController.createCollectionZkNode Collection zkNode exists
[junit4:junit4]   2> 12608 T915 oasc.ZkController.readConfigName Load collection config from:/collections/collection1
[junit4:junit4]   2> 12610 T915 oasc.SolrResourceLoader.<init> new SolrResourceLoader for directory: 'C:\Users\JenkinsSlave\workspace\Lucene-Solr-4.x-Windows\solr\build\solr-core\test\J0\.\solrtest-jetty3-1355330300567\collection1\'
[junit4:junit4]   2> 12612 T915 oasc.SolrResourceLoader.replaceClassLoader Adding 'file:/C:/Users/JenkinsSlave/workspace/Lucene-Solr-4.x-Windows/solr/build/solr-core/test/J0/solrtest-jetty3-1355330300567/collection1/lib/classes/' to classloader
[junit4:junit4]   2> 12613 T915 oasc.SolrResourceLoader.replaceClassLoader Adding 'file:/C:/Users/JenkinsSlave/workspace/Lucene-Solr-4.x-Windows/solr/build/solr-core/test/J0/solrtest-jetty3-1355330300567/collection1/lib/README' to classloader
[junit4:junit4]   2> 12745 T915 oasc.SolrConfig.<init> Using Lucene MatchVersion: LUCENE_41
[junit4:junit4]   2> 12896 T915 oasc.SolrConfig.<init> Loaded SolrConfig: solrconfig.xml
[junit4:junit4]   2> 12901 T915 oass.IndexSchema.readSchema Reading Solr Schema
[junit4:junit4]   2> 12909 T915 oass.IndexSchema.readSchema Schema name=test
[junit4:junit4]   2> 14203 T915 oass.OpenExchangeRatesOrgProvider.init Initialized with rates=open-exchange-rates.json, refreshInterval=1440.
[junit4:junit4]   2> 14226 T915 oass.IndexSchema.readSchema default search field in schema is text
[junit4:junit4]   2> 14233 T915 oass.IndexSchema.readSchema unique key field: id
[junit4:junit4]   2> 14261 T915 oass.FileExchangeRateProvider.reload Reloading exchange rates from file currency.xml
[junit4:junit4]   2> 14269 T915 oass.FileExchangeRateProvider.reload Reloading exchange rates from file currency.xml
[junit4:junit4]   2> 14279 T915 oass.OpenExchangeRatesOrgProvider.reload Reloading exchange rates from open-exchange-rates.json
[junit4:junit4]   2> 14280 T915 oass.OpenExchangeRatesOrgProvider.reload Reloading exchange rates from open-exchange-rates.json
[junit4:junit4]   2> 14283 T915 oasc.SolrCore.<init> [collection1] Opening new SolrCore at C:\Users\JenkinsSlave\workspace\Lucene-Solr-4.x-Windows\solr\build\solr-core\test\J0\.\solrtest-jetty3-1355330300567\collection1\, dataDir=.\org.apache.solr.cloud.BasicDistributedZk2Test-1355330288757/jetty3\
[junit4:junit4]   2> 14283 T915 oasc.JmxMonitoredMap.<init> JMX monitoring is enabled. Adding Solr mbeans to JMX Server: com.sun.jmx.mbeanserver.JmxMBeanServer@165b7e
[junit4:junit4]   2> 14285 T915 oasc.SolrCore.getNewIndexDir New index directory detected: old=null new=.\org.apache.solr.cloud.BasicDistributedZk2Test-1355330288757/jetty3\index/
[junit4:junit4]   2> 14288 T915 oasc.SolrCore.initIndex WARNING [collection1] Solr index directory '.\org.apache.solr.cloud.BasicDistributedZk2Test-1355330288757\jetty3\index' doesn't exist. Creating new index...
[junit4:junit4]   2> 14289 T915 oasc.CachingDirectoryFactory.get return new directory for C:\Users\JenkinsSlave\workspace\Lucene-Solr-4.x-Windows\solr\build\solr-core\test\J0\.\org.apache.solr.cloud.BasicDistributedZk2Test-1355330288757\jetty3\index forceNew:false
[junit4:junit4]   2> 14311 T915 oasc.SolrDeletionPolicy.onCommit SolrDeletionPolicy.onCommit: commits:num=1
[junit4:junit4]   2> 		commit{dir=RateLimitedDirectoryWrapper(NRTCachingDirectory(org.apache.lucene.store.SimpleFSDirectory@C:\Users\JenkinsSlave\workspace\Lucene-Solr-4.x-Windows\solr\build\solr-core\test\J0\org.apache.solr.cloud.BasicDistributedZk2Test-1355330288757\jetty3\index lockFactory=org.apache.lucene.store.NativeFSLockFactory@12980bd; maxCacheMB=48.0 maxMergeSizeMB=4.0)),segFN=segments_1,generation=1,filenames=[segments_1]
[junit4:junit4]   2> 14313 T915 oasc.SolrDeletionPolicy.updateCommits newest commit = 1
[junit4:junit4]   2> 14316 T915 oasc.SolrCore.initWriters created xml: solr.XMLResponseWriter
[junit4:junit4]   2> 14317 T915 oasup.UpdateRequestProcessorChain.init inserting DistributedUpdateProcessorFactory into updateRequestProcessorChain "dedupe"
[junit4:junit4]   2> 14318 T915 oasup.UpdateRequestProcessorChain.init inserting DistributedUpdateProcessorFactory into updateRequestProcessorChain "dedupe-allfields"
[junit4:junit4]   2> 14318 T915 oasup.UpdateRequestProcessorChain.init inserting DistributedUpdateProcessorFactory into updateRequestProcessorChain "stored_sig"
[junit4:junit4]   2> 14318 T915 oasup.UpdateRequestProcessorChain.init inserting DistributedUpdateProcessorFactory into updateRequestProcessorChain "uniq-fields"
[junit4:junit4]   2> 14320 T915 oasup.UpdateRequestProcessorChain.init inserting DistributedUpdateProcessorFactory into updateRequestProcessorChain "distrib-dup-test-chain-implicit"
[junit4:junit4]   2> 14320 T915 oasc.RequestHandlers.initHandlersFromConfig adding lazy requestHandler: solr.ReplicationHandler
[junit4:junit4]   2> 14321 T915 oasc.RequestHandlers.initHandlersFromConfig created /replication: solr.ReplicationHandler
[junit4:junit4]   2> 14321 T915 oasc.RequestHandlers.initHandlersFromConfig created standard: solr.StandardRequestHandler
[junit4:junit4]   2> 14323 T915 oasc.RequestHandlers.initHandlersFromConfig created /get: solr.RealTimeGetHandler
[junit4:junit4]   2> 14324 T915 oasc.RequestHandlers.initHandlersFromConfig created dismax: solr.SearchHandler
[junit4:junit4]   2> 14326 T915 oasc.RequestHandlers.initHandlersFromConfig created mock: org.apache.solr.core.MockQuerySenderListenerReqHandler
[junit4:junit4]   2> 14326 T915 oasc.RequestHandlers.initHandlersFromConfig created /admin/: org.apache.solr.handler.admin.AdminHandlers
[junit4:junit4]   2> 14327 T915 oasc.RequestHandlers.initHandlersFromConfig created defaults: solr.StandardRequestHandler
[junit4:junit4]   2> 14327 T915 oasc.RequestHandlers.initHandlersFromConfig adding lazy requestHandler: solr.StandardRequestHandler
[junit4:junit4]   2> 14329 T915 oasc.RequestHandlers.initHandlersFromConfig created lazy: solr.StandardRequestHandler
[junit4:junit4]   2> 14330 T915 oasc.RequestHandlers.initHandlersFromConfig created /update: solr.UpdateRequestHandler
[junit4:junit4]   2> 14330 T915 oasc.RequestHandlers.initHandlersFromConfig created /terms: org.apache.solr.handler.component.SearchHandler
[junit4:junit4]   2> 14332 T915 oasc.RequestHandlers.initHandlersFromConfig created spellCheckCompRH: org.apache.solr.handler.component.SearchHandler
[junit4:junit4]   2> 14333 T915 oasc.RequestHandlers.initHandlersFromConfig created spellCheckCompRH_Direct: org.apache.solr.handler.component.SearchHandler
[junit4:junit4]   2> 14335 T915 oasc.RequestHandlers.initHandlersFromConfig created spellCheckWithWordbreak: org.apache.solr.handler.component.SearchHandler
[junit4:junit4]   2> 14336 T915 oasc.RequestHandlers.initHandlersFromConfig created spellCheckWithWordbreak_Direct: org.apache.solr.handler.component.SearchHandler
[junit4:junit4]   2> 14337 T915 oasc.RequestHandlers.initHandlersFromConfig created spellCheckCompRH1: org.apache.solr.handler.component.SearchHandler
[junit4:junit4]   2> 14337 T915 oasc.RequestHandlers.initHandlersFromConfig created tvrh: org.apache.solr.handler.component.SearchHandler
[junit4:junit4]   2> 14339 T915 oasc.RequestHandlers.initHandlersFromConfig created /mlt: solr.MoreLikeThisHandler
[junit4:junit4]   2> 14340 T915 oasc.RequestHandlers.initHandlersFromConfig created /debug/dump: solr.DumpRequestHandler
[junit4:junit4]   2> 14354 T915 oashl.XMLLoader.init xsltCacheLifetimeSeconds=60
[junit4:junit4]   2> 14362 T915 oasc.SolrCore.initDeprecatedSupport WARNING solrconfig.xml uses deprecated <admin/gettableFiles>, Please update your config to use the ShowFileRequestHandler.
[junit4:junit4]   2> 14365 T915 oasc.SolrCore.initDeprecatedSupport WARNING adding ShowFileRequestHandler with hidden files: [SCHEMA.XML, OLD_SYNONYMS.TXT, STOPWORDS.TXT, PROTWORDS.TXT, OPEN-EXCHANGE-RATES.JSON, SYNONYMS.TXT, CURRENCY.XML, MAPPING-ISOLATIN1ACCENT.TXT]
[junit4:junit4]   2> 14374 T915 oass.SolrIndexSearcher.<init> Opening Searcher@180bf9f main
[junit4:junit4]   2> 14374 T915 oass.SolrIndexSearcher.getIndexDir WARNING WARNING: Directory impl does not support setting indexDir: org.apache.lucene.store.RateLimitedDirectoryWrapper
[junit4:junit4]   2> 14377 T915 oasu.CommitTracker.<init> Hard AutoCommit: disabled
[junit4:junit4]   2> 14379 T915 oasu.CommitTracker.<init> Soft AutoCommit: disabled
[junit4:junit4]   2> 14380 T915 oashc.SpellCheckComponent.inform Initializing spell checkers
[junit4:junit4]   2> 14396 T915 oass.DirectSolrSpellChecker.init init: {name=direct,classname=DirectSolrSpellChecker,field=lowerfilt,minQueryLength=3}
[junit4:junit4]   2> 14509 T916 oasc.SolrCore.registerSearcher [collection1] Registered new searcher Searcher@180bf9f main{StandardDirectoryReader(segments_1:1)}
[junit4:junit4]   2> 14519 T915 oasc.ZkController.publish publishing core=collection1 state=down
[junit4:junit4]   2> 14519 T915 oasc.ZkController.publish numShards not found on descriptor - reading it from system property
[junit4:junit4]   2> 14795 T868 oascc.ZkStateReader.updateClusterState Updating cloud state from ZooKeeper... 
[junit4:junit4]   2> 14796 T868 oasc.Overseer$ClusterStateUpdater.updateState Update state numShards=2 message={
[junit4:junit4]   2> 	  "operation":"state",
[junit4:junit4]   2> 	  "numShards":"2",
[junit4:junit4]   2> 	  "shard":null,
[junit4:junit4]   2> 	  "roles":null,
[junit4:junit4]   2> 	  "state":"down",
[junit4:junit4]   2> 	  "core":"collection1",
[junit4:junit4]   2> 	  "collection":"collection1",
[junit4:junit4]   2> 	  "node_name":"127.0.0.1:62245_solr",
[junit4:junit4]   2> 	  "base_url":"http://127.0.0.1:62245/solr"}
[junit4:junit4]   2> 14796 T868 oasc.Overseer$ClusterStateUpdater.updateState Collection already exists with numShards=2
[junit4:junit4]   2> 14796 T868 oasc.Overseer$ClusterStateUpdater.updateState Assigning new node to shard shard=shard1
[junit4:junit4]   2> 14811 T884 oascc.ZkStateReader$2.process A cluster state change has occurred - updating... (4)
[junit4:junit4]   2> 14811 T867 oascc.ZkStateReader$2.process A cluster state change has occurred - updating... (4)
[junit4:junit4]   2> 14812 T914 oascc.ZkStateReader$2.process A cluster state change has occurred - updating... (4)
[junit4:junit4]   2> 14814 T899 oascc.ZkStateReader$2.process A cluster state change has occurred - updating... (4)
[junit4:junit4]   2> 15274 T915 oasc.CoreContainer.register registering core: collection1
[junit4:junit4]   2> 15274 T915 oasc.ZkController.register Register shard - core:collection1 address:http://127.0.0.1:62245/solr shardId:shard1
[junit4:junit4]   2> 15281 T915 oasc.ZkController.register We are http://127.0.0.1:62245/solr/collection1/ and leader is http://127.0.0.1:62227/solr/collection1/
[junit4:junit4]   2> 15282 T915 oasc.ZkController.register No LogReplay needed for core=collection1 baseURL=http://127.0.0.1:62245/solr
[junit4:junit4]   2> 15282 T915 oasc.ZkController.checkRecovery Core needs to recover:collection1
[junit4:junit4]   2> 15282 T915 oasu.DefaultSolrCoreState.doRecovery Running recovery - first canceling any ongoing recovery
[junit4:junit4]   2> ASYNC  NEW_CORE C73 name=collection1 org.apache.solr.core.SolrCore@73dc15 url=http://127.0.0.1:62245/solr/collection1 node=127.0.0.1:62245_solr
[junit4:junit4]   2> 15290 T917 C73 P62245 oasc.RecoveryStrategy.run Starting recovery process.  core=collection1 recoveringAfterStartup=true
[junit4:junit4]   2> 15293 T917 C73 P62245 oasc.RecoveryStrategy.doRecovery ###### startupVersions=[]
[junit4:junit4]   2> 15293 T915 oascc.ZkStateReader.updateClusterState Updating cloud state from ZooKeeper... 
[junit4:junit4]   2> 15293 T917 C73 P62245 oasc.ZkController.publish publishing core=collection1 state=recovering
[junit4:junit4]   2> 15294 T917 C73 P62245 oasc.ZkController.publish numShards not found on descriptor - reading it from system property
[junit4:junit4]   2> 15295 T845 oass.SolrDispatchFilter.init user.dir=C:\Users\JenkinsSlave\workspace\Lucene-Solr-4.x-Windows\solr\build\solr-core\test\J0
[junit4:junit4]   2> 15297 T845 oass.SolrDispatchFilter.init SolrDispatchFilter.init() done
[junit4:junit4]   2> 15298 T845 oascsi.HttpClientUtil.createClient Creating new http client, config:maxConnections=128&maxConnectionsPerHost=32&followRedirects=false
[junit4:junit4]   2> 15300 T917 C73 P62245 oasc.RecoveryStrategy.doRecovery Attempting to PeerSync from http://127.0.0.1:62227/solr/collection1/ core=collection1 - recoveringAfterStartup=true
[junit4:junit4]   2> 15320 T917 C73 P62245 oascsi.HttpClientUtil.createClient Creating new http client, config:maxConnectionsPerHost=20&maxConnections=10000&connTimeout=30000&socketTimeout=30000&retry=false
[junit4:junit4]   2> 15348 T917 C73 P62245 oasu.PeerSync.sync PeerSync: core=collection1 url=http://127.0.0.1:62245/solr START replicas=[http://127.0.0.1:62227/solr/collection1/] nUpdates=100
[junit4:junit4]   2> 15350 T917 C73 P62245 oasu.PeerSync.sync WARNING no frame of reference to tell of we've missed updates
[junit4:junit4]   2> 15350 T917 C73 P62245 oasc.RecoveryStrategy.doRecovery PeerSync Recovery was not successful - trying replication. core=collection1
[junit4:junit4]   2> 15350 T917 C73 P62245 oasc.RecoveryStrategy.doRecovery Starting Replication Recovery. core=collection1
[junit4:junit4]   2> 15353 T917 C73 P62245 oascsi.HttpClientUtil.createClient Creating new http client, config:maxConnections=128&maxConnectionsPerHost=32&followRedirects=false
[junit4:junit4]   2> ASYNC  NEW_CORE C74 name=collection1 org.apache.solr.core.SolrCore@ce0e12 url=http://127.0.0.1:62227/solr/collection1 node=127.0.0.1:62227_solr
[junit4:junit4]   2> 15395 T880 C74 P62227 REQ /get {distrib=false&qt=/get&wt=javabin&version=2&getVersions=100} status=0 QTime=0 
[junit4:junit4]   2> 15574 T868 oascc.ZkStateReader.updateClusterState Updating cloud state from ZooKeeper... 
[junit4:junit4]   2> 15575 T868 oasc.Overseer$ClusterStateUpdater.updateState Update state numShards=2 message={
[junit4:junit4]   2> 	  "operation":"state",
[junit4:junit4]   2> 	  "numShards":"2",
[junit4:junit4]   2> 	  "shard":"shard1",
[junit4:junit4]   2> 	  "roles":null,
[junit4:junit4]   2> 	  "state":"recovering",
[junit4:junit4]   2> 	  "core":"collection1",
[junit4:junit4]   2> 	  "collection":"collection1",
[junit4:junit4]   2> 	  "node_name":"127.0.0.1:62245_solr",
[junit4:junit4]   2> 	  "base_url":"http://127.0.0.1:62245/solr"}
[junit4:junit4]   2> 15596 T867 oascc.ZkStateReader$2.process A cluster state change has occurred - updating... (4)
[junit4:junit4]   2> 15597 T899 oascc.ZkStateReader$2.process A cluster state change has occurred - updating... (4)
[junit4:junit4]   2> 15597 T884 oascc.ZkStateReader$2.process A cluster state change has occurred - updating... (4)
[junit4:junit4]   2> 15599 T914 oascc.ZkStateReader$2.process A cluster state change has occurred - updating... (4)
[junit4:junit4]   2> 15843 T845 oejs.Server.doStart jetty-8.1.8.v20121106
[junit4:junit4]   2> 15851 T845 oejs.AbstractConnector.doStart Started SelectChannelConnector@0.0.0.0:62256
[junit4:junit4]   2> 15854 T845 oasc.SolrResourceLoader.locateSolrHome JNDI not configured for solr (NoInitialContextEx)
[junit4:junit4]   2> 15854 T845 oasc.SolrResourceLoader.locateSolrHome using system property solr.solr.home: C:\Users\JenkinsSlave\workspace\Lucene-Solr-4.x-Windows\solr\build\solr-core\test\J0\.\solrtest-jetty4-1355330304073
[junit4:junit4]   2> 15855 T845 oasc.SolrResourceLoader.<init> new SolrResourceLoader for deduced Solr Home: 'C:\Users\JenkinsSlave\workspace\Lucene-Solr-4.x-Windows\solr\build\solr-core\test\J0\.\solrtest-jetty4-1355330304073\'
[junit4:junit4]   2> 15908 T845 oass.SolrDispatchFilter.init SolrDispatchFilter.init()
[junit4:junit4]   2> 15908 T845 oasc.SolrResourceLoader.locateSolrHome JNDI not configured for solr (NoInitialContextEx)
[junit4:junit4]   2> 15908 T845 oasc.SolrResourceLoader.locateSolrHome using system property solr.solr.home: C:\Users\JenkinsSlave\workspace\Lucene-Solr-4.x-Windows\solr\build\solr-core\test\J0\.\solrtest-jetty4-1355330304073
[junit4:junit4]   2> 15909 T845 oasc.CoreContainer$Initializer.initialize looking for solr.xml: C:\Users\JenkinsSlave\workspace\Lucene-Solr-4.x-Windows\solr\build\solr-core\test\J0\.\solrtest-jetty4-1355330304073\solr.xml
[junit4:junit4]   2> 15909 T845 oasc.CoreContainer.<init> New CoreContainer 4461748
[junit4:junit4]   2> 15909 T845 oasc.CoreContainer.load Loading CoreContainer using Solr Home: 'C:\Users\JenkinsSlave\workspace\Lucene-Solr-4.x-Windows\solr\build\solr-core\test\J0\.\solrtest-jetty4-1355330304073\'
[junit4:junit4]   2> 15909 T845 oasc.SolrResourceLoader.<init> new SolrResourceLoader for directory: 'C:\Users\JenkinsSlave\workspace\Lucene-Solr-4.x-Windows\solr\build\solr-core\test\J0\.\solrtest-jetty4-1355330304073\'
[junit4:junit4]   2> 15958 T845 oasc.CoreContainer.load Registering Log Listener
[junit4:junit4]   2> 15990 T845 oasc.CoreContainer.initZooKeeper Zookeeper client=127.0.0.1:62211/solr
[junit4:junit4]   2> 15991 T845 oasc.ZkController.checkChrootPath zkHost includes chroot
[junit4:junit4]   2> 15991 T845 oaz.ZooKeeper.<init> Initiating client connection, connectString=127.0.0.1:62211 sessionTimeout=60000 watcher=org.apache.solr.common.cloud.ConnectionManager@1faa5a9
[junit4:junit4]   2> 15994 T845 oascc.ConnectionManager.waitForConnected Waiting for client to connect to ZooKeeper
[junit4:junit4]   2> 15996 T928 oaz.ClientCnxn$SendThread.logStartConnect Opening socket connection to server 127.0.0.1/127.0.0.1:62211. Will not attempt to authenticate using SASL (access denied (javax.security.auth.AuthPermission getLoginConfiguration))
[junit4:junit4]   2> 15997 T928 oaz.ClientCnxn$SendThread.primeConnection Socket connection established to 127.0.0.1/127.0.0.1:62211, initiating session
[junit4:junit4]   2> 15997 T847 oazs.NIOServerCnxnFactory.run Accepted socket connection from /127.0.0.1:62261
[junit4:junit4]   2> 15999 T847 oazs.ZooKeeperServer.processConnectRequest Client attempting to establish new session at /127.0.0.1:62261
[junit4:junit4]   2> 16007 T849 oazs.ZooKeeperServer.finishSessionInit Established session 0x13b8ffafc8a000a with negotiated timeout 20000 for client /127.0.0.1:62261
[junit4:junit4]   2> 16007 T928 oaz.ClientCnxn$SendThread.onConnected Session establishment complete on server 127.0.0.1/127.0.0.1:62211, sessionid = 0x13b8ffafc8a000a, negotiated timeout = 20000
[junit4:junit4]   2> 16009 T929 oascc.ConnectionManager.process Watcher org.apache.solr.common.cloud.ConnectionManager@1faa5a9 name:ZooKeeperConnection Watcher:127.0.0.1:62211 got event WatchedEvent state:SyncConnected type:None path:null path:null type:None
[junit4:junit4]   2> 16009 T845 oascc.ConnectionManager.waitForConnected Client is connected to ZooKeeper
[junit4:junit4]   2> 16013 T850 oazs.PrepRequestProcessor.pRequest2Txn Processed session termination for sessionid: 0x13b8ffafc8a000a
[junit4:junit4]   2> 16015 T847 oazs.NIOServerCnxn.closeSock Closed socket connection for client /127.0.0.1:62261 which had sessionid 0x13b8ffafc8a000a
[junit4:junit4]   2> 16015 T845 oaz.ZooKeeper.close Session: 0x13b8ffafc8a000a closed
[junit4:junit4]   2> 16016 T929 oaz.ClientCnxn$EventThread.run EventThread shut down
[junit4:junit4]   2> 16016 T845 oaz.ZooKeeper.<init> Initiating client connection, connectString=127.0.0.1:62211/solr sessionTimeout=8000 watcher=org.apache.solr.common.cloud.ConnectionManager@1d0a86a
[junit4:junit4]   2> 16021 T845 oascc.ConnectionManager.waitForConnected Waiting for client to connect to ZooKeeper
[junit4:junit4]   2> 16022 T930 oaz.ClientCnxn$SendThread.logStartConnect Opening socket connection to server 127.0.0.1/127.0.0.1:62211. Will not attempt to authenticate using SASL (access denied (javax.security.auth.AuthPermission getLoginConfiguration))
[junit4:junit4]   2> 16022 T930 oaz.ClientCnxn$SendThread.primeConnection Socket connection established to 127.0.0.1/127.0.0.1:62211, initiating session
[junit4:junit4]   2> 16023 T847 oazs.NIOServerCnxnFactory.run Accepted socket connection from /127.0.0.1:62264
[junit4:junit4]   2> 16023 T847 oazs.ZooKeeperServer.processConnectRequest Client attempting to establish new session at /127.0.0.1:62264
[junit4:junit4]   2> 16026 T849 oazs.ZooKeeperServer.finishSessionInit Established session 0x13b8ffafc8a000b with negotiated timeout 8000 for client /127.0.0.1:62264
[junit4:junit4]   2> 16026 T930 oaz.ClientCnxn$SendThread.onConnected Session establishment complete on server 127.0.0.1/127.0.0.1:62211, sessionid = 0x13b8ffafc8a000b, negotiated timeout = 8000
[junit4:junit4]   2> 16026 T931 oascc.ConnectionManager.process Watcher org.apache.solr.common.cloud.ConnectionManager@1d0a86a name:ZooKeeperConnection Watcher:127.0.0.1:62211/solr got event WatchedEvent state:SyncConnected type:None path:null path:null type:None
[junit4:junit4]   2> 16028 T845 oascc.ConnectionManager.waitForConnected Client is connected to ZooKeeper
[junit4:junit4]   2> 16029 T850 oazs.PrepRequestProcessor.pRequest Got user-level KeeperException when processing sessionid:0x13b8ffafc8a000b type:create cxid:0x1 zxid:0xa6 txntype:-1 reqpath:n/a Error Path:/solr/overseer Error:KeeperErrorCode = NodeExists for /solr/overseer
[junit4:junit4]   2> 16031 T850 oazs.PrepRequestProcessor.pRequest Got user-level KeeperException when processing sessionid:0x13b8ffafc8a000b type:create cxid:0x2 zxid:0xa7 txntype:-1 reqpath:n/a Error Path:/solr/overseer Error:KeeperErrorCode = NodeExists for /solr/overseer
[junit4:junit4]   2> 16035 T845 oasc.ZkController.createEphemeralLiveNode Register node as live in ZooKeeper:/live_nodes/127.0.0.1:62256_solr
[junit4:junit4]   2> 16037 T850 oazs.PrepRequestProcessor.pRequest Got user-level KeeperException when processing sessionid:0x13b8ffafc8a000b type:delete cxid:0x4 zxid:0xa8 txntype:-1 reqpath:n/a Error Path:/solr/live_nodes/127.0.0.1:62256_solr Error:KeeperErrorCode = NoNode for /solr/live_nodes/127.0.0.1:62256_solr
[junit4:junit4]   2> 16038 T845 oascc.SolrZkClient.makePath makePath: /live_nodes/127.0.0.1:62256_solr
[junit4:junit4]   2> 16044 T914 oascc.ZkStateReader$2.process A cluster state change has occurred - updating... (4)
[junit4:junit4]   2> 16045 T867 oascc.ZkStateReader$2.process A cluster state change has occurred - updating... (4)
[junit4:junit4]   2> 16045 T899 oascc.ZkStateReader$2.process A cluster state change has occurred - updating... (4)
[junit4:junit4]   2> 16045 T884 oascc.ZkStateReader$3.process Updating live nodes... (5)
[junit4:junit4]   2> 16047 T884 oascc.ZkStateReader$2.process A cluster state change has occurred - updating... (5)
[junit4:junit4]   2> 16051 T845 oashc.HttpShardHandlerFactory.getParameter Setting socketTimeout to: 0
[junit4:junit4]   2> 16053 T845 oashc.HttpShardHandlerFactory.getParameter Setting urlScheme to: http://
[junit4:junit4]   2> 16053 T845 oashc.HttpShardHandlerFactory.getParameter Setting connTimeout to: 0
[junit4:junit4]   2> 16056 T914 oascc.ZkStateReader$3.process Updating live nodes... (5)
[junit4:junit4]   2> 16056 T899 oascc.ZkStateReader$3.process Updating live nodes... (5)
[junit4:junit4]   2> 16056 T845 oashc.HttpShardHandlerFactory.getParameter Setting maxConnectionsPerHost to: 20
[junit4:junit4]   2> 16056 T867 oascc.ZkStateReader$3.process Updating live nodes... (5)
[junit4:junit4]   2> 16057 T845 oashc.HttpShardHandlerFactory.getParameter Setting corePoolSize to: 0
[junit4:junit4]   2> 16057 T845 oashc.HttpShardHandlerFactory.getParameter Setting maximumPoolSize to: 2147483647
[junit4:junit4]   2> 16059 T845 oashc.HttpShardHandlerFactory.getParameter Setting maxThreadIdleTime to: 5
[junit4:junit4]   2> 16059 T845 oashc.HttpShardHandlerFactory.getParameter Setting sizeOfQueue to: -1
[junit4:junit4]   2> 16060 T845 oashc.HttpShardHandlerFactory.getParameter Setting fairnessPolicy to: false
[junit4:junit4]   2> 16060 T845 oascsi.HttpClientUtil.createClient Creating new http client, config:maxConnectionsPerHost=20&maxConnections=10000&socketTimeout=0&connTimeout=0&retry=false
[junit4:junit4]   2> 16079 T845 oascc.ZkStateReader.createClusterStateWatchersAndUpdate Updating cluster state from ZooKeeper... 
[junit4:junit4]   2> 16106 T932 oasc.CoreContainer.create Creating SolrCore 'collection1' using instanceDir: C:\Users\JenkinsSlave\workspace\Lucene-Solr-4.x-Windows\solr\build\solr-core\test\J0\.\solrtest-jetty4-1355330304073\collection1
[junit4:junit4]   2> 16107 T932 oasc.ZkController.createCollectionZkNode Check for collection zkNode:collection1
[junit4:junit4]   2> 16108 T932 oasc.ZkController.createCollectionZkNode Collection zkNode exists
[junit4:junit4]   2> 16110 T932 oasc.ZkController.readConfigName Load collection config from:/collections/collection1
[junit4:junit4]   2> 16114 T932 oasc.SolrResourceLoader.<init> new SolrResourceLoader for directory: 'C:\Users\JenkinsSlave\workspace\Lucene-Solr-4.x-Windows\solr\build\solr-core\test\J0\.\solrtest-jetty4-1355330304073\collection1\'
[junit4:junit4]   2> 16119 T932 oasc.SolrResourceLoader.replaceClassLoader Adding 'file:/C:/Users/JenkinsSlave/workspace/Lucene-Solr-4.x-Windows/solr/build/solr-core/test/J0/solrtest-jetty4-1355330304073/collection1/lib/classes/' to classloader
[junit4:junit4]   2> 16120 T932 oasc.SolrResourceLoader.replaceClassLoader Adding 'file:/C:/Users/JenkinsSlave/workspace/Lucene-Solr-4.x-Windows/solr/build/solr-core/test/J0/solrtest-jetty4-1355330304073/collection1/lib/README' to classloader
[junit4:junit4]   2> 16215 T932 oasc.SolrConfig.<init> Using Lucene MatchVersion: LUCENE_41
[junit4:junit4]   2> 16353 T932 oasc.SolrConfig.<init> Loaded SolrConfig: solrconfig.xml
[junit4:junit4]   2> 16357 T932 oass.IndexSchema.readSchema Reading Solr Schema
[junit4:junit4]   2> 16369 T932 oass.IndexSchema.readSchema Schema name=test
[junit4:junit4]   2> 17727 T932 oass.OpenExchangeRatesOrgProvider.init Initialized with rates=open-exchange-rates.json, refreshInterval=1440.
[junit4:junit4]   2> 17746 T932 oass.IndexSchema.readSchema default search field in schema is text
[junit4:junit4]   2> 17753 T932 oass.IndexSchema.readSchema unique key field: id
[junit4:junit4]   2> 17781 T932 oass.FileExchangeRateProvider.reload Reloading exchange rates from file currency.xml
[junit4:junit4]   2> 17784 T932 oass.FileExchangeRateProvider.reload Reloading exchange rates from file currency.xml
[junit4:junit4]   2> 17794 T932 oass.OpenExchangeRatesOrgProvider.reload Reloading exchange rates from open-exchange-rates.json
[junit4:junit4]   2> 17799 T932 oass.OpenExchangeRatesOrgProvider.reload Reloading exchange rates from open-exchange-rates.json
[junit4:junit4]   2> 17802 T932 oasc.SolrCore.<init> [collection1] Opening new SolrCore at C:\Users\JenkinsSlave\workspace\Lucene-Solr-4.x-Windows\solr\build\solr-core\test\J0\.\solrtest-jetty4-1355330304073\collection1\, dataDir=.\org.apache.solr.cloud.BasicDistributedZk2Test-1355330288757/jetty4\
[junit4:junit4]   2> 17803 T932 oasc.JmxMonitoredMap.<init> JMX monitoring is enabled. Adding Solr mbeans to JMX Server: com.sun.jmx.mbeanserver.JmxMBeanServer@165b7e
[junit4:junit4]   2> 17805 T932 oasc.SolrCore.getNewIndexDir New index directory detected: old=null new=.\org.apache.solr.cloud.BasicDistributedZk2Test-1355330288757/jetty4\index/
[junit4:junit4]   2> 17808 T932 oasc.SolrCore.initIndex WARNING [collection1] Solr index directory '.\org.apache.solr.cloud.BasicDistributedZk2Test-1355330288757\jetty4\index' doesn't exist. Creating new index...
[junit4:junit4]   2> 17809 T932 oasc.CachingDirectoryFactory.get return new directory for C:\Users\JenkinsSlave\workspace\Lucene-Solr-4.x-Windows\solr\build\solr-core\test\J0\.\org.apache.solr.cloud.BasicDistributedZk2Test-1355330288757\jetty4\index forceNew:false
[junit4:junit4]   2> 17846 T932 oasc.SolrDeletionPolicy.onCommit SolrDeletionPolicy.onCommit: commits:num=1
[junit4:junit4]   2> 		commit{dir=RateLimitedDirectoryWrapper(NRTCachingDirectory(org.apache.lucene.store.SimpleFSDirectory@C:\Users\JenkinsSlave\workspace\Lucene-Solr-4.x-Windows\solr\build\solr-core\test\J0\org.apache.solr.cloud.BasicDistributedZk2Test-1355330288757\jetty4\index lockFactory=org.apache.lucene.store.NativeFSLockFactory@48dc6; maxCacheMB=48.0 maxMergeSizeMB=4.0)),segFN=segments_1,generation=1,filenames=[segments_1]
[junit4:junit4]   2> 17846 T932 oasc.SolrDeletionPolicy.updateCommits newest commit = 1
[junit4:junit4]   2> 17850 T932 oasc.SolrCore.initWriters created xml: solr.XMLResponseWriter
[junit4:junit4]   2> 17852 T932 oasup.UpdateRequestProcessorChain.init inserting DistributedUpdateProcessorFactory into updateRequestProcessorChain "dedupe"
[junit4:junit4]   2> 17853 T932 oasup.UpdateRequestProcessorChain.init inserting DistributedUpdateProcessorFactory into updateRequestProcessorChain "dedupe-allfields"
[junit4:junit4]   2> 17853 T932 oasup.UpdateRequestProcessorChain.init inserting DistributedUpdateProcessorFactory into updateRequestProcessorChain "stored_sig"
[junit4:junit4]   2> 17853 T932 oasup.UpdateRequestProcessorChain.init inserting DistributedUpdateProcessorFactory into updateRequestProcessorChain "uniq-fields"
[junit4:junit4]   2> 17853 T932 oasup.UpdateRequestProcessorChain.init inserting DistributedUpdateProcessorFactory into updateRequestProcessorChain "distrib-dup-test-chain-implicit"
[junit4:junit4]   2> 17854 T932 oasc.RequestHandlers.initHandlersFromConfig adding lazy requestHandler: solr.ReplicationHandler
[junit4:junit4]   2> 17854 T932 oasc.RequestHandlers.initHandlersFromConfig created /replication: solr.ReplicationHandler
[junit4:junit4]   2> 17854 T932 oasc.RequestHandlers.initHandlersFromConfig created standard: solr.StandardRequestHandler
[junit4:junit4]   2> 17857 T932 oasc.RequestHandlers.initHandlersFromConfig created /get: solr.RealTimeGetHandler
[junit4:junit4]   2> 17859 T932 oasc.RequestHandlers.initHandlersFromConfig created dismax: solr.SearchHandler
[junit4:junit4]   2> 17860 T932 oasc.RequestHandlers.initHandlersFromConfig created mock: org.apache.solr.core.MockQuerySenderListenerReqHandler
[junit4:junit4]   2> 17860 T932 oasc.RequestHandlers.initHandlersFromConfig created /admin/: org.apache.solr.handler.admin.AdminHandlers
[junit4:junit4]   2> 17860 T932 oasc.RequestHandlers.initHandlersFromConfig created defaults: solr.StandardRequestHandler
[junit4:junit4]   2> 17860 T932 oasc.RequestHandlers.initHandlersFromConfig adding lazy requestHandler: solr.StandardRequestHandler
[junit4:junit4]   2> 17862 T932 oasc.RequestHandlers.initHandlersFromConfig created lazy: solr.StandardRequestHandler
[junit4:junit4]   2> 17865 T932 oasc.RequestHandlers.initHandlersFromConfig created /update: solr.UpdateRequestHandler
[junit4:junit4]   2> 17865 T932 oasc.RequestHandlers.initHandlersFromConfig created /terms: org.apache.solr.handler.component.SearchHandler
[junit4:junit4]   2> 17866 T932 oasc.RequestHandlers.initHandlersFromConfig created spellCheckCompRH: org.apache.solr.handler.component.SearchHandler
[junit4:junit4]   2> 17866 T932 oasc.RequestHandlers.initHandlersFromConfig created spellCheckCompRH_Direct: org.apache.solr.handler.component.SearchHandler
[junit4:junit4]   2> 17869 T932 oasc.RequestHandlers.initHandlersFromConfig created spellCheckWithWordbreak: org.apache.solr.handler.component.SearchHandler
[junit4:junit4]   2> 17871 T932 oasc.RequestHandlers.initHandlersFromConfig created spellCheckWithWordbreak_Direct: org.apache.solr.handler.component.SearchHandler
[junit4:junit4]   2> 17872 T932 oasc.RequestHandlers.initHandlersFromConfig created spellCheckCompRH1: org.apache.solr.handler.component.SearchHandler
[junit4:junit4]   2> 17874 T932 oasc.RequestHandlers.initHandlersFromConfig created tvrh: org.apache.solr.handler.component.SearchHandler
[junit4:junit4]   2> 17876 T932 oasc.RequestHandlers.initHandlersFromConfig created /mlt: solr.MoreLikeThisHandler
[junit4:junit4]   2> 17878 T932 oasc.RequestHandlers.initHandlersFromConfig created /debug/dump: solr.DumpRequestHandler
[junit4:junit4]   2> 17890 T932 oashl.XMLLoader.init xsltCacheLifetimeSeconds=60
[junit4:junit4]   2> 17904 T932 oasc.SolrCore.initDeprecatedSupport WARNING solrconfig.xml uses deprecated <admin/gettableFiles>, Please update your config to use the ShowFileRequestHandler.
[junit4:junit4]   2> 17909 T932 oasc.SolrCore.initDeprecatedSupport WARNING adding ShowFileRequestHandler with hidden files: [SCHEMA.XML, OLD_SYNONYMS.TXT, STOPWORDS.TXT, PROTWORDS.TXT, OPEN-EXCHANGE-RATES.JSON, SYNONYMS.TXT, CURRENCY.XML, MAPPING-ISOLATIN1ACCENT.TXT]
[junit4:junit4]   2> 17917 T932 oass.SolrIndexSearcher.<init> Opening Searcher@15f852e main
[junit4:junit4]   2> 17917 T932 oass.SolrIndexSearcher.getIndexDir WARNING WARNING: Directory impl does not support setting indexDir: org.apache.lucene.store.RateLimitedDirectoryWrapper
[junit4:junit4]   2> 17919 T932 oasu.CommitTracker.<init> Hard AutoCommit: disabled
[junit4:junit4]   2> 17919 T932 oasu.CommitTracker.<init> Soft AutoCommit: disabled
[junit4:junit4]   2> 17922 T932 oashc.SpellCheckComponent.inform Initializing spell checkers
[junit4:junit4]   2> 17938 T932 oass.DirectSolrSpellChecker.init init: {name=direct,classname=DirectSolrSpellChecker,field=lowerfilt,minQueryLength=3}
[junit4:junit4]   2> 18130 T933 oasc.SolrCore.registerSearcher [collection1] Registered new searcher Searcher@15f852e main{StandardDirectoryReader(segments_1:1)}
[junit4:junit4]   2> 18145 T932 oasc.ZkController.publish publishing core=collection1 state=down
[junit4:junit4]   2> 18145 T932 oasc.ZkController.publish numShards not found on descriptor - reading it from system property
[junit4:junit4]   2> 18631 T868 oascc.ZkStateReader.updateClusterState Updating cloud state from ZooKeeper... 
[junit4:junit4]   2> 18632 T868 oasc.Overseer$ClusterStateUpdater.updateState Update state numShards=2 message={
[junit4:junit4]   2> 	  "operation":"state",
[junit4:junit4]   2> 	  "numShards":"2",
[junit4:junit4]   2> 	  "shard":null,
[junit4:junit4]   2> 	  "roles":null,
[junit4:junit4]   2> 	  "state":"down",
[junit4:junit4]   2> 	  "core":"collection1",
[junit4:junit4]   2> 	  "collection":"collection1",
[junit4:junit4]   2> 	  "node_name":"127.0.0.1:62256_solr",
[junit4:junit4]   2> 	  "base_url":"http://127.0.0.1:62256/solr"}
[junit4:junit4]   2> 18632 T868 oasc.Overseer$ClusterStateUpdater.updateState Collection already exists with numShards=2
[junit4:junit4]   2> 18632 T868 oasc.Overseer$ClusterStateUpdater.updateState Assigning new node to shard shard=shard2
[junit4:junit4]   2> 18645 T884 oascc.ZkStateReader$2.process A cluster state change has occurred - updating... (5)
[junit4:junit4]   2> 18647 T914 oascc.ZkStateReader$2.process A cluster state change has occurred - updating... (5)
[junit4:junit4]   2> 18647 T867 oascc.ZkStateReader$2.process A cluster state change has occurred - updating... (5)
[junit4:junit4]   2> 18648 T899 oascc.ZkStateReader$2.process A cluster state change has occurred - updating... (5)
[junit4:junit4]   2> 18647 T931 oascc.ZkStateReader$2.process A cluster state change has occurred - updating... (5)
[junit4:junit4]   2> 18899 T932 oasc.CoreContainer.register registering core: collection1
[junit4:junit4]   2> 18899 T932 oasc.ZkController.register Register shard - core:collection1 address:http://127.0.0.1:62256/solr shardId:shard2
[junit4:junit4]   2> 18906 T932 oasc.ZkController.register We are http://127.0.0.1:62256/solr/collection1/ and leader is http://127.0.0.1:62236/solr/collection1/
[junit4:junit4]   2> 18906 T932 oasc.ZkController.register No LogReplay needed for core=collection1 baseURL=http://127.0.0.1:62256/solr
[junit4:junit4]   2> 18906 T932 oasc.ZkController.checkRecovery Core needs to recover:collection1
[junit4:junit4]   2> 18908 T932 oasu.DefaultSolrCoreState.doRecovery Running recovery - first canceling any ongoing recovery
[junit4:junit4]   2> ASYNC  NEW_CORE C75 name=collection1 org.apache.solr.core.SolrCore@1d5e2ae url=http://127.0.0.1:62256/solr/collection1 node=127.0.0.1:62256_solr
[junit4:junit4]   2> 18908 T934 C75 P62256 oasc.RecoveryStrategy.run Starting recovery process.  core=collection1 recoveringAfterStartup=true
[junit4:junit4]   2> 18909 T932 oascc.ZkStateReader.updateClusterState Updating cloud state from ZooKeeper... 
[junit4:junit4]   2> 18911 T934 C75 P62256 oasc.RecoveryStrategy.doRecovery ###### startupVersions=[]
[junit4:junit4]   2> 18911 T934 C75 P62256 oasc.ZkController.publish publishing core=collection1 state=recovering
[junit4:junit4]   2> 18911 T934 C75 P62256 oasc.ZkController.publish numShards not found on descriptor - reading it from system property
[junit4:junit4]   2> 18912 T845 oass.SolrDispatchFilter.init user.dir=C:\Users\JenkinsSlave\workspace\Lucene-Solr-4.x-Windows\solr\build\solr-core\test\J0
[junit4:junit4]   2> 18914 T845 oass.SolrDispatchFilter.init SolrDispatchFilter.init() done
[junit4:junit4]   2> 18915 T845 oascsi.HttpClientUtil.createClient Creating new http client, config:maxConnections=128&maxConnectionsPerHost=32&followRedirects=false
[junit4:junit4]   2> 18915 T934 C75 P62256 oasc.RecoveryStrategy.doRecovery Attempting to PeerSync from http://127.0.0.1:62236/solr/collection1/ core=collection1 - recoveringAfterStartup=true
[junit4:junit4]   2> 18915 T934 C75 P62256 oasu.PeerSync.sync PeerSync: core=collection1 url=http://127.0.0.1:62256/solr START replicas=[http://127.0.0.1:62236/solr/collection1/] nUpdates=100
[junit4:junit4]   2> 18916 T934 C75 P62256 oasu.PeerSync.sync WARNING no frame of reference to tell of we've missed updates
[junit4:junit4]   2> 18916 T934 C75 P62256 oasc.RecoveryStrategy.doRecovery PeerSync Recovery was not successful - trying replication. core=collection1
[junit4:junit4]   2> 18916 T934 C75 P62256 oasc.RecoveryStrategy.doRecovery Starting Replication Recovery. core=collection1
[junit4:junit4]   2> 18918 T934 C75 P62256 oascsi.HttpClientUtil.createClient Creating new http client, config:maxConnections=128&maxConnectionsPerHost=32&followRedirects=false
[junit4:junit4]   2> 18937 T845 oaz.ZooKeeper.<init> Initiating client connection, connectString=127.0.0.1:62211/solr sessionTimeout=10000 watcher=org.apache.solr.common.cloud.ConnectionManager@17846d4
[junit4:junit4]   2> 18941 T845 oascc.ConnectionManager.waitForConnected Waiting for client to connect to ZooKeeper
[junit4:junit4]   2> 18943 T936 oaz.ClientCnxn$SendThread.logStartConnect Opening socket connection to server 127.0.0.1/127.0.0.1:62211. Will not attempt to authenticate using SASL (access denied (javax.security.auth.AuthPermission getLoginConfiguration))
[junit4:junit4]   2> 18944 T847 oazs.NIOServerCnxnFactory.run Accepted socket connection from /127.0.0.1:62269
[junit4:junit4]   2> 18944 T936 oaz.ClientCnxn$SendThread.primeConnection Socket connection established to 127.0.0.1/127.0.0.1:62211, initiating session
[junit4:junit4]   2> 18944 T847 oazs.ZooKeeperServer.processConnectRequest Client attempting to establish new session at /127.0.0.1:62269
[junit4:junit4]   2> 18949 T849 oazs.ZooKeeperServer.finishSessionInit Established session 0x13b8ffafc8a000c with negotiated timeout 10000 for client /127.0.0.1:62269
[junit4:junit4]   2> 18950 T936 oaz.ClientCnxn$SendThread.onConnected Session establishment complete on server 127.0.0.1/127.0.0.1:62211, sessionid = 0x13b8ffafc8a000c, negotiated timeout = 10000
[junit4:junit4]   2> 18950 T937 oascc.ConnectionManager.process Watcher org.apache.solr.common.cloud.ConnectionManager@17846d4 name:ZooKeeperConnection Watcher:127.0.0.1:62211/solr got event WatchedEvent state:SyncConnected type:None path:null path:null type:None
[junit4:junit4]   2> 18950 T845 oascc.ConnectionManager.waitForConnected Client is connected to ZooKeeper
[junit4:junit4]   2> ASYNC  NEW_CORE C76 name=collection1 org.apache.solr.core.SolrCore@1904a5c url=http://127.0.0.1:62236/solr/collection1 node=127.0.0.1:62236_solr
[junit4:junit4]   2> 18952 T895 C76 P62236 REQ /get {distrib=false&qt=/get&wt=javabin&version=2&getVersions=100} status=0 QTime=2 
[junit4:junit4]   2> 18956 T845 oascc.ZkStateReader.createClusterStateWatchersAndUpdate Updating cluster state from ZooKeeper... 
[junit4:junit4]   2> 18959 T845 oasc.ChaosMonkey.monkeyLog monkey: init - expire sessions:true cause connection loss:true
[junit4:junit4]   2> 18960 T845 oascsi.HttpClientUtil.createClient Creating new http client, config:
[junit4:junit4]   2> 18969 T845 oascc.ZkStateReader.updateClusterState Updating cloud state from ZooKeeper... 
[junit4:junit4]   2> ASYNC  NEW_CORE C77 name=collection1 org.apache.solr.core.SolrCore@13674f3 url=http://127.0.0.1:62218/solr/collection1 node=127.0.0.1:62218_solr
[junit4:junit4]   2> 19000 T859 C77 P62218 oascsi.HttpClientUtil.createClient Creating new http client, config:maxConnections=500&maxConnectionsPerHost=16
[junit4:junit4]   2> 19031 T859 C77 P62218 oasc.SolrDeletionPolicy.onInit SolrDeletionPolicy.onInit: commits:num=1
[junit4:junit4]   2> 		commit{dir=RateLimitedDirectoryWrapper(NRTCachingDirectory(org.apache.lucene.store.SimpleFSDirectory@C:\Users\JenkinsSlave\workspace\Lucene-Solr-4.x-Windows\solr\build\solr-core\test\J0\org.apache.solr.cloud.BasicDistributedZk2Test-1355330288757\control\data\index lockFactory=org.apache.lucene.store.NativeFSLockFactory@1208bc8; maxCacheMB=48.0 maxMergeSizeMB=4.0)),segFN=segments_1,generation=1,filenames=[segments_1]
[junit4:junit4]   2> 19032 T859 C77 P62218 oasc.SolrDeletionPolicy.updateCommits newest commit = 1
[junit4:junit4]   2> 19048 T859 C77 P62218 /update {wt=javabin&version=2} {add=[1 (1421166832803381248)]} 0 58
[junit4:junit4]   2> 19050 T845 oaz.ZooKeeper.<init> Initiating client connection, connectString=127.0.0.1:62211/solr sessionTimeout=10000 watcher=org.apache.solr.common.cloud.ConnectionManager@4157d2
[junit4:junit4]   2> 19053 T845 oascc.ConnectionManager.waitForConnected Waiting for client to connect to ZooKeeper
[junit4:junit4]   2> 19054 T938 oaz.ClientCnxn$SendThread.logStartConnect Opening socket connection to server 127.0.0.1/127.0.0.1:62211. Will not attempt to authenticate using SASL (access denied (javax.security.auth.AuthPermission getLoginConfiguration))
[junit4:junit4]   2> 19057 T938 oaz.ClientCnxn$SendThread.primeConnection Socket connection established to 127.0.0.1/127.0.0.1:62211, initiating session
[junit4:junit4]   2> 19059 T847 oazs.NIOServerCnxnFactory.run Accepted socket connection from /127.0.0.1:62273
[junit4:junit4]   2> 19060 T847 oazs.ZooKeeperServer.processConnectRequest Client attempting to establish new session at /127.0.0.1:62273
[junit4:junit4]   2> 19076 T849 oazs.ZooKeeperServer.finishSessionInit Established session 0x13b8ffafc8a000d with negotiated timeout 10000 for client /127.0.0.1:62273
[junit4:junit4]   2> 19076 T938 oaz.ClientCnxn$SendThread.onConnected Session establishment complete on server 127.0.0.1/127.0.0.1:62211, sessionid = 0x13b8ffafc8a000d, negotiated timeout = 10000
[junit4:junit4]   2> 19078 T939 oascc.ConnectionManager.process Watcher org.apache.solr.common.cloud.ConnectionManager@4157d2 name:ZooKeeperConnection Watcher:127.0.0.1:62211/solr got event WatchedEvent state:SyncConnected type:None path:null path:null type:None
[junit4:junit4]   2> 19078 T845 oascc.ConnectionManager.waitForConnected Client is connected to ZooKeeper
[junit4:junit4]   2> 19081 T845 oascc.ZkStateReader.createClusterStateWatchersAndUpdate Updating cluster state from ZooKeeper... 
[junit4:junit4]   2> 19168 T877 C74 P62227 oasc.SolrDeletionPolicy.onInit SolrDeletionPolicy.onInit: commits:num=1
[junit4:junit4]   2> 		commit{dir=RateLimitedDirectoryWrapper(NRTCachingDirectory(org.apache.lucene.store.SimpleFSDirectory@C:\Users\JenkinsSlave\workspace\Lucene-Solr-4.x-Windows\solr\build\solr-core\test\J0\org.apache.solr.cloud.BasicDistributedZk2Test-1355330288757\jetty1\index lockFactory=org.apache.lucene.store.NativeFSLockFactory@bfd73e; maxCacheMB=48.0 maxMergeSizeMB=4.0)),segFN=segments_1,generation=1,filenames=[segments_1]
[junit4:junit4]   2> 19170 T877 C74 P62227 oasc.SolrDeletionPolicy.updateCommits newest commit = 1
[junit4:junit4]   2>  C73_STATE=coll:collection1 core:collection1 props:{shard=shard1, roles=null, state=recovering, core=collection1, collection=collection1, node_name=127.0.0.1:62245_solr, base_url=http://127.0.0.1:62245/solr}
[junit4:junit4]   2> 19204 T910 C73 P62245 oasc.SolrDeletionPolicy.onInit SolrDeletionPolicy.onInit: commits:num=1
[junit4:junit4]   2> 		commit{dir=RateLimitedDirectoryWrapper(NRTCachingDirectory(org.apache.lucene.store.SimpleFSDirectory@C:\Users\JenkinsSlave\workspace\Lucene-Solr-4.x-Windows\solr\build\solr-core\test\J0\org.apache.solr.cloud.BasicDistributedZk2Test-1355330288757\jetty3\index lockFactory=org.apache.lucene.store.NativeFSLockFactory@12980bd; maxCacheMB=48.0 maxMergeSizeMB=4.0)),segFN=segments_1,generation=1,filenames=[segments_1]
[junit4:junit4]   2> 19206 T910 C73 P62245 oasc.SolrDeletionPolicy.updateCommits newest commit = 1
[junit4:junit4]   2> 19212 T910 C73 P62245 REQ /update {distrib.from=http://127.0.0.1:62227/solr/collection1/&update.distrib=FROMLEADER&wt=javabin&version=2} status=0 QTime=17 
[junit4:junit4]   2> 19214 T877 C74 P62227 REQ /update {distrib.from=http://127.0.0.1:62236/solr/collection1/&update.distrib=TOLEADER&wt=javabin&version=2} status=0 QTime=56 
[junit4:junit4]   2> 19214 T892 C76 P62236 /update {wt=javabin&version=2} {add=[1]} 0 128
[junit4:junit4]   2> 19218 T860 C77 P62218 oasu.DirectUpdateHandler2.commit start commit{flags=0,_version_=0,optimize=false,openSearcher=true,waitSearcher=true,expungeDeletes=false,softCommit=false}
[junit4:junit4]   2> 19306 T860 C77 P62218 oasc.SolrDeletionPolicy.onCommit SolrDeletionPolicy.onCommit: commits:num=2
[junit4:junit4]   2> 		commit{dir=RateLimitedDirectoryWrapper(NRTCachingDirectory(org.apache.lucene.store.SimpleFSDirectory@C:\Users\JenkinsSlave\workspace\Lucene-Solr-4.x-Windows\solr\build\solr-core\test\J0\org.apache.solr.cloud.BasicDistributedZk2Test-1355330288757\control\data\index lockFactory=org.apache.lucene.store.NativeFSLockFactory@1208bc8; maxCacheMB=48.0 maxMergeSizeMB=4.0)),segFN=segments_1,generation=1,filenames=[segments_1]
[junit4:junit4]   2> 		commit{dir=RateLimitedDirectoryWrapper(NRTCachingDirectory(org.apache.lucene.store.SimpleFSDirectory@C:\Users\JenkinsSlave\workspace\Lucene-Solr-4.x-Windows\solr\build\solr-core\test\J0\org.apache.solr.cloud.BasicDistributedZk2Test-1355330288757\control\data\index lockFactory=org.apache.lucene.store.NativeFSLockFactory@1208bc8; maxCacheMB=48.0 maxMergeSizeMB=4.0)),segFN=segments_2,generation=2,filenames=[_0_NestedPulsing_0.doc, _0.fnm, _0_Lucene41_0.pos, _0_Memory_0.ram, _0_nrm.cfs, _0_NestedPulsing_0.tip, _0_NestedPulsing_0.tim, _0_NestedPulsing_0.pos, _0_Lucene41_0.doc, _0_nrm.cfe, _0_SimpleText_0.pst, segments_2, _0.fdx, _0.si, _0_Lucene41_0.tim, _0_Lucene41_0.tip, _0.fdt]
[junit4:junit4]   2> 19306 T860 C77 P62218 oasc.SolrDeletionPolicy.updateCommits newest commit = 2
[junit4:junit4]   2> 19334 T860 C77 P62218 oass.SolrIndexSearcher.<init> Opening Searcher@efd3fa main
[junit4:junit4]   2> 19334 T860 C77 P62218 oass.SolrIndexSearcher.getIndexDir WARNING WARNING: Directory impl does not support setting indexDir: org.apache.lucene.store.RateLimitedDirectoryWrapper
[junit4:junit4]   2> 19335 T860 C77 P62218 oasu.DirectUpdateHandler2.commit end_commit_flush
[junit4:junit4]   2> 19337 T871 oasc.SolrCore.registerSearcher [collection1] Registered new searcher Searcher@efd3fa main{StandardDirectoryReader(segments_2:3 _0(4.1):C1)}
[junit4:junit4]   2> 19338 T860 C77 P62218 /update {waitSearcher=true&wt=javabin&commit=true&softCommit=false&version=2} {commit=} 0 120
[junit4:junit4]   2> 19341 T876 C74 P62227 oasu.DirectUpdateHandler2.commit start commit{flags=0,_version_=0,optimize=false,openSearcher=true,waitSearcher=true,expungeDeletes=false,softCommit=false}
[junit4:junit4]   2> 19412 T868 oascc.ZkStateReader.updateClusterState Updating cloud state from ZooKeeper... 
[junit4:junit4]   2> 19414 T868 oasc.Overseer$ClusterStateUpdater.updateState Update state numShards=2 message={
[junit4:junit4]   2> 	  "operation":"state",
[junit4:junit4]   2> 	  "numShards":"2",
[junit4:junit4]   2> 	  "shard":"shard2",
[junit4:junit4]   2> 	  "roles":null,
[junit4:junit4]   2> 	  "state":"recovering",
[junit4:junit4]   2> 	  "core":"collection1",
[junit4:junit4]   2> 	  "collection":"collection1",
[junit4:junit4]   2> 	  "node_name":"127.0.0.1:62256_solr",
[junit4:junit4]   2> 	  "base_url":"http://127.0.0.1:62256/solr"}
[junit4:junit4]   2> 19431 T876 C74 P62227 oasc.SolrDeletionPolicy.onCommit SolrDeletionPolicy.onCommit: commits:num=2
[junit4:junit4]   2> 		commit{dir=RateLimitedDirectoryWrapper(NRTCachingDirectory(org.apache.lucene.store.SimpleFSDirectory@C:\Users\JenkinsSlave\workspace\Lucene-Solr-4.x-Windows\solr\build\solr-core\test\J0\org.apache.solr.cloud.BasicDistributedZk2Test-1355330288757\jetty1\index lockFactory=org.apache.lucene.store.NativeFSLockFactory@bfd73e; maxCacheMB=48.0 maxMergeSizeMB=4.0)),segFN=segments_1,generation=1,filenames=[segments_1]
[junit4:junit4]   2> 		commit{dir=RateLimitedDirectoryWrapper(NRTCachingDirectory(org.apache.lucene.store.SimpleFSDirectory@C:\Users\JenkinsSlave\workspace\Lucene-Solr-4.x-Windows\solr\build\solr-core\test\J0\org.apache.solr.cloud.BasicDistributedZk2Test-1355330288757\jetty1\index lockFactory=org.apache.lucene.store.NativeFSLockFactory@bfd73e; maxCacheMB=48.0 maxMergeSizeMB=4.0)),segFN=segments_2,generation=2,filenames=[_0_NestedPulsing_0.doc, _0.fnm, _0_Lucene41_0.pos, _0_Memory_0.ram, _0_nrm.cfs, _0_NestedPulsing_0.tip, _0_NestedPulsing_0.tim, _0_NestedPulsing_0.pos, _0_Lucene41_0.doc, _0_nrm.cfe, _0_SimpleText_0.pst, segments_2, _0.fdx, _0.si, _0_Lucene41_0.tim, _0_Lucene41_0.tip, _0.fdt]
[junit4:junit4]   2> 19432 T876 C74 P62227 oasc.SolrDeletionPolicy.updateCommits newest commit = 2
[junit4:junit4]   2> 19435 T867 oascc.ZkStateReader$2.process A cluster state change has occurred - updating... (5)
[junit4:junit4]   2> 19435 T931 oascc.ZkStateReader$2.process A cluster state change has occurred - updating... (5)
[junit4:junit4]   2> 19435 T899 oascc.ZkStateReader$2.process A cluster state change has occurred - updating... (5)
[junit4:junit4]   2> 19438 T937 oascc.ZkStateReader$2.process A cluster state change has occurred - updating... (5)
[junit4:junit4]   2> 19439 T939 oascc.ZkStateReader$2.process A cluster state change has occurred - updating... (5)
[junit4:junit4]   2> 19442 T884 oascc.ZkStateReader$2.process A cluster state change has occurred - updating... (5)
[junit4:junit4]   2> 19442 T914 oascc.ZkStateReader$2.process A cluster state change has occurred - updating... (5)
[junit4:junit4]   2> 19475 T876 C74 P62227 oass.SolrIndexSearcher.<init> Opening Searcher@13097e5 main
[junit4:junit4]   2> 19477 T876 C74 P62227 oass.SolrIndexSearcher.getIndexDir WARNING WARNING: Directory impl does not support setting indexDir: org.apache.lucene.store.RateLimitedDirectoryWrapper
[junit4:junit4]   2> 19479 T876 C74 P62227 oasu.DirectUpdateHandler2.commit end_commit_flush
[junit4:junit4]   2> 19482 T886 oasc.SolrCore.registerSearcher [collection1] Registered new searcher Searcher@13097e5 main{StandardDirectoryReader(segments_2:3 _0(4.1):C1)}
[junit4:junit4]   2> 19485 T876 C74 P62227 oasu.SolrCmdDistributor.distribCommit Distrib commit to:[StdNode: http://127.0.0.1:62245/solr/collection1/, StdNode: http://127.0.0.1:62236/solr/collection1/, StdNode: http://127.0.0.1:62256/solr/collection1/] params:commit_end_point=true&commit=true&softCommit=false&waitSearcher=true&expungeDeletes=false
[junit4:junit4]   2> 19491 T905 C73 P62245 oasu.DirectUpdateHandler2.commit start commit{flags=0,_version_=0,optimize=false,openSearcher=true,waitSearcher=true,expungeDeletes=false,softCommit=false}
[junit4:junit4]   2> 19492 T893 C76 P62236 oasu.DirectUpdateHandler2.commit start commit{flags=0,_version_=0,optimize=false,openSearcher=true,waitSearcher=true,expungeDeletes=false,softCommit=false}
[junit4:junit4]   2> 19504 T893 C76 P62236 oasc.SolrDeletionPolicy.onInit SolrDeletionPolicy.onInit: commits:num=1
[junit4:junit4]   2> 		commit{dir=RateLimitedDirectoryWrapper(NRTCachingDirectory(org.apache.lucene.store.SimpleFSDirectory@C:\Users\JenkinsSlave\workspace\Lucene-Solr-4.x-Windows\solr\build\solr-core\test\J0\org.apache.solr.cloud.BasicDistributedZk2Test-1355330288757\jetty2\index lockFactory=org.apache.lucene.store.NativeFSLockFactory@1ac978a; maxCacheMB=48.0 maxMergeSizeMB=4.0)),segFN=segments_1,generation=1,filenames=[segments_1]
[junit4:junit4]   2> 19505 T893 C76 P62236 oasc.SolrDeletionPolicy.updateCommits newest commit = 1
[junit4:junit4]   2>  C75_STATE=coll:collection1 core:collection1 props:{shard=shard2, roles=null, state=recovering, core=collection1, collection=collection1, node_name=127.0.0.1:62256_solr, base_url=http://127.0.0.1:62256/solr}
[junit4:junit4]   2> 19552 T922 C75 P62256 oasu.DirectUpdateHandler2.commit start commit{flags=0,_version_=0,optimize=false,openSearcher=true,waitSearcher=true,expungeDeletes=false,softCommit=false}
[junit4:junit4]   2> 19561 T922 C75 P62256 oasc.SolrDeletionPolicy.onInit SolrDeletionPolicy.onInit: commits:num=1
[junit4:junit4]   2> 		commit{dir=RateLimitedDirectoryWrapper(NRTCachingDirectory(org.apache.lucene.store.SimpleFSDirectory@C:\Users\JenkinsSlave\workspace\Lucene-Solr-4.x-Windows\solr\build\solr-core\test\J0\org.apache.solr.cloud.BasicDistributedZk2Test-1355330288757\jetty4\index lockFactory=org.apache.lucene.store.NativeFSLockFactory@48dc6; maxCacheMB=48.0 maxMergeSizeMB=4.0)),segFN=segments_1,generation=1,filenames=[segments_1]
[junit4:junit4]   2> 19564 T922 C75 P62256 oasc.SolrDeletionPolicy.updateCommits newest commit = 1
[junit4:junit4]   2> 19589 T893 C76 P62236 oasc.SolrDeletionPolicy.onCommit SolrDeletionPolicy.onCommit: commits:num=2
[junit4:junit4]   2> 		commit{dir=RateLimitedDirectoryWrapper(NRTCachingDirectory(org.apache.lucene.store.SimpleFSDirectory@C:\Users\JenkinsSlave\workspace\Lucene-Solr-4.x-Windows\solr\build\solr-core\test\J0\org.apache.solr.cloud.BasicDistributedZk2Test-1355330288757\jetty2\index lockFactory=org.apache.lucene.store.NativeFSLockFactory@1ac978a; maxCacheMB=48.0 maxMergeSizeMB=4.0)),segFN=segments_1,generation=1,filenames=[segments_1]
[junit4:junit4]   2> 		commit{dir=RateLimitedDirectoryWrapper(NRTCachingDirectory(org.apache.lucene.store.SimpleFSDirectory@C:\Users\JenkinsSlave\workspace\Lucene-Solr-4.x-Windows\solr\build\solr-core\test\J0\org.apache.solr.cloud.BasicDistributedZk2Test-1355330288757\jetty2\index lockFactory=org.apache.lucene.store.NativeFSLockFactory@1ac978a; maxCacheMB=48.0 maxMergeSizeMB=4.0)),segFN=segments_2,generation=2,filenames=[segments_2]
[junit4:junit4]   2> 19590 T893 C76 P62236 oasc.SolrDeletionPolicy.updateCommits newest commit = 2
[junit4:junit4]   2> 19601 T893 C76 P62236 oass.SolrIndexSearcher.<init> Opening Searcher@133cec2 main
[junit4:junit4]   2> 19601 T893 C76 P62236 oass.SolrIndexSearcher.getIndexDir WARNING WARNING: Directory impl does not support setting indexDir: org.apache.lucene.store.RateLimitedDirectoryWrapper
[junit4:junit4]   2> 19602 T893 C76 P62236 oasu.DirectUpdateHandler2.commit end_commit_flush
[junit4:junit4]   2> 19605 T901 oasc.SolrCore.registerSearcher [collection1] Registered new searcher Searcher@133cec2 main{StandardDirectoryReader(segments_1:1)}
[junit4:junit4]   2> 19606 T893 C76 P62236 /update {waitSearcher=true&commit=true&commit_end_point=true&expungeDeletes=false&wt=javabin&softCommit=false&version=2} {commit=} 0 114
[junit4:junit4]   2> 19614 T922 C75 P62256 oasc.SolrDeletionPolicy.onCommit SolrDeletionPolicy.onCommit: commits:num=2
[junit4:junit4]   2> 		commit{dir=RateLimitedDirectoryWrapper(NRTCachingDirectory(org.apache.lucene.store.SimpleFSDirectory@C:\Users\JenkinsSlave\workspace\Lucene-Solr-4.x-Windows\solr\build\solr-core\test\J0\org.apache.solr.cloud.BasicDistributedZk2Test-1355330288757\jetty4\index lockFactory=org.apache.lucene.store.NativeFSLockFactory@48dc6; maxCacheMB=48.0 maxMergeSizeMB=4.0)),segFN=segments_1,generation=1,filenames=[segments_1]
[junit4:junit4]   2> 		commit{dir=RateLimitedDirectoryWrapper(NRTCachingDirectory(org.apache.lucene.store.SimpleFSDirectory@C:\Users\JenkinsSlave\workspace\Lucene-Solr-4.x-Windows\solr\build\solr-core\test\J0\org.apache.solr.cloud.BasicDistributedZk2Test-1355330288757\jetty4\index lockFactory=org.apache.lucene.store.NativeFSLockFactory@48dc6; maxCacheMB=48.0 maxMergeSizeMB=4.0)),segFN=segments_2,generation=2,filenames=[segments_2]
[junit4:junit4]   2> 19614 T922 C75 P62256 oasc.SolrDeletionPolicy.updateCommits newest commit = 2
[junit4:junit4]   2> 19621 T922 C75 P62256 oass.SolrIndexSearcher.<init> Opening Searcher@19a3ff4 main
[junit4:junit4]   2> 19622 T922 C75 P62256 oass.SolrIndexSearcher.getIndexDir WARNING WARNING: Directory impl does not support setting indexDir: org.apache.lucene.store.RateLimitedDirectoryWrapper
[junit4:junit4]   2> 19622 T922 C75 P62256 oasu.DirectUpdateHandler2.commit end_commit_flush
[junit4:junit4]   2> 19625 T933 oasc.SolrCore.registerSearcher [collection1] Registered new searcher Searcher@19a3ff4 main{StandardDirectoryReader(segments_1:1)}
[junit4:junit4]   2> 19627 T922 C75 P62256 /update {waitSearcher=true&commit=true&commit_end_point=true&expungeDeletes=false&wt=javabin&softCommit=false&version=2} {commit=} 0 76
[junit4:junit4]   2> 19642 T905 C73 P62245 oasc.SolrDeletionPolicy.onCommit SolrDeletionPolicy.onCommit: commits:num=2
[junit4:junit4]   2> 		commit{dir=RateLimitedDirectoryWrapper(NRTCachingDirectory(org.apache.lucene.store.SimpleFSDirectory@C:\Users\JenkinsSlave\workspace\Lucene-Solr-4.x-Windows\solr\build\solr-core\test\J0\org.apache.solr.cloud.BasicDistributedZk2Test-1355330288757\jetty3\index lockFactory=org.apache.lucene.store.NativeFSLockFactory@12980bd; maxCacheMB=48.0 maxMergeSizeMB=4.0)),segFN=segments_1,generation=1,filenames=[segments_1]
[junit4:junit4]   2> 		commit{dir=RateLimitedDirectoryWrapper(NRTCachingDirectory(org.apache.lucene.store.SimpleFSDirectory@C:\Users\JenkinsSlave\workspace\Lucene-Solr-4.x-Windows\solr\build\solr-core\test\J0\org.apache.solr.cloud.BasicDistributedZk2Test-1355330288757\jetty3\index lockFactory=org.apache.lucene.store.NativeFSLockFactory@12980bd; maxCacheMB=48.0 maxMergeSizeMB=4.0)),segFN=segments_2,generation=2,filenames=[_0_NestedPulsing_0.doc, _0.fnm, _0_Lucene41_0.pos, _0_Memory_0.ram, _0_nrm.cfs, _0_NestedPulsing_0.tip, _0_NestedPulsing_0.tim, _0_NestedPulsing_0.pos, _0_Lucene41_0.doc, _0_nrm.cfe, _0_SimpleText_0.pst, segments_2, _0.fdx, _0.si, _0_Lucene41_0.tim, _0_Lucene41_0.tip, _0.fdt]
[junit4:junit4]   2> 19642 T905 C73 P62245 oasc.SolrDeletionPolicy.updateCommits newest commit = 2
[junit4:junit4]   2> 19658 T905 C73 P62245 oass.SolrIndexSearcher.<init> Opening Searcher@15b9b89 main
[junit4:junit4]   2> 19659 T905 C73 P62245 oass.SolrIndexSearcher.getIndexDir WARNING WARNING: Directory impl does not support setting indexDir: org.apache.lucene.store.RateLimitedDirectoryWrapper
[junit4:junit4]   2> 19661 T905 C73 P62245 oasu.DirectUpdateHandler2.commit end_commit_flush
[junit4:junit4]   2> 19664 T916 oasc.SolrCore.registerSearcher [collection1] Registered new searcher Searcher@15b9b89 main{StandardDirectoryReader(segments_2:3 _0(4.1):C1)}
[junit4:junit4]   2> 19664 T905 C73 P62245 /update {waitSearcher=true&commit=true&commit_end_point=true&expungeDeletes=false&wt=javabin&softCommit=false&version=2} {commit=} 0 173
[junit4:junit4]   2> 19666 T876 C74 P62227 /update {waitSearcher=true&wt=javabin&commit=true&softCommit=false&version=2} {commit=} 0 325
[junit4:junit4]   2> 19666 T845 oasc.AbstractDistribZkTestBase.waitForRecoveriesToFinish Wait for recoveries to finish - collection: collection1 failOnTimeout:true timeout (sec):180
[junit4:junit4]   2> 19668 T845 oascc.ZkStateReader.updateClusterState Updating cloud state from ZooKeeper... 
[junit4:junit4]   2> 19892 T917 C73 P62245 oasc.RecoveryStrategy.doRecovery Begin buffering updates. core=collection1
[junit4:junit4]   2> 19892 T917 C73 P62245 oasu.UpdateLog.bufferUpdates Starting to buffer updates. FSUpdateLog{state=ACTIVE, tlog=null}
[junit4:junit4]   2> 19893 T917 C73 P62245 oasc.RecoveryStrategy.replicate Attempting to replicate from http://127.0.0.1:62227/solr/collection1/. core=collection1
[junit4:junit4]   2> 19893 T917 C73 P62245 oascsi.HttpClientUtil.createClient Creating new http client, config:maxConnections=128&maxConnectionsPerHost=32&followRedirects=false
[junit4:junit4]   2> 19913 T875 C74 P62227 oasu.DirectUpdateHandler2.commit start commit{flags=0,_version_=0,optimize=false,openSearcher=false,waitSearcher=true,expungeDeletes=false,softCommit=false}
[junit4:junit4]   2> 19929 T875 C74 P62227 oasc.SolrDeletionPolicy.onCommit SolrDeletionPolicy.onCommit: commits:num=2
[junit4:junit4]   2> 		commit{dir=RateLimitedDirectoryWrapper(NRTCachingDirectory(org.apache.lucene.store.SimpleFSDirectory@C:\Users\JenkinsSlave\workspace\Lucene-Solr-4.x-Windows\solr\build\solr-core\test\J0\org.apache.solr.cloud.BasicDistributedZk2Test-1355330288757\jetty1\index lockFactory=org.apache.lucene.store.NativeFSLockFactory@bfd73e; maxCacheMB=48.0 maxMergeSizeMB=4.0)),segFN=segments_2,generation=2,filenames=[_0_NestedPulsing_0.doc, _0.fnm, _0_Lucene41_0.pos, _0_Memory_0.ram, _0_nrm.cfs, _0_NestedPulsing_0.tip, _0_NestedPulsing_0.tim, _0_NestedPulsing_0.pos, _0_Lucene41_0.doc, _0_nrm.cfe, _0_SimpleText_0.pst, segments_2, _0.fdx, _0.si, _0_Lucene41_0.tim, _0_Lucene41_0.tip, _0.fdt]
[junit4:junit4]   2> 		commit{dir=RateLimitedDirectoryWrapper(NRTCachingDirectory(org.apache.lucene.store.SimpleFSDirectory@C:\Users\JenkinsSlave\workspace\Lucene-Solr-4.x-Windows\solr\build\solr-core\test\J0\org.apache.solr.cloud.BasicDistributedZk2Test-1355330288757\jetty1\index lockFactory=org.apache.lucene.store.NativeFSLockFactory@bfd73e; maxCacheMB=48.0 maxMergeSizeMB=4.0)),segFN=segments_3,generation=3,filenames=[_0_NestedPulsing_0.doc, _0.fnm, _0_Lucene41_0.pos, _0_Memory_0.ram, _0_nrm.cfs, _0_NestedPulsing_0.tip, _0_NestedPulsing_0.tim, _0_NestedPulsing_0.pos, _0_Lucene41_0.doc, _0_nrm.cfe, _0_SimpleText_0.pst, _0.fdx, _0.si, _0_Lucene41_0.tim, _0_Lucene41_0.tip, _0.fdt, segments_3]
[junit4:junit4]   2> 19930 T875 C74 P62227 oasc.SolrDeletionPolicy.updateCommits newest commit = 3
[junit4:junit4]   2> 19939 T875 C74 P62227 oass.SolrIndexSearcher.<init> Opening Searcher@cd5aa1 realtime
[junit4:junit4]   2> 19939 T875 C74 P62227 oass.SolrIndexSearcher.getIndexDir WARNING WARNING: Directory impl does not support setting indexDir: org.apache.lucene.store.RateLimitedDirectoryWrapper
[junit4:junit4]   2> 19940 T875 C74 P62227 oasu.DirectUpdateHandler2.commit end_commit_flush
[junit4:junit4]   2> 19940 T875 C74 P62227 /update {waitSearcher=true&openSearcher=false&commit=true&commit_end_point=true&wt=javabin&softCommit=false&version=2} {commit=} 0 27
[junit4:junit4]   2> 19943 T917 C73 P62245 oash.ReplicationHandler.inform Commits will be reserved for  10000
[junit4:junit4]   2> 19943 T917 C73 P62245 oash.SnapPuller.<init>  No value set for 'pollInterval'. Timer Task not started.
[junit4:junit4]   2> 19951 T878 C74 P62227 oash.ReplicationHandler.inform Commits will be reserved for  10000
[junit4:junit4]   2> 19951 T878 C74 P62227 REQ /replication {command=indexversion&wt=javabin&qt=/replication&version=2} status=0 QTime=3 
[junit4:junit4]   2> 19952 T917 C73 P62245 oash.SnapPuller.fetchLatestIndex Master's generation: 3
[junit4:junit4]   2> 19954 T917 C73 P62245 oash.SnapPuller.fetchLatestIndex Slave's generation: 2
[junit4:junit4]   2> 19954 T917 C73 P62245 oash.SnapPuller.fetchLatestIndex Starting replication process
[junit4:junit4]   2> 19968 T877 C74 P62227 REQ /replication {command=filelist&generation=3&wt=javabin&qt=/replication&version=2} status=0 QTime=12 
[junit4:junit4]   2> 19970 T917 C73 P62245 oash.SnapPuller.fetchLatestIndex Number of files in latest index in master: 17
[junit4:junit4]   2> 19980 T917 C73 P62245 oash.SnapPuller.fetchLatestIndex Starting download to .\org.apache.solr.cloud.BasicDistributedZk2Test-1355330288757\jetty3\index.20121213063828723 fullCopy=true
[junit4:junit4]   2> 19990 T876 C74 P62227 REQ /replication {file=_0_NestedPulsing_0.doc&command=filecontent&checksum=true&generation=3&qt=/replication&wt=filestream} status=0 QTime=0 
[junit4:junit4]   2> 20003 T879 C74 P62227 REQ /replication {file=_0.fnm&command=filecontent&checksum=true&generation=3&qt=/replication&wt=filestream} status=0 QTime=0 
[junit4:junit4]   2> 20017 T875 C74 P62227 REQ /replication {file=_0_Memory_0.ram&command=filecontent&checksum=true&generation=3&qt=/replication&wt=filestream} status=0 QTime=0 
[junit4:junit4]   2> 20052 T880 C74 P62227 REQ /replication {file=_0_Lucene41_0.pos&command=filecontent&checksum=true&generation=3&qt=/replication&wt=filestream} status=0 QTime=0 
[junit4:junit4]   2> 20065 T878 C74 P62227 REQ /replication {file=_0_nrm.cfs&command=filecontent&checksum=true&generation=3&qt=/replication&wt=filestream} status=0 QTime=0 
[junit4:junit4]   2> 20080 T876 C74 P62227 REQ /replication {file=_0_NestedPulsing_0.tip&command=filecontent&checksum=true&generation=3&qt=/replication&wt=filestream} status=0 QTime=0 
[junit4:junit4]   2> 20087 T879 C74 P62227 REQ /replication {file=_0_NestedPulsing_0.tim&command=filecontent&checksum=true&generation=3&qt=/replication&wt=filestream} status=0 QTime=0 
[junit4:junit4]   2> 20096 T875 C74 P62227 REQ /replication {file=_0_NestedPulsing_0.pos&command=filecontent&checksum=true&generation=3&qt=/replication&wt=filestream} status=0 QTime=0 
[junit4:junit4]   2> 20104 T880 C74 P62227 REQ /replication {file=_0_Lucene41_0.doc&command=filecontent&checksum=true&generation=3&qt=/replication&wt=filestream} status=0 QTime=0 
[junit4:junit4]   2> 20121 T878 C74 P62227 REQ /replication {file=_0_SimpleText_0.pst&command=filecontent&checksum=true&generation=3&qt=/replication&wt=filestream} status=0 QTime=0 
[junit4:junit4]   2> 20129 T877 C74 P62227 REQ /replication {file=_0_nrm.cfe&command=filecontent&checksum=true&generation=3&qt=/replication&wt=filestream} status=0 QTime=0 
[junit4:junit4]   2> 20143 T876 C74 P62227 REQ /replication {file=_0.fdx&command=filecontent&checksum=true&generation=3&qt=/replication&wt=filestream} status=0 QTime=0 
[junit4:junit4]   2> 20150 T879 C74 P62227 REQ /replication {file=_0.si&command=filecontent&checksum=true&generation=3&qt=/replication&wt=filestream} status=0 QTime=0 
[junit4:junit4]   2> 20157 T875 C74 P62227 REQ /replication {file=_0_Lucene41_0.tim&command=filecontent&checksum=true&generation=3&qt=/replication&wt=filestream} status=0 QTime=0 
[junit4:junit4]   2> 20164 T880 C74 P62227 REQ /replication {file=segments_3&command=filecontent&checksum=true&generation=3&qt=/replication&wt=filestream} status=0 QTime=0 
[junit4:junit4]   2> 20188 T878 C74 P62227 REQ /replication {file=_0.fdt&command=filecontent&checksum=true&generation=3&qt=/replication&wt=filestream} status=0 QTime=0 
[junit4:junit4]   2> 20197 T877 C74 P62227 REQ /replication {file=_0_Lucene41_0.tip&command=filecontent&checksum=true&generation=3&qt=/replication&wt=filestream} status=0 QTime=0 
[junit4:junit4]   2> 20200 T917 C73 P62245 oash.SnapPuller.fetchLatestIndex Total time taken for download : 0 secs
[junit4:junit4]   2> 20203 T917 C73 P62245 oash.SnapPuller.modifyIndexProps New index installed. Updating index properties... index=index.20121213063828723
[junit4:junit4]   2> 20207 T917 C73 P62245 oasu.DefaultSolrCoreState.newIndexWriter Creating new IndexWriter...
[junit4:junit4]   2> 20207 T917 C73 P62245 oasu.DefaultSolrCoreState.newIndexWriter Waiting until IndexWriter is unused... core=collection1
[junit4:junit4]   2> 20207 T917 C73 P62245 oasu.DefaultSolrCoreState.newIndexWriter Rollback old IndexWriter... core=collection1
[junit4:junit4]   2> 20232 T917 C73 P62245 oasc.SolrCore.getNewIndexDir New index directory detected: old=.\org.apache.solr.cloud.BasicDistributedZk2Test-1355330288757/jetty3\index/ new=.\org.apache.solr.cloud.BasicDistributedZk2Test-1355330288757/jetty3\index.20121213063828723
[junit4:junit4]   2> 20232 T917 C73 P62245 oasc.CachingDirectoryFactory.get return new directory for C:\Users\JenkinsSlave\workspace\Lucene-Solr-4.x-Windows\solr\build\solr-core\test\J0\.\org.apache.solr.cloud.BasicDistributedZk2Test-1355330288757\jetty3\index.20121213063828723 forceNew:true
[junit4:junit4]   2> 20242 T917 C73 P62245 oasc.SolrDeletionPolicy.onInit SolrDeletionPolicy.onInit: commits:num=1
[junit4:junit4]   2> 		commit{dir=RateLimitedDirectoryWrapper(NRTCachingDirectory(org.apache.lucene.store.SimpleFSDirectory@C:\Users\JenkinsSlave\workspace\Lucene-Solr-4.x-Windows\solr\build\solr-core\test\J0\org.apache.solr.cloud.BasicDistributedZk2Test-1355330288757\jetty3\index.20121213063828723 lockFactory=org.apache.lucene.store.NativeFSLockFactory@ca224f; maxCacheMB=48.0 maxMergeSizeMB=4.0)),segFN=segments_3,generation=3,filenames=[_0_NestedPulsing_0.doc, _0.fnm, _0_Lucene41_0.pos, _0_Memory_0.ram, _0_nrm.cfs, _0_NestedPulsing_0.tip, _0_NestedPulsing_0.tim, _0_NestedPulsing_0.pos, _0_Lucene41_0.doc, _0_nrm.cfe, _0_SimpleText_0.pst, _0.fdx, _0.si, _0_Lucene41_0.tim, _0.fdt, _0_Lucene41_0.tip, segments_3]
[junit4:junit4]   2> 20242 T917 C73 P62245 oasc.SolrDeletionPolicy.updateCommits newest commit = 3
[junit4:junit4]   2> 20244 T917 C73 P62245 oasu.DefaultSolrCoreState.newIndexWriter New IndexWriter is ready to be used.
[junit4:junit4]   2> 20248 T917 C73 P62245 oass.SolrIndexSearcher.<init> Opening Searcher@b0244c main
[junit4:junit4]   2> 20248 T917 C73 P62245 oass.SolrIndexSearcher.getIndexDir WARNING WARNING: Directory impl does not support setting indexDir: org.apache.lucene.store.RateLimitedDirectoryWrapper
[junit4:junit4]   2> 20251 T916 oasc.SolrCore.registerSearcher [collection1] Registered new searcher Searcher@b0244c main{StandardDirectoryReader(segments_3:3:nrt _0(4.1):C1)}
[junit4:junit4]   2> 20252 T916 oasc.CachingDirectoryFactory.close Closing directory:C:\Users\JenkinsSlave\workspace\Lucene-Solr-4.x-Windows\solr\build\solr-core\test\J0\.\org.apache.solr.cloud.BasicDistributedZk2Test-1355330288757\jetty3\index
[junit4:junit4]   2> 20252 T916 oash.SnapPuller$2.onClose removing old index directory .\org.apache.solr.cloud.BasicDistributedZk2Test-1355330288757\jetty3\index
[junit4:junit4]   2> 20295 T917 C73 P62245 oasu.DirectUpdateHandler2.commit start commit{flags=0,_version_=0,optimize=false,openSearcher=false,waitSearcher=false,expungeDeletes=false,softCommit=false}
[junit4:junit4]   2> 20308 T917 C73 P62245 oasc.SolrDeletionPolicy.onCommit SolrDeletionPolicy.onCommit: commits:num=2
[junit4:junit4]   2> 		commit{dir=RateLimitedDirectoryWrapper(NRTCachingDirectory(org.apache.lucene.store.SimpleFSDirectory@C:\Users\JenkinsSlave\workspace\Lucene-Solr-4.x-Windows\solr\build\solr-core\test\J0\org.apache.solr.cloud.BasicDistributedZk2Test-1355330288757\jetty3\index.20121213063828723 lockFactory=org.apache.lucene.store.NativeFSLockFactory@ca224f; maxCacheMB=48.0 maxMergeSizeMB=4.0)),segFN=segments_3,generation=3,filenames=[_0_NestedPulsing_0.doc, _0.fnm, _0_Lucene41_0.pos, _0_Memory_0.ram, _0_nrm.cfs, _0_NestedPulsing_0.tip, _0_NestedPulsing_0.tim, _0_NestedPulsing_0.pos, _0_Lucene41_0.doc, _0_nrm.cfe, _0_SimpleText_0.pst, _0.fdx, _0.si, _0_Lucene41_0.tim, _0.fdt, _0_Lucene41_0.tip, segments_3]
[junit4:junit4]   2> 		commit{dir=RateLimitedDirectoryWrapper(NRTCachingDirectory(org.apache.lucene.store.SimpleFSDirectory@C:\Users\JenkinsSlave\workspace\Lucene-Solr-4.x-Windows\solr\build\solr-core\test\J0\org.apache.solr.cloud.BasicDistributedZk2Test-1355330288757\jetty3\index.20121213063828723 lockFactory=org.apache.lucene.store.NativeFSLockFactory@ca224f; maxCacheMB=48.0 maxMergeSizeMB=4.0)),segFN=segments_4,generation=4,filenames=[_0_NestedPulsing_0.doc, _0.fnm, _0_Lucene41_0.pos, _0_Memory_0.ram, _0_nrm.cfs, _0_NestedPulsing_0.tip, _0_NestedPulsing_0.tim, _0_NestedPulsing_0.pos, _0_Lucene41_0.doc, _0_nrm.cfe, _0_SimpleText_0.pst, _0.fdx, _0.si, _0_Lucene41_0.tim, _0.fdt, _0_Lucene41_0.tip, segments_4]
[junit4:junit4]   2> 20309 T917 C73 P62245 oasc.SolrDeletionPolicy.updateCommits newest commit = 4
[junit4:junit4]   2> 20314 T917 C73 P62245 oasu.DirectUpdateHandler2.commit end_commit_flush
[junit4:junit4]   2> 20314 T917 C73 P62245 oasc.RecoveryStrategy.replay No replay needed. core=collection1
[junit4:junit4]   2> 20315 T917 C73 P62245 oasc.RecoveryStrategy.doRecovery Replication Recovery was successful - registering as Active. core=collection1
[junit4:junit4]   2> 20315 T917 C73 P62245 oasc.ZkController.publish publishing core=collection1 state=active
[junit4:junit4]   2> 20315 T917 C73 P62245 oasc.ZkController.publish numShards not found on descriptor - reading it from system property
[junit4:junit4]   2> 20323 T917 C73 P62245 oasc.RecoveryStrategy.doRecovery Finished recovery process. core=collection1
[junit4:junit4]   2> 20324 T868 oascc.ZkStateReader.updateClusterState Updating cloud state from ZooKeeper... 
[junit4:junit4]   2> 20326 T868 oasc.Overseer$ClusterStateUpdater.updateState Update state numShards=2 message={
[junit4:junit4]   2> 	  "operation":"state",
[junit4:junit4]   2> 	  "numShards":"2",
[junit4:junit4]   2> 	  "shard":"shard1",
[junit4:junit4]   2> 	  "roles":null,
[junit4:junit4]   2> 	  "state":"active",
[junit4:junit4]   2> 	  "core":"collection1",
[junit4:junit4]   2> 	  "collection":"collection1",
[junit4:junit4]   2> 	  "node_name":"127.0.0.1:62245_solr",
[junit4:junit4]   2> 	  "base_url":"http://127.0.0.1:62245/solr"}
[junit4:junit4]   2> 20342 T884 oascc.ZkStateReader$2.process A cluster state change has occurred - updating... (5)
[junit4:junit4]   2> 20343 T939 oascc.ZkStateReader$2.process A cluster state change has occurred - updating... (5)
[junit4:junit4]   2> 20343 T931 oascc.ZkStateReader$2.process A cluster state change has occurred - updating... (5)
[junit4:junit4]   2> 20343 T899 oascc.ZkStateReader$2.process A cluster state change has occurred - updating... (5)
[junit4:junit4]   2> 20345 T867 oascc.ZkStateReader$2.process A cluster state change has occurred - updating... (5)
[junit4:junit4]   2> 20342 T937 oascc.ZkStateReader$2.process A cluster state change has occurred - updating... (5)
[junit4:junit4]   2> 20343 T914 oascc.ZkStateReader$2.process A cluster state change has occurred - updating... (5)
[junit4:junit4]   2> 21169 T845 oascc.ZkStateReader.updateClusterState Updating cloud state from ZooKeeper... 
[junit4:junit4]   2> 22626 T845 oascc.ZkStateReader.updateClusterState Updating cloud state from ZooKeeper... 
[junit4:junit4]   2> 23313 T934 C75 P62256 oasc.RecoveryStrategy.doRecovery Begin buffering updates. core=collection1
[junit4:junit4]   2> 23313 T934 C75 P62256 oasu.UpdateLog.bufferUpdates Starting to buffer updates. FSUpdateLog{state=ACTIVE, tlog=null}
[junit4:junit4]   2> 23313 T934 C75 P62256 oasc.RecoveryStrategy.replicate Attempting to replicate from http://127.0.0.1:62236/solr/collection1/. core=collection1
[junit4:junit4]   2> 23313 T934 C75 P62256 oascsi.HttpClientUtil.createClient Creating new http client, config:maxConnections=128&maxConnectionsPerHost=32&followRedirects=false
[junit4:junit4]   2> 23337 T891 C76 P62236 oasu.DirectUpdateHandler2.commit start commit{flags=0,_version_=0,optimize=false,openSearcher=false,waitSearcher=true,expungeDeletes=false,softCommit=false}
[junit4:junit4]   2> 23358 T891 C76 P62236 oasc.SolrDeletionPolicy.onCommit SolrDeletionPolicy.onCommit: commits:num=2
[junit4:junit4]   2> 		commit{dir=RateLimitedDirectoryWrapper(NRTCachingDirectory(org.apache.lucene.store.SimpleFSDirectory@C:\Users\JenkinsSlave\workspace\Lucene-Solr-4.x-Windows\solr\build\solr-core\test\J0\org.apache.solr.cloud.BasicDistributedZk2Test-1355330288757\jetty2\index lockFactory=org.apache.lucene.store.NativeFSLockFactory@1ac978a; maxCacheMB=48.0 maxMergeSizeMB=4.0)),segFN=segments_2,generation=2,filenames=[segments_2]
[junit4:junit4]   2> 		commit{dir=RateLimitedDirectoryWrapper(NRTCachingDirectory(org.apache.lucene.store.SimpleFSDirectory@C:\Users\JenkinsSlave\workspace\Lucene-Solr-4.x-Windows\solr\build\solr-core\test\J0\org.apache.solr.cloud.BasicDistributedZk2Test-1355330288757\jetty2\index lockFactory=org.apache.lucene.store.NativeFSLockFactory@1ac978a; maxCacheMB=48.0 maxMergeSizeMB=4.0)),segFN=segments_3,generation=3,filenames=[segments_3]
[junit4:junit4]   2> 23359 T891 C76 P62236 oasc.SolrDeletionPolicy.updateCommits newest commit = 3
[junit4:junit4]   2> 23362 T891 C76 P62236 oass.SolrIndexSearcher.<init> Opening Searcher@1334bda realtime
[junit4:junit4]   2> 23363 T891 C76 P62236 oass.SolrIndexSearcher.getIndexDir WARNING WARNING: Directory impl does not support setting indexDir: org.apache.lucene.store.RateLimitedDirectoryWrapper
[junit4:junit4]   2> 23363 T891 C76 P62236 oasu.DirectUpdateHandler2.commit end_commit_flush
[junit4:junit4]   2> 23364 T891 C76 P62236 /update {waitSearcher=true&openSearcher=false&commit=true&commit_end_point=true&wt=javabin&softCommit=false&version=2} {commit=} 0 27
[junit4:junit4]   2> 23364 T934 C75 P62256 oash.ReplicationHandler.inform Commits will be reserved for  10000
[junit4:junit4]   2> 23364 T934 C75 P62256 oash.SnapPuller.<init>  No value set for 'pollInterval'. Timer Task not started.
[junit4:junit4]   2> 23370 T894 C76 P62236 oash.ReplicationHandler.inform Commits will be reserved for  10000
[junit4:junit4]   2> 23371 T894 C76 P62236 REQ /replication {command=indexversion&wt=javabin&qt=/replication&version=2} status=0 QTime=3 
[junit4:junit4]   2> 23371 T934 C75 P62256 oash.SnapPuller.fetchLatestIndex Master's generation: 3
[junit4:junit4]   2> 23372 T934 C75 P62256 oash.SnapPuller.fetchLatestIndex Slave's generation: 1
[junit4:junit4]   2> 23372 T934 C75 P62256 oash.SnapPuller.fetchLatestIndex Starting replication process
[junit4:junit4]   2> 23378 T893 C76 P62236 REQ /replication {command=filelist&generation=3&wt=javabin&qt=/replication&version=2} status=0 QTime=3 
[junit4:junit4]   2> 23379 T934 C75 P62256 oash.SnapPuller.fetchLatestIndex Number of files in latest index in master: 1
[junit4:junit4]   2> 23382 T934 C75 P62256 oash.SnapPuller.fetchLatestIndex Starting download to .\org.apache.solr.cloud.BasicDistributedZk2Test-1355330288757\jetty4\index.20121213063832132 fullCopy=true
[junit4:junit4]   2> 23388 T895 C76 P62236 REQ /replication {file=segments_3&command=filecontent&checksum=true&generation=3&qt=/replication&wt=filestream} status=0 QTime=0 
[junit4:junit4]   2> 23392 T934 C75 P62256 oash.SnapPuller.fetchLatestIndex Total time taken for download : 0 secs
[junit4:junit4]   2> 23396 T934 C75 P62256 oash.SnapPuller.modifyIndexProps New index installed. Updating index properties... index=index.20121213063832132
[junit4:junit4]   2> 23401 T934 C75 P62256 oasu.DefaultSolrCoreState.newIndexWriter Creating new IndexWriter...
[junit4:junit4]   2> 23401 T934 C75 P62256 oasu.DefaultSolrCoreState.newIndexWriter Waiting until IndexWriter is unused... core=collection1
[junit4:junit4]   2> 23401 T934 C75 P62256 oasu.DefaultSolrCoreState.newIndexWriter Rollback old IndexWriter... core=collection1
[junit4:junit4]   2> 23412 T934 C75 P62256 oasc.SolrCore.getNewIndexDir New index directory detected: old=.\org.apache.solr.cloud.BasicDistributedZk2Test-1355330288757/jetty4\index/ new=.\org.apache.solr.cloud.BasicDistributedZk2Test-1355330288757/jetty4\index.20121213063832132
[junit4:junit4]   2> 23412 T934 C75 P62256 oasc.CachingDirectoryFactory.get return new directory for C:\Users\JenkinsSlave\workspace\Lucene-Solr-4.x-Windows\solr\build\solr-core\test\J0\.\org.apache.solr.cloud.BasicDistributedZk2Test-1355330288757\jetty4\index.20121213063832132 forceNew:true
[junit4:junit4]   2> 23417 T934 C75 P62256 oasc.SolrDeletionPolicy.onInit SolrDeletionPolicy.onInit: commits:num=1
[junit4:junit4]   2> 		commit{dir=RateLimitedDirectoryWrapper(NRTCachingDirectory(org.apache.lucene.store.SimpleFSDirectory@C:\Users\JenkinsSlave\workspace\Lucene-Solr-4.x-Windows\solr\build\solr-core\test\J0\org.apache.solr.cloud.BasicDistributedZk2Test-1355330288757\jetty4\index.20121213063832132 lockFactory=org.apach

[...truncated too long message...]

/127.0.0.1:62879/solr returned non ok status:500, message:Server Error
[junit4:junit4]    > 	at __randomizedtesting.SeedInfo.seed([6F2A9D0729B2DA39:EECC131F5EEDBA05]:0)
[junit4:junit4]    > 	at org.apache.solr.client.solrj.impl.HttpSolrServer.request(HttpSolrServer.java:372)
[junit4:junit4]    > 	at org.apache.solr.client.solrj.impl.HttpSolrServer.request(HttpSolrServer.java:181)
[junit4:junit4]    > 	at org.apache.solr.client.solrj.request.CoreAdminRequest.process(CoreAdminRequest.java:429)
[junit4:junit4]    > 	at org.apache.solr.client.solrj.request.CoreAdminRequest.getStatus(CoreAdminRequest.java:472)
[junit4:junit4]    > 	at org.apache.solr.cloud.BasicDistributedZkTest.collectStartTimes(BasicDistributedZkTest.java:959)
[junit4:junit4]    > 	at org.apache.solr.cloud.BasicDistributedZkTest.testCollectionsAPI(BasicDistributedZkTest.java:795)
[junit4:junit4]    > 	at org.apache.solr.cloud.BasicDistributedZkTest.doTest(BasicDistributedZkTest.java:343)
[junit4:junit4]    > 	at org.apache.solr.BaseDistributedSearchTestCase.testDistribSearch(BaseDistributedSearchTestCase.java:697)
[junit4:junit4]    > 	at sun.reflect.NativeMethodAccessorImpl.invoke0(Native Method)
[junit4:junit4]    > 	at sun.reflect.NativeMethodAccessorImpl.invoke(NativeMethodAccessorImpl.java:39)
[junit4:junit4]    > 	at sun.reflect.DelegatingMethodAccessorImpl.invoke(DelegatingMethodAccessorImpl.java:25)
[junit4:junit4]    > 	at java.lang.reflect.Method.invoke(Method.java:597)
[junit4:junit4]    > 	at com.carrotsearch.randomizedtesting.RandomizedRunner.invoke(RandomizedRunner.java:1559)
[junit4:junit4]    > 	at com.carrotsearch.randomizedtesting.RandomizedRunner.access$600(RandomizedRunner.java:79)
[junit4:junit4]    > 	at com.carrotsearch.randomizedtesting.RandomizedRunner$6.evaluate(RandomizedRunner.java:737)
[junit4:junit4]    > 	at com.carrotsearch.randomizedtesting.RandomizedRunner$7.evaluate(RandomizedRunner.java:773)
[junit4:junit4]    > 	at com.carrotsearch.randomizedtesting.RandomizedRunner$8.evaluate(RandomizedRunner.java:787)
[junit4:junit4]    > 	at com.carrotsearch.randomizedtesting.rules.SystemPropertiesRestoreRule$1.evaluate(SystemPropertiesRestoreRule.java:53)
[junit4:junit4]    > 	at org.apache.lucene.util.TestRuleSetupTeardownChained$1.evaluate(TestRuleSetupTeardownChained.java:50)
[junit4:junit4]    > 	at org.apache.lucene.util.TestRuleFieldCacheSanity$1.evaluate(TestRuleFieldCacheSanity.java:51)
[junit4:junit4]    > 	at org.apache.lucene.util.AbstractBeforeAfterRule$1.evaluate(AbstractBeforeAfterRule.java:46)
[junit4:junit4]    > 	at com.carrotsearch.randomizedtesting.rules.SystemPropertiesInvariantRule$1.evaluate(SystemPropertiesInvariantRule.java:55)
[junit4:junit4]    > 	at org.apache.lucene.util.TestRuleThreadAndTestName$1.evaluate(TestRuleThreadAndTestName.java:49)
[junit4:junit4]    > 	at org.apache.lucene.util.TestRuleIgnoreAfterMaxFailures$1.evaluate(TestRuleIgnoreAfterMaxFailures.java:70)
[junit4:junit4]    > 	at org.apache.lucene.util.TestRuleMarkFailure$1.evaluate(TestRuleMarkFailure.java:48)
[junit4:junit4]    > 	at com.carrotsearch.randomizedtesting.rules.StatementAdapter.evaluate(StatementAdapter.java:36)
[junit4:junit4]    > 	at com.carrotsearch.randomizedtesting.ThreadLeakControl$StatementRunner.run(ThreadLeakControl.java:358)
[junit4:junit4]    > 	at com.carrotsearch.randomizedtesting.ThreadLeakControl.forkTimeoutingTask(ThreadLeakControl.java:782)
[junit4:junit4]    > 	at com.carrotsearch.randomizedtesting.ThreadLeakControl$3.evaluate(ThreadLeakControl.java:442)
[junit4:junit4]    > 	at com.carrotsearch.randomizedtesting.RandomizedRunner.runSingleTest(RandomizedRunner.java:746)
[junit4:junit4]    > 	at com.carrotsearch.randomizedtesting.RandomizedRunner$3.evaluate(RandomizedRunner.java:648)
[junit4:junit4]    > 	at com.carrotsearch.randomizedtesting.RandomizedRunner$4.evaluate(RandomizedRunner.java:682)
[junit4:junit4]    > 	at com.carrotsearch.randomizedtesting.RandomizedRunner$5.evaluate(RandomizedRunner.java:693)
[junit4:junit4]    > 	at com.carrotsearch.randomizedtesting.rules.StatementAdapter.evaluate(StatementAdapter.java:36)
[junit4:junit4]    > 	at com.carrotsearch.randomizedtesting.rules.SystemPropertiesRestoreRule$1.evaluate(SystemPropertiesRestoreRule.java:53)
[junit4:junit4]    > 	at org.apache.lucene.util.AbstractBeforeAfterRule$1.evaluate(AbstractBeforeAfterRule.java:46)
[junit4:junit4]    > 	at org.apache.lucene.util.TestRuleStoreClassName$1.evaluate(TestRuleStoreClassName.java:42)
[junit4:junit4]    > 	at com.carrotsearch.randomizedtesting.rules.SystemPropertiesInvariantRule$1.evaluate(SystemPropertiesInvariantRule.java:55)
[junit4:junit4]    > 	at com.carrotsearch.randomizedtesting.rules.NoShadowingOrOverridesOnMethodsRule$1.evaluate(NoShadowingOrOverridesOnMethodsRule.java:39)
[junit4:junit4]    > 	at com.carrotsearch.randomizedtesting.rules.NoShadowingOrOverridesOnMethodsRule$1.evaluate(NoShadowingOrOverridesOnMethodsRule.java:39)
[junit4:junit4]    > 	at com.carrotsearch.randomizedtesting.rules.StatementAdapter.evaluate(StatementAdapter.java:36)
[junit4:junit4]    > 	at org.apache.lucene.util.TestRuleAssertionsRequired$1.evaluate(TestRuleAssertionsRequired.java:43)
[junit4:junit4]    > 	at org.apache.lucene.util.TestRuleMarkFailure$1.evaluate(TestRuleMarkFailure.java:48)
[junit4:junit4]    > 	at org.apache.lucene.util.TestRuleIgnoreAfterMaxFailures$1.evaluate(TestRuleIgnoreAfterMaxFailures.java:70)
[junit4:junit4]    > 	at org.apache.lucene.util.TestRuleIgnoreTestSuites$1.evaluate(TestRuleIgnoreTestSuites.java:55)
[junit4:junit4]    > 	at com.carrotsearch.randomizedtesting.rules.StatementAdapter.evaluate(StatementAdapter.java:36)
[junit4:junit4]    > 	at com.carrotsearch.randomizedtesting.ThreadLeakControl$StatementRunner.run(ThreadLeakControl.java:358)
[junit4:junit4]    > 	at java.lang.Thread.run(Thread.java:662)
[junit4:junit4]   2> 147924 T2075 oas.SolrTestCaseJ4.deleteCore ###deleteCore
[junit4:junit4]   2> NOTE: test params are: codec=SimpleText, sim=DefaultSimilarity, locale=ca, timezone=Portugal
[junit4:junit4]   2> NOTE: Windows 7 6.1 x86/Sun Microsystems Inc. 1.6.0_37 (32-bit)/cpus=2,threads=1,free=126869040,total=287334400
[junit4:junit4]   2> NOTE: All tests run in this JVM: [TestSystemIdResolver, BasicFunctionalityTest, TestFastWriter, DebugComponentTest, DocumentBuilderTest, TestSolr4Spatial, TestOmitPositions, TestBinaryResponseWriter, TestRemoteStreaming, TestLuceneMatchVersion, TestSolrIndexConfig, TestSearchPerf, UpdateRequestProcessorFactoryTest, PreAnalyzedFieldTest, SuggesterTSTTest, TestCollationField, TermsComponentTest, DateFieldTest, LegacyHTMLStripCharFilterTest, TestSolrCoreProperties, TestPseudoReturnFields, SuggesterWFSTTest, TestSolrJ, ZkCLITest, TestBadConfig, PolyFieldTest, TestDocSet, ZkControllerTest, DirectUpdateHandlerTest, TestMultiCoreConfBootstrap, TestAtomicUpdateErrorCases, IndexSchemaRuntimeFieldTest, TestConfig, ZkSolrClientTest, TestAnalyzedSuggestions, TestReplicationHandler, TestNumberUtils, DateMathParserTest, TestRecovery, TestZkChroot, TestPHPSerializedResponseWriter, TestDistributedSearch, ReturnFieldsTest, TestValueSourceCache, TestStressVersions, PathHierarchyTokenizerFactoryTest, AutoCommitTest, SystemInfoHandlerTest, BasicDistributedZk2Test, OutputWriterTest, FileBasedSpellCheckerTest, MoreLikeThisHandlerTest, TestRTGBase, SolrPluginUtilsTest, ClusterStateTest, TestPerFieldSimilarity, SpellPossibilityIteratorTest, TestJoin, SpellCheckComponentTest, PluginInfoTest, SearchHandlerTest, CurrencyFieldTest, TestUpdate, TestQuerySenderListener, TestRandomFaceting, SpellingQueryConverterTest, TestJmxMonitoredMap, MBeansHandlerTest, NumericFieldsTest, DefaultValueUpdateProcessorTest, TestSolrXMLSerializer, DirectUpdateHandlerOptimizeTest, QueryElevationComponentTest, TestCodecSupport, TestDocumentBuilder, TestFastLRUCache, SampleTest, TestReload, UniqFieldsUpdateProcessorFactoryTest, XmlUpdateRequestHandlerTest, TestDistributedGrouping, TestFunctionQuery, ShowFileRequestHandlerTest, TestCharFilters, CSVRequestHandlerTest, DirectSolrSpellCheckerTest, NotRequiredUniqueKeyTest, ConvertedLegacyTest, RecoveryZkTest, CoreContainerCoreInitFailuresTest, SyncSliceTest, PrimUtilsTest, DistributedQueryElevationComponentTest, LukeRequestHandlerTest, SolrInfoMBeanTest, TestCollationKeyRangeQueries, TestCoreContainer, TestIndexingPerformance, DistributedSpellCheckComponentTest, JsonLoaderTest, TestQueryTypes, SignatureUpdateProcessorFactoryTest, BadIndexSchemaTest, QueryEqualityTest, TestLMJelinekMercerSimilarityFactory, TestBinaryField, TestLFUCache, TermVectorComponentDistributedTest, TestCSVResponseWriter, TestGroupingSearch, IndexReaderFactoryTest, SolrCoreTest, BasicDistributedZkTest]
[junit4:junit4] Completed in 149.21s, 1 test, 1 error <<< FAILURES!

[...truncated 377 lines...]
BUILD FAILED
C:\Users\JenkinsSlave\workspace\Lucene-Solr-4.x-Windows\build.xml:352: The following error occurred while executing this line:
C:\Users\JenkinsSlave\workspace\Lucene-Solr-4.x-Windows\build.xml:39: The following error occurred while executing this line:
C:\Users\JenkinsSlave\workspace\Lucene-Solr-4.x-Windows\solr\build.xml:178: The following error occurred while executing this line:
C:\Users\JenkinsSlave\workspace\Lucene-Solr-4.x-Windows\solr\common-build.xml:438: The following error occurred while executing this line:
C:\Users\JenkinsSlave\workspace\Lucene-Solr-4.x-Windows\lucene\common-build.xml:1175: The following error occurred while executing this line:
C:\Users\JenkinsSlave\workspace\Lucene-Solr-4.x-Windows\lucene\common-build.xml:839: There were test failures: 239 suites, 994 tests, 1 error, 2 failures, 12 ignored (7 assumptions)

Total time: 49 minutes 30 seconds
Build step 'Invoke Ant' marked build as failure
Archiving artifacts
Recording test results
Description set: Java: 32bit/jdk1.6.0_37 -client -XX:+UseConcMarkSweepGC
Email was triggered for: Failure
Sending email for trigger: Failure



Mime
View raw message