lucene-dev mailing list archives

Site index · List index
Message view « Date » · « Thread »
Top « Date » · « Thread »
From Policeman Jenkins Server <jenk...@sd-datasolutions.de>
Subject [JENKINS] Lucene-Solr-trunk-Linux (32bit/jdk1.8.0-ea-b65) - Build # 3006 - Failure!
Date Sat, 01 Dec 2012 21:34:55 GMT
Build: http://jenkins.sd-datasolutions.de/job/Lucene-Solr-trunk-Linux/3006/
Java: 32bit/jdk1.8.0-ea-b65 -client -XX:+UseParallelGC

1 tests failed.
REGRESSION:  org.apache.solr.cloud.ClusterStateUpdateTest.testCoreRegistration

Error Message:
Unable to create core: testcore

Stack Trace:
org.apache.solr.common.SolrException: Unable to create core: testcore
	at __randomizedtesting.SeedInfo.seed([2AA8C670B8754FDB:9423A0DFC10F41EE]:0)
	at org.apache.solr.core.CoreContainer.recordAndThrow(CoreContainer.java:1598)
	at org.apache.solr.core.CoreContainer.create(CoreContainer.java:1009)
	at org.apache.solr.cloud.ClusterStateUpdateTest.testCoreRegistration(ClusterStateUpdateTest.java:160)
	at sun.reflect.NativeMethodAccessorImpl.invoke0(Native Method)
	at sun.reflect.NativeMethodAccessorImpl.invoke(NativeMethodAccessorImpl.java:57)
	at sun.reflect.DelegatingMethodAccessorImpl.invoke(DelegatingMethodAccessorImpl.java:43)
	at java.lang.reflect.Method.invoke(Method.java:474)
	at com.carrotsearch.randomizedtesting.RandomizedRunner.invoke(RandomizedRunner.java:1559)
	at com.carrotsearch.randomizedtesting.RandomizedRunner.access$600(RandomizedRunner.java:79)
	at com.carrotsearch.randomizedtesting.RandomizedRunner$6.evaluate(RandomizedRunner.java:737)
	at com.carrotsearch.randomizedtesting.RandomizedRunner$7.evaluate(RandomizedRunner.java:773)
	at com.carrotsearch.randomizedtesting.RandomizedRunner$8.evaluate(RandomizedRunner.java:787)
	at com.carrotsearch.randomizedtesting.rules.SystemPropertiesRestoreRule$1.evaluate(SystemPropertiesRestoreRule.java:53)
	at org.apache.lucene.util.TestRuleSetupTeardownChained$1.evaluate(TestRuleSetupTeardownChained.java:50)
	at org.apache.lucene.util.TestRuleFieldCacheSanity$1.evaluate(TestRuleFieldCacheSanity.java:51)
	at org.apache.lucene.util.AbstractBeforeAfterRule$1.evaluate(AbstractBeforeAfterRule.java:45)
	at com.carrotsearch.randomizedtesting.rules.SystemPropertiesInvariantRule$1.evaluate(SystemPropertiesInvariantRule.java:55)
	at org.apache.lucene.util.TestRuleThreadAndTestName$1.evaluate(TestRuleThreadAndTestName.java:48)
	at org.apache.lucene.util.TestRuleIgnoreAfterMaxFailures$1.evaluate(TestRuleIgnoreAfterMaxFailures.java:70)
	at org.apache.lucene.util.TestRuleMarkFailure$1.evaluate(TestRuleMarkFailure.java:48)
	at com.carrotsearch.randomizedtesting.rules.StatementAdapter.evaluate(StatementAdapter.java:36)
	at com.carrotsearch.randomizedtesting.ThreadLeakControl$StatementRunner.run(ThreadLeakControl.java:358)
	at com.carrotsearch.randomizedtesting.ThreadLeakControl.forkTimeoutingTask(ThreadLeakControl.java:782)
	at com.carrotsearch.randomizedtesting.ThreadLeakControl$3.evaluate(ThreadLeakControl.java:442)
	at com.carrotsearch.randomizedtesting.RandomizedRunner.runSingleTest(RandomizedRunner.java:746)
	at com.carrotsearch.randomizedtesting.RandomizedRunner$3.evaluate(RandomizedRunner.java:648)
	at com.carrotsearch.randomizedtesting.RandomizedRunner$4.evaluate(RandomizedRunner.java:682)
	at com.carrotsearch.randomizedtesting.RandomizedRunner$5.evaluate(RandomizedRunner.java:693)
	at com.carrotsearch.randomizedtesting.rules.StatementAdapter.evaluate(StatementAdapter.java:36)
	at com.carrotsearch.randomizedtesting.rules.SystemPropertiesRestoreRule$1.evaluate(SystemPropertiesRestoreRule.java:53)
	at org.apache.lucene.util.AbstractBeforeAfterRule$1.evaluate(AbstractBeforeAfterRule.java:45)
	at org.apache.lucene.util.TestRuleStoreClassName$1.evaluate(TestRuleStoreClassName.java:42)
	at com.carrotsearch.randomizedtesting.rules.SystemPropertiesInvariantRule$1.evaluate(SystemPropertiesInvariantRule.java:55)
	at com.carrotsearch.randomizedtesting.rules.NoShadowingOrOverridesOnMethodsRule$1.evaluate(NoShadowingOrOverridesOnMethodsRule.java:39)
	at com.carrotsearch.randomizedtesting.rules.NoShadowingOrOverridesOnMethodsRule$1.evaluate(NoShadowingOrOverridesOnMethodsRule.java:39)
	at com.carrotsearch.randomizedtesting.rules.StatementAdapter.evaluate(StatementAdapter.java:36)
	at org.apache.lucene.util.TestRuleAssertionsRequired$1.evaluate(TestRuleAssertionsRequired.java:43)
	at org.apache.lucene.util.TestRuleMarkFailure$1.evaluate(TestRuleMarkFailure.java:48)
	at org.apache.lucene.util.TestRuleIgnoreAfterMaxFailures$1.evaluate(TestRuleIgnoreAfterMaxFailures.java:70)
	at org.apache.lucene.util.TestRuleIgnoreTestSuites$1.evaluate(TestRuleIgnoreTestSuites.java:55)
	at com.carrotsearch.randomizedtesting.rules.StatementAdapter.evaluate(StatementAdapter.java:36)
	at com.carrotsearch.randomizedtesting.ThreadLeakControl$StatementRunner.run(ThreadLeakControl.java:358)
	at java.lang.Thread.run(Thread.java:722)
Caused by: java.lang.RuntimeException: java.io.IOException: Can't find resource 'stopwords.txt' in classpath or '/configs/conf1', cwd=/mnt/ssd/jenkins/workspace/Lucene-Solr-trunk-Linux/solr/build/solr-core/test/J1
	at org.apache.solr.schema.IndexSchema.<init>(IndexSchema.java:118)
	at org.apache.solr.core.CoreContainer.getSchemaFromZk(CoreContainer.java:1606)
	at org.apache.solr.core.CoreContainer.createFromZk(CoreContainer.java:918)
	at org.apache.solr.core.CoreContainer.create(CoreContainer.java:1001)
	... 41 more
Caused by: java.io.IOException: Can't find resource 'stopwords.txt' in classpath or '/configs/conf1', cwd=/mnt/ssd/jenkins/workspace/Lucene-Solr-trunk-Linux/solr/build/solr-core/test/J1
	at org.apache.solr.cloud.ZkSolrResourceLoader.openResource(ZkSolrResourceLoader.java:93)
	at org.apache.lucene.analysis.util.AbstractAnalysisFactory.getLines(AbstractAnalysisFactory.java:163)
	at org.apache.lucene.analysis.util.AbstractAnalysisFactory.getWordSet(AbstractAnalysisFactory.java:151)
	at org.apache.lucene.analysis.core.StopFilterFactory.inform(StopFilterFactory.java:58)
	at org.apache.solr.core.SolrResourceLoader.inform(SolrResourceLoader.java:611)
	at org.apache.solr.schema.IndexSchema.<init>(IndexSchema.java:116)
	... 44 more




Build Log:
[...truncated 9197 lines...]
[junit4:junit4] Suite: org.apache.solr.cloud.ClusterStateUpdateTest
[junit4:junit4]   2> 3 T2603 oas.SolrTestCaseJ4.setUp ###Starting testCoreRegistration
[junit4:junit4]   2> Creating dataDir: /mnt/ssd/jenkins/workspace/Lucene-Solr-trunk-Linux/solr/build/solr-core/test/J1/./solrtest-ClusterStateUpdateTest-1354397651456
[junit4:junit4]   2> 3 T2603 oasc.ZkTestServer.run STARTING ZK TEST SERVER
[junit4:junit4]   2> 4 T2604 oasc.ZkTestServer$ZKServerMain.runFromConfig Starting server
[junit4:junit4]   2> 5 T2604 oazs.ZooKeeperServer.setTickTime tickTime set to 1000
[junit4:junit4]   2> 5 T2604 oazs.ZooKeeperServer.setMinSessionTimeout minSessionTimeout set to -1
[junit4:junit4]   2> 5 T2604 oazs.ZooKeeperServer.setMaxSessionTimeout maxSessionTimeout set to -1
[junit4:junit4]   2> 5 T2604 oazs.NIOServerCnxnFactory.configure binding to port 0.0.0.0/0.0.0.0:0
[junit4:junit4]   2> 6 T2604 oazsp.FileTxnSnapLog.save Snapshotting: 0x0 to /mnt/ssd/jenkins/workspace/Lucene-Solr-trunk-Linux/solr/build/solr-core/test/J1/./solrtest-ClusterStateUpdateTest-1354397651456/zookeeper/server1/data/version-2/snapshot.0
[junit4:junit4]   2> 104 T2603 oasc.ZkTestServer.run start zk server on port:60502
[junit4:junit4]   2> 105 T2603 oaz.ZooKeeper.<init> Initiating client connection, connectString=127.0.0.1:60502 sessionTimeout=10000 watcher=org.apache.solr.common.cloud.ConnectionManager@98761b
[junit4:junit4]   2> 106 T2609 oaz.ClientCnxn$SendThread.logStartConnect Opening socket connection to server localhost.localdomain/127.0.0.1:60502. Will not attempt to authenticate using SASL (access denied ("javax.security.auth.AuthPermission" "getLoginConfiguration"))
[junit4:junit4]   2> 106 T2603 oascc.ConnectionManager.waitForConnected Waiting for client to connect to ZooKeeper
[junit4:junit4]   2> 106 T2609 oaz.ClientCnxn$SendThread.primeConnection Socket connection established to localhost.localdomain/127.0.0.1:60502, initiating session
[junit4:junit4]   2> 106 T2605 oazs.NIOServerCnxnFactory.run Accepted socket connection from /127.0.0.1:57466
[junit4:junit4]   2> 107 T2605 oazs.ZooKeeperServer.processConnectRequest Client attempting to establish new session at /127.0.0.1:57466
[junit4:junit4]   2> 107 T2607 oazsp.FileTxnLog.append Creating new log file: log.1
[junit4:junit4]   2> 155 T2609 oaz.ClientCnxn$SendThread.onConnected Session establishment complete on server localhost.localdomain/127.0.0.1:60502, sessionid = 0x13b586412030000, negotiated timeout = 10000
[junit4:junit4]   2> 155 T2607 oazs.ZooKeeperServer.finishSessionInit Established session 0x13b586412030000 with negotiated timeout 10000 for client /127.0.0.1:57466
[junit4:junit4]   2> 156 T2610 oascc.ConnectionManager.process Watcher org.apache.solr.common.cloud.ConnectionManager@98761b name:ZooKeeperConnection Watcher:127.0.0.1:60502 got event WatchedEvent state:SyncConnected type:None path:null path:null type:None
[junit4:junit4]   2> 156 T2603 oascc.ConnectionManager.waitForConnected Client is connected to ZooKeeper
[junit4:junit4]   2> 157 T2603 oascc.SolrZkClient.makePath makePath: /solr
[junit4:junit4]   2> 160 T2608 oazs.PrepRequestProcessor.pRequest2Txn Processed session termination for sessionid: 0x13b586412030000
[junit4:junit4]   2> 161 T2610 oaz.ClientCnxn$EventThread.run EventThread shut down
[junit4:junit4]   2> 161 T2605 oazs.NIOServerCnxn.closeSock Closed socket connection for client /127.0.0.1:57466 which had sessionid 0x13b586412030000
[junit4:junit4]   2> 160 T2603 oaz.ZooKeeper.close Session: 0x13b586412030000 closed
[junit4:junit4]   2> 161 T2603 oaz.ZooKeeper.<init> Initiating client connection, connectString=127.0.0.1:60502/solr sessionTimeout=10000 watcher=org.apache.solr.common.cloud.ConnectionManager@6ea284
[junit4:junit4]   2> 162 T2611 oaz.ClientCnxn$SendThread.logStartConnect Opening socket connection to server localhost.localdomain/127.0.0.1:60502. Will not attempt to authenticate using SASL (access denied ("javax.security.auth.AuthPermission" "getLoginConfiguration"))
[junit4:junit4]   2> 162 T2603 oascc.ConnectionManager.waitForConnected Waiting for client to connect to ZooKeeper
[junit4:junit4]   2> 163 T2611 oaz.ClientCnxn$SendThread.primeConnection Socket connection established to localhost.localdomain/127.0.0.1:60502, initiating session
[junit4:junit4]   2> 163 T2605 oazs.NIOServerCnxnFactory.run Accepted socket connection from /127.0.0.1:57467
[junit4:junit4]   2> 163 T2605 oazs.ZooKeeperServer.processConnectRequest Client attempting to establish new session at /127.0.0.1:57467
[junit4:junit4]   2> 164 T2607 oazs.ZooKeeperServer.finishSessionInit Established session 0x13b586412030001 with negotiated timeout 10000 for client /127.0.0.1:57467
[junit4:junit4]   2> 164 T2611 oaz.ClientCnxn$SendThread.onConnected Session establishment complete on server localhost.localdomain/127.0.0.1:60502, sessionid = 0x13b586412030001, negotiated timeout = 10000
[junit4:junit4]   2> 165 T2612 oascc.ConnectionManager.process Watcher org.apache.solr.common.cloud.ConnectionManager@6ea284 name:ZooKeeperConnection Watcher:127.0.0.1:60502/solr got event WatchedEvent state:SyncConnected type:None path:null path:null type:None
[junit4:junit4]   2> 165 T2603 oascc.ConnectionManager.waitForConnected Client is connected to ZooKeeper
[junit4:junit4]   2> 165 T2603 oascc.SolrZkClient.makePath makePath: /collections/collection1
[junit4:junit4]   2> 167 T2603 oascc.SolrZkClient.makePath makePath: /collections/collection1/shards
[junit4:junit4]   2> 169 T2603 oascc.SolrZkClient.makePath makePath: /collections/control_collection
[junit4:junit4]   2> 170 T2603 oascc.SolrZkClient.makePath makePath: /collections/control_collection/shards
[junit4:junit4]   2> 172 T2603 oasc.AbstractZkTestCase.putConfig put /mnt/ssd/jenkins/workspace/Lucene-Solr-trunk-Linux/solr/build/solr-core/test-files/solr/collection1/conf/solrconfig.xml to /configs/conf1/solrconfig.xml
[junit4:junit4]   2> 173 T2603 oascc.SolrZkClient.makePath makePath: /configs/conf1/solrconfig.xml
[junit4:junit4]   2> 179 T2603 oasc.AbstractZkTestCase.putConfig put /mnt/ssd/jenkins/workspace/Lucene-Solr-trunk-Linux/solr/build/solr-core/test-files/solr/collection1/conf/schema.xml to /configs/conf1/schema.xml
[junit4:junit4]   2> 180 T2603 oascc.SolrZkClient.makePath makePath: /configs/conf1/schema.xml
[junit4:junit4]   2> 183 T2603 oasc.AbstractZkTestCase.putConfig put /mnt/ssd/jenkins/workspace/Lucene-Solr-trunk-Linux/solr/build/solr-core/test-files/solr/collection1/conf/solrconfig.xml to /configs/conf1/solrconfig.xml
[junit4:junit4]   2> 184 T2603 oascc.SolrZkClient.makePath makePath: /configs/conf1/solrconfig.xml
[junit4:junit4]   2> 186 T2603 oasc.AbstractZkTestCase.putConfig skipping /mnt/ssd/jenkins/workspace/Lucene-Solr-trunk-Linux/solr/build/solr-core/test-files/solr/collection1/conf/stopwords.txt because it doesn't exist
[junit4:junit4]   2> 187 T2603 oasc.AbstractZkTestCase.putConfig put /mnt/ssd/jenkins/workspace/Lucene-Solr-trunk-Linux/solr/build/solr-core/test-files/solr/collection1/conf/protwords.txt to /configs/conf1/protwords.txt
[junit4:junit4]   2> 188 T2603 oascc.SolrZkClient.makePath makePath: /configs/conf1/protwords.txt
[junit4:junit4]   2> 190 T2603 oasc.AbstractZkTestCase.putConfig put /mnt/ssd/jenkins/workspace/Lucene-Solr-trunk-Linux/solr/build/solr-core/test-files/solr/collection1/conf/currency.xml to /configs/conf1/currency.xml
[junit4:junit4]   2> 190 T2603 oascc.SolrZkClient.makePath makePath: /configs/conf1/currency.xml
[junit4:junit4]   2> 192 T2603 oasc.AbstractZkTestCase.putConfig put /mnt/ssd/jenkins/workspace/Lucene-Solr-trunk-Linux/solr/build/solr-core/test-files/solr/collection1/conf/open-exchange-rates.json to /configs/conf1/open-exchange-rates.json
[junit4:junit4]   2> 193 T2603 oascc.SolrZkClient.makePath makePath: /configs/conf1/open-exchange-rates.json
[junit4:junit4]   2> 195 T2603 oasc.AbstractZkTestCase.putConfig put /mnt/ssd/jenkins/workspace/Lucene-Solr-trunk-Linux/solr/build/solr-core/test-files/solr/collection1/conf/mapping-ISOLatin1Accent.txt to /configs/conf1/mapping-ISOLatin1Accent.txt
[junit4:junit4]   2> 195 T2603 oascc.SolrZkClient.makePath makePath: /configs/conf1/mapping-ISOLatin1Accent.txt
[junit4:junit4]   2> 197 T2603 oasc.AbstractZkTestCase.putConfig put /mnt/ssd/jenkins/workspace/Lucene-Solr-trunk-Linux/solr/build/solr-core/test-files/solr/collection1/conf/old_synonyms.txt to /configs/conf1/old_synonyms.txt
[junit4:junit4]   2> 198 T2603 oascc.SolrZkClient.makePath makePath: /configs/conf1/old_synonyms.txt
[junit4:junit4]   2> 200 T2603 oasc.AbstractZkTestCase.putConfig put /mnt/ssd/jenkins/workspace/Lucene-Solr-trunk-Linux/solr/build/solr-core/test-files/solr/collection1/conf/synonyms.txt to /configs/conf1/synonyms.txt
[junit4:junit4]   2> 200 T2603 oascc.SolrZkClient.makePath makePath: /configs/conf1/synonyms.txt
[junit4:junit4]   2> 202 T2608 oazs.PrepRequestProcessor.pRequest2Txn Processed session termination for sessionid: 0x13b586412030001
[junit4:junit4]   2> 203 T2612 oaz.ClientCnxn$EventThread.run EventThread shut down
[junit4:junit4]   2> 203 T2605 oazs.NIOServerCnxn.closeSock Closed socket connection for client /127.0.0.1:57467 which had sessionid 0x13b586412030001
[junit4:junit4]   2> 202 T2603 oaz.ZooKeeper.close Session: 0x13b586412030001 closed
[junit4:junit4]   2> 203 T2603 oasc.ClusterStateUpdateTest.setUp ####SETUP_START testCoreRegistration
[junit4:junit4]   2> 205 T2603 oasc.SolrResourceLoader.locateSolrHome JNDI not configured for solr (NoInitialContextEx)
[junit4:junit4]   2> 205 T2603 oasc.SolrResourceLoader.locateSolrHome using system property solr.solr.home: /mnt/ssd/jenkins/workspace/Lucene-Solr-trunk-Linux/solr/build/solr-core/test-files/solr
[junit4:junit4]   2> 206 T2603 oasc.CoreContainer$Initializer.initialize looking for solr.xml: /mnt/ssd/jenkins/workspace/Lucene-Solr-trunk-Linux/solr/build/solr-core/test-files/solr/solr.xml
[junit4:junit4]   2> 206 T2603 oasc.CoreContainer.<init> New CoreContainer 14726630
[junit4:junit4]   2> 207 T2603 oasc.CoreContainer.load Loading CoreContainer using Solr Home: '/mnt/ssd/jenkins/workspace/Lucene-Solr-trunk-Linux/solr/build/solr-core/test-files/solr/'
[junit4:junit4]   2> 207 T2603 oasc.SolrResourceLoader.<init> new SolrResourceLoader for directory: '/mnt/ssd/jenkins/workspace/Lucene-Solr-trunk-Linux/solr/build/solr-core/test-files/solr/'
[junit4:junit4]   2> 225 T2603 oasc.CoreContainer.load Registering Log Listener
[junit4:junit4]   2> 236 T2603 oasc.CoreContainer.initZooKeeper Zookeeper client=127.0.0.1:60502/solr
[junit4:junit4]   2> 237 T2603 oaz.ZooKeeper.<init> Initiating client connection, connectString=127.0.0.1:60502/solr sessionTimeout=3000 watcher=org.apache.solr.common.cloud.ConnectionManager@b82f23
[junit4:junit4]   2> 238 T2613 oaz.ClientCnxn$SendThread.logStartConnect Opening socket connection to server localhost.localdomain/127.0.0.1:60502. Will not attempt to authenticate using SASL (access denied ("javax.security.auth.AuthPermission" "getLoginConfiguration"))
[junit4:junit4]   2> 238 T2603 oascc.ConnectionManager.waitForConnected Waiting for client to connect to ZooKeeper
[junit4:junit4]   2> 238 T2613 oaz.ClientCnxn$SendThread.primeConnection Socket connection established to localhost.localdomain/127.0.0.1:60502, initiating session
[junit4:junit4]   2> 239 T2605 oazs.NIOServerCnxnFactory.run Accepted socket connection from /127.0.0.1:57468
[junit4:junit4]   2> 239 T2605 oazs.ZooKeeperServer.processConnectRequest Client attempting to establish new session at /127.0.0.1:57468
[junit4:junit4]   2> 240 T2607 oazs.ZooKeeperServer.finishSessionInit Established session 0x13b586412030002 with negotiated timeout 3000 for client /127.0.0.1:57468
[junit4:junit4]   2> 240 T2613 oaz.ClientCnxn$SendThread.onConnected Session establishment complete on server localhost.localdomain/127.0.0.1:60502, sessionid = 0x13b586412030002, negotiated timeout = 3000
[junit4:junit4]   2> 240 T2614 oascc.ConnectionManager.process Watcher org.apache.solr.common.cloud.ConnectionManager@b82f23 name:ZooKeeperConnection Watcher:127.0.0.1:60502/solr got event WatchedEvent state:SyncConnected type:None path:null path:null type:None
[junit4:junit4]   2> 240 T2603 oascc.ConnectionManager.waitForConnected Client is connected to ZooKeeper
[junit4:junit4]   2> 241 T2608 oazs.PrepRequestProcessor.pRequest Got user-level KeeperException when processing sessionid:0x13b586412030002 type:create cxid:0x2 zxid:0x18 txntype:-1 reqpath:n/a Error Path:/solr/overseer Error:KeeperErrorCode = NodeExists for /solr/overseer
[junit4:junit4]   2> 242 T2603 oascc.SolrZkClient.makePath makePath: /live_nodes
[junit4:junit4]   2> 243 T2603 oasc.ZkController.createEphemeralLiveNode Register node as live in ZooKeeper:/live_nodes/127.0.0.1:1661_solr
[junit4:junit4]   2> 244 T2608 oazs.PrepRequestProcessor.pRequest Got user-level KeeperException when processing sessionid:0x13b586412030002 type:delete cxid:0x7 zxid:0x1a txntype:-1 reqpath:n/a Error Path:/solr/live_nodes/127.0.0.1:1661_solr Error:KeeperErrorCode = NoNode for /solr/live_nodes/127.0.0.1:1661_solr
[junit4:junit4]   2> 244 T2603 oascc.SolrZkClient.makePath makePath: /live_nodes/127.0.0.1:1661_solr
[junit4:junit4]   2> 246 T2603 oashc.HttpShardHandlerFactory.getParameter Setting socketTimeout to: 0
[junit4:junit4]   2> 246 T2603 oashc.HttpShardHandlerFactory.getParameter Setting urlScheme to: http://
[junit4:junit4]   2> 247 T2603 oashc.HttpShardHandlerFactory.getParameter Setting connTimeout to: 0
[junit4:junit4]   2> 247 T2603 oashc.HttpShardHandlerFactory.getParameter Setting maxConnectionsPerHost to: 20
[junit4:junit4]   2> 248 T2603 oashc.HttpShardHandlerFactory.getParameter Setting corePoolSize to: 0
[junit4:junit4]   2> 248 T2603 oashc.HttpShardHandlerFactory.getParameter Setting maximumPoolSize to: 2147483647
[junit4:junit4]   2> 249 T2603 oashc.HttpShardHandlerFactory.getParameter Setting maxThreadIdleTime to: 5
[junit4:junit4]   2> 249 T2603 oashc.HttpShardHandlerFactory.getParameter Setting sizeOfQueue to: -1
[junit4:junit4]   2> 249 T2603 oashc.HttpShardHandlerFactory.getParameter Setting fairnessPolicy to: false
[junit4:junit4]   2> 250 T2603 oascsi.HttpClientUtil.createClient Creating new http client, config:maxConnectionsPerHost=20&maxConnections=10000&socketTimeout=0&connTimeout=0&retry=false
[junit4:junit4]   2> 253 T2603 oascc.SolrZkClient.makePath makePath: /overseer_elect/election
[junit4:junit4]   2> 256 T2608 oazs.PrepRequestProcessor.pRequest Got user-level KeeperException when processing sessionid:0x13b586412030002 type:delete cxid:0x15 zxid:0x1f txntype:-1 reqpath:n/a Error Path:/solr/overseer_elect/leader Error:KeeperErrorCode = NoNode for /solr/overseer_elect/leader
[junit4:junit4]   2> 257 T2603 oascc.SolrZkClient.makePath makePath: /overseer_elect/leader
[junit4:junit4]   2> 259 T2603 oasc.Overseer.start Overseer (id=88761804486017026-127.0.0.1:1661_solr-n_0000000000) starting
[junit4:junit4]   2> 259 T2608 oazs.PrepRequestProcessor.pRequest Got user-level KeeperException when processing sessionid:0x13b586412030002 type:create cxid:0x1a zxid:0x21 txntype:-1 reqpath:n/a Error Path:/solr/overseer Error:KeeperErrorCode = NodeExists for /solr/overseer
[junit4:junit4]   2> 260 T2608 oazs.PrepRequestProcessor.pRequest Got user-level KeeperException when processing sessionid:0x13b586412030002 type:create cxid:0x1b zxid:0x22 txntype:-1 reqpath:n/a Error Path:/solr/overseer Error:KeeperErrorCode = NodeExists for /solr/overseer
[junit4:junit4]   2> 260 T2608 oazs.PrepRequestProcessor.pRequest Got user-level KeeperException when processing sessionid:0x13b586412030002 type:create cxid:0x1c zxid:0x23 txntype:-1 reqpath:n/a Error Path:/solr/overseer Error:KeeperErrorCode = NodeExists for /solr/overseer
[junit4:junit4]   2> 261 T2608 oazs.PrepRequestProcessor.pRequest Got user-level KeeperException when processing sessionid:0x13b586412030002 type:create cxid:0x1d zxid:0x24 txntype:-1 reqpath:n/a Error Path:/solr/overseer Error:KeeperErrorCode = NodeExists for /solr/overseer
[junit4:junit4]   2> 261 T2616 oasc.OverseerCollectionProcessor.run Process current queue of collection messages
[junit4:junit4]   2> 262 T2603 oascc.SolrZkClient.makePath makePath: /clusterstate.json
[junit4:junit4]   2> 263 T2603 oascc.ZkStateReader.createClusterStateWatchersAndUpdate Updating cluster state from ZooKeeper... 
[junit4:junit4]   2> 264 T2615 oasc.Overseer$ClusterStateUpdater.run Starting to work on the main queue
[junit4:junit4]   2> 268 T2617 oasc.CoreContainer.create Creating SolrCore 'collection1' using instanceDir: /mnt/ssd/jenkins/workspace/Lucene-Solr-trunk-Linux/solr/build/solr-core/test-files/solr/collection1
[junit4:junit4]   2> 269 T2617 oasc.ZkController.createCollectionZkNode Check for collection zkNode:collection1
[junit4:junit4]   2> 269 T2617 oasc.ZkController.createCollectionZkNode Collection zkNode exists
[junit4:junit4]   2> 270 T2617 oasc.ZkController.readConfigName Load collection config from:/collections/collection1
[junit4:junit4]   2> 270 T2617 oasc.SolrResourceLoader.<init> new SolrResourceLoader for directory: '/mnt/ssd/jenkins/workspace/Lucene-Solr-trunk-Linux/solr/build/solr-core/test-files/solr/collection1/'
[junit4:junit4]   2> 271 T2617 oasc.SolrResourceLoader.replaceClassLoader Adding 'file:/mnt/ssd/jenkins/workspace/Lucene-Solr-trunk-Linux/solr/build/solr-core/test-files/solr/collection1/lib/README' to classloader
[junit4:junit4]   2> 271 T2617 oasc.SolrResourceLoader.replaceClassLoader Adding 'file:/mnt/ssd/jenkins/workspace/Lucene-Solr-trunk-Linux/solr/build/solr-core/test-files/solr/collection1/lib/classes/' to classloader
[junit4:junit4]   2> 301 T2617 oasc.SolrConfig.<init> Using Lucene MatchVersion: LUCENE_50
[junit4:junit4]   2> 347 T2617 oasc.SolrConfig.<init> Loaded SolrConfig: solrconfig.xml
[junit4:junit4]   2> 347 T2617 oass.IndexSchema.readSchema Reading Solr Schema
[junit4:junit4]   2> 353 T2617 oass.IndexSchema.readSchema Schema name=test
[junit4:junit4]   2> 736 T2617 oass.OpenExchangeRatesOrgProvider.init Initialized with rates=open-exchange-rates.json, refreshInterval=1440.
[junit4:junit4]   2> 742 T2617 oass.IndexSchema.readSchema default search field in schema is text
[junit4:junit4]   2> 745 T2617 oass.IndexSchema.readSchema unique key field: id
[junit4:junit4]   2> 748 T2617 oasc.CoreContainer.recordAndThrow SEVERE Unable to create core: collection1 java.lang.RuntimeException: java.io.IOException: Can't find resource 'stopwords.txt' in classpath or '/configs/conf1', cwd=/mnt/ssd/jenkins/workspace/Lucene-Solr-trunk-Linux/solr/build/solr-core/test/J1
[junit4:junit4]   2> 	at org.apache.solr.schema.IndexSchema.<init>(IndexSchema.java:118)
[junit4:junit4]   2> 	at org.apache.solr.core.CoreContainer.getSchemaFromZk(CoreContainer.java:1606)
[junit4:junit4]   2> 	at org.apache.solr.core.CoreContainer.createFromZk(CoreContainer.java:918)
[junit4:junit4]   2> 	at org.apache.solr.core.CoreContainer.create(CoreContainer.java:1001)
[junit4:junit4]   2> 	at org.apache.solr.core.CoreContainer$3.call(CoreContainer.java:610)
[junit4:junit4]   2> 	at org.apache.solr.core.CoreContainer$3.call(CoreContainer.java:606)
[junit4:junit4]   2> 	at java.util.concurrent.FutureTask.run(FutureTask.java:262)
[junit4:junit4]   2> 	at java.util.concurrent.Executors$RunnableAdapter.call(Executors.java:471)
[junit4:junit4]   2> 	at java.util.concurrent.FutureTask.run(FutureTask.java:262)
[junit4:junit4]   2> 	at java.util.concurrent.ThreadPoolExecutor.runWorker(ThreadPoolExecutor.java:1110)
[junit4:junit4]   2> 	at java.util.concurrent.ThreadPoolExecutor$Worker.run(ThreadPoolExecutor.java:603)
[junit4:junit4]   2> 	at java.lang.Thread.run(Thread.java:722)
[junit4:junit4]   2> Caused by: java.io.IOException: Can't find resource 'stopwords.txt' in classpath or '/configs/conf1', cwd=/mnt/ssd/jenkins/workspace/Lucene-Solr-trunk-Linux/solr/build/solr-core/test/J1
[junit4:junit4]   2> 	at org.apache.solr.cloud.ZkSolrResourceLoader.openResource(ZkSolrResourceLoader.java:93)
[junit4:junit4]   2> 	at org.apache.lucene.analysis.util.AbstractAnalysisFactory.getLines(AbstractAnalysisFactory.java:163)
[junit4:junit4]   2> 	at org.apache.lucene.analysis.util.AbstractAnalysisFactory.getWordSet(AbstractAnalysisFactory.java:151)
[junit4:junit4]   2> 	at org.apache.lucene.analysis.core.StopFilterFactory.inform(StopFilterFactory.java:58)
[junit4:junit4]   2> 	at org.apache.solr.core.SolrResourceLoader.inform(SolrResourceLoader.java:611)
[junit4:junit4]   2> 	at org.apache.solr.schema.IndexSchema.<init>(IndexSchema.java:116)
[junit4:junit4]   2> 	... 11 more
[junit4:junit4]   2> 
[junit4:junit4]   2> 749 T2617 oasc.SolrException.log SEVERE null:org.apache.solr.common.SolrException: Unable to create core: collection1
[junit4:junit4]   2> 		at org.apache.solr.core.CoreContainer.recordAndThrow(CoreContainer.java:1598)
[junit4:junit4]   2> 		at org.apache.solr.core.CoreContainer.create(CoreContainer.java:1009)
[junit4:junit4]   2> 		at org.apache.solr.core.CoreContainer$3.call(CoreContainer.java:610)
[junit4:junit4]   2> 		at org.apache.solr.core.CoreContainer$3.call(CoreContainer.java:606)
[junit4:junit4]   2> 		at java.util.concurrent.FutureTask.run(FutureTask.java:262)
[junit4:junit4]   2> 		at java.util.concurrent.Executors$RunnableAdapter.call(Executors.java:471)
[junit4:junit4]   2> 		at java.util.concurrent.FutureTask.run(FutureTask.java:262)
[junit4:junit4]   2> 		at java.util.concurrent.ThreadPoolExecutor.runWorker(ThreadPoolExecutor.java:1110)
[junit4:junit4]   2> 		at java.util.concurrent.ThreadPoolExecutor$Worker.run(ThreadPoolExecutor.java:603)
[junit4:junit4]   2> 		at java.lang.Thread.run(Thread.java:722)
[junit4:junit4]   2> 	Caused by: java.lang.RuntimeException: java.io.IOException: Can't find resource 'stopwords.txt' in classpath or '/configs/conf1', cwd=/mnt/ssd/jenkins/workspace/Lucene-Solr-trunk-Linux/solr/build/solr-core/test/J1
[junit4:junit4]   2> 		at org.apache.solr.schema.IndexSchema.<init>(IndexSchema.java:118)
[junit4:junit4]   2> 		at org.apache.solr.core.CoreContainer.getSchemaFromZk(CoreContainer.java:1606)
[junit4:junit4]   2> 		at org.apache.solr.core.CoreContainer.createFromZk(CoreContainer.java:918)
[junit4:junit4]   2> 		at org.apache.solr.core.CoreContainer.create(CoreContainer.java:1001)
[junit4:junit4]   2> 		... 8 more
[junit4:junit4]   2> 	Caused by: java.io.IOException: Can't find resource 'stopwords.txt' in classpath or '/configs/conf1', cwd=/mnt/ssd/jenkins/workspace/Lucene-Solr-trunk-Linux/solr/build/solr-core/test/J1
[junit4:junit4]   2> 		at org.apache.solr.cloud.ZkSolrResourceLoader.openResource(ZkSolrResourceLoader.java:93)
[junit4:junit4]   2> 		at org.apache.lucene.analysis.util.AbstractAnalysisFactory.getLines(AbstractAnalysisFactory.java:163)
[junit4:junit4]   2> 		at org.apache.lucene.analysis.util.AbstractAnalysisFactory.getWordSet(AbstractAnalysisFactory.java:151)
[junit4:junit4]   2> 		at org.apache.lucene.analysis.core.StopFilterFactory.inform(StopFilterFactory.java:58)
[junit4:junit4]   2> 		at org.apache.solr.core.SolrResourceLoader.inform(SolrResourceLoader.java:611)
[junit4:junit4]   2> 		at org.apache.solr.schema.IndexSchema.<init>(IndexSchema.java:116)
[junit4:junit4]   2> 		... 11 more
[junit4:junit4]   2> 	
[junit4:junit4]   2> 750 T2603 oasc.SolrResourceLoader.locateSolrHome JNDI not configured for solr (NoInitialContextEx)
[junit4:junit4]   2> 750 T2603 oasc.SolrResourceLoader.locateSolrHome using system property solr.solr.home: /mnt/ssd/jenkins/workspace/Lucene-Solr-trunk-Linux/solr/build/solr-core/test-files/solr
[junit4:junit4]   2> 751 T2603 oasc.CoreContainer$Initializer.initialize looking for solr.xml: /mnt/ssd/jenkins/workspace/Lucene-Solr-trunk-Linux/solr/build/solr-core/test-files/solr/solr.xml
[junit4:junit4]   2> 751 T2603 oasc.CoreContainer.<init> New CoreContainer 32021528
[junit4:junit4]   2> 752 T2603 oasc.CoreContainer.load Loading CoreContainer using Solr Home: '/mnt/ssd/jenkins/workspace/Lucene-Solr-trunk-Linux/solr/build/solr-core/test-files/solr/'
[junit4:junit4]   2> 753 T2603 oasc.SolrResourceLoader.<init> new SolrResourceLoader for directory: '/mnt/ssd/jenkins/workspace/Lucene-Solr-trunk-Linux/solr/build/solr-core/test-files/solr/'
[junit4:junit4]   2> 771 T2603 oasc.CoreContainer.load Registering Log Listener
[junit4:junit4]   2> 782 T2603 oasc.CoreContainer.initZooKeeper Zookeeper client=127.0.0.1:60502/solr
[junit4:junit4]   2> 783 T2603 oaz.ZooKeeper.<init> Initiating client connection, connectString=127.0.0.1:60502/solr sessionTimeout=3000 watcher=org.apache.solr.common.cloud.ConnectionManager@9ad418
[junit4:junit4]   2> 784 T2618 oaz.ClientCnxn$SendThread.logStartConnect Opening socket connection to server localhost.localdomain/127.0.0.1:60502. Will not attempt to authenticate using SASL (access denied ("javax.security.auth.AuthPermission" "getLoginConfiguration"))
[junit4:junit4]   2> 784 T2603 oascc.ConnectionManager.waitForConnected Waiting for client to connect to ZooKeeper
[junit4:junit4]   2> 784 T2618 oaz.ClientCnxn$SendThread.primeConnection Socket connection established to localhost.localdomain/127.0.0.1:60502, initiating session
[junit4:junit4]   2> 784 T2605 oazs.NIOServerCnxnFactory.run Accepted socket connection from /127.0.0.1:57471
[junit4:junit4]   2> 785 T2605 oazs.ZooKeeperServer.processConnectRequest Client attempting to establish new session at /127.0.0.1:57471
[junit4:junit4]   2> 785 T2618 oaz.ClientCnxn$SendThread.onConnected Session establishment complete on server localhost.localdomain/127.0.0.1:60502, sessionid = 0x13b586412030003, negotiated timeout = 3000
[junit4:junit4]   2> 785 T2607 oazs.ZooKeeperServer.finishSessionInit Established session 0x13b586412030003 with negotiated timeout 3000 for client /127.0.0.1:57471
[junit4:junit4]   2> 786 T2619 oascc.ConnectionManager.process Watcher org.apache.solr.common.cloud.ConnectionManager@9ad418 name:ZooKeeperConnection Watcher:127.0.0.1:60502/solr got event WatchedEvent state:SyncConnected type:None path:null path:null type:None
[junit4:junit4]   2> 786 T2603 oascc.ConnectionManager.waitForConnected Client is connected to ZooKeeper
[junit4:junit4]   2> 787 T2608 oazs.PrepRequestProcessor.pRequest Got user-level KeeperException when processing sessionid:0x13b586412030003 type:create cxid:0x1 zxid:0x28 txntype:-1 reqpath:n/a Error Path:/solr/overseer Error:KeeperErrorCode = NodeExists for /solr/overseer
[junit4:junit4]   2> 787 T2608 oazs.PrepRequestProcessor.pRequest Got user-level KeeperException when processing sessionid:0x13b586412030003 type:create cxid:0x2 zxid:0x29 txntype:-1 reqpath:n/a Error Path:/solr/overseer Error:KeeperErrorCode = NodeExists for /solr/overseer
[junit4:junit4]   2> 788 T2603 oasc.ZkController.createEphemeralLiveNode Register node as live in ZooKeeper:/live_nodes/127.0.0.1:1662_solr
[junit4:junit4]   2> 789 T2608 oazs.PrepRequestProcessor.pRequest Got user-level KeeperException when processing sessionid:0x13b586412030003 type:delete cxid:0x4 zxid:0x2a txntype:-1 reqpath:n/a Error Path:/solr/live_nodes/127.0.0.1:1662_solr Error:KeeperErrorCode = NoNode for /solr/live_nodes/127.0.0.1:1662_solr
[junit4:junit4]   2> 789 T2603 oascc.SolrZkClient.makePath makePath: /live_nodes/127.0.0.1:1662_solr
[junit4:junit4]   2> 791 T2614 oascc.ZkStateReader$3.process Updating live nodes... (2)
[junit4:junit4]   2> 791 T2603 oashc.HttpShardHandlerFactory.getParameter Setting socketTimeout to: 0
[junit4:junit4]   2> 791 T2603 oashc.HttpShardHandlerFactory.getParameter Setting urlScheme to: http://
[junit4:junit4]   2> 792 T2603 oashc.HttpShardHandlerFactory.getParameter Setting connTimeout to: 0
[junit4:junit4]   2> 792 T2603 oashc.HttpShardHandlerFactory.getParameter Setting maxConnectionsPerHost to: 20
[junit4:junit4]   2> 793 T2603 oashc.HttpShardHandlerFactory.getParameter Setting corePoolSize to: 0
[junit4:junit4]   2> 793 T2603 oashc.HttpShardHandlerFactory.getParameter Setting maximumPoolSize to: 2147483647
[junit4:junit4]   2> 794 T2603 oashc.HttpShardHandlerFactory.getParameter Setting maxThreadIdleTime to: 5
[junit4:junit4]   2> 794 T2603 oashc.HttpShardHandlerFactory.getParameter Setting sizeOfQueue to: -1
[junit4:junit4]   2> 795 T2603 oashc.HttpShardHandlerFactory.getParameter Setting fairnessPolicy to: false
[junit4:junit4]   2> 795 T2603 oascsi.HttpClientUtil.createClient Creating new http client, config:maxConnectionsPerHost=20&maxConnections=10000&socketTimeout=0&connTimeout=0&retry=false
[junit4:junit4]   2> 799 T2603 oascc.ZkStateReader.createClusterStateWatchersAndUpdate Updating cluster state from ZooKeeper... 
[junit4:junit4]   2> 805 T2620 oasc.CoreContainer.create Creating SolrCore 'collection1' using instanceDir: /mnt/ssd/jenkins/workspace/Lucene-Solr-trunk-Linux/solr/build/solr-core/test-files/solr/collection1
[junit4:junit4]   2> 805 T2620 oasc.ZkController.createCollectionZkNode Check for collection zkNode:collection1
[junit4:junit4]   2> 806 T2620 oasc.ZkController.createCollectionZkNode Collection zkNode exists
[junit4:junit4]   2> 806 T2620 oasc.ZkController.readConfigName Load collection config from:/collections/collection1
[junit4:junit4]   2> 807 T2620 oasc.SolrResourceLoader.<init> new SolrResourceLoader for directory: '/mnt/ssd/jenkins/workspace/Lucene-Solr-trunk-Linux/solr/build/solr-core/test-files/solr/collection1/'
[junit4:junit4]   2> 807 T2620 oasc.SolrResourceLoader.replaceClassLoader Adding 'file:/mnt/ssd/jenkins/workspace/Lucene-Solr-trunk-Linux/solr/build/solr-core/test-files/solr/collection1/lib/README' to classloader
[junit4:junit4]   2> 808 T2620 oasc.SolrResourceLoader.replaceClassLoader Adding 'file:/mnt/ssd/jenkins/workspace/Lucene-Solr-trunk-Linux/solr/build/solr-core/test-files/solr/collection1/lib/classes/' to classloader
[junit4:junit4]   2> 839 T2620 oasc.SolrConfig.<init> Using Lucene MatchVersion: LUCENE_50
[junit4:junit4]   2> 895 T2620 oasc.SolrConfig.<init> Loaded SolrConfig: solrconfig.xml
[junit4:junit4]   2> 895 T2620 oass.IndexSchema.readSchema Reading Solr Schema
[junit4:junit4]   2> 900 T2620 oass.IndexSchema.readSchema Schema name=test
[junit4:junit4]   2> 1286 T2620 oass.OpenExchangeRatesOrgProvider.init Initialized with rates=open-exchange-rates.json, refreshInterval=1440.
[junit4:junit4]   2> 1292 T2620 oass.IndexSchema.readSchema default search field in schema is text
[junit4:junit4]   2> 1295 T2620 oass.IndexSchema.readSchema unique key field: id
[junit4:junit4]   2> 1297 T2620 oasc.CoreContainer.recordAndThrow SEVERE Unable to create core: collection1 java.lang.RuntimeException: java.io.IOException: Can't find resource 'stopwords.txt' in classpath or '/configs/conf1', cwd=/mnt/ssd/jenkins/workspace/Lucene-Solr-trunk-Linux/solr/build/solr-core/test/J1
[junit4:junit4]   2> 	at org.apache.solr.schema.IndexSchema.<init>(IndexSchema.java:118)
[junit4:junit4]   2> 	at org.apache.solr.core.CoreContainer.getSchemaFromZk(CoreContainer.java:1606)
[junit4:junit4]   2> 	at org.apache.solr.core.CoreContainer.createFromZk(CoreContainer.java:918)
[junit4:junit4]   2> 	at org.apache.solr.core.CoreContainer.create(CoreContainer.java:1001)
[junit4:junit4]   2> 	at org.apache.solr.core.CoreContainer$3.call(CoreContainer.java:610)
[junit4:junit4]   2> 	at org.apache.solr.core.CoreContainer$3.call(CoreContainer.java:606)
[junit4:junit4]   2> 	at java.util.concurrent.FutureTask.run(FutureTask.java:262)
[junit4:junit4]   2> 	at java.util.concurrent.Executors$RunnableAdapter.call(Executors.java:471)
[junit4:junit4]   2> 	at java.util.concurrent.FutureTask.run(FutureTask.java:262)
[junit4:junit4]   2> 	at java.util.concurrent.ThreadPoolExecutor.runWorker(ThreadPoolExecutor.java:1110)
[junit4:junit4]   2> 	at java.util.concurrent.ThreadPoolExecutor$Worker.run(ThreadPoolExecutor.java:603)
[junit4:junit4]   2> 	at java.lang.Thread.run(Thread.java:722)
[junit4:junit4]   2> Caused by: java.io.IOException: Can't find resource 'stopwords.txt' in classpath or '/configs/conf1', cwd=/mnt/ssd/jenkins/workspace/Lucene-Solr-trunk-Linux/solr/build/solr-core/test/J1
[junit4:junit4]   2> 	at org.apache.solr.cloud.ZkSolrResourceLoader.openResource(ZkSolrResourceLoader.java:93)
[junit4:junit4]   2> 	at org.apache.lucene.analysis.util.AbstractAnalysisFactory.getLines(AbstractAnalysisFactory.java:163)
[junit4:junit4]   2> 	at org.apache.lucene.analysis.util.AbstractAnalysisFactory.getWordSet(AbstractAnalysisFactory.java:151)
[junit4:junit4]   2> 	at org.apache.lucene.analysis.core.StopFilterFactory.inform(StopFilterFactory.java:58)
[junit4:junit4]   2> 	at org.apache.solr.core.SolrResourceLoader.inform(SolrResourceLoader.java:611)
[junit4:junit4]   2> 	at org.apache.solr.schema.IndexSchema.<init>(IndexSchema.java:116)
[junit4:junit4]   2> 	... 11 more
[junit4:junit4]   2> 
[junit4:junit4]   2> 1298 T2620 oasc.SolrException.log SEVERE null:org.apache.solr.common.SolrException: Unable to create core: collection1
[junit4:junit4]   2> 		at org.apache.solr.core.CoreContainer.recordAndThrow(CoreContainer.java:1598)
[junit4:junit4]   2> 		at org.apache.solr.core.CoreContainer.create(CoreContainer.java:1009)
[junit4:junit4]   2> 		at org.apache.solr.core.CoreContainer$3.call(CoreContainer.java:610)
[junit4:junit4]   2> 		at org.apache.solr.core.CoreContainer$3.call(CoreContainer.java:606)
[junit4:junit4]   2> 		at java.util.concurrent.FutureTask.run(FutureTask.java:262)
[junit4:junit4]   2> 		at java.util.concurrent.Executors$RunnableAdapter.call(Executors.java:471)
[junit4:junit4]   2> 		at java.util.concurrent.FutureTask.run(FutureTask.java:262)
[junit4:junit4]   2> 		at java.util.concurrent.ThreadPoolExecutor.runWorker(ThreadPoolExecutor.java:1110)
[junit4:junit4]   2> 		at java.util.concurrent.ThreadPoolExecutor$Worker.run(ThreadPoolExecutor.java:603)
[junit4:junit4]   2> 		at java.lang.Thread.run(Thread.java:722)
[junit4:junit4]   2> 	Caused by: java.lang.RuntimeException: java.io.IOException: Can't find resource 'stopwords.txt' in classpath or '/configs/conf1', cwd=/mnt/ssd/jenkins/workspace/Lucene-Solr-trunk-Linux/solr/build/solr-core/test/J1
[junit4:junit4]   2> 		at org.apache.solr.schema.IndexSchema.<init>(IndexSchema.java:118)
[junit4:junit4]   2> 		at org.apache.solr.core.CoreContainer.getSchemaFromZk(CoreContainer.java:1606)
[junit4:junit4]   2> 		at org.apache.solr.core.CoreContainer.createFromZk(CoreContainer.java:918)
[junit4:junit4]   2> 		at org.apache.solr.core.CoreContainer.create(CoreContainer.java:1001)
[junit4:junit4]   2> 		... 8 more
[junit4:junit4]   2> 	Caused by: java.io.IOException: Can't find resource 'stopwords.txt' in classpath or '/configs/conf1', cwd=/mnt/ssd/jenkins/workspace/Lucene-Solr-trunk-Linux/solr/build/solr-core/test/J1
[junit4:junit4]   2> 		at org.apache.solr.cloud.ZkSolrResourceLoader.openResource(ZkSolrResourceLoader.java:93)
[junit4:junit4]   2> 		at org.apache.lucene.analysis.util.AbstractAnalysisFactory.getLines(AbstractAnalysisFactory.java:163)
[junit4:junit4]   2> 		at org.apache.lucene.analysis.util.AbstractAnalysisFactory.getWordSet(AbstractAnalysisFactory.java:151)
[junit4:junit4]   2> 		at org.apache.lucene.analysis.core.StopFilterFactory.inform(StopFilterFactory.java:58)
[junit4:junit4]   2> 		at org.apache.solr.core.SolrResourceLoader.inform(SolrResourceLoader.java:611)
[junit4:junit4]   2> 		at org.apache.solr.schema.IndexSchema.<init>(IndexSchema.java:116)
[junit4:junit4]   2> 		... 11 more
[junit4:junit4]   2> 	
[junit4:junit4]   2> 1299 T2603 oasc.SolrResourceLoader.locateSolrHome JNDI not configured for solr (NoInitialContextEx)
[junit4:junit4]   2> 1300 T2603 oasc.SolrResourceLoader.locateSolrHome using system property solr.solr.home: /mnt/ssd/jenkins/workspace/Lucene-Solr-trunk-Linux/solr/build/solr-core/test-files/solr
[junit4:junit4]   2> 1300 T2603 oasc.CoreContainer$Initializer.initialize looking for solr.xml: /mnt/ssd/jenkins/workspace/Lucene-Solr-trunk-Linux/solr/build/solr-core/test-files/solr/solr.xml
[junit4:junit4]   2> 1301 T2603 oasc.CoreContainer.<init> New CoreContainer 26221754
[junit4:junit4]   2> 1301 T2603 oasc.CoreContainer.load Loading CoreContainer using Solr Home: '/mnt/ssd/jenkins/workspace/Lucene-Solr-trunk-Linux/solr/build/solr-core/test-files/solr/'
[junit4:junit4]   2> 1301 T2603 oasc.SolrResourceLoader.<init> new SolrResourceLoader for directory: '/mnt/ssd/jenkins/workspace/Lucene-Solr-trunk-Linux/solr/build/solr-core/test-files/solr/'
[junit4:junit4]   2> 1315 T2603 oasc.CoreContainer.load Registering Log Listener
[junit4:junit4]   2> 1325 T2603 oasc.CoreContainer.initZooKeeper Zookeeper client=127.0.0.1:60502/solr
[junit4:junit4]   2> 1326 T2603 oaz.ZooKeeper.<init> Initiating client connection, connectString=127.0.0.1:60502/solr sessionTimeout=3000 watcher=org.apache.solr.common.cloud.ConnectionManager@19ff60
[junit4:junit4]   2> 1327 T2621 oaz.ClientCnxn$SendThread.logStartConnect Opening socket connection to server localhost.localdomain/127.0.0.1:60502. Will not attempt to authenticate using SASL (access denied ("javax.security.auth.AuthPermission" "getLoginConfiguration"))
[junit4:junit4]   2> 1327 T2603 oascc.ConnectionManager.waitForConnected Waiting for client to connect to ZooKeeper
[junit4:junit4]   2> 1328 T2621 oaz.ClientCnxn$SendThread.primeConnection Socket connection established to localhost.localdomain/127.0.0.1:60502, initiating session
[junit4:junit4]   2> 1328 T2605 oazs.NIOServerCnxnFactory.run Accepted socket connection from /127.0.0.1:57473
[junit4:junit4]   2> 1328 T2605 oazs.ZooKeeperServer.processConnectRequest Client attempting to establish new session at /127.0.0.1:57473
[junit4:junit4]   2> 1329 T2607 oazs.ZooKeeperServer.finishSessionInit Established session 0x13b586412030004 with negotiated timeout 3000 for client /127.0.0.1:57473
[junit4:junit4]   2> 1329 T2621 oaz.ClientCnxn$SendThread.onConnected Session establishment complete on server localhost.localdomain/127.0.0.1:60502, sessionid = 0x13b586412030004, negotiated timeout = 3000
[junit4:junit4]   2> 1329 T2622 oascc.ConnectionManager.process Watcher org.apache.solr.common.cloud.ConnectionManager@19ff60 name:ZooKeeperConnection Watcher:127.0.0.1:60502/solr got event WatchedEvent state:SyncConnected type:None path:null path:null type:None
[junit4:junit4]   2> 1330 T2603 oascc.ConnectionManager.waitForConnected Client is connected to ZooKeeper
[junit4:junit4]   2> 1330 T2608 oazs.PrepRequestProcessor.pRequest Got user-level KeeperException when processing sessionid:0x13b586412030004 type:create cxid:0x1 zxid:0x2e txntype:-1 reqpath:n/a Error Path:/solr/overseer Error:KeeperErrorCode = NodeExists for /solr/overseer
[junit4:junit4]   2> 1331 T2608 oazs.PrepRequestProcessor.pRequest Got user-level KeeperException when processing sessionid:0x13b586412030004 type:create cxid:0x2 zxid:0x2f txntype:-1 reqpath:n/a Error Path:/solr/overseer Error:KeeperErrorCode = NodeExists for /solr/overseer
[junit4:junit4]   2> 1331 T2603 oasc.ZkController.createEphemeralLiveNode Register node as live in ZooKeeper:/live_nodes/127.0.0.1:1663_solr
[junit4:junit4]   2> 1332 T2608 oazs.PrepRequestProcessor.pRequest Got user-level KeeperException when processing sessionid:0x13b586412030004 type:delete cxid:0x4 zxid:0x30 txntype:-1 reqpath:n/a Error Path:/solr/live_nodes/127.0.0.1:1663_solr Error:KeeperErrorCode = NoNode for /solr/live_nodes/127.0.0.1:1663_solr
[junit4:junit4]   2> 1333 T2603 oascc.SolrZkClient.makePath makePath: /live_nodes/127.0.0.1:1663_solr
[junit4:junit4]   2> 1334 T2614 oascc.ZkStateReader$3.process Updating live nodes... (3)
[junit4:junit4]   2> 1334 T2619 oascc.ZkStateReader$3.process Updating live nodes... (3)
[junit4:junit4]   2> 1334 T2603 oashc.HttpShardHandlerFactory.getParameter Setting socketTimeout to: 0
[junit4:junit4]   2> 1335 T2603 oashc.HttpShardHandlerFactory.getParameter Setting urlScheme to: http://
[junit4:junit4]   2> 1335 T2603 oashc.HttpShardHandlerFactory.getParameter Setting connTimeout to: 0
[junit4:junit4]   2> 1336 T2603 oashc.HttpShardHandlerFactory.getParameter Setting maxConnectionsPerHost to: 20
[junit4:junit4]   2> 1336 T2603 oashc.HttpShardHandlerFactory.getParameter Setting corePoolSize to: 0
[junit4:junit4]   2> 1337 T2603 oashc.HttpShardHandlerFactory.getParameter Setting maximumPoolSize to: 2147483647
[junit4:junit4]   2> 1337 T2603 oashc.HttpShardHandlerFactory.getParameter Setting maxThreadIdleTime to: 5
[junit4:junit4]   2> 1337 T2603 oashc.HttpShardHandlerFactory.getParameter Setting sizeOfQueue to: -1
[junit4:junit4]   2> 1338 T2603 oashc.HttpShardHandlerFactory.getParameter Setting fairnessPolicy to: false
[junit4:junit4]   2> 1338 T2603 oascsi.HttpClientUtil.createClient Creating new http client, config:maxConnectionsPerHost=20&maxConnections=10000&socketTimeout=0&connTimeout=0&retry=false
[junit4:junit4]   2> 1343 T2603 oascc.ZkStateReader.createClusterStateWatchersAndUpdate Updating cluster state from ZooKeeper... 
[junit4:junit4]   2> 1348 T2623 oasc.CoreContainer.create Creating SolrCore 'collection1' using instanceDir: /mnt/ssd/jenkins/workspace/Lucene-Solr-trunk-Linux/solr/build/solr-core/test-files/solr/collection1
[junit4:junit4]   2> 1348 T2623 oasc.ZkController.createCollectionZkNode Check for collection zkNode:collection1
[junit4:junit4]   2> 1349 T2623 oasc.ZkController.createCollectionZkNode Collection zkNode exists
[junit4:junit4]   2> 1349 T2623 oasc.ZkController.readConfigName Load collection config from:/collections/collection1
[junit4:junit4]   2> 1349 T2623 oasc.SolrResourceLoader.<init> new SolrResourceLoader for directory: '/mnt/ssd/jenkins/workspace/Lucene-Solr-trunk-Linux/solr/build/solr-core/test-files/solr/collection1/'
[junit4:junit4]   2> 1350 T2623 oasc.SolrResourceLoader.replaceClassLoader Adding 'file:/mnt/ssd/jenkins/workspace/Lucene-Solr-trunk-Linux/solr/build/solr-core/test-files/solr/collection1/lib/README' to classloader
[junit4:junit4]   2> 1350 T2623 oasc.SolrResourceLoader.replaceClassLoader Adding 'file:/mnt/ssd/jenkins/workspace/Lucene-Solr-trunk-Linux/solr/build/solr-core/test-files/solr/collection1/lib/classes/' to classloader
[junit4:junit4]   2> 1382 T2623 oasc.SolrConfig.<init> Using Lucene MatchVersion: LUCENE_50
[junit4:junit4]   2> 1425 T2623 oasc.SolrConfig.<init> Loaded SolrConfig: solrconfig.xml
[junit4:junit4]   2> 1426 T2623 oass.IndexSchema.readSchema Reading Solr Schema
[junit4:junit4]   2> 1431 T2623 oass.IndexSchema.readSchema Schema name=test
[junit4:junit4]   2> 1808 T2623 oass.OpenExchangeRatesOrgProvider.init Initialized with rates=open-exchange-rates.json, refreshInterval=1440.
[junit4:junit4]   2> 1814 T2623 oass.IndexSchema.readSchema default search field in schema is text
[junit4:junit4]   2> 1817 T2623 oass.IndexSchema.readSchema unique key field: id
[junit4:junit4]   2> 1819 T2623 oasc.CoreContainer.recordAndThrow SEVERE Unable to create core: collection1 java.lang.RuntimeException: java.io.IOException: Can't find resource 'stopwords.txt' in classpath or '/configs/conf1', cwd=/mnt/ssd/jenkins/workspace/Lucene-Solr-trunk-Linux/solr/build/solr-core/test/J1
[junit4:junit4]   2> 	at org.apache.solr.schema.IndexSchema.<init>(IndexSchema.java:118)
[junit4:junit4]   2> 	at org.apache.solr.core.CoreContainer.getSchemaFromZk(CoreContainer.java:1606)
[junit4:junit4]   2> 	at org.apache.solr.core.CoreContainer.createFromZk(CoreContainer.java:918)
[junit4:junit4]   2> 	at org.apache.solr.core.CoreContainer.create(CoreContainer.java:1001)
[junit4:junit4]   2> 	at org.apache.solr.core.CoreContainer$3.call(CoreContainer.java:610)
[junit4:junit4]   2> 	at org.apache.solr.core.CoreContainer$3.call(CoreContainer.java:606)
[junit4:junit4]   2> 	at java.util.concurrent.FutureTask.run(FutureTask.java:262)
[junit4:junit4]   2> 	at java.util.concurrent.Executors$RunnableAdapter.call(Executors.java:471)
[junit4:junit4]   2> 	at java.util.concurrent.FutureTask.run(FutureTask.java:262)
[junit4:junit4]   2> 	at java.util.concurrent.ThreadPoolExecutor.runWorker(ThreadPoolExecutor.java:1110)
[junit4:junit4]   2> 	at java.util.concurrent.ThreadPoolExecutor$Worker.run(ThreadPoolExecutor.java:603)
[junit4:junit4]   2> 	at java.lang.Thread.run(Thread.java:722)
[junit4:junit4]   2> Caused by: java.io.IOException: Can't find resource 'stopwords.txt' in classpath or '/configs/conf1', cwd=/mnt/ssd/jenkins/workspace/Lucene-Solr-trunk-Linux/solr/build/solr-core/test/J1
[junit4:junit4]   2> 	at org.apache.solr.cloud.ZkSolrResourceLoader.openResource(ZkSolrResourceLoader.java:93)
[junit4:junit4]   2> 	at org.apache.lucene.analysis.util.AbstractAnalysisFactory.getLines(AbstractAnalysisFactory.java:163)
[junit4:junit4]   2> 	at org.apache.lucene.analysis.util.AbstractAnalysisFactory.getWordSet(AbstractAnalysisFactory.java:151)
[junit4:junit4]   2> 	at org.apache.lucene.analysis.core.StopFilterFactory.inform(StopFilterFactory.java:58)
[junit4:junit4]   2> 	at org.apache.solr.core.SolrResourceLoader.inform(SolrResourceLoader.java:611)
[junit4:junit4]   2> 	at org.apache.solr.schema.IndexSchema.<init>(IndexSchema.java:116)
[junit4:junit4]   2> 	... 11 more
[junit4:junit4]   2> 
[junit4:junit4]   2> 1820 T2623 oasc.SolrException.log SEVERE null:org.apache.solr.common.SolrException: Unable to create core: collection1
[junit4:junit4]   2> 		at org.apache.solr.core.CoreContainer.recordAndThrow(CoreContainer.java:1598)
[junit4:junit4]   2> 		at org.apache.solr.core.CoreContainer.create(CoreContainer.java:1009)
[junit4:junit4]   2> 		at org.apache.solr.core.CoreContainer$3.call(CoreContainer.java:610)
[junit4:junit4]   2> 		at org.apache.solr.core.CoreContainer$3.call(CoreContainer.java:606)
[junit4:junit4]   2> 		at java.util.concurrent.FutureTask.run(FutureTask.java:262)
[junit4:junit4]   2> 		at java.util.concurrent.Executors$RunnableAdapter.call(Executors.java:471)
[junit4:junit4]   2> 		at java.util.concurrent.FutureTask.run(FutureTask.java:262)
[junit4:junit4]   2> 		at java.util.concurrent.ThreadPoolExecutor.runWorker(ThreadPoolExecutor.java:1110)
[junit4:junit4]   2> 		at java.util.concurrent.ThreadPoolExecutor$Worker.run(ThreadPoolExecutor.java:603)
[junit4:junit4]   2> 		at java.lang.Thread.run(Thread.java:722)
[junit4:junit4]   2> 	Caused by: java.lang.RuntimeException: java.io.IOException: Can't find resource 'stopwords.txt' in classpath or '/configs/conf1', cwd=/mnt/ssd/jenkins/workspace/Lucene-Solr-trunk-Linux/solr/build/solr-core/test/J1
[junit4:junit4]   2> 		at org.apache.solr.schema.IndexSchema.<init>(IndexSchema.java:118)
[junit4:junit4]   2> 		at org.apache.solr.core.CoreContainer.getSchemaFromZk(CoreContainer.java:1606)
[junit4:junit4]   2> 		at org.apache.solr.core.CoreContainer.createFromZk(CoreContainer.java:918)
[junit4:junit4]   2> 		at org.apache.solr.core.CoreContainer.create(CoreContainer.java:1001)
[junit4:junit4]   2> 		... 8 more
[junit4:junit4]   2> 	Caused by: java.io.IOException: Can't find resource 'stopwords.txt' in classpath or '/configs/conf1', cwd=/mnt/ssd/jenkins/workspace/Lucene-Solr-trunk-Linux/solr/build/solr-core/test/J1
[junit4:junit4]   2> 		at org.apache.solr.cloud.ZkSolrResourceLoader.openResource(ZkSolrResourceLoader.java:93)
[junit4:junit4]   2> 		at org.apache.lucene.analysis.util.AbstractAnalysisFactory.getLines(AbstractAnalysisFactory.java:163)
[junit4:junit4]   2> 		at org.apache.lucene.analysis.util.AbstractAnalysisFactory.getWordSet(AbstractAnalysisFactory.java:151)
[junit4:junit4]   2> 		at org.apache.lucene.analysis.core.StopFilterFactory.inform(StopFilterFactory.java:58)
[junit4:junit4]   2> 		at org.apache.solr.core.SolrResourceLoader.inform(SolrResourceLoader.java:611)
[junit4:junit4]   2> 		at org.apache.solr.schema.IndexSchema.<init>(IndexSchema.java:116)
[junit4:junit4]   2> 		... 11 more
[junit4:junit4]   2> 	
[junit4:junit4]   2> 1821 T2603 oasc.ClusterStateUpdateTest.setUp ####SETUP_END testCoreRegistration
[junit4:junit4]   2> 1822 T2603 oaz.ZooKeeper.<init> Initiating client connection, connectString=127.0.0.1:60502/solr sessionTimeout=10000 watcher=org.apache.solr.common.cloud.ConnectionManager@f6a40
[junit4:junit4]   2> 1823 T2624 oaz.ClientCnxn$SendThread.logStartConnect Opening socket connection to server localhost.localdomain/127.0.0.1:60502. Will not attempt to authenticate using SASL (access denied ("javax.security.auth.AuthPermission" "getLoginConfiguration"))
[junit4:junit4]   2> 1822 T2603 oascc.ConnectionManager.waitForConnected Waiting for client to connect to ZooKeeper
[junit4:junit4]   2> 1823 T2624 oaz.ClientCnxn$SendThread.primeConnection Socket connection established to localhost.localdomain/127.0.0.1:60502, initiating session
[junit4:junit4]   2> 1823 T2605 oazs.NIOServerCnxnFactory.run Accepted socket connection from /127.0.0.1:57474
[junit4:junit4]   2> 1823 T2605 oazs.ZooKeeperServer.processConnectRequest Client attempting to establish new session at /127.0.0.1:57474
[junit4:junit4]   2> 1824 T2624 oaz.ClientCnxn$SendThread.onConnected Session establishment complete on server localhost.localdomain/127.0.0.1:60502, sessionid = 0x13b586412030005, negotiated timeout = 10000
[junit4:junit4]   2> 1824 T2607 oazs.ZooKeeperServer.finishSessionInit Established session 0x13b586412030005 with negotiated timeout 10000 for client /127.0.0.1:57474
[junit4:junit4]   2> 1825 T2625 oascc.ConnectionManager.process Watcher org.apache.solr.common.cloud.ConnectionManager@f6a40 name:ZooKeeperConnection Watcher:127.0.0.1:60502/solr got event WatchedEvent state:SyncConnected type:None path:null path:null type:None
[junit4:junit4]   2> 1825 T2603 oascc.ConnectionManager.waitForConnected Client is connected to ZooKeeper
[junit4:junit4]   2> 1825 T2603 oascc.SolrZkClient.makePath makePath: /collections/testcore
[junit4:junit4]   2> 1827 T2603 oascc.SolrZkClient.makePath makePath: /collections/testcore/shards
[junit4:junit4]   2> 1828 T2608 oazs.PrepRequestProcessor.pRequest2Txn Processed session termination for sessionid: 0x13b586412030005
[junit4:junit4]   2> 1829 T2625 oaz.ClientCnxn$EventThread.run EventThread shut down
[junit4:junit4]   2> 1829 T2605 oazs.NIOServerCnxn.closeSock Closed socket connection for client /127.0.0.1:57474 which had sessionid 0x13b586412030005
[junit4:junit4]   2> 1829 T2603 oaz.ZooKeeper.close Session: 0x13b586412030005 closed
[junit4:junit4]   2> 1830 T2603 oasc.CoreContainer.create Creating SolrCore 'testcore' using instanceDir: /mnt/ssd/jenkins/workspace/Lucene-Solr-trunk-Linux/solr/build/solr-core/test-files/solr/testcore
[junit4:junit4]   2> 1830 T2603 oasc.ZkController.createCollectionZkNode Check for collection zkNode:testcore
[junit4:junit4]   2> 1831 T2603 oasc.ZkController.createCollectionZkNode Collection zkNode exists
[junit4:junit4]   2> 1831 T2603 oasc.ZkController.readConfigName Load collection config from:/collections/testcore
[junit4:junit4]   2> 1832 T2603 oasc.SolrResourceLoader.<init> new SolrResourceLoader for directory: '/mnt/ssd/jenkins/workspace/Lucene-Solr-trunk-Linux/solr/build/solr-core/test-files/solr/testcore/'
[junit4:junit4]   2> 1863 T2603 oasc.SolrConfig.<init> Using Lucene MatchVersion: LUCENE_50
[junit4:junit4]   2> 1908 T2603 oasc.SolrConfig.<init> Loaded SolrConfig: solrconfig.xml
[junit4:junit4]   2> 1910 T2603 oass.IndexSchema.readSchema Reading Solr Schema
[junit4:junit4]   2> 1914 T2603 oass.IndexSchema.readSchema Schema name=test
[junit4:junit4]   2> 2302 T2603 oass.OpenExchangeRatesOrgProvider.init Initialized with rates=open-exchange-rates.json, refreshInterval=1440.
[junit4:junit4]   2> 2308 T2603 oass.IndexSchema.readSchema default search field in schema is text
[junit4:junit4]   2> 2311 T2603 oass.IndexSchema.readSchema unique key field: id
[junit4:junit4]   2> 2316 T2603 oasc.CoreContainer.recordAndThrow SEVERE Unable to create core: testcore java.lang.RuntimeException: java.io.IOException: Can't find resource 'stopwords.txt' in classpath or '/configs/conf1', cwd=/mnt/ssd/jenkins/workspace/Lucene-Solr-trunk-Linux/solr/build/solr-core/test/J1
[junit4:junit4]   2> 	at org.apache.solr.schema.IndexSchema.<init>(IndexSchema.java:118)
[junit4:junit4]   2> 	at org.apache.solr.core.CoreContainer.getSchemaFromZk(CoreContainer.java:1606)
[junit4:junit4]   2> 	at org.apache.solr.core.CoreContainer.createFromZk(CoreContainer.java:918)
[junit4:junit4]   2> 	at org.apache.solr.core.CoreContainer.create(CoreContainer.java:1001)
[junit4:junit4]   2> 	at org.apache.solr.cloud.ClusterStateUpdateTest.testCoreRegistration(ClusterStateUpdateTest.java:160)
[junit4:junit4]   2> 	at sun.reflect.NativeMethodAccessorImpl.invoke0(Native Method)
[junit4:junit4]   2> 	at sun.reflect.NativeMethodAccessorImpl.invoke(NativeMethodAccessorImpl.java:57)
[junit4:junit4]   2> 	at sun.reflect.DelegatingMethodAccessorImpl.invoke(DelegatingMethodAccessorImpl.java:43)
[junit4:junit4]   2> 	at java.lang.reflect.Method.invoke(Method.java:474)
[junit4:junit4]   2> 	at com.carrotsearch.randomizedtesting.RandomizedRunner.invoke(RandomizedRunner.java:1559)
[junit4:junit4]   2> 	at com.carrotsearch.randomizedtesting.RandomizedRunner.access$600(RandomizedRunner.java:79)
[junit4:junit4]   2> 	at com.carrotsearch.randomizedtesting.RandomizedRunner$6.evaluate(RandomizedRunner.java:737)
[junit4:junit4]   2> 	at com.carrotsearch.randomizedtesting.RandomizedRunner$7.evaluate(RandomizedRunner.java:773)
[junit4:junit4]   2> 	at com.carrotsearch.randomizedtesting.RandomizedRunner$8.evaluate(RandomizedRunner.java:787)
[junit4:junit4]   2> 	at com.carrotsearch.randomizedtesting.rules.SystemPropertiesRestoreRule$1.evaluate(SystemPropertiesRestoreRule.java:53)
[junit4:junit4]   2> 	at org.apache.lucene.util.TestRuleSetupTeardownChained$1.evaluate(TestRuleSetupTeardownChained.java:50)
[junit4:junit4]   2> 	at org.apache.lucene.util.TestRuleFieldCacheSanity$1.evaluate(TestRuleFieldCacheSanity.java:51)
[junit4:junit4]   2> 	at org.apache.lucene.util.AbstractBeforeAfterRule$1.evaluate(AbstractBeforeAfterRule.java:45)
[junit4:junit4]   2> 	at com.carrotsearch.randomizedtesting.rules.SystemPropertiesInvariantRule$1.evaluate(SystemPropertiesInvariantRule.java:55)
[junit4:junit4]   2> 	at org.apache.lucene.util.TestRuleThreadAndTestName$1.evaluate(TestRuleThreadAndTestName.java:48)
[junit4:junit4]   2> 	at org.apache.lucene.util.TestRuleIgnoreAfterMaxFailures$1.evaluate(TestRuleIgnoreAfterMaxFailures.java:70)
[junit4:junit4]   2> 	at org.apache.lucene.util.TestRuleMarkFailure$1.evaluate(TestRuleMarkFailure.java:48)
[junit4:junit4]   2> 	at com.carrotsearch.randomizedtesting.rules.StatementAdapter.evaluate(StatementAdapter.java:36)
[junit4:junit4]   2> 	at com.carrotsearch.randomizedtesting.ThreadLeakControl$StatementRunner.run(ThreadLeakControl.java:358)
[junit4:junit4]   2> 	at com.carrotsearch.randomizedtesting.ThreadLeakControl.forkTimeoutingTask(ThreadLeakControl.java:782)
[junit4:junit4]   2> 	at com.carrotsearch.randomizedtesting.ThreadLeakControl$3.evaluate(ThreadLeakControl.java:442)
[junit4:junit4]   2> 	at com.carrotsearch.randomizedtesting.RandomizedRunner.runSingleTest(RandomizedRunner.java:746)
[junit4:junit4]   2> 	at com.carrotsearch.randomizedtesting.RandomizedRunner$3.evaluate(RandomizedRunner.java:648)
[junit4:junit4]   2> 	at com.carrotsearch.randomizedtesting.RandomizedRunner$4.evaluate(RandomizedRunner.java:682)
[junit4:junit4]   2> 	at com.carrotsearch.randomizedtesting.RandomizedRunner$5.evaluate(RandomizedRunner.java:693)
[junit4:junit4]   2> 	at com.carrotsearch.randomizedtesting.rules.StatementAdapter.evaluate(StatementAdapter.java:36)
[junit4:junit4]   2> 	at com.carrotsearch.randomizedtesting.rules.SystemPropertiesRestoreRule$1.evaluate(SystemPropertiesRestoreRule.java:53)
[junit4:junit4]   2> 	at org.apache.lucene.util.AbstractBeforeAfterRule$1.evaluate(AbstractBeforeAfterRule.java:45)
[junit4:junit4]   2> 	at org.apache.lucene.util.TestRuleStoreClassName$1.evaluate(TestRuleStoreClassName.java:42)
[junit4:junit4]   2> 	at com.carrotsearch.randomizedtesting.rules.SystemPropertiesInvariantRule$1.evaluate(SystemPropertiesInvariantRule.java:55)
[junit4:junit4]   2> 	at com.carrotsearch.randomizedtesting.rules.NoShadowingOrOverridesOnMethodsRule$1.evaluate(NoShadowingOrOverridesOnMethodsRule.java:39)
[junit4:junit4]   2> 	at com.carrotsearch.randomizedtesting.rules.NoShadowingOrOverridesOnMethodsRule$1.evaluate(NoShadowingOrOverridesOnMethodsRule.java:39)
[junit4:junit4]   2> 	at com.carrotsearch.randomizedtesting.rules.StatementAdapter.evaluate(StatementAdapter.java:36)
[junit4:junit4]   2> 	at org.apache.lucene.util.TestRuleAssertionsRequired$1.evaluate(TestRuleAssertionsRequired.java:43)
[junit4:junit4]   2> 	at org.apache.lucene.util.TestRuleMarkFailure$1.evaluate(TestRuleMarkFailure.java:48)
[junit4:junit4]   2> 	at org.apache.lucene.util.TestRuleIgnoreAfterMaxFailures$1.evaluate(TestRuleIgnoreAfterMaxFailures.java:70)
[junit4:junit4]   2> 	at org.apache.lucene.util.TestRuleIgnoreTestSuites$1.evaluate(TestRuleIgnoreTestSuites.java:55)
[junit4:junit4]   2> 	at com.carrotsearch.randomizedtesting.rules.StatementAdapter.evaluate(StatementAdapter.java:36)
[junit4:junit4]   2> 	at com.carrotsearch.randomizedtesting.ThreadLeakControl$StatementRunner.run(ThreadLeakControl.java:358)
[junit4:junit4]   2> 	at java.lang.Thread.run(Thread.java:722)
[junit4:junit4]   2> Caused by: java.io.IOException: Can't find resource 'stopwords.txt' in classpath or '/configs/conf1', cwd=/mnt/ssd/jenkins/workspace/Lucene-Solr-trunk-Linux/solr/build/solr-core/test/J1
[junit4:junit4]   2> 	at org.apache.solr.cloud.ZkSolrResourceLoader.openResource(ZkSolrResourceLoader.java:93)
[junit4:junit4]   2> 	at org.apache.lucene.analysis.util.AbstractAnalysisFactory.getLines(AbstractAnalysisFactory.java:163)
[junit4:junit4]   2> 	at org.apache.lucene.analysis.util.AbstractAnalysisFactory.getWordSet(AbstractAnalysisFactory.java:151)
[junit4:junit4]   2> 	at org.apache.lucene.analysis.core.StopFilterFactory.inform(StopFilterFactory.java:58)
[junit4:junit4]   2> 	at org.apache.solr.core.SolrResourceLoader.inform(SolrResourceLoader.java:611)
[junit4:junit4]   2> 	at org.apache.solr.schema.IndexSchema.<init>(IndexSchema.java:116)
[junit4:junit4]   2> 	... 44 more
[junit4:junit4]   2> 
[junit4:junit4]   2> 2318 T2603 oasc.CoreContainer.shutdown Shutting down CoreContainer instance=14726630
[junit4:junit4]   2> 2319 T2615 oasc.Overseer$ClusterStateUpdater.amILeader According to ZK I (id=88761804486017026-127.0.0.1:1661_solr-n_0000000000) am no longer a leader.
[junit4:junit4]   2> 2319 T2608 oazs.PrepRequestProcessor.pRequest2Txn Processed session termination for sessionid: 0x13b586412030002
[junit4:junit4]   2> 2320 T2605 oazs.NIOServerCnxn.closeSock Closed socket connection for client /127.0.0.1:57468 which had sessionid 0x13b586412030002
[junit4:junit4]   2> 2320 T2603 oaz.ZooKeeper.close Session: 0x13b586412030002 closed
[junit4:junit4]   2> 2320 T2619 oascc.ZkStateReader$3.process Updating live nodes... (2)
[junit4:junit4]   2> 2320 T2622 oascc.ZkStateReader$3.process Updating live nodes... (2)
[junit4:junit4]   2> 2320 T2603 oasc.CoreContainer.shutdown Shutting down CoreContainer instance=32021528
[junit4:junit4]   2> 2321 T2608 oazs.PrepRequestProcessor.pRequest Got user-level KeeperException when processing sessionid:0x13b586412030003 type:delete cxid:0x1b zxid:0x38 txntype:-1 reqpath:n/a Error Path:/solr/overseer_elect/leader Error:KeeperErrorCode = NoNode for /solr/overseer_elect/leader
[junit4:junit4]   2> 2321 T2608 oazs.PrepRequestProcessor.pRequest2Txn Processed session termination for sessionid: 0x13b586412030003
[junit4:junit4]   2> 2322 T2619 oascc.SolrZkClient.makePath makePath: /overseer_elect/leader
[junit4:junit4]   2> 2322 T2605 oazs.NIOServerCnxn.closeSock Closed socket connection for client /127.0.0.1:57471 which had sessionid 0x13b586412030003
[junit4:junit4]   2> 2322 T2603 oaz.ZooKeeper.close Session: 0x13b586412030003 closed
[junit4:junit4]   2> 2322 T2608 oazs.PrepRequestProcessor.pRequest Got user-level KeeperException when processing sessionid:0x13b586412030004 type:delete cxid:0x1a zxid:0x3a txntype:-1 reqpath:n/a Error Path:/solr/overseer_elect/leader Error:KeeperErrorCode = NoNode for /solr/overseer_elect/leader
[junit4:junit4]   2> 2322 T2603 oasc.CoreContainer.shutdown Shutting down CoreContainer instance=26221754
[junit4:junit4]   2> 2323 T2622 oascc.SolrZkClient.makePath makePath: /overseer_elect/leader
[junit4:junit4]   2> 2323 T2608 oazs.PrepRequestProcessor.pRequest2Txn Processed session termination for sessionid: 0x13b586412030004
[junit4:junit4]   2> 2323 T2605 oazs.NIOServerCnxn.closeSock Closed socket connection for client /127.0.0.1:57473 which had sessionid 0x13b586412030004
[junit4:junit4]   2> 2323 T2603 oaz.ZooKeeper.close Session: 0x13b586412030004 closed
[junit4:junit4]   2> 2324 T2603 oazs.ZooKeeperServer.shutdown shutting down
[junit4:junit4]   2> 2324 T2603 oazs.SessionTrackerImpl.shutdown Shutting down
[junit4:junit4]   2> 2325 T2603 oazs.PrepRequestProcessor.shutdown Shutting down
[junit4:junit4]   2> 2325 T2608 oazs.PrepRequestProcessor.run PrepRequestProcessor exited loop!
[junit4:junit4]   2> 2325 T2603 oazs.SyncRequestProcessor.shutdown Shutting down
[junit4:junit4]   2> 2326 T2607 oazs.SyncRequestProcessor.run SyncRequestProcessor exited!
[junit4:junit4]   2> 2326 T2603 oazs.FinalRequestProcessor.shutdown shutdown of request processor complete
[junit4:junit4]   2> 2327 T2603 oasc.ZkTestServer.send4LetterWord connecting to 127.0.0.1:60502 60502
[junit4:junit4]   2> 2328 T2605 oazs.NIOServerCnxnFactory.run NIOServerCnxn factory exited run method
[junit4:junit4]   2> 2328 T2603 oazs.ZooKeeperServer.shutdown shutting down
[junit4:junit4]   2> 2329 T2603 oazs.SessionTrackerImpl.shutdown Shutting down
[junit4:junit4]   2> 2329 T2603 oazs.PrepRequestProcessor.shutdown Shutting down
[junit4:junit4]   2> 2330 T2603 oazs.SyncRequestProcessor.shutdown Shutting down
[junit4:junit4]   2> 2330 T2603 oazs.FinalRequestProcessor.shutdown shutdown of request processor complete
[junit4:junit4]   2> 2330 T2603 oas.SolrTestCaseJ4.tearDown ###Ending testCoreRegistration
[junit4:junit4]   1> client port:0.0.0.0/0.0.0.0:0
[junit4:junit4]   2> NOTE: reproduce with: ant test  -Dtestcase=ClusterStateUpdateTest -Dtests.method=testCoreRegistration -Dtests.seed=2AA8C670B8754FDB -Dtests.multiplier=3 -Dtests.slow=true -Dtests.locale=ga_IE -Dtests.timezone=America/Glace_Bay -Dtests.file.encoding=UTF-8
[junit4:junit4] ERROR   2.38s J1 | ClusterStateUpdateTest.testCoreRegistration <<<
[junit4:junit4]    > Throwable #1: org.apache.solr.common.SolrException: Unable to create core: testcore
[junit4:junit4]    > 	at __randomizedtesting.SeedInfo.seed([2AA8C670B8754FDB:9423A0DFC10F41EE]:0)
[junit4:junit4]    > 	at org.apache.solr.core.CoreContainer.recordAndThrow(CoreContainer.java:1598)
[junit4:junit4]    > 	at org.apache.solr.core.CoreContainer.create(CoreContainer.java:1009)
[junit4:junit4]    > 	at org.apache.solr.cloud.ClusterStateUpdateTest.testCoreRegistration(ClusterStateUpdateTest.java:160)
[junit4:junit4]    > 	at sun.reflect.NativeMethodAccessorImpl.invoke0(Native Method)
[junit4:junit4]    > 	at sun.reflect.NativeMethodAccessorImpl.invoke(NativeMethodAccessorImpl.java:57)
[junit4:junit4]    > 	at sun.reflect.DelegatingMethodAccessorImpl.invoke(DelegatingMethodAccessorImpl.java:43)
[junit4:junit4]    > 	at java.lang.reflect.Method.invoke(Method.java:474)
[junit4:junit4]    > 	at com.carrotsearch.randomizedtesting.RandomizedRunner.invoke(RandomizedRunner.java:1559)
[junit4:junit4]    > 	at com.carrotsearch.randomizedtesting.RandomizedRunner.access$600(RandomizedRunner.java:79)
[junit4:junit4]    > 	at com.carrotsearch.randomizedtesting.RandomizedRunner$6.evaluate(RandomizedRunner.java:737)
[junit4:junit4]    > 	at com.carrotsearch.randomizedtesting.RandomizedRunner$7.evaluate(RandomizedRunner.java:773)
[junit4:junit4]    > 	at com.carrotsearch.randomizedtesting.RandomizedRunner$8.evaluate(RandomizedRunner.java:787)
[junit4:junit4]    > 	at com.carrotsearch.randomizedtesting.rules.SystemPropertiesRestoreRule$1.evaluate(SystemPropertiesRestoreRule.java:53)
[junit4:junit4]    > 	at org.apache.lucene.util.TestRuleSetupTeardownChained$1.evaluate(TestRuleSetupTeardownChained.java:50)
[junit4:junit4]    > 	at org.apache.lucene.util.TestRuleFieldCacheSanity$1.evaluate(TestRuleFieldCacheSanity.java:51)
[junit4:junit4]    > 	at org.apache.lucene.util.AbstractBeforeAfterRule$1.evaluate(AbstractBeforeAfterRule.java:45)
[junit4:junit4]    > 	at com.carrotsearch.randomizedtesting.rules.SystemPropertiesInvariantRule$1.evaluate(SystemPropertiesInvariantRule.java:55)
[junit4:junit4]    > 	at org.apache.lucene.util.TestRuleThreadAndTestName$1.evaluate(TestRuleThreadAndTestName.java:48)
[junit4:junit4]    > 	at org.apache.lucene.util.TestRuleIgnoreAfterMaxFailures$1.evaluate(TestRuleIgnoreAfterMaxFailures.java:70)
[junit4:junit4]    > 	at org.apache.lucene.util.TestRuleMarkFailure$1.evaluate(TestRuleMarkFailure.java:48)
[junit4:junit4]    > 	at com.carrotsearch.randomizedtesting.rules.StatementAdapter.evaluate(StatementAdapter.java:36)
[junit4:junit4]    > 	at com.carrotsearch.randomizedtesting.ThreadLeakControl$StatementRunner.run(ThreadLeakControl.java:358)
[junit4:junit4]    > 	at com.carrotsearch.randomizedtesting.ThreadLeakControl.forkTimeoutingTask(ThreadLeakControl.java:782)
[junit4:junit4]    > 	at com.carrotsearch.randomizedtesting.ThreadLeakControl$3.evaluate(ThreadLeakControl.java:442)
[junit4:junit4]    > 	at com.carrotsearch.randomizedtesting.RandomizedRunner.runSingleTest(RandomizedRunner.java:746)
[junit4:junit4]    > 	at com.carrotsearch.randomizedtesting.RandomizedRunner$3.evaluate(RandomizedRunner.java:648)
[junit4:junit4]    > 	at com.carrotsearch.randomizedtesting.RandomizedRunner$4.evaluate(RandomizedRunner.java:682)
[junit4:junit4]    > 	at com.carrotsearch.randomizedtesting.RandomizedRunner$5.evaluate(RandomizedRunner.java:693)
[junit4:junit4]    > 	at com.carrotsearch.randomizedtesting.rules.StatementAdapter.evaluate(StatementAdapter.java:36)
[junit4:junit4]    > 	at com.carrotsearch.randomizedtesting.rules.SystemPropertiesRestoreRule$1.evaluate(SystemPropertiesRestoreRule.java:53)
[junit4:junit4]    > 	at org.apache.lucene.util.AbstractBeforeAfterRule$1.evaluate(AbstractBeforeAfterRule.java:45)
[junit4:junit4]    > 	at org.apache.lucene.util.TestRuleStoreClassName$1.evaluate(TestRuleStoreClassName.java:42)
[junit4:junit4]    > 	at com.carrotsearch.randomizedtesting.rules.SystemPropertiesInvariantRule$1.evaluate(SystemPropertiesInvariantRule.java:55)
[junit4:junit4]    > 	at com.carrotsearch.randomizedtesting.rules.NoShadowingOrOverridesOnMethodsRule$1.evaluate(NoShadowingOrOverridesOnMethodsRule.java:39)
[junit4:junit4]    > 	at com.carrotsearch.randomizedtesting.rules.NoShadowingOrOverridesOnMethodsRule$1.evaluate(NoShadowingOrOverridesOnMethodsRule.java:39)
[junit4:junit4]    > 	at com.carrotsearch.randomizedtesting.rules.StatementAdapter.evaluate(StatementAdapter.java:36)
[junit4:junit4]    > 	at org.apache.lucene.util.TestRuleAssertionsRequired$1.evaluate(TestRuleAssertionsRequired.java:43)
[junit4:junit4]    > 	at org.apache.lucene.util.TestRuleMarkFailure$1.evaluate(TestRuleMarkFailure.java:48)
[junit4:junit4]    > 	at org.apache.lucene.util.TestRuleIgnoreAfterMaxFailures$1.evaluate(TestRuleIgnoreAfterMaxFailures.java:70)
[junit4:junit4]    > 	at org.apache.lucene.util.TestRuleIgnoreTestSuites$1.evaluate(TestRuleIgnoreTestSuites.java:55)
[junit4:junit4]    > 	at com.carrotsearch.randomizedtesting.rules.StatementAdapter.evaluate(StatementAdapter.java:36)
[junit4:junit4]    > 	at com.carrotsearch.randomizedtesting.ThreadLeakControl$StatementRunner.run(ThreadLeakControl.java:358)
[junit4:junit4]    > 	at java.lang.Thread.run(Thread.java:722)
[junit4:junit4]    > Caused by: java.lang.RuntimeException: java.io.IOException: Can't find resource 'stopwords.txt' in classpath or '/configs/conf1', cwd=/mnt/ssd/jenkins/workspace/Lucene-Solr-trunk-Linux/solr/build/solr-core/test/J1
[junit4:junit4]    > 	at org.apache.solr.schema.IndexSchema.<init>(IndexSchema.java:118)
[junit4:junit4]    > 	at org.apache.solr.core.CoreContainer.getSchemaFromZk(CoreContainer.java:1606)
[junit4:junit4]    > 	at org.apache.solr.core.CoreContainer.createFromZk(CoreContainer.java:918)
[junit4:junit4]    > 	at org.apache.solr.core.CoreContainer.create(CoreContainer.java:1001)
[junit4:junit4]    > 	... 41 more
[junit4:junit4]    > Caused by: java.io.IOException: Can't find resource 'stopwords.txt' in classpath or '/configs/conf1', cwd=/mnt/ssd/jenkins/workspace/Lucene-Solr-trunk-Linux/solr/build/solr-core/test/J1
[junit4:junit4]    > 	at org.apache.solr.cloud.ZkSolrResourceLoader.openResource(ZkSolrResourceLoader.java:93)
[junit4:junit4]    > 	at org.apache.lucene.analysis.util.AbstractAnalysisFactory.getLines(AbstractAnalysisFactory.java:163)
[junit4:junit4]    > 	at org.apache.lucene.analysis.util.AbstractAnalysisFactory.getWordSet(AbstractAnalysisFactory.java:151)
[junit4:junit4]    > 	at org.apache.lucene.analysis.core.StopFilterFactory.inform(StopFilterFactory.java:58)
[junit4:junit4]    > 	at org.apache.solr.core.SolrResourceLoader.inform(SolrResourceLoader.java:611)
[junit4:junit4]    > 	at org.apache.solr.schema.IndexSchema.<init>(IndexSchema.java:116)
[junit4:junit4]    > 	... 44 more
[junit4:junit4]   2> 2377 T2603 oas.SolrTestCaseJ4.deleteCore ###deleteCore
[junit4:junit4]   2> 2382 T2602 ccr.ThreadLeakControl.checkThreadLeaks WARNING Will linger awaiting termination of 7 leaked thread(s).
[junit4:junit4]   2> 2547 T2606 oazs.SessionTrackerImpl.run SessionTrackerImpl exited loop!
[junit4:junit4]   2> 3320 T2614 oascc.ZkStateReader$3.process WARNING ZooKeeper watch triggered, but Solr cannot talk to ZK
[junit4:junit4]   2> 3320 T2614 oaz.ClientCnxn$EventThread.run EventThread shut down
[junit4:junit4]   2> 3322 T2619 oasc.LeaderElector$1.process WARNING  org.apache.zookeeper.KeeperException$SessionExpiredException: KeeperErrorCode = Session expired for /overseer_elect
[junit4:junit4]   2> 	at org.apache.zookeeper.KeeperException.create(KeeperException.java:127)
[junit4:junit4]   2> 	at org.apache.zookeeper.KeeperException.create(KeeperException.java:51)
[junit4:junit4]   2> 	at org.apache.zookeeper.ZooKeeper.exists(ZooKeeper.java:1041)
[junit4:junit4]   2> 	at org.apache.solr.common.cloud.SolrZkClient$3.execute(SolrZkClient.java:176)
[junit4:junit4]   2> 	at org.apache.solr.common.cloud.SolrZkClient$3.execute(SolrZkClient.java:173)
[junit4:junit4]   2> 	at org.apache.solr.common.cloud.ZkCmdExecutor.retryOperation(ZkCmdExecutor.java:63)
[junit4:junit4]   2> 	at org.apache.solr.common.cloud.SolrZkClient.exists(SolrZkClient.java:173)
[junit4:junit4]   2> 	at org.apache.solr.common.cloud.SolrZkClient.makePath(SolrZkClient.java:384)
[junit4:junit4]   2> 	at org.apache.solr.common.cloud.SolrZkClient.makePath(SolrZkClient.java:353)
[junit4:junit4]   2> 	at org.apache.solr.common.cloud.SolrZkClient.makePath(SolrZkClient.java:340)
[junit4:junit4]   2> 	at org.apache.solr.cloud.OverseerElectionContext.runLeaderProcess(ElectionContext.java:394)
[junit4:junit4]   2> 	at org.apache.solr.cloud.LeaderElector.runIamLeaderProcess(LeaderElector.java:155)
[junit4:junit4]   2> 	at org.apache.solr.cloud.LeaderElector.checkIfIamLeader(LeaderElector.java:99)
[junit4:junit4]   2> 	at org.apache.solr.cloud.LeaderElector.access$000(LeaderElector.java:55)
[junit4:junit4]   2> 	at org.apache.solr.cloud.LeaderElector$1.process(LeaderElector.java:128)
[junit4:junit4]   2> 	at org.apache.zookeeper.ClientCnxn$EventThread.processEvent(ClientCnxn.java:519)
[junit4:junit4]   2> 	at org.apache.zookeeper.ClientCnxn$EventThread.run(ClientCnxn.java:495)
[junit4:junit4]   2> 
[junit4:junit4]   2> 3323 T2619 oascc.ZkStateReader$3.process WARNING ZooKeeper watch triggered, but Solr cannot talk to ZK
[junit4:junit4]   2> 3323 T2619 oaz.ClientCnxn$EventThread.run EventThread shut down
[junit4:junit4]   2> 3323 T2622 oasc.LeaderElector$1.process WARNING  org.apache.zookeeper.KeeperException$SessionExpiredException: KeeperErrorCode = Session expired for /overseer_elect
[junit4:junit4]   2> 	at org.apache.zookeeper.KeeperException.create(KeeperException.java:127)
[junit4:junit4]   2> 	at org.apache.zookeeper.KeeperException.create(KeeperException.java:51)
[junit4:junit4]   2> 	at org.apache.zookeeper.ZooKeeper.exists(ZooKeeper.java:1041)
[junit4:junit4]   2> 	at org.apache.solr.common.cloud.SolrZkClient$3.execute(SolrZkClient.java:176)
[junit4:junit4]   2> 	at org.apache.solr.common.cloud.SolrZkClient$3.execute(SolrZkClient.java:173)
[junit4:junit4]   2> 	at org.apache.solr.common.cloud.ZkCmdExecutor.retryOperation(ZkCmdExecutor.java:63)
[junit4:junit4]   2> 	at org.apache.solr.common.cloud.SolrZkClient.exists(SolrZkClient.java:173)
[junit4:junit4]   2> 	at org.apache.solr.common.cloud.SolrZkClient.makePath(SolrZkClient.java:384)
[junit4:junit4]   2> 	at org.apache.solr.common.cloud.SolrZkClient.makePath(SolrZkClient.java:353)
[junit4:junit4]   2> 	at org.apache.solr.common.cloud.SolrZkClient.makePath(SolrZkClient.java:340)
[junit4:junit4]   2> 	at org.apache.solr.cloud.OverseerElectionContext.runLeaderProcess(ElectionContext.java:394)
[junit4:junit4]   2> 	at org.apache.solr.cloud.LeaderElector.runIamLeaderProcess(LeaderElector.java:155)
[junit4:junit4]   2> 	at org.apache.solr.cloud.LeaderElector.checkIfIamLeader(LeaderElector.java:99)
[junit4:junit4]   2> 	at org.apache.solr.cloud.LeaderElector.access$000(LeaderElector.java:55)
[junit4:junit4]   2> 	at org.apache.solr.cloud.LeaderElector$1.process(LeaderElector.java:128)
[junit4:junit4]   2> 	at org.apache.zookeeper.ClientCnxn$EventThread.processEvent(ClientCnxn.java:519)
[junit4:junit4]   2> 	at org.apache.zookeeper.ClientCnxn$EventThread.run(ClientCnxn.java:495)
[junit4:junit4]   2> 
[junit4:junit4]   2> 3324 T2622 oascc.ZkStateReader$3.process WARNING ZooKeeper watch triggered, but Solr cannot talk to ZK
[junit4:junit4]   2> 3324 T2622 oaz.ClientCnxn$EventThread.run EventThread shut down
[junit4:junit4]   2> NOTE: test params are: codec=Lucene41: {}, sim=RandomSimilarityProvider(queryNorm=false,coord=yes): {}, locale=ga_IE, timezone=America/Glace_Bay
[junit4:junit4]   2> NOTE: Linux 3.2.0-34-generic i386/Oracle Corporation 1.8.0-ea (32-bit)/cpus=8,threads=1,free=135122008,total=440729600
[junit4:junit4]   2> NOTE: All tests run in this JVM: [TestAnalyzedSuggestions, DisMaxRequestHandlerTest, SuggesterTest, LukeRequestHandlerTest, XmlUpdateRequestHandlerTest, TestPluginEnable, LeaderElectionTest, DOMUtilTest, IndexSchemaRuntimeFieldTest, ConvertedLegacyTest, PrimUtilsTest, PrimitiveFieldTypeTest, ZkNodePropsTest, TestBM25SimilarityFactory, TestHashPartitioner, LegacyHTMLStripCharFilterTest, ReturnFieldsTest, TestBinaryField, TestReversedWildcardFilterFactory, SolrIndexConfigTest, TestPropInject, TestStressVersions, TestSort, TestSolrJ, XsltUpdateRequestHandlerTest, DistributedQueryElevationComponentTest, RequiredFieldsTest, TestDocSet, TestSolrIndexConfig, TestWriterPerf, TestRecovery, StatelessScriptUpdateProcessorFactoryTest, TestDFRSimilarityFactory, RAMDirectoryFactoryTest, FullSolrCloudDistribCmdsTest, TermVectorComponentTest, MultiTermTest, TestDistributedSearch, TestDocumentBuilder, TestSurroundQueryParser, PingRequestHandlerTest, TestUtils, TestFastOutputStream, BadIndexSchemaTest, TestValueSourceCache, TestMergePolicyConfig, TestMultiCoreConfBootstrap, OpenExchangeRatesOrgProviderTest, TestSolrCoreProperties, UUIDFieldTest, ShowFileRequestHandlerTest, TestOmitPositions, SignatureUpdateProcessorFactoryTest, OutputWriterTest, TestCSVResponseWriter, TestQuerySenderListener, OverseerTest, RecoveryZkTest, TestReplicationHandler, LeaderElectionIntegrationTest, DistributedSpellCheckComponentTest, TestRealTimeGet, ZkControllerTest, TestDistributedGrouping, TestRandomFaceting, BasicZkTest, WordBreakSolrSpellCheckerTest, StatsComponentTest, SolrCoreTest, IndexBasedSpellCheckerTest, TestRangeQuery, DirectUpdateHandlerTest, SimpleFacetsTest, TestCoreContainer, TestGroupingSearch, DirectSolrSpellCheckerTest, TestFiltering, TestIndexSearcher, TestFunctionQuery, PolyFieldTest, DocumentBuilderTest, IndexSchemaTest, BinaryUpdateRequestHandlerTest, DistanceFunctionTest, MinimalSchemaTest, TestQueryTypes, SuggesterWFSTTest, DocumentAnalysisRequestHandlerTest, SolrPluginUtilsTest, JSONWriterTest, CopyFieldTest, TestQueryUtils, SuggesterTSTTest, NotRequiredUniqueKeyTest, TestSolrDeletionPolicy1, AlternateDirectoryTest, BadComponentTest, TestUpdate, DefaultValueUpdateProcessorTest, TestLFUCache, IndexReaderFactoryTest, SpellPossibilityIteratorTest, TestPerFieldSimilarity, TestDefaultSimilarityFactory, TestFastLRUCache, ResourceLoaderTest, TestSystemIdResolver, DateFieldTest, PathHierarchyTokenizerFactoryTest, ClusterStateUpdateTest]
[junit4:junit4] Completed on J1 in 3.40s, 1 test, 1 error <<< FAILURES!

[...truncated 45 lines...]
BUILD FAILED
/mnt/ssd/jenkins/workspace/Lucene-Solr-trunk-Linux/build.xml:335: The following error occurred while executing this line:
/mnt/ssd/jenkins/workspace/Lucene-Solr-trunk-Linux/build.xml:39: The following error occurred while executing this line:
/mnt/ssd/jenkins/workspace/Lucene-Solr-trunk-Linux/solr/build.xml:178: The following error occurred while executing this line:
/mnt/ssd/jenkins/workspace/Lucene-Solr-trunk-Linux/solr/common-build.xml:438: The following error occurred while executing this line:
/mnt/ssd/jenkins/workspace/Lucene-Solr-trunk-Linux/lucene/common-build.xml:1163: The following error occurred while executing this line:
/mnt/ssd/jenkins/workspace/Lucene-Solr-trunk-Linux/lucene/common-build.xml:827: There were test failures: 236 suites, 980 tests, 1 error, 7 ignored (2 assumptions)

Total time: 24 minutes 24 seconds
Build step 'Invoke Ant' marked build as failure
Archiving artifacts
Recording test results
Description set: Java: 32bit/jdk1.8.0-ea-b65 -client -XX:+UseParallelGC
Email was triggered for: Failure
Sending email for trigger: Failure



Mime
View raw message