lucene-dev mailing list archives

Site index · List index
Message view « Date » · « Thread »
Top « Date » · « Thread »
From Policeman Jenkins Server <jenk...@sd-datasolutions.de>
Subject [JENKINS] Lucene-Solr-4.x-Windows (32bit/jdk1.6.0_37) - Build # 2150 - Still Failing!
Date Wed, 12 Dec 2012 22:02:05 GMT
Build: http://jenkins.sd-datasolutions.de/job/Lucene-Solr-4.x-Windows/2150/
Java: 32bit/jdk1.6.0_37 -server -XX:+UseConcMarkSweepGC

3 tests failed.
FAILED:  org.apache.solr.cloud.SyncSliceTest.testDistribSearch

Error Message:
There are still nodes recoverying - waited for 180 seconds

Stack Trace:
java.lang.AssertionError: There are still nodes recoverying - waited for 180 seconds
	at __randomizedtesting.SeedInfo.seed([10347BB4AA212E87:91D2F5ACDD7E4EBB]:0)
	at org.junit.Assert.fail(Assert.java:93)
	at org.apache.solr.cloud.AbstractDistribZkTestBase.waitForRecoveriesToFinish(AbstractDistribZkTestBase.java:165)
	at org.apache.solr.cloud.AbstractDistribZkTestBase.waitForRecoveriesToFinish(AbstractDistribZkTestBase.java:115)
	at org.apache.solr.cloud.AbstractDistribZkTestBase.waitForRecoveriesToFinish(AbstractDistribZkTestBase.java:110)
	at org.apache.solr.cloud.AbstractFullDistribZkTestBase.waitForRecoveriesToFinish(AbstractFullDistribZkTestBase.java:563)
	at org.apache.solr.cloud.SyncSliceTest.doTest(SyncSliceTest.java:224)
	at org.apache.solr.BaseDistributedSearchTestCase.testDistribSearch(BaseDistributedSearchTestCase.java:697)
	at sun.reflect.NativeMethodAccessorImpl.invoke0(Native Method)
	at sun.reflect.NativeMethodAccessorImpl.invoke(NativeMethodAccessorImpl.java:39)
	at sun.reflect.DelegatingMethodAccessorImpl.invoke(DelegatingMethodAccessorImpl.java:25)
	at java.lang.reflect.Method.invoke(Method.java:597)
	at com.carrotsearch.randomizedtesting.RandomizedRunner.invoke(RandomizedRunner.java:1559)
	at com.carrotsearch.randomizedtesting.RandomizedRunner.access$600(RandomizedRunner.java:79)
	at com.carrotsearch.randomizedtesting.RandomizedRunner$6.evaluate(RandomizedRunner.java:737)
	at com.carrotsearch.randomizedtesting.RandomizedRunner$7.evaluate(RandomizedRunner.java:773)
	at com.carrotsearch.randomizedtesting.RandomizedRunner$8.evaluate(RandomizedRunner.java:787)
	at com.carrotsearch.randomizedtesting.rules.SystemPropertiesRestoreRule$1.evaluate(SystemPropertiesRestoreRule.java:53)
	at org.apache.lucene.util.TestRuleSetupTeardownChained$1.evaluate(TestRuleSetupTeardownChained.java:50)
	at org.apache.lucene.util.TestRuleFieldCacheSanity$1.evaluate(TestRuleFieldCacheSanity.java:51)
	at org.apache.lucene.util.AbstractBeforeAfterRule$1.evaluate(AbstractBeforeAfterRule.java:46)
	at com.carrotsearch.randomizedtesting.rules.SystemPropertiesInvariantRule$1.evaluate(SystemPropertiesInvariantRule.java:55)
	at org.apache.lucene.util.TestRuleThreadAndTestName$1.evaluate(TestRuleThreadAndTestName.java:49)
	at org.apache.lucene.util.TestRuleIgnoreAfterMaxFailures$1.evaluate(TestRuleIgnoreAfterMaxFailures.java:70)
	at org.apache.lucene.util.TestRuleMarkFailure$1.evaluate(TestRuleMarkFailure.java:48)
	at com.carrotsearch.randomizedtesting.rules.StatementAdapter.evaluate(StatementAdapter.java:36)
	at com.carrotsearch.randomizedtesting.ThreadLeakControl$StatementRunner.run(ThreadLeakControl.java:358)
	at com.carrotsearch.randomizedtesting.ThreadLeakControl.forkTimeoutingTask(ThreadLeakControl.java:782)
	at com.carrotsearch.randomizedtesting.ThreadLeakControl$3.evaluate(ThreadLeakControl.java:442)
	at com.carrotsearch.randomizedtesting.RandomizedRunner.runSingleTest(RandomizedRunner.java:746)
	at com.carrotsearch.randomizedtesting.RandomizedRunner$3.evaluate(RandomizedRunner.java:648)
	at com.carrotsearch.randomizedtesting.RandomizedRunner$4.evaluate(RandomizedRunner.java:682)
	at com.carrotsearch.randomizedtesting.RandomizedRunner$5.evaluate(RandomizedRunner.java:693)
	at com.carrotsearch.randomizedtesting.rules.StatementAdapter.evaluate(StatementAdapter.java:36)
	at com.carrotsearch.randomizedtesting.rules.SystemPropertiesRestoreRule$1.evaluate(SystemPropertiesRestoreRule.java:53)
	at org.apache.lucene.util.AbstractBeforeAfterRule$1.evaluate(AbstractBeforeAfterRule.java:46)
	at org.apache.lucene.util.TestRuleStoreClassName$1.evaluate(TestRuleStoreClassName.java:42)
	at com.carrotsearch.randomizedtesting.rules.SystemPropertiesInvariantRule$1.evaluate(SystemPropertiesInvariantRule.java:55)
	at com.carrotsearch.randomizedtesting.rules.NoShadowingOrOverridesOnMethodsRule$1.evaluate(NoShadowingOrOverridesOnMethodsRule.java:39)
	at com.carrotsearch.randomizedtesting.rules.NoShadowingOrOverridesOnMethodsRule$1.evaluate(NoShadowingOrOverridesOnMethodsRule.java:39)
	at com.carrotsearch.randomizedtesting.rules.StatementAdapter.evaluate(StatementAdapter.java:36)
	at org.apache.lucene.util.TestRuleAssertionsRequired$1.evaluate(TestRuleAssertionsRequired.java:43)
	at org.apache.lucene.util.TestRuleMarkFailure$1.evaluate(TestRuleMarkFailure.java:48)
	at org.apache.lucene.util.TestRuleIgnoreAfterMaxFailures$1.evaluate(TestRuleIgnoreAfterMaxFailures.java:70)
	at org.apache.lucene.util.TestRuleIgnoreTestSuites$1.evaluate(TestRuleIgnoreTestSuites.java:55)
	at com.carrotsearch.randomizedtesting.rules.StatementAdapter.evaluate(StatementAdapter.java:36)
	at com.carrotsearch.randomizedtesting.ThreadLeakControl$StatementRunner.run(ThreadLeakControl.java:358)
	at java.lang.Thread.run(Thread.java:662)


FAILED:  org.apache.solr.cloud.BasicDistributedZk2Test.testDistribSearch

Error Message:
There are still nodes recoverying - waited for 180 seconds

Stack Trace:
java.lang.AssertionError: There are still nodes recoverying - waited for 180 seconds
	at __randomizedtesting.SeedInfo.seed([10347BB4AA212E87:91D2F5ACDD7E4EBB]:0)
	at org.junit.Assert.fail(Assert.java:93)
	at org.apache.solr.cloud.AbstractDistribZkTestBase.waitForRecoveriesToFinish(AbstractDistribZkTestBase.java:165)
	at org.apache.solr.cloud.AbstractDistribZkTestBase.waitForRecoveriesToFinish(AbstractDistribZkTestBase.java:115)
	at org.apache.solr.cloud.AbstractDistribZkTestBase.waitForRecoveriesToFinish(AbstractDistribZkTestBase.java:110)
	at org.apache.solr.cloud.AbstractFullDistribZkTestBase.waitForRecoveriesToFinish(AbstractFullDistribZkTestBase.java:563)
	at org.apache.solr.cloud.BasicDistributedZk2Test.brindDownShardIndexSomeDocsAndRecover(BasicDistributedZk2Test.java:321)
	at org.apache.solr.cloud.BasicDistributedZk2Test.doTest(BasicDistributedZk2Test.java:83)
	at org.apache.solr.BaseDistributedSearchTestCase.testDistribSearch(BaseDistributedSearchTestCase.java:697)
	at sun.reflect.NativeMethodAccessorImpl.invoke0(Native Method)
	at sun.reflect.NativeMethodAccessorImpl.invoke(NativeMethodAccessorImpl.java:39)
	at sun.reflect.DelegatingMethodAccessorImpl.invoke(DelegatingMethodAccessorImpl.java:25)
	at java.lang.reflect.Method.invoke(Method.java:597)
	at com.carrotsearch.randomizedtesting.RandomizedRunner.invoke(RandomizedRunner.java:1559)
	at com.carrotsearch.randomizedtesting.RandomizedRunner.access$600(RandomizedRunner.java:79)
	at com.carrotsearch.randomizedtesting.RandomizedRunner$6.evaluate(RandomizedRunner.java:737)
	at com.carrotsearch.randomizedtesting.RandomizedRunner$7.evaluate(RandomizedRunner.java:773)
	at com.carrotsearch.randomizedtesting.RandomizedRunner$8.evaluate(RandomizedRunner.java:787)
	at com.carrotsearch.randomizedtesting.rules.SystemPropertiesRestoreRule$1.evaluate(SystemPropertiesRestoreRule.java:53)
	at org.apache.lucene.util.TestRuleSetupTeardownChained$1.evaluate(TestRuleSetupTeardownChained.java:50)
	at org.apache.lucene.util.TestRuleFieldCacheSanity$1.evaluate(TestRuleFieldCacheSanity.java:51)
	at org.apache.lucene.util.AbstractBeforeAfterRule$1.evaluate(AbstractBeforeAfterRule.java:46)
	at com.carrotsearch.randomizedtesting.rules.SystemPropertiesInvariantRule$1.evaluate(SystemPropertiesInvariantRule.java:55)
	at org.apache.lucene.util.TestRuleThreadAndTestName$1.evaluate(TestRuleThreadAndTestName.java:49)
	at org.apache.lucene.util.TestRuleIgnoreAfterMaxFailures$1.evaluate(TestRuleIgnoreAfterMaxFailures.java:70)
	at org.apache.lucene.util.TestRuleMarkFailure$1.evaluate(TestRuleMarkFailure.java:48)
	at com.carrotsearch.randomizedtesting.rules.StatementAdapter.evaluate(StatementAdapter.java:36)
	at com.carrotsearch.randomizedtesting.ThreadLeakControl$StatementRunner.run(ThreadLeakControl.java:358)
	at com.carrotsearch.randomizedtesting.ThreadLeakControl.forkTimeoutingTask(ThreadLeakControl.java:782)
	at com.carrotsearch.randomizedtesting.ThreadLeakControl$3.evaluate(ThreadLeakControl.java:442)
	at com.carrotsearch.randomizedtesting.RandomizedRunner.runSingleTest(RandomizedRunner.java:746)
	at com.carrotsearch.randomizedtesting.RandomizedRunner$3.evaluate(RandomizedRunner.java:648)
	at com.carrotsearch.randomizedtesting.RandomizedRunner$4.evaluate(RandomizedRunner.java:682)
	at com.carrotsearch.randomizedtesting.RandomizedRunner$5.evaluate(RandomizedRunner.java:693)
	at com.carrotsearch.randomizedtesting.rules.StatementAdapter.evaluate(StatementAdapter.java:36)
	at com.carrotsearch.randomizedtesting.rules.SystemPropertiesRestoreRule$1.evaluate(SystemPropertiesRestoreRule.java:53)
	at org.apache.lucene.util.AbstractBeforeAfterRule$1.evaluate(AbstractBeforeAfterRule.java:46)
	at org.apache.lucene.util.TestRuleStoreClassName$1.evaluate(TestRuleStoreClassName.java:42)
	at com.carrotsearch.randomizedtesting.rules.SystemPropertiesInvariantRule$1.evaluate(SystemPropertiesInvariantRule.java:55)
	at com.carrotsearch.randomizedtesting.rules.NoShadowingOrOverridesOnMethodsRule$1.evaluate(NoShadowingOrOverridesOnMethodsRule.java:39)
	at com.carrotsearch.randomizedtesting.rules.NoShadowingOrOverridesOnMethodsRule$1.evaluate(NoShadowingOrOverridesOnMethodsRule.java:39)
	at com.carrotsearch.randomizedtesting.rules.StatementAdapter.evaluate(StatementAdapter.java:36)
	at org.apache.lucene.util.TestRuleAssertionsRequired$1.evaluate(TestRuleAssertionsRequired.java:43)
	at org.apache.lucene.util.TestRuleMarkFailure$1.evaluate(TestRuleMarkFailure.java:48)
	at org.apache.lucene.util.TestRuleIgnoreAfterMaxFailures$1.evaluate(TestRuleIgnoreAfterMaxFailures.java:70)
	at org.apache.lucene.util.TestRuleIgnoreTestSuites$1.evaluate(TestRuleIgnoreTestSuites.java:55)
	at com.carrotsearch.randomizedtesting.rules.StatementAdapter.evaluate(StatementAdapter.java:36)
	at com.carrotsearch.randomizedtesting.ThreadLeakControl$StatementRunner.run(ThreadLeakControl.java:358)
	at java.lang.Thread.run(Thread.java:662)


FAILED:  org.apache.solr.cloud.BasicDistributedZkTest.testDistribSearch

Error Message:
Server at http://127.0.0.1:61174/solr returned non ok status:500, message:Server Error

Stack Trace:
org.apache.solr.common.SolrException: Server at http://127.0.0.1:61174/solr returned non ok status:500, message:Server Error
	at __randomizedtesting.SeedInfo.seed([10347BB4AA212E87:91D2F5ACDD7E4EBB]:0)
	at org.apache.solr.client.solrj.impl.HttpSolrServer.request(HttpSolrServer.java:372)
	at org.apache.solr.client.solrj.impl.HttpSolrServer.request(HttpSolrServer.java:181)
	at org.apache.solr.client.solrj.request.CoreAdminRequest.process(CoreAdminRequest.java:429)
	at org.apache.solr.client.solrj.request.CoreAdminRequest.getStatus(CoreAdminRequest.java:472)
	at org.apache.solr.cloud.BasicDistributedZkTest.collectStartTimes(BasicDistributedZkTest.java:959)
	at org.apache.solr.cloud.BasicDistributedZkTest.testCollectionsAPI(BasicDistributedZkTest.java:795)
	at org.apache.solr.cloud.BasicDistributedZkTest.doTest(BasicDistributedZkTest.java:343)
	at org.apache.solr.BaseDistributedSearchTestCase.testDistribSearch(BaseDistributedSearchTestCase.java:697)
	at sun.reflect.NativeMethodAccessorImpl.invoke0(Native Method)
	at sun.reflect.NativeMethodAccessorImpl.invoke(NativeMethodAccessorImpl.java:39)
	at sun.reflect.DelegatingMethodAccessorImpl.invoke(DelegatingMethodAccessorImpl.java:25)
	at java.lang.reflect.Method.invoke(Method.java:597)
	at com.carrotsearch.randomizedtesting.RandomizedRunner.invoke(RandomizedRunner.java:1559)
	at com.carrotsearch.randomizedtesting.RandomizedRunner.access$600(RandomizedRunner.java:79)
	at com.carrotsearch.randomizedtesting.RandomizedRunner$6.evaluate(RandomizedRunner.java:737)
	at com.carrotsearch.randomizedtesting.RandomizedRunner$7.evaluate(RandomizedRunner.java:773)
	at com.carrotsearch.randomizedtesting.RandomizedRunner$8.evaluate(RandomizedRunner.java:787)
	at com.carrotsearch.randomizedtesting.rules.SystemPropertiesRestoreRule$1.evaluate(SystemPropertiesRestoreRule.java:53)
	at org.apache.lucene.util.TestRuleSetupTeardownChained$1.evaluate(TestRuleSetupTeardownChained.java:50)
	at org.apache.lucene.util.TestRuleFieldCacheSanity$1.evaluate(TestRuleFieldCacheSanity.java:51)
	at org.apache.lucene.util.AbstractBeforeAfterRule$1.evaluate(AbstractBeforeAfterRule.java:46)
	at com.carrotsearch.randomizedtesting.rules.SystemPropertiesInvariantRule$1.evaluate(SystemPropertiesInvariantRule.java:55)
	at org.apache.lucene.util.TestRuleThreadAndTestName$1.evaluate(TestRuleThreadAndTestName.java:49)
	at org.apache.lucene.util.TestRuleIgnoreAfterMaxFailures$1.evaluate(TestRuleIgnoreAfterMaxFailures.java:70)
	at org.apache.lucene.util.TestRuleMarkFailure$1.evaluate(TestRuleMarkFailure.java:48)
	at com.carrotsearch.randomizedtesting.rules.StatementAdapter.evaluate(StatementAdapter.java:36)
	at com.carrotsearch.randomizedtesting.ThreadLeakControl$StatementRunner.run(ThreadLeakControl.java:358)
	at com.carrotsearch.randomizedtesting.ThreadLeakControl.forkTimeoutingTask(ThreadLeakControl.java:782)
	at com.carrotsearch.randomizedtesting.ThreadLeakControl$3.evaluate(ThreadLeakControl.java:442)
	at com.carrotsearch.randomizedtesting.RandomizedRunner.runSingleTest(RandomizedRunner.java:746)
	at com.carrotsearch.randomizedtesting.RandomizedRunner$3.evaluate(RandomizedRunner.java:648)
	at com.carrotsearch.randomizedtesting.RandomizedRunner$4.evaluate(RandomizedRunner.java:682)
	at com.carrotsearch.randomizedtesting.RandomizedRunner$5.evaluate(RandomizedRunner.java:693)
	at com.carrotsearch.randomizedtesting.rules.StatementAdapter.evaluate(StatementAdapter.java:36)
	at com.carrotsearch.randomizedtesting.rules.SystemPropertiesRestoreRule$1.evaluate(SystemPropertiesRestoreRule.java:53)
	at org.apache.lucene.util.AbstractBeforeAfterRule$1.evaluate(AbstractBeforeAfterRule.java:46)
	at org.apache.lucene.util.TestRuleStoreClassName$1.evaluate(TestRuleStoreClassName.java:42)
	at com.carrotsearch.randomizedtesting.rules.SystemPropertiesInvariantRule$1.evaluate(SystemPropertiesInvariantRule.java:55)
	at com.carrotsearch.randomizedtesting.rules.NoShadowingOrOverridesOnMethodsRule$1.evaluate(NoShadowingOrOverridesOnMethodsRule.java:39)
	at com.carrotsearch.randomizedtesting.rules.NoShadowingOrOverridesOnMethodsRule$1.evaluate(NoShadowingOrOverridesOnMethodsRule.java:39)
	at com.carrotsearch.randomizedtesting.rules.StatementAdapter.evaluate(StatementAdapter.java:36)
	at org.apache.lucene.util.TestRuleAssertionsRequired$1.evaluate(TestRuleAssertionsRequired.java:43)
	at org.apache.lucene.util.TestRuleMarkFailure$1.evaluate(TestRuleMarkFailure.java:48)
	at org.apache.lucene.util.TestRuleIgnoreAfterMaxFailures$1.evaluate(TestRuleIgnoreAfterMaxFailures.java:70)
	at org.apache.lucene.util.TestRuleIgnoreTestSuites$1.evaluate(TestRuleIgnoreTestSuites.java:55)
	at com.carrotsearch.randomizedtesting.rules.StatementAdapter.evaluate(StatementAdapter.java:36)
	at com.carrotsearch.randomizedtesting.ThreadLeakControl$StatementRunner.run(ThreadLeakControl.java:358)
	at java.lang.Thread.run(Thread.java:662)




Build Log:
[...truncated 8206 lines...]
[junit4:junit4] Suite: org.apache.solr.cloud.BasicDistributedZkTest
[junit4:junit4]   2> 0 T1373 oas.SolrTestCaseJ4.setUp ###Starting testDistribSearch
[junit4:junit4]   2> Creating dataDir: C:\Users\JenkinsSlave\workspace\Lucene-Solr-4.x-Windows\solr\build\solr-core\test\J0\.\solrtest-BasicDistributedZkTest-1355348510767
[junit4:junit4]   2> 0 T1373 oasc.ZkTestServer.run STARTING ZK TEST SERVER
[junit4:junit4]   2> 0 T1374 oasc.ZkTestServer$ZKServerMain.runFromConfig Starting server
[junit4:junit4]   2> 13 T1374 oazs.ZooKeeperServer.setTickTime tickTime set to 1000
[junit4:junit4]   2> 13 T1374 oazs.ZooKeeperServer.setMinSessionTimeout minSessionTimeout set to -1
[junit4:junit4]   2> 13 T1374 oazs.ZooKeeperServer.setMaxSessionTimeout maxSessionTimeout set to -1
[junit4:junit4]   2> 13 T1374 oazs.NIOServerCnxnFactory.configure binding to port 0.0.0.0/0.0.0.0:0
[junit4:junit4]   2> 13 T1374 oazsp.FileTxnSnapLog.save Snapshotting: 0x0 to C:\Users\JenkinsSlave\workspace\Lucene-Solr-4.x-Windows\solr\build\solr-core\test\J0\.\org.apache.solr.cloud.BasicDistributedZkTest-1355348510767\zookeeper\server1\data\version-2\snapshot.0
[junit4:junit4]   2> 96 T1373 oasc.ZkTestServer.run start zk server on port:61158
[junit4:junit4]   2> 96 T1373 oaz.ZooKeeper.<init> Initiating client connection, connectString=127.0.0.1:61158 sessionTimeout=10000 watcher=org.apache.solr.common.cloud.ConnectionManager@483d2
[junit4:junit4]   2> 96 T1373 oascc.ConnectionManager.waitForConnected Waiting for client to connect to ZooKeeper
[junit4:junit4]   2> 96 T1379 oaz.ClientCnxn$SendThread.logStartConnect Opening socket connection to server 127.0.0.1/127.0.0.1:61158. Will not attempt to authenticate using SASL (access denied (javax.security.auth.AuthPermission getLoginConfiguration))
[junit4:junit4]   2> 96 T1379 oaz.ClientCnxn$SendThread.primeConnection Socket connection established to 127.0.0.1/127.0.0.1:61158, initiating session
[junit4:junit4]   2> 96 T1375 oazs.NIOServerCnxnFactory.run Accepted socket connection from /127.0.0.1:61161
[junit4:junit4]   2> 96 T1375 oazs.ZooKeeperServer.processConnectRequest Client attempting to establish new session at /127.0.0.1:61161
[junit4:junit4]   2> 96 T1377 oazsp.FileTxnLog.append Creating new log file: log.1
[junit4:junit4]   2> 109 T1377 oazs.ZooKeeperServer.finishSessionInit Established session 0x13b9111083c0000 with negotiated timeout 10000 for client /127.0.0.1:61161
[junit4:junit4]   2> 109 T1379 oaz.ClientCnxn$SendThread.onConnected Session establishment complete on server 127.0.0.1/127.0.0.1:61158, sessionid = 0x13b9111083c0000, negotiated timeout = 10000
[junit4:junit4]   2> 109 T1380 oascc.ConnectionManager.process Watcher org.apache.solr.common.cloud.ConnectionManager@483d2 name:ZooKeeperConnection Watcher:127.0.0.1:61158 got event WatchedEvent state:SyncConnected type:None path:null path:null type:None
[junit4:junit4]   2> 109 T1373 oascc.ConnectionManager.waitForConnected Client is connected to ZooKeeper
[junit4:junit4]   2> 109 T1373 oascc.SolrZkClient.makePath makePath: /solr
[junit4:junit4]   2> 109 T1378 oazs.PrepRequestProcessor.pRequest2Txn Processed session termination for sessionid: 0x13b9111083c0000
[junit4:junit4]   2> 109 T1380 oaz.ClientCnxn$EventThread.run EventThread shut down
[junit4:junit4]   2> 109 T1375 oazs.NIOServerCnxn.doIO WARNING caught end of stream exception EndOfStreamException: Unable to read additional data from client sessionid 0x13b9111083c0000, likely client has closed socket
[junit4:junit4]   2> 	at org.apache.zookeeper.server.NIOServerCnxn.doIO(NIOServerCnxn.java:220)
[junit4:junit4]   2> 	at org.apache.zookeeper.server.NIOServerCnxnFactory.run(NIOServerCnxnFactory.java:208)
[junit4:junit4]   2> 	at java.lang.Thread.run(Thread.java:662)
[junit4:junit4]   2> 
[junit4:junit4]   2> 109 T1373 oaz.ZooKeeper.close Session: 0x13b9111083c0000 closed
[junit4:junit4]   2> 109 T1373 oaz.ZooKeeper.<init> Initiating client connection, connectString=127.0.0.1:61158/solr sessionTimeout=10000 watcher=org.apache.solr.common.cloud.ConnectionManager@dfec91
[junit4:junit4]   2> 109 T1375 oazs.NIOServerCnxn.closeSock Closed socket connection for client /127.0.0.1:61161 which had sessionid 0x13b9111083c0000
[junit4:junit4]   2> 109 T1373 oascc.ConnectionManager.waitForConnected Waiting for client to connect to ZooKeeper
[junit4:junit4]   2> 123 T1381 oaz.ClientCnxn$SendThread.logStartConnect Opening socket connection to server 127.0.0.1/127.0.0.1:61158. Will not attempt to authenticate using SASL (access denied (javax.security.auth.AuthPermission getLoginConfiguration))
[junit4:junit4]   2> 123 T1381 oaz.ClientCnxn$SendThread.primeConnection Socket connection established to 127.0.0.1/127.0.0.1:61158, initiating session
[junit4:junit4]   2> 123 T1375 oazs.NIOServerCnxnFactory.run Accepted socket connection from /127.0.0.1:61164
[junit4:junit4]   2> 123 T1375 oazs.ZooKeeperServer.processConnectRequest Client attempting to establish new session at /127.0.0.1:61164
[junit4:junit4]   2> 123 T1377 oazs.ZooKeeperServer.finishSessionInit Established session 0x13b9111083c0001 with negotiated timeout 10000 for client /127.0.0.1:61164
[junit4:junit4]   2> 123 T1381 oaz.ClientCnxn$SendThread.onConnected Session establishment complete on server 127.0.0.1/127.0.0.1:61158, sessionid = 0x13b9111083c0001, negotiated timeout = 10000
[junit4:junit4]   2> 123 T1382 oascc.ConnectionManager.process Watcher org.apache.solr.common.cloud.ConnectionManager@dfec91 name:ZooKeeperConnection Watcher:127.0.0.1:61158/solr got event WatchedEvent state:SyncConnected type:None path:null path:null type:None
[junit4:junit4]   2> 123 T1373 oascc.ConnectionManager.waitForConnected Client is connected to ZooKeeper
[junit4:junit4]   2> 123 T1373 oascc.SolrZkClient.makePath makePath: /collections/collection1
[junit4:junit4]   2> 123 T1373 oascc.SolrZkClient.makePath makePath: /collections/collection1/shards
[junit4:junit4]   2> 137 T1373 oascc.SolrZkClient.makePath makePath: /collections/control_collection
[junit4:junit4]   2> 137 T1373 oascc.SolrZkClient.makePath makePath: /collections/control_collection/shards
[junit4:junit4]   2> 137 T1373 oasc.AbstractZkTestCase.putConfig put C:\Users\JenkinsSlave\workspace\Lucene-Solr-4.x-Windows\solr\build\solr-core\test-files\solr\collection1\conf\solrconfig.xml to /configs/conf1/solrconfig.xml
[junit4:junit4]   2> 137 T1373 oascc.SolrZkClient.makePath makePath: /configs/conf1/solrconfig.xml
[junit4:junit4]   2> 151 T1373 oasc.AbstractZkTestCase.putConfig put C:\Users\JenkinsSlave\workspace\Lucene-Solr-4.x-Windows\solr\build\solr-core\test-files\solr\collection1\conf\schema.xml to /configs/conf1/schema.xml
[junit4:junit4]   2> 151 T1373 oascc.SolrZkClient.makePath makePath: /configs/conf1/schema.xml
[junit4:junit4]   2> 151 T1373 oasc.AbstractZkTestCase.putConfig put C:\Users\JenkinsSlave\workspace\Lucene-Solr-4.x-Windows\solr\build\solr-core\test-files\solr\collection1\conf\solrconfig.xml to /configs/conf1/solrconfig.xml
[junit4:junit4]   2> 151 T1373 oascc.SolrZkClient.makePath makePath: /configs/conf1/solrconfig.xml
[junit4:junit4]   2> 151 T1373 oasc.AbstractZkTestCase.putConfig put C:\Users\JenkinsSlave\workspace\Lucene-Solr-4.x-Windows\solr\build\solr-core\test-files\solr\collection1\conf\stopwords.txt to /configs/conf1/stopwords.txt
[junit4:junit4]   2> 164 T1373 oascc.SolrZkClient.makePath makePath: /configs/conf1/stopwords.txt
[junit4:junit4]   2> 164 T1373 oasc.AbstractZkTestCase.putConfig put C:\Users\JenkinsSlave\workspace\Lucene-Solr-4.x-Windows\solr\build\solr-core\test-files\solr\collection1\conf\protwords.txt to /configs/conf1/protwords.txt
[junit4:junit4]   2> 164 T1373 oascc.SolrZkClient.makePath makePath: /configs/conf1/protwords.txt
[junit4:junit4]   2> 164 T1373 oasc.AbstractZkTestCase.putConfig put C:\Users\JenkinsSlave\workspace\Lucene-Solr-4.x-Windows\solr\build\solr-core\test-files\solr\collection1\conf\currency.xml to /configs/conf1/currency.xml
[junit4:junit4]   2> 164 T1373 oascc.SolrZkClient.makePath makePath: /configs/conf1/currency.xml
[junit4:junit4]   2> 178 T1373 oasc.AbstractZkTestCase.putConfig put C:\Users\JenkinsSlave\workspace\Lucene-Solr-4.x-Windows\solr\build\solr-core\test-files\solr\collection1\conf\open-exchange-rates.json to /configs/conf1/open-exchange-rates.json
[junit4:junit4]   2> 178 T1373 oascc.SolrZkClient.makePath makePath: /configs/conf1/open-exchange-rates.json
[junit4:junit4]   2> 178 T1373 oasc.AbstractZkTestCase.putConfig put C:\Users\JenkinsSlave\workspace\Lucene-Solr-4.x-Windows\solr\build\solr-core\test-files\solr\collection1\conf\mapping-ISOLatin1Accent.txt to /configs/conf1/mapping-ISOLatin1Accent.txt
[junit4:junit4]   2> 178 T1373 oascc.SolrZkClient.makePath makePath: /configs/conf1/mapping-ISOLatin1Accent.txt
[junit4:junit4]   2> 192 T1373 oasc.AbstractZkTestCase.putConfig put C:\Users\JenkinsSlave\workspace\Lucene-Solr-4.x-Windows\solr\build\solr-core\test-files\solr\collection1\conf\old_synonyms.txt to /configs/conf1/old_synonyms.txt
[junit4:junit4]   2> 192 T1373 oascc.SolrZkClient.makePath makePath: /configs/conf1/old_synonyms.txt
[junit4:junit4]   2> 192 T1373 oasc.AbstractZkTestCase.putConfig put C:\Users\JenkinsSlave\workspace\Lucene-Solr-4.x-Windows\solr\build\solr-core\test-files\solr\collection1\conf\synonyms.txt to /configs/conf1/synonyms.txt
[junit4:junit4]   2> 192 T1373 oascc.SolrZkClient.makePath makePath: /configs/conf1/synonyms.txt
[junit4:junit4]   2> 192 T1378 oazs.PrepRequestProcessor.pRequest2Txn Processed session termination for sessionid: 0x13b9111083c0001
[junit4:junit4]   2> 192 T1382 oaz.ClientCnxn$EventThread.run EventThread shut down
[junit4:junit4]   2> 192 T1375 oazs.NIOServerCnxn.doIO WARNING caught end of stream exception EndOfStreamException: Unable to read additional data from client sessionid 0x13b9111083c0001, likely client has closed socket
[junit4:junit4]   2> 	at org.apache.zookeeper.server.NIOServerCnxn.doIO(NIOServerCnxn.java:220)
[junit4:junit4]   2> 	at org.apache.zookeeper.server.NIOServerCnxnFactory.run(NIOServerCnxnFactory.java:208)
[junit4:junit4]   2> 	at java.lang.Thread.run(Thread.java:662)
[junit4:junit4]   2> 
[junit4:junit4]   2> 205 T1373 oaz.ZooKeeper.close Session: 0x13b9111083c0001 closed
[junit4:junit4]   2> 205 T1375 oazs.NIOServerCnxn.closeSock Closed socket connection for client /127.0.0.1:61164 which had sessionid 0x13b9111083c0001
[junit4:junit4]   2> 452 T1373 oejs.Server.doStart jetty-8.1.8.v20121106
[junit4:junit4]   2> 452 T1373 oejs.AbstractConnector.doStart Started SelectChannelConnector@0.0.0.0:61165
[junit4:junit4]   2> 452 T1373 oasc.SolrResourceLoader.locateSolrHome JNDI not configured for solr (NoInitialContextEx)
[junit4:junit4]   2> 452 T1373 oasc.SolrResourceLoader.locateSolrHome using system property solr.solr.home: C:\Users\JenkinsSlave\workspace\Lucene-Solr-4.x-Windows\solr\build\solr-core\test\J0\.\org.apache.solr.cloud.BasicDistributedZkTest-controljetty-1355348510972
[junit4:junit4]   2> 452 T1373 oasc.SolrResourceLoader.<init> new SolrResourceLoader for deduced Solr Home: 'C:\Users\JenkinsSlave\workspace\Lucene-Solr-4.x-Windows\solr\build\solr-core\test\J0\.\org.apache.solr.cloud.BasicDistributedZkTest-controljetty-1355348510972\'
[junit4:junit4]   2> 480 T1373 oass.SolrDispatchFilter.init SolrDispatchFilter.init()
[junit4:junit4]   2> 480 T1373 oasc.SolrResourceLoader.locateSolrHome JNDI not configured for solr (NoInitialContextEx)
[junit4:junit4]   2> 493 T1373 oasc.SolrResourceLoader.locateSolrHome using system property solr.solr.home: C:\Users\JenkinsSlave\workspace\Lucene-Solr-4.x-Windows\solr\build\solr-core\test\J0\.\org.apache.solr.cloud.BasicDistributedZkTest-controljetty-1355348510972
[junit4:junit4]   2> 493 T1373 oasc.CoreContainer$Initializer.initialize looking for solr.xml: C:\Users\JenkinsSlave\workspace\Lucene-Solr-4.x-Windows\solr\build\solr-core\test\J0\.\org.apache.solr.cloud.BasicDistributedZkTest-controljetty-1355348510972\solr.xml
[junit4:junit4]   2> 493 T1373 oasc.CoreContainer.<init> New CoreContainer 21489029
[junit4:junit4]   2> 493 T1373 oasc.CoreContainer.load Loading CoreContainer using Solr Home: 'C:\Users\JenkinsSlave\workspace\Lucene-Solr-4.x-Windows\solr\build\solr-core\test\J0\.\org.apache.solr.cloud.BasicDistributedZkTest-controljetty-1355348510972\'
[junit4:junit4]   2> 493 T1373 oasc.SolrResourceLoader.<init> new SolrResourceLoader for directory: 'C:\Users\JenkinsSlave\workspace\Lucene-Solr-4.x-Windows\solr\build\solr-core\test\J0\.\org.apache.solr.cloud.BasicDistributedZkTest-controljetty-1355348510972\'
[junit4:junit4]   2> 507 T1373 oasc.CoreContainer.load Registering Log Listener
[junit4:junit4]   2> 535 T1373 oasc.CoreContainer.initZooKeeper Zookeeper client=127.0.0.1:61158/solr
[junit4:junit4]   2> 535 T1373 oasc.ZkController.checkChrootPath zkHost includes chroot
[junit4:junit4]   2> 535 T1373 oaz.ZooKeeper.<init> Initiating client connection, connectString=127.0.0.1:61158 sessionTimeout=60000 watcher=org.apache.solr.common.cloud.ConnectionManager@160bd25
[junit4:junit4]   2> 535 T1373 oascc.ConnectionManager.waitForConnected Waiting for client to connect to ZooKeeper
[junit4:junit4]   2> 535 T1392 oaz.ClientCnxn$SendThread.logStartConnect Opening socket connection to server 127.0.0.1/127.0.0.1:61158. Will not attempt to authenticate using SASL (access denied (javax.security.auth.AuthPermission getLoginConfiguration))
[junit4:junit4]   2> 535 T1392 oaz.ClientCnxn$SendThread.primeConnection Socket connection established to 127.0.0.1/127.0.0.1:61158, initiating session
[junit4:junit4]   2> 535 T1375 oazs.NIOServerCnxnFactory.run Accepted socket connection from /127.0.0.1:61170
[junit4:junit4]   2> 535 T1375 oazs.ZooKeeperServer.processConnectRequest Client attempting to establish new session at /127.0.0.1:61170
[junit4:junit4]   2> 548 T1377 oazs.ZooKeeperServer.finishSessionInit Established session 0x13b9111083c0002 with negotiated timeout 20000 for client /127.0.0.1:61170
[junit4:junit4]   2> 548 T1392 oaz.ClientCnxn$SendThread.onConnected Session establishment complete on server 127.0.0.1/127.0.0.1:61158, sessionid = 0x13b9111083c0002, negotiated timeout = 20000
[junit4:junit4]   2> 548 T1393 oascc.ConnectionManager.process Watcher org.apache.solr.common.cloud.ConnectionManager@160bd25 name:ZooKeeperConnection Watcher:127.0.0.1:61158 got event WatchedEvent state:SyncConnected type:None path:null path:null type:None
[junit4:junit4]   2> 548 T1373 oascc.ConnectionManager.waitForConnected Client is connected to ZooKeeper
[junit4:junit4]   2> 548 T1378 oazs.PrepRequestProcessor.pRequest2Txn Processed session termination for sessionid: 0x13b9111083c0002
[junit4:junit4]   2> 548 T1373 oaz.ZooKeeper.close Session: 0x13b9111083c0002 closed
[junit4:junit4]   2> 548 T1393 oaz.ClientCnxn$EventThread.run EventThread shut down
[junit4:junit4]   2> 548 T1375 oazs.NIOServerCnxn.closeSock Closed socket connection for client /127.0.0.1:61170 which had sessionid 0x13b9111083c0002
[junit4:junit4]   2> 548 T1373 oaz.ZooKeeper.<init> Initiating client connection, connectString=127.0.0.1:61158/solr sessionTimeout=8000 watcher=org.apache.solr.common.cloud.ConnectionManager@11f1b43
[junit4:junit4]   2> 548 T1373 oascc.ConnectionManager.waitForConnected Waiting for client to connect to ZooKeeper
[junit4:junit4]   2> 548 T1394 oaz.ClientCnxn$SendThread.logStartConnect Opening socket connection to server 127.0.0.1/127.0.0.1:61158. Will not attempt to authenticate using SASL (access denied (javax.security.auth.AuthPermission getLoginConfiguration))
[junit4:junit4]   2> 548 T1394 oaz.ClientCnxn$SendThread.primeConnection Socket connection established to 127.0.0.1/127.0.0.1:61158, initiating session
[junit4:junit4]   2> 548 T1375 oazs.NIOServerCnxnFactory.run Accepted socket connection from /127.0.0.1:61173
[junit4:junit4]   2> 548 T1375 oazs.ZooKeeperServer.processConnectRequest Client attempting to establish new session at /127.0.0.1:61173
[junit4:junit4]   2> 548 T1377 oazs.ZooKeeperServer.finishSessionInit Established session 0x13b9111083c0003 with negotiated timeout 8000 for client /127.0.0.1:61173
[junit4:junit4]   2> 548 T1394 oaz.ClientCnxn$SendThread.onConnected Session establishment complete on server 127.0.0.1/127.0.0.1:61158, sessionid = 0x13b9111083c0003, negotiated timeout = 8000
[junit4:junit4]   2> 548 T1395 oascc.ConnectionManager.process Watcher org.apache.solr.common.cloud.ConnectionManager@11f1b43 name:ZooKeeperConnection Watcher:127.0.0.1:61158/solr got event WatchedEvent state:SyncConnected type:None path:null path:null type:None
[junit4:junit4]   2> 548 T1373 oascc.ConnectionManager.waitForConnected Client is connected to ZooKeeper
[junit4:junit4]   2> 562 T1378 oazs.PrepRequestProcessor.pRequest Got user-level KeeperException when processing sessionid:0x13b9111083c0003 type:create cxid:0x2 zxid:0x1b txntype:-1 reqpath:n/a Error Path:/solr/overseer Error:KeeperErrorCode = NodeExists for /solr/overseer
[junit4:junit4]   2> 562 T1373 oascc.SolrZkClient.makePath makePath: /live_nodes
[junit4:junit4]   2> 562 T1373 oasc.ZkController.createEphemeralLiveNode Register node as live in ZooKeeper:/live_nodes/127.0.0.1:61165_solr
[junit4:junit4]   2> 562 T1378 oazs.PrepRequestProcessor.pRequest Got user-level KeeperException when processing sessionid:0x13b9111083c0003 type:delete cxid:0x7 zxid:0x1d txntype:-1 reqpath:n/a Error Path:/solr/live_nodes/127.0.0.1:61165_solr Error:KeeperErrorCode = NoNode for /solr/live_nodes/127.0.0.1:61165_solr
[junit4:junit4]   2> 562 T1373 oascc.SolrZkClient.makePath makePath: /live_nodes/127.0.0.1:61165_solr
[junit4:junit4]   2> 576 T1373 oashc.HttpShardHandlerFactory.getParameter Setting socketTimeout to: 0
[junit4:junit4]   2> 576 T1373 oashc.HttpShardHandlerFactory.getParameter Setting urlScheme to: http://
[junit4:junit4]   2> 576 T1373 oashc.HttpShardHandlerFactory.getParameter Setting connTimeout to: 0
[junit4:junit4]   2> 576 T1373 oashc.HttpShardHandlerFactory.getParameter Setting maxConnectionsPerHost to: 20
[junit4:junit4]   2> 576 T1373 oashc.HttpShardHandlerFactory.getParameter Setting corePoolSize to: 0
[junit4:junit4]   2> 576 T1373 oashc.HttpShardHandlerFactory.getParameter Setting maximumPoolSize to: 2147483647
[junit4:junit4]   2> 576 T1373 oashc.HttpShardHandlerFactory.getParameter Setting maxThreadIdleTime to: 5
[junit4:junit4]   2> 576 T1373 oashc.HttpShardHandlerFactory.getParameter Setting sizeOfQueue to: -1
[junit4:junit4]   2> 576 T1373 oashc.HttpShardHandlerFactory.getParameter Setting fairnessPolicy to: false
[junit4:junit4]   2> 576 T1373 oascsi.HttpClientUtil.createClient Creating new http client, config:maxConnectionsPerHost=20&maxConnections=10000&socketTimeout=0&connTimeout=0&retry=false
[junit4:junit4]   2> 589 T1373 oascc.SolrZkClient.makePath makePath: /overseer_elect/election
[junit4:junit4]   2> 589 T1378 oazs.PrepRequestProcessor.pRequest Got user-level KeeperException when processing sessionid:0x13b9111083c0003 type:delete cxid:0x15 zxid:0x22 txntype:-1 reqpath:n/a Error Path:/solr/overseer_elect/leader Error:KeeperErrorCode = NoNode for /solr/overseer_elect/leader
[junit4:junit4]   2> 589 T1373 oascc.SolrZkClient.makePath makePath: /overseer_elect/leader
[junit4:junit4]   2> 603 T1373 oasc.Overseer.start Overseer (id=88824120002478083-127.0.0.1:61165_solr-n_0000000000) starting
[junit4:junit4]   2> 603 T1378 oazs.PrepRequestProcessor.pRequest Got user-level KeeperException when processing sessionid:0x13b9111083c0003 type:create cxid:0x1a zxid:0x24 txntype:-1 reqpath:n/a Error Path:/solr/overseer Error:KeeperErrorCode = NodeExists for /solr/overseer
[junit4:junit4]   2> 603 T1378 oazs.PrepRequestProcessor.pRequest Got user-level KeeperException when processing sessionid:0x13b9111083c0003 type:create cxid:0x1b zxid:0x25 txntype:-1 reqpath:n/a Error Path:/solr/overseer Error:KeeperErrorCode = NodeExists for /solr/overseer
[junit4:junit4]   2> 603 T1378 oazs.PrepRequestProcessor.pRequest Got user-level KeeperException when processing sessionid:0x13b9111083c0003 type:create cxid:0x1c zxid:0x26 txntype:-1 reqpath:n/a Error Path:/solr/overseer Error:KeeperErrorCode = NodeExists for /solr/overseer
[junit4:junit4]   2> 617 T1378 oazs.PrepRequestProcessor.pRequest Got user-level KeeperException when processing sessionid:0x13b9111083c0003 type:create cxid:0x1d zxid:0x27 txntype:-1 reqpath:n/a Error Path:/solr/overseer Error:KeeperErrorCode = NodeExists for /solr/overseer
[junit4:junit4]   2> 617 T1397 oasc.OverseerCollectionProcessor.run Process current queue of collection messages
[junit4:junit4]   2> 617 T1373 oascc.SolrZkClient.makePath makePath: /clusterstate.json
[junit4:junit4]   2> 630 T1373 oascc.ZkStateReader.createClusterStateWatchersAndUpdate Updating cluster state from ZooKeeper... 
[junit4:junit4]   2> 630 T1396 oasc.Overseer$ClusterStateUpdater.run Starting to work on the main queue
[junit4:junit4]   2> 630 T1398 oasc.CoreContainer.create Creating SolrCore 'collection1' using instanceDir: C:\Users\JenkinsSlave\workspace\Lucene-Solr-4.x-Windows\solr\build\solr-core\test\J0\.\org.apache.solr.cloud.BasicDistributedZkTest-controljetty-1355348510972\collection1
[junit4:junit4]   2> 630 T1398 oasc.ZkController.createCollectionZkNode Check for collection zkNode:control_collection
[junit4:junit4]   2> 630 T1398 oasc.ZkController.createCollectionZkNode Collection zkNode exists
[junit4:junit4]   2> 630 T1398 oasc.ZkController.readConfigName Load collection config from:/collections/control_collection
[junit4:junit4]   2> 630 T1398 oasc.SolrResourceLoader.<init> new SolrResourceLoader for directory: 'C:\Users\JenkinsSlave\workspace\Lucene-Solr-4.x-Windows\solr\build\solr-core\test\J0\.\org.apache.solr.cloud.BasicDistributedZkTest-controljetty-1355348510972\collection1\'
[junit4:junit4]   2> 644 T1398 oasc.SolrResourceLoader.replaceClassLoader Adding 'file:/C:/Users/JenkinsSlave/workspace/Lucene-Solr-4.x-Windows/solr/build/solr-core/test/J0/org.apache.solr.cloud.BasicDistributedZkTest-controljetty-1355348510972/collection1/lib/classes/' to classloader
[junit4:junit4]   2> 644 T1398 oasc.SolrResourceLoader.replaceClassLoader Adding 'file:/C:/Users/JenkinsSlave/workspace/Lucene-Solr-4.x-Windows/solr/build/solr-core/test/J0/org.apache.solr.cloud.BasicDistributedZkTest-controljetty-1355348510972/collection1/lib/README' to classloader
[junit4:junit4]   2> 685 T1398 oasc.SolrConfig.<init> Using Lucene MatchVersion: LUCENE_41
[junit4:junit4]   2> 754 T1398 oasc.SolrConfig.<init> Loaded SolrConfig: solrconfig.xml
[junit4:junit4]   2> 754 T1398 oass.IndexSchema.readSchema Reading Solr Schema
[junit4:junit4]   2> 768 T1398 oass.IndexSchema.readSchema Schema name=test
[junit4:junit4]   2> 1345 T1398 oass.OpenExchangeRatesOrgProvider.init Initialized with rates=open-exchange-rates.json, refreshInterval=1440.
[junit4:junit4]   2> 1360 T1398 oass.IndexSchema.readSchema default search field in schema is text
[junit4:junit4]   2> 1360 T1398 oass.IndexSchema.readSchema unique key field: id
[junit4:junit4]   2> 1375 T1398 oass.FileExchangeRateProvider.reload Reloading exchange rates from file currency.xml
[junit4:junit4]   2> 1390 T1398 oass.FileExchangeRateProvider.reload Reloading exchange rates from file currency.xml
[junit4:junit4]   2> 1390 T1398 oass.OpenExchangeRatesOrgProvider.reload Reloading exchange rates from open-exchange-rates.json
[junit4:junit4]   2> 1390 T1398 oass.OpenExchangeRatesOrgProvider.reload Reloading exchange rates from open-exchange-rates.json
[junit4:junit4]   2> 1390 T1398 oasc.SolrCore.<init> [collection1] Opening new SolrCore at C:\Users\JenkinsSlave\workspace\Lucene-Solr-4.x-Windows\solr\build\solr-core\test\J0\.\org.apache.solr.cloud.BasicDistributedZkTest-controljetty-1355348510972\collection1\, dataDir=.\org.apache.solr.cloud.BasicDistributedZkTest-1355348510767/control/data\
[junit4:junit4]   2> 1390 T1398 oasc.JmxMonitoredMap.<init> JMX monitoring is enabled. Adding Solr mbeans to JMX Server: com.sun.jmx.mbeanserver.JmxMBeanServer@1759d12
[junit4:junit4]   2> 1390 T1398 oasc.SolrCore.getNewIndexDir New index directory detected: old=null new=.\org.apache.solr.cloud.BasicDistributedZkTest-1355348510767/control/data\index/
[junit4:junit4]   2> 1390 T1398 oasc.SolrCore.initIndex WARNING [collection1] Solr index directory '.\org.apache.solr.cloud.BasicDistributedZkTest-1355348510767\control\data\index' doesn't exist. Creating new index...
[junit4:junit4]   2> 1405 T1398 oasc.CachingDirectoryFactory.get return new directory for C:\Users\JenkinsSlave\workspace\Lucene-Solr-4.x-Windows\solr\build\solr-core\test\J0\.\org.apache.solr.cloud.BasicDistributedZkTest-1355348510767\control\data\index forceNew:false
[junit4:junit4]   2> 1405 T1398 oasc.SolrDeletionPolicy.onCommit SolrDeletionPolicy.onCommit: commits:num=1
[junit4:junit4]   2> 		commit{dir=RateLimitedDirectoryWrapper(NRTCachingDirectory(org.apache.lucene.store.SimpleFSDirectory@C:\Users\JenkinsSlave\workspace\Lucene-Solr-4.x-Windows\solr\build\solr-core\test\J0\org.apache.solr.cloud.BasicDistributedZkTest-1355348510767\control\data\index lockFactory=org.apache.lucene.store.NativeFSLockFactory@a9fac1; maxCacheMB=48.0 maxMergeSizeMB=4.0)),segFN=segments_1,generation=1,filenames=[segments_1]
[junit4:junit4]   2> 1405 T1398 oasc.SolrDeletionPolicy.updateCommits newest commit = 1
[junit4:junit4]   2> 1420 T1398 oasc.SolrCore.initWriters created xml: solr.XMLResponseWriter
[junit4:junit4]   2> 1420 T1398 oasup.UpdateRequestProcessorChain.init inserting DistributedUpdateProcessorFactory into updateRequestProcessorChain "dedupe"
[junit4:junit4]   2> 1420 T1398 oasup.UpdateRequestProcessorChain.init inserting DistributedUpdateProcessorFactory into updateRequestProcessorChain "dedupe-allfields"
[junit4:junit4]   2> 1420 T1398 oasup.UpdateRequestProcessorChain.init inserting DistributedUpdateProcessorFactory into updateRequestProcessorChain "stored_sig"
[junit4:junit4]   2> 1420 T1398 oasup.UpdateRequestProcessorChain.init inserting DistributedUpdateProcessorFactory into updateRequestProcessorChain "uniq-fields"
[junit4:junit4]   2> 1420 T1398 oasup.UpdateRequestProcessorChain.init inserting DistributedUpdateProcessorFactory into updateRequestProcessorChain "distrib-dup-test-chain-implicit"
[junit4:junit4]   2> 1420 T1398 oasc.RequestHandlers.initHandlersFromConfig adding lazy requestHandler: solr.ReplicationHandler
[junit4:junit4]   2> 1420 T1398 oasc.RequestHandlers.initHandlersFromConfig created /replication: solr.ReplicationHandler
[junit4:junit4]   2> 1420 T1398 oasc.RequestHandlers.initHandlersFromConfig created standard: solr.StandardRequestHandler
[junit4:junit4]   2> 1420 T1398 oasc.RequestHandlers.initHandlersFromConfig created /get: solr.RealTimeGetHandler
[junit4:junit4]   2> 1420 T1398 oasc.RequestHandlers.initHandlersFromConfig created dismax: solr.SearchHandler
[junit4:junit4]   2> 1420 T1398 oasc.RequestHandlers.initHandlersFromConfig created mock: org.apache.solr.core.MockQuerySenderListenerReqHandler
[junit4:junit4]   2> 1420 T1398 oasc.RequestHandlers.initHandlersFromConfig created /admin/: org.apache.solr.handler.admin.AdminHandlers
[junit4:junit4]   2> 1420 T1398 oasc.RequestHandlers.initHandlersFromConfig created defaults: solr.StandardRequestHandler
[junit4:junit4]   2> 1420 T1398 oasc.RequestHandlers.initHandlersFromConfig adding lazy requestHandler: solr.StandardRequestHandler
[junit4:junit4]   2> 1420 T1398 oasc.RequestHandlers.initHandlersFromConfig created lazy: solr.StandardRequestHandler
[junit4:junit4]   2> 1420 T1398 oasc.RequestHandlers.initHandlersFromConfig created /update: solr.UpdateRequestHandler
[junit4:junit4]   2> 1420 T1398 oasc.RequestHandlers.initHandlersFromConfig created /terms: org.apache.solr.handler.component.SearchHandler
[junit4:junit4]   2> 1420 T1398 oasc.RequestHandlers.initHandlersFromConfig created spellCheckCompRH: org.apache.solr.handler.component.SearchHandler
[junit4:junit4]   2> 1420 T1398 oasc.RequestHandlers.initHandlersFromConfig created spellCheckCompRH_Direct: org.apache.solr.handler.component.SearchHandler
[junit4:junit4]   2> 1420 T1398 oasc.RequestHandlers.initHandlersFromConfig created spellCheckWithWordbreak: org.apache.solr.handler.component.SearchHandler
[junit4:junit4]   2> 1420 T1398 oasc.RequestHandlers.initHandlersFromConfig created spellCheckWithWordbreak_Direct: org.apache.solr.handler.component.SearchHandler
[junit4:junit4]   2> 1435 T1398 oasc.RequestHandlers.initHandlersFromConfig created spellCheckCompRH1: org.apache.solr.handler.component.SearchHandler
[junit4:junit4]   2> 1435 T1398 oasc.RequestHandlers.initHandlersFromConfig created tvrh: org.apache.solr.handler.component.SearchHandler
[junit4:junit4]   2> 1435 T1398 oasc.RequestHandlers.initHandlersFromConfig created /mlt: solr.MoreLikeThisHandler
[junit4:junit4]   2> 1435 T1398 oasc.RequestHandlers.initHandlersFromConfig created /debug/dump: solr.DumpRequestHandler
[junit4:junit4]   2> 1435 T1398 oashl.XMLLoader.init xsltCacheLifetimeSeconds=60
[junit4:junit4]   2> 1435 T1398 oasc.SolrCore.initDeprecatedSupport WARNING solrconfig.xml uses deprecated <admin/gettableFiles>, Please update your config to use the ShowFileRequestHandler.
[junit4:junit4]   2> 1435 T1398 oasc.SolrCore.initDeprecatedSupport WARNING adding ShowFileRequestHandler with hidden files: [SCHEMA.XML, OLD_SYNONYMS.TXT, STOPWORDS.TXT, PROTWORDS.TXT, OPEN-EXCHANGE-RATES.JSON, SYNONYMS.TXT, CURRENCY.XML, MAPPING-ISOLATIN1ACCENT.TXT]
[junit4:junit4]   2> 1450 T1398 oass.SolrIndexSearcher.<init> Opening Searcher@e97557 main
[junit4:junit4]   2> 1450 T1398 oass.SolrIndexSearcher.getIndexDir WARNING WARNING: Directory impl does not support setting indexDir: org.apache.lucene.store.RateLimitedDirectoryWrapper
[junit4:junit4]   2> 1450 T1398 oasu.CommitTracker.<init> Hard AutoCommit: disabled
[junit4:junit4]   2> 1450 T1398 oasu.CommitTracker.<init> Soft AutoCommit: disabled
[junit4:junit4]   2> 1450 T1398 oashc.SpellCheckComponent.inform Initializing spell checkers
[junit4:junit4]   2> 1465 T1398 oass.DirectSolrSpellChecker.init init: {name=direct,classname=DirectSolrSpellChecker,field=lowerfilt,minQueryLength=3}
[junit4:junit4]   2> 1511 T1399 oasc.SolrCore.registerSearcher [collection1] Registered new searcher Searcher@e97557 main{StandardDirectoryReader(segments_1:1)}
[junit4:junit4]   2> 1511 T1398 oasc.ZkController.publish publishing core=collection1 state=down
[junit4:junit4]   2> 1511 T1398 oasc.ZkController.publish numShards not found on descriptor - reading it from system property
[junit4:junit4]   2> 1511 T1378 oazs.PrepRequestProcessor.pRequest Got user-level KeeperException when processing sessionid:0x13b9111083c0003 type:create cxid:0x53 zxid:0x2a txntype:-1 reqpath:n/a Error Path:/solr/overseer/queue Error:KeeperErrorCode = NoNode for /solr/overseer/queue
[junit4:junit4]   2> 1526 T1398 oasc.CoreContainer.register registering core: collection1
[junit4:junit4]   2> 1526 T1398 oasc.ZkController.register Register shard - core:collection1 address:http://127.0.0.1:61165/solr shardId:control_shard
[junit4:junit4]   2> 1526 T1398 oascc.SolrZkClient.makePath makePath: /collections/control_collection/leader_elect/control_shard/election
[junit4:junit4]   2> 1541 T1396 oascc.ZkStateReader.updateClusterState Updating cloud state from ZooKeeper... 
[junit4:junit4]   2> 1541 T1378 oazs.PrepRequestProcessor.pRequest Got user-level KeeperException when processing sessionid:0x13b9111083c0003 type:delete cxid:0x67 zxid:0x31 txntype:-1 reqpath:n/a Error Path:/solr/collections/control_collection/leaders Error:KeeperErrorCode = NoNode for /solr/collections/control_collection/leaders
[junit4:junit4]   2> 1541 T1396 oasc.Overseer$ClusterStateUpdater.updateState Update state numShards=null message={
[junit4:junit4]   2> 	  "operation":"state",
[junit4:junit4]   2> 	  "numShards":null,
[junit4:junit4]   2> 	  "shard":"control_shard",
[junit4:junit4]   2> 	  "roles":null,
[junit4:junit4]   2> 	  "state":"down",
[junit4:junit4]   2> 	  "core":"collection1",
[junit4:junit4]   2> 	  "collection":"control_collection",
[junit4:junit4]   2> 	  "node_name":"127.0.0.1:61165_solr",
[junit4:junit4]   2> 	  "base_url":"http://127.0.0.1:61165/solr"}
[junit4:junit4]   2> 1541 T1378 oazs.PrepRequestProcessor.pRequest Got user-level KeeperException when processing sessionid:0x13b9111083c0003 type:create cxid:0x68 zxid:0x32 txntype:-1 reqpath:n/a Error Path:/solr/overseer/queue-work Error:KeeperErrorCode = NoNode for /solr/overseer/queue-work
[junit4:junit4]   2> 1541 T1398 oasc.ShardLeaderElectionContext.runLeaderProcess Running the leader process.
[junit4:junit4]   2> 1541 T1378 oazs.PrepRequestProcessor.pRequest Got user-level KeeperException when processing sessionid:0x13b9111083c0003 type:create cxid:0x69 zxid:0x33 txntype:-1 reqpath:n/a Error Path:/solr/overseer Error:KeeperErrorCode = NodeExists for /solr/overseer
[junit4:junit4]   2> 1556 T1395 oascc.ZkStateReader$2.process A cluster state change has occurred - updating... (1)
[junit4:junit4]   2> 2024 T1398 oasc.ShardLeaderElectionContext.waitForReplicasToComeUp Enough replicas found to continue.
[junit4:junit4]   2> 2024 T1398 oasc.ShardLeaderElectionContext.runLeaderProcess I may be the new leader - try and sync
[junit4:junit4]   2> 2024 T1398 oasc.SyncStrategy.sync Sync replicas to http://127.0.0.1:61165/solr/collection1/
[junit4:junit4]   2> 2024 T1398 oasc.SyncStrategy.syncReplicas Sync Success - now sync replicas to me
[junit4:junit4]   2> 2024 T1398 oasc.SyncStrategy.syncToMe http://127.0.0.1:61165/solr/collection1/ has no replicas
[junit4:junit4]   2> 2024 T1398 oasc.ShardLeaderElectionContext.runLeaderProcess I am the new leader: http://127.0.0.1:61165/solr/collection1/
[junit4:junit4]   2> 2024 T1398 oascc.SolrZkClient.makePath makePath: /collections/control_collection/leaders/control_shard
[junit4:junit4]   2> 2024 T1378 oazs.PrepRequestProcessor.pRequest Got user-level KeeperException when processing sessionid:0x13b9111083c0003 type:create cxid:0x89 zxid:0x3f txntype:-1 reqpath:n/a Error Path:/solr/overseer Error:KeeperErrorCode = NodeExists for /solr/overseer
[junit4:junit4]   2> 2039 T1396 oascc.ZkStateReader.updateClusterState Updating cloud state from ZooKeeper... 
[junit4:junit4]   2> 2039 T1395 oascc.ZkStateReader$2.process A cluster state change has occurred - updating... (1)
[junit4:junit4]   2> 2084 T1398 oasc.ZkController.register We are http://127.0.0.1:61165/solr/collection1/ and leader is http://127.0.0.1:61165/solr/collection1/
[junit4:junit4]   2> 2084 T1398 oasc.ZkController.register No LogReplay needed for core=collection1 baseURL=http://127.0.0.1:61165/solr
[junit4:junit4]   2> 2084 T1398 oasc.ZkController.checkRecovery I am the leader, no recovery necessary
[junit4:junit4]   2> 2084 T1398 oasc.ZkController.publish publishing core=collection1 state=active
[junit4:junit4]   2> 2084 T1398 oasc.ZkController.publish numShards not found on descriptor - reading it from system property
[junit4:junit4]   2> 2084 T1398 oascc.ZkStateReader.updateClusterState Updating cloud state from ZooKeeper... 
[junit4:junit4]   2> 2084 T1373 oass.SolrDispatchFilter.init user.dir=C:\Users\JenkinsSlave\workspace\Lucene-Solr-4.x-Windows\solr\build\solr-core\test\J0
[junit4:junit4]   2> 2084 T1373 oass.SolrDispatchFilter.init SolrDispatchFilter.init() done
[junit4:junit4]   2> 2084 T1373 oascsi.HttpClientUtil.createClient Creating new http client, config:maxConnections=128&maxConnectionsPerHost=32&followRedirects=false
[junit4:junit4]   2> 2370 T1373 oejs.Server.doStart jetty-8.1.8.v20121106
[junit4:junit4]   2> 2370 T1373 oejs.AbstractConnector.doStart Started SelectChannelConnector@0.0.0.0:61174
[junit4:junit4]   2> 2370 T1373 oasc.SolrResourceLoader.locateSolrHome JNDI not configured for solr (NoInitialContextEx)
[junit4:junit4]   2> 2370 T1373 oasc.SolrResourceLoader.locateSolrHome using system property solr.solr.home: C:\Users\JenkinsSlave\workspace\Lucene-Solr-4.x-Windows\solr\build\solr-core\test\J0\.\solrtest-jetty1-1355348512851
[junit4:junit4]   2> 2370 T1373 oasc.SolrResourceLoader.<init> new SolrResourceLoader for deduced Solr Home: 'C:\Users\JenkinsSlave\workspace\Lucene-Solr-4.x-Windows\solr\build\solr-core\test\J0\.\solrtest-jetty1-1355348512851\'
[junit4:junit4]   2> 2401 T1373 oass.SolrDispatchFilter.init SolrDispatchFilter.init()
[junit4:junit4]   2> 2401 T1373 oasc.SolrResourceLoader.locateSolrHome JNDI not configured for solr (NoInitialContextEx)
[junit4:junit4]   2> 2401 T1373 oasc.SolrResourceLoader.locateSolrHome using system property solr.solr.home: C:\Users\JenkinsSlave\workspace\Lucene-Solr-4.x-Windows\solr\build\solr-core\test\J0\.\solrtest-jetty1-1355348512851
[junit4:junit4]   2> 2401 T1373 oasc.CoreContainer$Initializer.initialize looking for solr.xml: C:\Users\JenkinsSlave\workspace\Lucene-Solr-4.x-Windows\solr\build\solr-core\test\J0\.\solrtest-jetty1-1355348512851\solr.xml
[junit4:junit4]   2> 2401 T1373 oasc.CoreContainer.<init> New CoreContainer 5751884
[junit4:junit4]   2> 2401 T1373 oasc.CoreContainer.load Loading CoreContainer using Solr Home: 'C:\Users\JenkinsSlave\workspace\Lucene-Solr-4.x-Windows\solr\build\solr-core\test\J0\.\solrtest-jetty1-1355348512851\'
[junit4:junit4]   2> 2401 T1373 oasc.SolrResourceLoader.<init> new SolrResourceLoader for directory: 'C:\Users\JenkinsSlave\workspace\Lucene-Solr-4.x-Windows\solr\build\solr-core\test\J0\.\solrtest-jetty1-1355348512851\'
[junit4:junit4]   2> 2431 T1373 oasc.CoreContainer.load Registering Log Listener
[junit4:junit4]   2> 2446 T1373 oasc.CoreContainer.initZooKeeper Zookeeper client=127.0.0.1:61158/solr
[junit4:junit4]   2> 2446 T1373 oasc.ZkController.checkChrootPath zkHost includes chroot
[junit4:junit4]   2> 2446 T1373 oaz.ZooKeeper.<init> Initiating client connection, connectString=127.0.0.1:61158 sessionTimeout=60000 watcher=org.apache.solr.common.cloud.ConnectionManager@12576a2
[junit4:junit4]   2> 2446 T1373 oascc.ConnectionManager.waitForConnected Waiting for client to connect to ZooKeeper
[junit4:junit4]   2> 2446 T1409 oaz.ClientCnxn$SendThread.logStartConnect Opening socket connection to server 127.0.0.1/127.0.0.1:61158. Will not attempt to authenticate using SASL (access denied (javax.security.auth.AuthPermission getLoginConfiguration))
[junit4:junit4]   2> 2446 T1409 oaz.ClientCnxn$SendThread.primeConnection Socket connection established to 127.0.0.1/127.0.0.1:61158, initiating session
[junit4:junit4]   2> 2446 T1375 oazs.NIOServerCnxnFactory.run Accepted socket connection from /127.0.0.1:61179
[junit4:junit4]   2> 2446 T1375 oazs.ZooKeeperServer.processConnectRequest Client attempting to establish new session at /127.0.0.1:61179
[junit4:junit4]   2> 2461 T1377 oazs.ZooKeeperServer.finishSessionInit Established session 0x13b9111083c0004 with negotiated timeout 20000 for client /127.0.0.1:61179
[junit4:junit4]   2> 2461 T1409 oaz.ClientCnxn$SendThread.onConnected Session establishment complete on server 127.0.0.1/127.0.0.1:61158, sessionid = 0x13b9111083c0004, negotiated timeout = 20000
[junit4:junit4]   2> 2461 T1410 oascc.ConnectionManager.process Watcher org.apache.solr.common.cloud.ConnectionManager@12576a2 name:ZooKeeperConnection Watcher:127.0.0.1:61158 got event WatchedEvent state:SyncConnected type:None path:null path:null type:None
[junit4:junit4]   2> 2461 T1373 oascc.ConnectionManager.waitForConnected Client is connected to ZooKeeper
[junit4:junit4]   2> 2461 T1378 oazs.PrepRequestProcessor.pRequest2Txn Processed session termination for sessionid: 0x13b9111083c0004
[junit4:junit4]   2> 2461 T1373 oaz.ZooKeeper.close Session: 0x13b9111083c0004 closed
[junit4:junit4]   2> 2461 T1410 oaz.ClientCnxn$EventThread.run EventThread shut down
[junit4:junit4]   2> 2461 T1375 oazs.NIOServerCnxn.doIO WARNING caught end of stream exception EndOfStreamException: Unable to read additional data from client sessionid 0x13b9111083c0004, likely client has closed socket
[junit4:junit4]   2> 	at org.apache.zookeeper.server.NIOServerCnxn.doIO(NIOServerCnxn.java:220)
[junit4:junit4]   2> 	at org.apache.zookeeper.server.NIOServerCnxnFactory.run(NIOServerCnxnFactory.java:208)
[junit4:junit4]   2> 	at java.lang.Thread.run(Thread.java:662)
[junit4:junit4]   2> 
[junit4:junit4]   2> 2461 T1373 oaz.ZooKeeper.<init> Initiating client connection, connectString=127.0.0.1:61158/solr sessionTimeout=8000 watcher=org.apache.solr.common.cloud.ConnectionManager@5d564b
[junit4:junit4]   2> 2461 T1375 oazs.NIOServerCnxn.closeSock Closed socket connection for client /127.0.0.1:61179 which had sessionid 0x13b9111083c0004
[junit4:junit4]   2> 2461 T1373 oascc.ConnectionManager.waitForConnected Waiting for client to connect to ZooKeeper
[junit4:junit4]   2> 2461 T1411 oaz.ClientCnxn$SendThread.logStartConnect Opening socket connection to server 127.0.0.1/127.0.0.1:61158. Will not attempt to authenticate using SASL (access denied (javax.security.auth.AuthPermission getLoginConfiguration))
[junit4:junit4]   2> 2461 T1411 oaz.ClientCnxn$SendThread.primeConnection Socket connection established to 127.0.0.1/127.0.0.1:61158, initiating session
[junit4:junit4]   2> 2461 T1375 oazs.NIOServerCnxnFactory.run Accepted socket connection from /127.0.0.1:61182
[junit4:junit4]   2> 2461 T1375 oazs.ZooKeeperServer.processConnectRequest Client attempting to establish new session at /127.0.0.1:61182
[junit4:junit4]   2> 2461 T1377 oazs.ZooKeeperServer.finishSessionInit Established session 0x13b9111083c0005 with negotiated timeout 8000 for client /127.0.0.1:61182
[junit4:junit4]   2> 2461 T1411 oaz.ClientCnxn$SendThread.onConnected Session establishment complete on server 127.0.0.1/127.0.0.1:61158, sessionid = 0x13b9111083c0005, negotiated timeout = 8000
[junit4:junit4]   2> 2476 T1412 oascc.ConnectionManager.process Watcher org.apache.solr.common.cloud.ConnectionManager@5d564b name:ZooKeeperConnection Watcher:127.0.0.1:61158/solr got event WatchedEvent state:SyncConnected type:None path:null path:null type:None
[junit4:junit4]   2> 2476 T1373 oascc.ConnectionManager.waitForConnected Client is connected to ZooKeeper
[junit4:junit4]   2> 2476 T1378 oazs.PrepRequestProcessor.pRequest Got user-level KeeperException when processing sessionid:0x13b9111083c0005 type:create cxid:0x1 zxid:0x49 txntype:-1 reqpath:n/a Error Path:/solr/overseer Error:KeeperErrorCode = NodeExists for /solr/overseer
[junit4:junit4]   2> 2476 T1378 oazs.PrepRequestProcessor.pRequest Got user-level KeeperException when processing sessionid:0x13b9111083c0005 type:create cxid:0x2 zxid:0x4a txntype:-1 reqpath:n/a Error Path:/solr/overseer Error:KeeperErrorCode = NodeExists for /solr/overseer
[junit4:junit4]   2> 2476 T1373 oasc.ZkController.createEphemeralLiveNode Register node as live in ZooKeeper:/live_nodes/127.0.0.1:61174_solr
[junit4:junit4]   2> 2476 T1378 oazs.PrepRequestProcessor.pRequest Got user-level KeeperException when processing sessionid:0x13b9111083c0005 type:delete cxid:0x4 zxid:0x4b txntype:-1 reqpath:n/a Error Path:/solr/live_nodes/127.0.0.1:61174_solr Error:KeeperErrorCode = NoNode for /solr/live_nodes/127.0.0.1:61174_solr
[junit4:junit4]   2> 2476 T1373 oascc.SolrZkClient.makePath makePath: /live_nodes/127.0.0.1:61174_solr
[junit4:junit4]   2> 2476 T1395 oascc.ZkStateReader$2.process A cluster state change has occurred - updating... (1)
[junit4:junit4]   2> 2476 T1373 oashc.HttpShardHandlerFactory.getParameter Setting socketTimeout to: 0
[junit4:junit4]   2> 2476 T1373 oashc.HttpShardHandlerFactory.getParameter Setting urlScheme to: http://
[junit4:junit4]   2> 2476 T1373 oashc.HttpShardHandlerFactory.getParameter Setting connTimeout to: 0
[junit4:junit4]   2> 2476 T1395 oascc.ZkStateReader$3.process Updating live nodes... (2)
[junit4:junit4]   2> 2476 T1373 oashc.HttpShardHandlerFactory.getParameter Setting maxConnectionsPerHost to: 20
[junit4:junit4]   2> 2476 T1373 oashc.HttpShardHandlerFactory.getParameter Setting corePoolSize to: 0
[junit4:junit4]   2> 2476 T1373 oashc.HttpShardHandlerFactory.getParameter Setting maximumPoolSize to: 2147483647
[junit4:junit4]   2> 2476 T1373 oashc.HttpShardHandlerFactory.getParameter Setting maxThreadIdleTime to: 5
[junit4:junit4]   2> 2491 T1373 oashc.HttpShardHandlerFactory.getParameter Setting sizeOfQueue to: -1
[junit4:junit4]   2> 2491 T1373 oashc.HttpShardHandlerFactory.getParameter Setting fairnessPolicy to: false
[junit4:junit4]   2> 2491 T1373 oascsi.HttpClientUtil.createClient Creating new http client, config:maxConnectionsPerHost=20&maxConnections=10000&socketTimeout=0&connTimeout=0&retry=false
[junit4:junit4]   2> 2506 T1373 oascc.ZkStateReader.createClusterStateWatchersAndUpdate Updating cluster state from ZooKeeper... 
[junit4:junit4]   2> 2506 T1413 oasc.CoreContainer.create Creating SolrCore 'collection1' using instanceDir: C:\Users\JenkinsSlave\workspace\Lucene-Solr-4.x-Windows\solr\build\solr-core\test\J0\.\solrtest-jetty1-1355348512851\collection1
[junit4:junit4]   2> 2506 T1413 oasc.ZkController.createCollectionZkNode Check for collection zkNode:collection1
[junit4:junit4]   2> 2521 T1413 oasc.ZkController.createCollectionZkNode Collection zkNode exists
[junit4:junit4]   2> 2521 T1413 oasc.ZkController.readConfigName Load collection config from:/collections/collection1
[junit4:junit4]   2> 2521 T1413 oasc.SolrResourceLoader.<init> new SolrResourceLoader for directory: 'C:\Users\JenkinsSlave\workspace\Lucene-Solr-4.x-Windows\solr\build\solr-core\test\J0\.\solrtest-jetty1-1355348512851\collection1\'
[junit4:junit4]   2> 2521 T1396 oascc.ZkStateReader.updateClusterState Updating cloud state from ZooKeeper... 
[junit4:junit4]   2> 2521 T1396 oasc.Overseer$ClusterStateUpdater.updateState Update state numShards=null message={
[junit4:junit4]   2> 	  "operation":"state",
[junit4:junit4]   2> 	  "numShards":null,
[junit4:junit4]   2> 	  "shard":"control_shard",
[junit4:junit4]   2> 	  "roles":null,
[junit4:junit4]   2> 	  "state":"active",
[junit4:junit4]   2> 	  "core":"collection1",
[junit4:junit4]   2> 	  "collection":"control_collection",
[junit4:junit4]   2> 	  "node_name":"127.0.0.1:61165_solr",
[junit4:junit4]   2> 	  "base_url":"http://127.0.0.1:61165/solr"}
[junit4:junit4]   2> 2521 T1413 oasc.SolrResourceLoader.replaceClassLoader Adding 'file:/C:/Users/JenkinsSlave/workspace/Lucene-Solr-4.x-Windows/solr/build/solr-core/test/J0/solrtest-jetty1-1355348512851/collection1/lib/classes/' to classloader
[junit4:junit4]   2> 2521 T1413 oasc.SolrResourceLoader.replaceClassLoader Adding 'file:/C:/Users/JenkinsSlave/workspace/Lucene-Solr-4.x-Windows/solr/build/solr-core/test/J0/solrtest-jetty1-1355348512851/collection1/lib/README' to classloader
[junit4:junit4]   2> 2521 T1412 oascc.ZkStateReader$2.process A cluster state change has occurred - updating... (2)
[junit4:junit4]   2> 2536 T1395 oascc.ZkStateReader$2.process A cluster state change has occurred - updating... (2)
[junit4:junit4]   2> 2582 T1413 oasc.SolrConfig.<init> Using Lucene MatchVersion: LUCENE_41
[junit4:junit4]   2> 2657 T1413 oasc.SolrConfig.<init> Loaded SolrConfig: solrconfig.xml
[junit4:junit4]   2> 2657 T1413 oass.IndexSchema.readSchema Reading Solr Schema
[junit4:junit4]   2> 2657 T1413 oass.IndexSchema.readSchema Schema name=test
[junit4:junit4]   2> 3290 T1413 oass.OpenExchangeRatesOrgProvider.init Initialized with rates=open-exchange-rates.json, refreshInterval=1440.
[junit4:junit4]   2> 3306 T1413 oass.IndexSchema.readSchema default search field in schema is text
[junit4:junit4]   2> 3306 T1413 oass.IndexSchema.readSchema unique key field: id
[junit4:junit4]   2> 3321 T1413 oass.FileExchangeRateProvider.reload Reloading exchange rates from file currency.xml
[junit4:junit4]   2> 3336 T1413 oass.FileExchangeRateProvider.reload Reloading exchange rates from file currency.xml
[junit4:junit4]   2> 3336 T1413 oass.OpenExchangeRatesOrgProvider.reload Reloading exchange rates from open-exchange-rates.json
[junit4:junit4]   2> 3336 T1413 oass.OpenExchangeRatesOrgProvider.reload Reloading exchange rates from open-exchange-rates.json
[junit4:junit4]   2> 3336 T1413 oasc.SolrCore.<init> [collection1] Opening new SolrCore at C:\Users\JenkinsSlave\workspace\Lucene-Solr-4.x-Windows\solr\build\solr-core\test\J0\.\solrtest-jetty1-1355348512851\collection1\, dataDir=.\org.apache.solr.cloud.BasicDistributedZkTest-1355348510767/jetty1\
[junit4:junit4]   2> 3336 T1413 oasc.JmxMonitoredMap.<init> JMX monitoring is enabled. Adding Solr mbeans to JMX Server: com.sun.jmx.mbeanserver.JmxMBeanServer@1759d12
[junit4:junit4]   2> 3336 T1413 oasc.SolrCore.getNewIndexDir New index directory detected: old=null new=.\org.apache.solr.cloud.BasicDistributedZkTest-1355348510767/jetty1\index/
[junit4:junit4]   2> 3336 T1413 oasc.SolrCore.initIndex WARNING [collection1] Solr index directory '.\org.apache.solr.cloud.BasicDistributedZkTest-1355348510767\jetty1\index' doesn't exist. Creating new index...
[junit4:junit4]   2> 3351 T1413 oasc.CachingDirectoryFactory.get return new directory for C:\Users\JenkinsSlave\workspace\Lucene-Solr-4.x-Windows\solr\build\solr-core\test\J0\.\org.apache.solr.cloud.BasicDistributedZkTest-1355348510767\jetty1\index forceNew:false
[junit4:junit4]   2> 3351 T1413 oasc.SolrDeletionPolicy.onCommit SolrDeletionPolicy.onCommit: commits:num=1
[junit4:junit4]   2> 		commit{dir=RateLimitedDirectoryWrapper(NRTCachingDirectory(org.apache.lucene.store.SimpleFSDirectory@C:\Users\JenkinsSlave\workspace\Lucene-Solr-4.x-Windows\solr\build\solr-core\test\J0\org.apache.solr.cloud.BasicDistributedZkTest-1355348510767\jetty1\index lockFactory=org.apache.lucene.store.NativeFSLockFactory@22c013; maxCacheMB=48.0 maxMergeSizeMB=4.0)),segFN=segments_1,generation=1,filenames=[segments_1]
[junit4:junit4]   2> 3351 T1413 oasc.SolrDeletionPolicy.updateCommits newest commit = 1
[junit4:junit4]   2> 3351 T1413 oasc.SolrCore.initWriters created xml: solr.XMLResponseWriter
[junit4:junit4]   2> 3351 T1413 oasup.UpdateRequestProcessorChain.init inserting DistributedUpdateProcessorFactory into updateRequestProcessorChain "dedupe"
[junit4:junit4]   2> 3351 T1413 oasup.UpdateRequestProcessorChain.init inserting DistributedUpdateProcessorFactory into updateRequestProcessorChain "dedupe-allfields"
[junit4:junit4]   2> 3351 T1413 oasup.UpdateRequestProcessorChain.init inserting DistributedUpdateProcessorFactory into updateRequestProcessorChain "stored_sig"
[junit4:junit4]   2> 3351 T1413 oasup.UpdateRequestProcessorChain.init inserting DistributedUpdateProcessorFactory into updateRequestProcessorChain "uniq-fields"
[junit4:junit4]   2> 3351 T1413 oasup.UpdateRequestProcessorChain.init inserting DistributedUpdateProcessorFactory into updateRequestProcessorChain "distrib-dup-test-chain-implicit"
[junit4:junit4]   2> 3351 T1413 oasc.RequestHandlers.initHandlersFromConfig adding lazy requestHandler: solr.ReplicationHandler
[junit4:junit4]   2> 3351 T1413 oasc.RequestHandlers.initHandlersFromConfig created /replication: solr.ReplicationHandler
[junit4:junit4]   2> 3351 T1413 oasc.RequestHandlers.initHandlersFromConfig created standard: solr.StandardRequestHandler
[junit4:junit4]   2> 3366 T1413 oasc.RequestHandlers.initHandlersFromConfig created /get: solr.RealTimeGetHandler
[junit4:junit4]   2> 3366 T1413 oasc.RequestHandlers.initHandlersFromConfig created dismax: solr.SearchHandler
[junit4:junit4]   2> 3366 T1413 oasc.RequestHandlers.initHandlersFromConfig created mock: org.apache.solr.core.MockQuerySenderListenerReqHandler
[junit4:junit4]   2> 3366 T1413 oasc.RequestHandlers.initHandlersFromConfig created /admin/: org.apache.solr.handler.admin.AdminHandlers
[junit4:junit4]   2> 3366 T1413 oasc.RequestHandlers.initHandlersFromConfig created defaults: solr.StandardRequestHandler
[junit4:junit4]   2> 3366 T1413 oasc.RequestHandlers.initHandlersFromConfig adding lazy requestHandler: solr.StandardRequestHandler
[junit4:junit4]   2> 3366 T1413 oasc.RequestHandlers.initHandlersFromConfig created lazy: solr.StandardRequestHandler
[junit4:junit4]   2> 3366 T1413 oasc.RequestHandlers.initHandlersFromConfig created /update: solr.UpdateRequestHandler
[junit4:junit4]   2> 3366 T1413 oasc.RequestHandlers.initHandlersFromConfig created /terms: org.apache.solr.handler.component.SearchHandler
[junit4:junit4]   2> 3366 T1413 oasc.RequestHandlers.initHandlersFromConfig created spellCheckCompRH: org.apache.solr.handler.component.SearchHandler
[junit4:junit4]   2> 3366 T1413 oasc.RequestHandlers.initHandlersFromConfig created spellCheckCompRH_Direct: org.apache.solr.handler.component.SearchHandler
[junit4:junit4]   2> 3366 T1413 oasc.RequestHandlers.initHandlersFromConfig created spellCheckWithWordbreak: org.apache.solr.handler.component.SearchHandler
[junit4:junit4]   2> 3366 T1413 oasc.RequestHandlers.initHandlersFromConfig created spellCheckWithWordbreak_Direct: org.apache.solr.handler.component.SearchHandler
[junit4:junit4]   2> 3366 T1413 oasc.RequestHandlers.initHandlersFromConfig created spellCheckCompRH1: org.apache.solr.handler.component.SearchHandler
[junit4:junit4]   2> 3366 T1413 oasc.RequestHandlers.initHandlersFromConfig created tvrh: org.apache.solr.handler.component.SearchHandler
[junit4:junit4]   2> 3366 T1413 oasc.RequestHandlers.initHandlersFromConfig created /mlt: solr.MoreLikeThisHandler
[junit4:junit4]   2> 3366 T1413 oasc.RequestHandlers.initHandlersFromConfig created /debug/dump: solr.DumpRequestHandler
[junit4:junit4]   2> 3381 T1413 oashl.XMLLoader.init xsltCacheLifetimeSeconds=60
[junit4:junit4]   2> 3381 T1413 oasc.SolrCore.initDeprecatedSupport WARNING solrconfig.xml uses deprecated <admin/gettableFiles>, Please update your config to use the ShowFileRequestHandler.
[junit4:junit4]   2> 3381 T1413 oasc.SolrCore.initDeprecatedSupport WARNING adding ShowFileRequestHandler with hidden files: [SCHEMA.XML, OLD_SYNONYMS.TXT, STOPWORDS.TXT, PROTWORDS.TXT, OPEN-EXCHANGE-RATES.JSON, SYNONYMS.TXT, CURRENCY.XML, MAPPING-ISOLATIN1ACCENT.TXT]
[junit4:junit4]   2> 3396 T1413 oass.SolrIndexSearcher.<init> Opening Searcher@10fc849 main
[junit4:junit4]   2> 3396 T1413 oass.SolrIndexSearcher.getIndexDir WARNING WARNING: Directory impl does not support setting indexDir: org.apache.lucene.store.RateLimitedDirectoryWrapper
[junit4:junit4]   2> 3396 T1413 oasu.CommitTracker.<init> Hard AutoCommit: disabled
[junit4:junit4]   2> 3396 T1413 oasu.CommitTracker.<init> Soft AutoCommit: disabled
[junit4:junit4]   2> 3396 T1413 oashc.SpellCheckComponent.inform Initializing spell checkers
[junit4:junit4]   2> 3396 T1413 oass.DirectSolrSpellChecker.init init: {name=direct,classname=DirectSolrSpellChecker,field=lowerfilt,minQueryLength=3}
[junit4:junit4]   2> 3456 T1414 oasc.SolrCore.registerSearcher [collection1] Registered new searcher Searcher@10fc849 main{StandardDirectoryReader(segments_1:1)}
[junit4:junit4]   2> 3456 T1413 oasc.ZkController.publish publishing core=collection1 state=down
[junit4:junit4]   2> 3456 T1413 oasc.ZkController.publish numShards not found on descriptor - reading it from system property
[junit4:junit4]   2> 3502 T1396 oascc.ZkStateReader.updateClusterState Updating cloud state from ZooKeeper... 
[junit4:junit4]   2> 3502 T1396 oasc.Overseer$ClusterStateUpdater.updateState Update state numShards=2 message={
[junit4:junit4]   2> 	  "operation":"state",
[junit4:junit4]   2> 	  "numShards":"2",
[junit4:junit4]   2> 	  "shard":null,
[junit4:junit4]   2> 	  "roles":null,
[junit4:junit4]   2> 	  "state":"down",
[junit4:junit4]   2> 	  "core":"collection1",
[junit4:junit4]   2> 	  "collection":"collection1",
[junit4:junit4]   2> 	  "node_name":"127.0.0.1:61174_solr",
[junit4:junit4]   2> 	  "base_url":"http://127.0.0.1:61174/solr"}
[junit4:junit4]   2> 3502 T1396 oasc.Overseer$ClusterStateUpdater.createCollection Create collection collection1 with numShards 2
[junit4:junit4]   2> 3502 T1396 oasc.Overseer$ClusterStateUpdater.updateState Assigning new node to shard shard=shard1
[junit4:junit4]   2> 3502 T1395 oascc.ZkStateReader$2.process A cluster state change has occurred - updating... (2)
[junit4:junit4]   2> 3502 T1412 oascc.ZkStateReader$2.process A cluster state change has occurred - updating... (2)
[junit4:junit4]   2> 3939 T1413 oasc.CoreContainer.register registering core: collection1
[junit4:junit4]   2> 3939 T1413 oasc.ZkController.register Register shard - core:collection1 address:http://127.0.0.1:61174/solr shardId:shard1
[junit4:junit4]   2> 3939 T1413 oascc.SolrZkClient.makePath makePath: /collections/collection1/leader_elect/shard1/election
[junit4:junit4]   2> 3939 T1378 oazs.PrepRequestProcessor.pRequest Got user-level KeeperException when processing sessionid:0x13b9111083c0005 type:delete cxid:0x45 zxid:0x5b txntype:-1 reqpath:n/a Error Path:/solr/collections/collection1/leaders Error:KeeperErrorCode = NoNode for /solr/collections/collection1/leaders
[junit4:junit4]   2> 3954 T1413 oasc.ShardLeaderElectionContext.runLeaderProcess Running the leader process.
[junit4:junit4]   2> 3954 T1378 oazs.PrepRequestProcessor.pRequest Got user-level KeeperException when processing sessionid:0x13b9111083c0005 type:create cxid:0x46 zxid:0x5c txntype:-1 reqpath:n/a Error Path:/solr/overseer Error:KeeperErrorCode = NodeExists for /solr/overseer
[junit4:junit4]   2> 3954 T1413 oasc.ShardLeaderElectionContext.waitForReplicasToComeUp Enough replicas found to continue.
[junit4:junit4]   2> 3954 T1413 oasc.ShardLeaderElectionContext.runLeaderProcess I may be the new leader - try and sync
[junit4:junit4]   2> 3954 T1413 oasc.SyncStrategy.sync Sync replicas to http://127.0.0.1:61174/solr/collection1/
[junit4:junit4]   2> 3954 T1413 oasc.SyncStrategy.syncReplicas Sync Success - now sync replicas to me
[junit4:junit4]   2> 3954 T1413 oasc.SyncStrategy.syncToMe http://127.0.0.1:61174/solr/collection1/ has no replicas
[junit4:junit4]   2> 3954 T1413 oasc.ShardLeaderElectionContext.runLeaderProcess I am the new leader: http://127.0.0.1:61174/solr/collection1/
[junit4:junit4]   2> 3954 T1413 oascc.SolrZkClient.makePath makePath: /collections/collection1/leaders/shard1
[junit4:junit4]   2> 3954 T1378 oazs.PrepRequestProcessor.pRequest Got user-level KeeperException when processing sessionid:0x13b9111083c0005 type:create cxid:0x50 zxid:0x60 txntype:-1 reqpath:n/a Error Path:/solr/overseer Error:KeeperErrorCode = NodeExists for /solr/overseer
[junit4:junit4]   2> 3999 T1396 oascc.ZkStateReader.updateClusterState Updating cloud state from ZooKeeper... 
[junit4:junit4]   2> 4014 T1395 oascc.ZkStateReader$2.process A cluster state change has occurred - updating... (2)
[junit4:junit4]   2> 4014 T1412 oascc.ZkStateReader$2.process A cluster state change has occurred - updating... (2)
[junit4:junit4]   2> 4029 T1413 oasc.ZkController.register We are http://127.0.0.1:61174/solr/collection1/ and leader is http://127.0.0.1:61174/solr/collection1/
[junit4:junit4]   2> 4029 T1413 oasc.ZkController.register No LogReplay needed for core=collection1 baseURL=http://127.0.0.1:61174/solr
[junit4:junit4]   2> 4029 T1413 oasc.ZkController.checkRecovery I am the leader, no recovery necessary
[junit4:junit4]   2> 4029 T1413 oasc.ZkController.publish publishing core=collection1 state=active
[junit4:junit4]   2> 4029 T1413 oasc.ZkController.publish numShards not found on descriptor - reading it from system property
[junit4:junit4]   2> 4029 T1413 oascc.ZkStateReader.updateClusterState Updating cloud state from ZooKeeper... 
[junit4:junit4]   2> 4029 T1373 oass.SolrDispatchFilter.init user.dir=C:\Users\JenkinsSlave\workspace\Lucene-Solr-4.x-Windows\solr\build\solr-core\test\J0
[junit4:junit4]   2> 4029 T1373 oass.SolrDispatchFilter.init SolrDispatchFilter.init() done
[junit4:junit4]   2> 4029 T1373 oascsi.HttpClientUtil.createClient Creating new http client, config:maxConnections=128&maxConnectionsPerHost=32&followRedirects=false
[junit4:junit4]   2> 4328 T1373 oejs.Server.doStart jetty-8.1.8.v20121106
[junit4:junit4]   2> 4332 T1373 oejs.AbstractConnector.doStart Started SelectChannelConnector@0.0.0.0:61183
[junit4:junit4]   2> 4333 T1373 oasc.SolrResourceLoader.locateSolrHome JNDI not configured for solr (NoInitialContextEx)
[junit4:junit4]   2> 4334 T1373 oasc.SolrResourceLoader.locateSolrHome using system property solr.solr.home: C:\Users\JenkinsSlave\workspace\Lucene-Solr-4.x-Windows\solr\build\solr-core\test\J0\.\solrtest-jetty2-1355348514796
[junit4:junit4]   2> 4334 T1373 oasc.SolrResourceLoader.<init> new SolrResourceLoader for deduced Solr Home: 'C:\Users\JenkinsSlave\workspace\Lucene-Solr-4.x-Windows\solr\build\solr-core\test\J0\.\solrtest-jetty2-1355348514796\'
[junit4:junit4]   2> 4374 T1373 oass.SolrDispatchFilter.init SolrDispatchFilter.init()
[junit4:junit4]   2> 4374 T1373 oasc.SolrResourceLoader.locateSolrHome JNDI not configured for solr (NoInitialContextEx)
[junit4:junit4]   2> 4375 T1373 oasc.SolrResourceLoader.locateSolrHome using system property solr.solr.home: C:\Users\JenkinsSlave\workspace\Lucene-Solr-4.x-Windows\solr\build\solr-core\test\J0\.\solrtest-jetty2-1355348514796
[junit4:junit4]   2> 4375 T1373 oasc.CoreContainer$Initializer.initialize looking for solr.xml: C:\Users\JenkinsSlave\workspace\Lucene-Solr-4.x-Windows\solr\build\solr-core\test\J0\.\solrtest-jetty2-1355348514796\solr.xml
[junit4:junit4]   2> 4375 T1373 oasc.CoreContainer.<init> New CoreContainer 17938452
[junit4:junit4]   2> 4376 T1373 oasc.CoreContainer.load Loading CoreContainer using Solr Home: 'C:\Users\JenkinsSlave\workspace\Lucene-Solr-4.x-Windows\solr\build\solr-core\test\J0\.\solrtest-jetty2-1355348514796\'
[junit4:junit4]   2> 4376 T1373 oasc.SolrResourceLoader.<init> new SolrResourceLoader for directory: 'C:\Users\JenkinsSlave\workspace\Lucene-Solr-4.x-Windows\solr\build\solr-core\test\J0\.\solrtest-jetty2-1355348514796\'
[junit4:junit4]   2> 4400 T1373 oasc.CoreContainer.load Registering Log Listener
[junit4:junit4]   2> 4420 T1373 oasc.CoreContainer.initZooKeeper Zookeeper client=127.0.0.1:61158/solr
[junit4:junit4]   2> 4421 T1373 oasc.ZkController.checkChrootPath zkHost includes chroot
[junit4:junit4]   2> 4421 T1373 oaz.ZooKeeper.<init> Initiating client connection, connectString=127.0.0.1:61158 sessionTimeout=60000 watcher=org.apache.solr.common.cloud.ConnectionManager@8e5d0d
[junit4:junit4]   2> 4423 T1373 oascc.ConnectionManager.waitForConnected Waiting for client to connect to ZooKeeper
[junit4:junit4]   2> 4423 T1424 oaz.ClientCnxn$SendThread.logStartConnect Opening socket connection to server 127.0.0.1/127.0.0.1:61158. Will not attempt to authenticate using SASL (access denied (javax.security.auth.AuthPermission getLoginConfiguration))
[junit4:junit4]   2> 4424 T1424 oaz.ClientCnxn$SendThread.primeConnection Socket connection established to 127.0.0.1/127.0.0.1:61158, initiating session
[junit4:junit4]   2> 4424 T1375 oazs.NIOServerCnxnFactory.run Accepted socket connection from /127.0.0.1:61188
[junit4:junit4]   2> 4425 T1375 oazs.ZooKeeperServer.processConnectRequest Client attempting to establish new session at /127.0.0.1:61188
[junit4:junit4]   2> 4437 T1377 oazs.ZooKeeperServer.finishSessionInit Established session 0x13b9111083c0006 with negotiated timeout 20000 for client /127.0.0.1:61188
[junit4:junit4]   2> 4437 T1424 oaz.ClientCnxn$SendThread.onConnected Session establishment complete on server 127.0.0.1/127.0.0.1:61158, sessionid = 0x13b9111083c0006, negotiated timeout = 20000
[junit4:junit4]   2> 4437 T1425 oascc.ConnectionManager.process Watcher org.apache.solr.common.cloud.ConnectionManager@8e5d0d name:ZooKeeperConnection Watcher:127.0.0.1:61158 got event WatchedEvent state:SyncConnected type:None path:null path:null type:None
[junit4:junit4]   2> 4438 T1373 oascc.ConnectionManager.waitForConnected Client is connected to ZooKeeper
[junit4:junit4]   2> 4440 T1378 oazs.PrepRequestProcessor.pRequest2Txn Processed session termination for sessionid: 0x13b9111083c0006
[junit4:junit4]   2> 4440 T1373 oaz.ZooKeeper.close Session: 0x13b9111083c0006 closed
[junit4:junit4]   2> 4440 T1425 oaz.ClientCnxn$EventThread.run EventThread shut down
[junit4:junit4]   2> 4440 T1375 oazs.NIOServerCnxn.closeSock Closed socket connection for client /127.0.0.1:61188 which had sessionid 0x13b9111083c0006
[junit4:junit4]   2> 4440 T1373 oaz.ZooKeeper.<init> Initiating client connection, connectString=127.0.0.1:61158/solr sessionTimeout=8000 watcher=org.apache.solr.common.cloud.ConnectionManager@180087d
[junit4:junit4]   2> 4443 T1373 oascc.ConnectionManager.waitForConnected Waiting for client to connect to ZooKeeper
[junit4:junit4]   2> 4443 T1426 oaz.ClientCnxn$SendThread.logStartConnect Opening socket connection to server 127.0.0.1/127.0.0.1:61158. Will not attempt to authenticate using SASL (access denied (javax.security.auth.AuthPermission getLoginConfiguration))
[junit4:junit4]   2> 4444 T1426 oaz.ClientCnxn$SendThread.primeConnection Socket connection established to 127.0.0.1/127.0.0.1:61158, initiating session
[junit4:junit4]   2> 4444 T1375 oazs.NIOServerCnxnFactory.run Accepted socket connection from /127.0.0.1:61191
[junit4:junit4]   2> 4444 T1375 oazs.ZooKeeperServer.processConnectRequest Client attempting to establish new session at /127.0.0.1:61191
[junit4:junit4]   2> 4446 T1377 oazs.ZooKeeperServer.finishSessionInit Established session 0x13b9111083c0007 with negotiated timeout 8000 for client /127.0.0.1:61191
[junit4:junit4]   2> 4446 T1426 oaz.ClientCnxn$SendThread.onConnected Session establishment complete on server 127.0.0.1/127.0.0.1:61158, sessionid = 0x13b9111083c0007, negotiated timeout = 8000
[junit4:junit4]   2> 4446 T1427 oascc.ConnectionManager.process Watcher org.apache.solr.common.cloud.ConnectionManager@180087d name:ZooKeeperConnection Watcher:127.0.0.1:61158/solr got event WatchedEvent state:SyncConnected type:None path:null path:null type:None
[junit4:junit4]   2> 4447 T1373 oascc.ConnectionManager.waitForConnected Client is connected to ZooKeeper
[junit4:junit4]   2> 4447 T1378 oazs.PrepRequestProcessor.pRequest Got user-level KeeperException when processing sessionid:0x13b9111083c0007 type:create cxid:0x1 zxid:0x6d txntype:-1 reqpath:n/a Error Path:/solr/overseer Error:KeeperErrorCode = NodeExists for /solr/overseer
[junit4:junit4]   2> 4449 T1378 oazs.PrepRequestProcessor.pRequest Got user-level KeeperException when processing sessionid:0x13b9111083c0007 type:create cxid:0x2 zxid:0x6e txntype:-1 reqpath:n/a Error Path:/solr/overseer Error:KeeperErrorCode = NodeExists for /solr/overseer
[junit4:junit4]   2> 4451 T1373 oasc.ZkController.createEphemeralLiveNode Register node as live in ZooKeeper:/live_nodes/127.0.0.1:61183_solr
[junit4:junit4]   2> 4452 T1378 oazs.PrepRequestProcessor.pRequest Got user-level KeeperException when processing sessionid:0x13b9111083c0007 type:delete cxid:0x4 zxid:0x6f txntype:-1 reqpath:n/a Error Path:/solr/live_nodes/127.0.0.1:61183_solr Error:KeeperErrorCode = NoNode for /solr/live_nodes/127.0.0.1:61183_solr
[junit4:junit4]   2> 4454 T1373 oascc.SolrZkClient.makePath makePath: /live_nodes/127.0.0.1:61183_solr
[junit4:junit4]   2> 4456 T1395 oascc.ZkStateReader$2.process A cluster state change has occurred - updating... (2)
[junit4:junit4]   2> 4457 T1412 oascc.ZkStateReader$3.process Updating live nodes... (3)
[junit4:junit4]   2> 4457 T1412 oascc.ZkStateReader$2.process A cluster state change has occurred - updating... (3)
[junit4:junit4]   2> 4458 T1373 oashc.HttpShardHandlerFactory.getParameter Setting socketTimeout to: 0
[junit4:junit4]   2> 4464 T1395 oascc.ZkStateReader$3.process Updating live nodes... (3)
[junit4:junit4]   2> 4459 T1373 oashc.HttpShardHandlerFactory.getParameter Setting urlScheme to: http://
[junit4:junit4]   2> 4464 T1373 oashc.HttpShardHandlerFactory.getParameter Setting connTimeout to: 0
[junit4:junit4]   2> 4464 T1373 oashc.HttpShardHandlerFactory.getParameter Setting maxConnectionsPerHost to: 20
[junit4:junit4]   2> 4465 T1373 oashc.HttpShardHandlerFactory.getParameter Setting corePoolSize to: 0
[junit4:junit4]   2> 4465 T1373 oashc.HttpShardHandlerFactory.getParameter Setting maximumPoolSize to: 2147483647
[junit4:junit4]   2> 4465 T1373 oashc.HttpShardHandlerFactory.getParameter Setting maxThreadIdleTime to: 5
[junit4:junit4]   2> 4466 T1373 oashc.HttpShardHandlerFactory.getParameter Setting sizeOfQueue to: -1
[junit4:junit4]   2> 4466 T1373 oashc.HttpShardHandlerFactory.getParameter Setting fairnessPolicy to: false
[junit4:junit4]   2> 4466 T1373 oascsi.HttpClientUtil.createClient Creating new http client, config:maxConnectionsPerHost=20&maxConnections=10000&socketTimeout=0&connTimeout=0&retry=false
[junit4:junit4]   2> 4479 T1373 oascc.ZkStateReader.createClusterStateWatchersAndUpdate Updating cluster state from ZooKeeper... 
[junit4:junit4]   2> 4485 T1396 oascc.ZkStateReader.updateClusterState Updating cloud state from ZooKeeper... 
[junit4:junit4]   2> 4486 T1396 oasc.Overseer$ClusterStateUpdater.updateState Update state numShards=2 message={
[junit4:junit4]   2> 	  "operation":"state",
[junit4:junit4]   2> 	  "numShards":"2",
[junit4:junit4]   2> 	  "shard":"shard1",
[junit4:junit4]   2> 	  "roles":null,
[junit4:junit4]   2> 	  "state":"active",
[junit4:junit4]   2> 	  "core":"collection1",
[junit4:junit4]   2> 	  "collection":"collection1",
[junit4:junit4]   2> 	  "node_name":"127.0.0.1:61174_solr",
[junit4:junit4]   2> 	  "base_url":"http://127.0.0.1:61174/solr"}
[junit4:junit4]   2> 4490 T1428 oasc.CoreContainer.create Creating SolrCore 'collection1' using instanceDir: C:\Users\JenkinsSlave\workspace\Lucene-Solr-4.x-Windows\solr\build\solr-core\test\J0\.\solrtest-jetty2-1355348514796\collection1
[junit4:junit4]   2> 4490 T1428 oasc.ZkController.createCollectionZkNode Check for collection zkNode:collection1
[junit4:junit4]   2> 4491 T1428 oasc.ZkController.createCollectionZkNode Collection zkNode exists
[junit4:junit4]   2> 4491 T1428 oasc.ZkController.readConfigName Load collection config from:/collections/collection1
[junit4:junit4]   2> 4495 T1427 oascc.ZkStateReader$2.process A cluster state change has occurred - updating... (3)
[junit4:junit4]   2> 4495 T1428 oasc.SolrResourceLoader.<init> new SolrResourceLoader for directory: 'C:\Users\JenkinsSlave\workspace\Lucene-Solr-4.x-Windows\solr\build\solr-core\test\J0\.\solrtest-jetty2-1355348514796\collection1\'
[junit4:junit4]   2> 4495 T1395 oascc.ZkStateReader$2.process A cluster state change has occurred - updating... (3)
[junit4:junit4]   2> 4495 T1412 oascc.ZkStateReader$2.process A cluster state change has occurred - updating... (3)
[junit4:junit4]   2> 4498 T1428 oasc.SolrResourceLoader.replaceClassLoader Adding 'file:/C:/Users/JenkinsSlave/workspace/Lucene-Solr-4.x-Windows/solr/build/solr-core/test/J0/solrtest-jetty2-1355348514796/collection1/lib/classes/' to classloader
[junit4:junit4]   2> 4499 T1428 oasc.SolrResourceLoader.replaceClassLoader Adding 'file:/C:/Users/JenkinsSlave/workspace/Lucene-Solr-4.x-Windows/solr/build/solr-core/test/J0/solrtest-jetty2-1355348514796/collection1/lib/README' to classloader
[junit4:junit4]   2> 4556 T1428 oasc.SolrConfig.<init> Using Lucene MatchVersion: LUCENE_41
[junit4:junit4]   2> 4635 T1428 oasc.SolrConfig.<init> Loaded SolrConfig: solrconfig.xml
[junit4:junit4]   2> 4637 T1428 oass.IndexSchema.readSchema Reading Solr Schema
[junit4:junit4]   2> 4646 T1428 oass.IndexSchema.readSchema Schema name=test
[junit4:junit4]   2> 5333 T1428 oass.OpenExchangeRatesOrgProvider.init Initialized with rates=open-exchange-rates.json, refreshInterval=1440.
[junit4:junit4]   2> 5343 T1428 oass.IndexSchema.readSchema default search field in schema is text
[junit4:junit4]   2> 5348 T1428 oass.IndexSchema.readSchema unique key field: id
[junit4:junit4]   2> 5366 T1428 oass.FileExchangeRateProvider.reload Reloading exchange rates from file currency.xml
[junit4:junit4]   2> 5372 T1428 oass.FileExchangeRateProvider.reload Reloading exchange rates from file currency.xml
[junit4:junit4]   2> 5376 T1428 oass.OpenExchangeRatesOrgProvider.reload Reloading exchange rates from open-exchange-rates.json
[junit4:junit4]   2> 5378 T1428 oass.OpenExchangeRatesOrgProvider.reload Reloading exchange rates from open-exchange-rates.json
[junit4:junit4]   2> 5379 T1428 oasc.SolrCore.<init> [collection1] Opening new SolrCore at C:\Users\JenkinsSlave\workspace\Lucene-Solr-4.x-Windows\solr\build\solr-core\test\J0\.\solrtest-jetty2-1355348514796\collection1\, dataDir=.\org.apache.solr.cloud.BasicDistributedZkTest-1355348510767/jetty2\
[junit4:junit4]   2> 5379 T1428 oasc.JmxMonitoredMap.<init> JMX monitoring is enabled. Adding Solr mbeans to JMX Server: com.sun.jmx.mbeanserver.JmxMBeanServer@1759d12
[junit4:junit4]   2> 5381 T1428 oasc.SolrCore.getNewIndexDir New index directory detected: old=null new=.\org.apache.solr.cloud.BasicDistributedZkTest-1355348510767/jetty2\index/
[junit4:junit4]   2> 5382 T1428 oasc.SolrCore.initIndex WARNING [collection1] Solr index directory '.\org.apache.solr.cloud.BasicDistributedZkTest-1355348510767\jetty2\index' doesn't exist. Creating new index...
[junit4:junit4]   2> 5382 T1428 oasc.CachingDirectoryFactory.get return new directory for C:\Users\JenkinsSlave\workspace\Lucene-Solr-4.x-Windows\solr\build\solr-core\test\J0\.\org.apache.solr.cloud.BasicDistributedZkTest-1355348510767\jetty2\index forceNew:false
[junit4:junit4]   2> 5393 T1428 oasc.SolrDeletionPolicy.onCommit SolrDeletionPolicy.onCommit: commits:num=1
[junit4:junit4]   2> 		commit{dir=RateLimitedDirectoryWrapper(NRTCachingDirectory(org.apache.lucene.store.SimpleFSDirectory@C:\Users\JenkinsSlave\workspace\Lucene-Solr-4.x-Windows\solr\build\solr-core\test\J0\org.apache.solr.cloud.BasicDistributedZkTest-1355348510767\jetty2\index lockFactory=org.apache.lucene.store.NativeFSLockFactory@8fbe3; maxCacheMB=48.0 maxMergeSizeMB=4.0)),segFN=segments_1,generation=1,filenames=[segments_1]
[junit4:junit4]   2> 5393 T1428 oasc.SolrDeletionPolicy.updateCommits newest commit = 1
[junit4:junit4]   2> 5395 T1428 oasc.SolrCore.initWriters created xml: solr.XMLResponseWriter
[junit4:junit4]   2> 5397 T1428 oasup.UpdateRequestProcessorChain.init inserting DistributedUpdateProcessorFactory into updateRequestProcessorChain "dedupe"
[junit4:junit4]   2> 5397 T1428 oasup.UpdateRequestProcessorChain.init inserting DistributedUpdateProcessorFactory into updateRequestProcessorChain "dedupe-allfields"
[junit4:junit4]   2> 5397 T1428 oasup.UpdateRequestProcessorChain.init inserting DistributedUpdateProcessorFactory into updateRequestProcessorChain "stored_sig"
[junit4:junit4]   2> 5397 T1428 oasup.UpdateRequestProcessorChain.init inserting DistributedUpdateProcessorFactory into updateRequestProcessorChain "uniq-fields"
[junit4:junit4]   2> 5398 T1428 oasup.UpdateRequestProcessorChain.init inserting DistributedUpdateProcessorFactory into updateRequestProcessorChain "distrib-dup-test-chain-implicit"
[junit4:junit4]   2> 5398 T1428 oasc.RequestHandlers.initHandlersFromConfig adding lazy requestHandler: solr.ReplicationHandler
[junit4:junit4]   2> 5398 T1428 oasc.RequestHandlers.initHandlersFromConfig created /replication: solr.ReplicationHandler
[junit4:junit4]   2> 5399 T1428 oasc.RequestHandlers.initHandlersFromConfig created standard: solr.StandardRequestHandler
[junit4:junit4]   2> 5400 T1428 oasc.RequestHandlers.initHandlersFromConfig created /get: solr.RealTimeGetHandler
[junit4:junit4]   2> 5401 T1428 oasc.RequestHandlers.initHandlersFromConfig created dismax: solr.SearchHandler
[junit4:junit4]   2> 5402 T1428 oasc.RequestHandlers.initHandlersFromConfig created mock: org.apache.solr.core.MockQuerySenderListenerReqHandler
[junit4:junit4]   2> 5402 T1428 oasc.RequestHandlers.initHandlersFromConfig created /admin/: org.apache.solr.handler.admin.AdminHandlers
[junit4:junit4]   2> 5403 T1428 oasc.RequestHandlers.initHandlersFromConfig created defaults: solr.StandardRequestHandler
[junit4:junit4]   2> 5404 T1428 oasc.RequestHandlers.initHandlersFromConfig adding lazy requestHandler: solr.StandardRequestHandler
[junit4:junit4]   2> 5404 T1428 oasc.RequestHandlers.initHandlersFromConfig created lazy: solr.StandardRequestHandler
[junit4:junit4]   2> 5404 T1428 oasc.RequestHandlers.initHandlersFromConfig created /update: solr.UpdateRequestHandler
[junit4:junit4]   2> 5405 T1428 oasc.RequestHandlers.initHandlersFromConfig created /terms: org.apache.solr.handler.component.SearchHandler
[junit4:junit4]   2> 5405 T1428 oasc.RequestHandlers.initHandlersFromConfig created spellCheckCompRH: org.apache.solr.handler.component.SearchHandler
[junit4:junit4]   2> 5410 T1428 oasc.RequestHandlers.initHandlersFromConfig created spellCheckCompRH_Direct: org.apache.solr.handler.component.SearchHandler
[junit4:junit4]   2> 5411 T1428 oasc.RequestHandlers.initHandlersFromConfig created spellCheckWithWordbreak: org.apache.solr.handler.component.SearchHandler
[junit4:junit4]   2> 5411 T1428 oasc.RequestHandlers.initHandlersFromConfig created spellCheckWithWordbreak_Direct: org.apache.solr.handler.component.SearchHandler
[junit4:junit4]   2> 5413 T1428 oasc.RequestHandlers.initHandlersFromConfig created spellCheckCompRH1: org.apache.solr.handler.component.SearchHandler
[junit4:junit4]   2> 5413 T1428 oasc.RequestHandlers.initHandlersFromConfig created tvrh: org.apache.solr.handler.component.SearchHandler
[junit4:junit4]   2> 5415 T1428 oasc.RequestHandlers.initHandlersFromConfig created /mlt: solr.MoreLikeThisHandler
[junit4:junit4]   2> 5415 T1428 oasc.RequestHandlers.initHandlersFromConfig created /debug/dump: solr.DumpRequestHandler
[junit4:junit4]   2> 5424 T1428 oashl.XMLLoader.init xsltCacheLifetimeSeconds=60
[junit4:junit4]   2> 5428 T1428 oasc.SolrCore.initDeprecatedSupport WARNING solrconfig.xml uses deprecated <admin/gettableFiles>, Please update your config to use the ShowFileRequestHandler.
[junit4:junit4]   2> 5429 T1428 oasc.SolrCore.initDeprecatedSupport WARNING adding ShowFileRequestHandler with hidden files: [SCHEMA.XML, OLD_SYNONYMS.TXT, STOPWORDS.TXT, PROTWORDS.TXT, OPEN-EXCHANGE-RATES.JSON, SYNONYMS.TXT, CURRENCY.XML, MAPPING-ISOLATIN1ACCENT.TXT]
[junit4:junit4]   2> 5434 T1428 oass.SolrIndexSearcher.<init> Opening Searcher@97bac main
[junit4:junit4]   2> 5435 T1428 oass.SolrIndexSearcher.getIndexDir WARNING WARNING: Directory impl does not support setting indexDir: org.apache.lucene.store.RateLimitedDirectoryWrapper
[junit4:junit4]   2> 5437 T1428 oasu.CommitTracker.<init> Hard AutoCommit: disabled
[junit4:junit4]   2> 5437 T1428 oasu.CommitTracker.<init> Soft AutoCommit: disabled
[junit4:junit4]   2> 5437 T1428 oashc.SpellCheckComponent.inform Initializing spell checkers
[junit4:junit4]   2> 5446 T1428 oass.DirectSolrSpellChecker.init init: {name=direct,classname=DirectSolrSpellChecker,field=lowerfilt,minQueryLength=3}
[junit4:junit4]   2> 5502 T1429 oasc.SolrCore.registerSearcher [collection1] Registered new searcher Searcher@97bac main{StandardDirectoryReader(segments_1:1)}
[junit4:junit4]   2> 5507 T1428 oasc.ZkController.publish publishing core=collection1 state=down
[junit4:junit4]   2> 5507 T1428 oasc.ZkController.publish numShards not found on descriptor - reading it from system property
[junit4:junit4]   2> 5957 T1396 oascc.ZkStateReader.updateClusterState Updating cloud state from ZooKeeper... 
[junit4:junit4]   2> 5958 T1396 oasc.Overseer$ClusterStateUpdater.updateState Update state numShards=2 message={
[junit4:junit4]   2> 	  "operation":"state",
[junit4:junit4]   2> 	  "numShards":"2",
[junit4:junit4]   2> 	  "shard":null,
[junit4:junit4]   2> 	  "roles":null,
[junit4:junit4]   2> 	  "state":"down",
[junit4:junit4]   2> 	  "core":"collection1",
[junit4:junit4]   2> 	  "collection":"collection1",
[junit4:junit4]   2> 	  "node_name":"127.0.0.1:61183_solr",
[junit4:junit4]   2> 	  "base_url":"http://127.0.0.1:61183/solr"}
[junit4:junit4]   2> 5958 T1396 oasc.Overseer$ClusterStateUpdater.updateState Collection already exists with numShards=2
[junit4:junit4]   2> 5958 T1396 oasc.Overseer$ClusterStateUpdater.updateState Assigning new node to shard shard=shard2
[junit4:junit4]   2> 5966 T1412 oascc.ZkStateReader$2.process A cluster state change has occurred - updating... (3)
[junit4:junit4]   2> 5967 T1395 oascc.ZkStateReader$2.process A cluster state change has occurred - updating... (3)
[junit4:junit4]   2> 5967 T1427 oascc.ZkStateReader$2.process A cluster state change has occurred - updating... (3)
[junit4:junit4]   2> 5991 T1428 oasc.CoreContainer.register registering core: collection1
[junit4:junit4]   2> 5991 T1428 oasc.ZkController.register Register shard - core:collection1 address:http://127.0.0.1:61183/solr shardId:shard2
[junit4:junit4]   2> 5992 T1428 oascc.SolrZkClient.makePath makePath: /collections/collection1/leader_elect/shard2/election
[junit4:junit4]   2> 6006 T1378 oazs.PrepRequestProcessor.pRequest Got user-level KeeperException when processing sessionid:0x13b9111083c0007 type:delete cxid:0x44 zxid:0x7e txntype:-1 reqpath:n/a Error Path:/solr/collections/collection1/leaders/shard2 Error:KeeperErrorCode = NoNode for /solr/collections/collection1/leaders/shard2
[junit4:junit4]   2> 6007 T1428 oasc.ShardLeaderElectionContext.runLeaderProcess Running the leader process.
[junit4:junit4]   2> 6008 T1378 oazs.PrepRequestProcessor.pRequest Got user-level KeeperException when processing sessionid:0x13b9111083c0007 type:create cxid:0x45 zxid:0x7f txntype:-1 reqpath:n/a Error Path:/solr/overseer Error:KeeperErrorCode = NodeExists for /solr/overseer
[junit4:junit4]   2> 6012 T1428 oasc.ShardLeaderElectionContext.waitForReplicasToComeUp Enough replicas found to continue.
[junit4:junit4]   2> 6013 T1428 oasc.ShardLeaderElectionContext.runLeaderProcess I may be the new leader - try and sync
[junit4:junit4]   2> 6013 T1428 oasc.SyncStrategy.sync Sync replicas to http://127.0.0.1:61183/solr/collection1/
[junit4:junit4]   2> 6013 T1428 oasc.SyncStrategy.syncReplicas Sync Success - now sync replicas to me
[junit4:junit4]   2> 6013 T1428 oasc.SyncStrategy.syncToMe http://127.0.0.1:61183/solr/collection1/ has no replicas
[junit4:junit4]   2> 6013 T1428 oasc.ShardLeaderElectionContext.runLeaderProcess I am the new leader: http://127.0.0.1:61183/solr/collection1/
[junit4:junit4]   2> 6014 T1428 oascc.SolrZkClient.makePath makePath: /collections/collection1/leaders/shard2
[junit4:junit4]   2> 6019 T1378 oazs.PrepRequestProcessor.pRequest Got user-level KeeperException when processing sessionid:0x13b9111083c0007 type:create cxid:0x4e zxid:0x82 txntype:-1 reqpath:n/a Error Path:/solr/overseer Error:KeeperErrorCode = NodeExists for /solr/overseer
[junit4:junit4]   2> 6459 T1396 oascc.ZkStateReader.updateClusterState Updating cloud state from ZooKeeper... 
[junit4:junit4]   2> 6472 T1395 oascc.ZkStateReader$2.process A cluster state change has occurred - updating... (3)
[junit4:junit4]   2> 6473 T1427 oascc.ZkStateReader$2.process A cluster state change has occurred - updating... (3)
[junit4:junit4]   2> 6472 T1412 oascc.ZkStateReader$2.process A cluster state change has occurred - updating... (3)
[junit4:junit4]   2> 6513 T1428 oasc.ZkController.register We are http://127.0.0.1:61183/solr/collection1/ and leader is http://127.0.0.1:61183/solr/collection1/
[junit4:junit4]   2> 6513 T1428 oasc.ZkController.register No LogReplay needed for core=collection1 baseURL=http://127.0.0.1:61183/solr
[junit4:junit4]   2> 6513 T1428 oasc.ZkController.checkRecovery I am the leader, no recovery necessary
[junit4:junit4]   2> 6514 T1428 oasc.ZkController.publish publishing core=collection1 state=active
[junit4:junit4]   2> 6514 T1428 oasc.ZkController.publish numShards not found on descriptor - reading it from system property
[junit4:junit4]   2> 6518 T1428 oascc.ZkStateReader.updateClusterState Updating cloud state from ZooKeeper... 
[junit4:junit4]   2> 6519 T1373 oass.SolrDispatchFilter.init user.dir=C:\Users\JenkinsSlave\workspace\Lucene-Solr-4.x-Windows\solr\build\solr-core\test\J0
[junit4:junit4]   2> 6520 T1373 oass.SolrDispatchFilter.init SolrDispatchFilter.init() done
[junit4:junit4]   2> 6520 T1373 oascsi.HttpClientUtil.createClient Creating new http client, config:maxConnections=128&maxConnectionsPerHost=32&followRedirects=false
[junit4:junit4]   2> 6824 T1373 oejs.Server.doStart jetty-8.1.8.v20121106
[junit4:junit4]   2> 6828 T1373 oejs.AbstractConnector.doStart Started SelectChannelConnector@0.0.0.0:61192
[junit4:junit4]   2> 6828 T1373 oasc.SolrResourceLoader.locateSolrHome JNDI not configured for solr (NoInitialContextEx)
[junit4:junit4]   2> 6829 T1373 oasc.SolrResourceLoader.locateSolrHome using system property solr.solr.home: C:\Users\JenkinsSlave\workspace\Lucene-Solr-4.x-Windows\solr\build\solr-core\test\J0\.\solrtest-jetty3-1355348517300
[junit4:junit4]   2> 6829 T1373 oasc.SolrResourceLoader.<init> new SolrResourceLoader for deduced Solr Home: 'C:\Users\JenkinsSlave\workspace\Lucene-Solr-4.x-Windows\solr\build\solr-core\test\J0\.\solrtest-jetty3-1355348517300\'
[junit4:junit4]   2> 6868 T1373 oass.SolrDispatchFilter.init SolrDispatchFilter.init()
[junit4:junit4]   2> 6869 T1373 oasc.SolrResourceLoader.locateSolrHome JNDI not configured for solr (NoInitialContextEx)
[junit4:junit4]   2> 6869 T1373 oasc.SolrResourceLoader.locateSolrHome using system property solr.solr.home: C:\Users\JenkinsSlave\workspace\Lucene-Solr-4.x-Windows\solr\build\solr-core\test\J0\.\solrtest-jetty3-1355348517300
[junit4:junit4]   2> 6870 T1373 oasc.CoreContainer$Initializer.initialize looking for solr.xml: C:\Users\JenkinsSlave\workspace\Lucene-Solr-4.x-Windows\solr\build\solr-core\test\J0\.\solrtest-jetty3-1355348517300\solr.xml
[junit4:junit4]   2> 6870 T1373 oasc.CoreContainer.<init> New CoreContainer 505165
[junit4:junit4]   2> 6870 T1373 oasc.CoreContainer.load Loading CoreContainer using Solr Home: 'C:\Users\JenkinsSlave\workspace\Lucene-Solr-4.x-Windows\solr\build\solr-core\test\J0\.\solrtest-jetty3-1355348517300\'
[junit4:junit4]   2> 6870 T1373 oasc.SolrResourceLoader.<init> new SolrResourceLoader for directory: 'C:\Users\JenkinsSlave\workspace\Lucene-Solr-4.x-Windows\solr\build\solr-core\test\J0\.\solrtest-jetty3-1355348517300\'
[junit4:junit4]   2> 6892 T1373 oasc.CoreContainer.load Registering Log Listener
[junit4:junit4]   2> 6910 T1373 oasc.CoreContainer.initZooKeeper Zookeeper client=127.0.0.1:61158/solr
[junit4:junit4]   2> 6911 T1373 oasc.ZkController.checkChrootPath zkHost includes chroot
[junit4:junit4]   2> 6912 T1373 oaz.ZooKeeper.<init> Initiating client connection, connectString=127.0.0.1:61158 sessionTimeout=60000 watcher=org.apache.solr.common.cloud.ConnectionManager@103ac26
[junit4:junit4]   2> 6913 T1373 oascc.ConnectionManager.waitForConnected Waiting for client to connect to ZooKeeper
[junit4:junit4]   2> 6915 T1439 oaz.ClientCnxn$SendThread.logStartConnect Opening socket connection to server 127.0.0.1/127.0.0.1:61158. Will not attempt to authenticate using SASL (access denied (javax.security.auth.AuthPermission getLoginConfiguration))
[junit4:junit4]   2> 6915 T1439 oaz.ClientCnxn$SendThread.primeConnection Socket connection established to 127.0.0.1/127.0.0.1:61158, initiating session
[junit4:junit4]   2> 6915 T1375 oazs.NIOServerCnxnFactory.run Accepted socket connection from /127.0.0.1:61197
[junit4:junit4]   2> 6916 T1375 oazs.ZooKeeperServer.processConnectRequest Client attempting to establish new session at /127.0.0.1:61197
[junit4:junit4]   2> 6925 T1377 oazs.ZooKeeperServer.finishSessionInit Established session 0x13b9111083c0008 with negotiated timeout 20000 for client /127.0.0.1:61197
[junit4:junit4]   2> 6925 T1439 oaz.ClientCnxn$SendThread.onConnected Session establishment complete on server 127.0.0.1/127.0.0.1:61158, sessionid = 0x13b9111083c0008, negotiated timeout = 20000
[junit4:junit4]   2> 6925 T1440 oascc.ConnectionManager.process Watcher org.apache.solr.common.cloud.ConnectionManager@103ac26 name:ZooKeeperConnection Watcher:127.0.0.1:61158 got event WatchedEvent state:SyncConnected type:None path:null path:null type:None
[junit4:junit4]   2> 6926 T1373 oascc.ConnectionManager.waitForConnected Client is connected to ZooKeeper
[junit4:junit4]   2> 6928 T1378 oazs.PrepRequestProcessor.pRequest2Txn Processed session termination for sessionid: 0x13b9111083c0008
[junit4:junit4]   2> 6929 T1440 oaz.ClientCnxn$EventThread.run EventThread shut down
[junit4:junit4]   2> 6929 T1375 oazs.NIOServerCnxn.doIO WARNING caught end of stream exception EndOfStreamException: Unable to read additional data from client sessionid 0x13b9111083c0008, likely client has closed socket
[junit4:junit4]   2> 	at org.apache.zookeeper.server.NIOServerCnxn.doIO(NIOServerCnxn.java:220)
[junit4:junit4]   2> 	at org.apache.zookeeper.server.NIOServerCnxnFactory.run(NIOServerCnxnFactory.java:208)
[junit4:junit4]   2> 	at java.lang.Thread.run(Thread.java:662)
[junit4:junit4]   2> 
[junit4:junit4]   2> 6929 T1373 oaz.ZooKeeper.close Session: 0x13b9111083c0008 closed
[junit4:junit4]   2> 6930 T1375 oazs.NIOServerCnxn.closeSock Closed socket connection for client /127.0.0.1:61197 which had sessionid 0x13b9111083c0008
[junit4:junit4]   2> 6930 T1373 oaz.ZooKeeper.<init> Initiating client connection, connectString=127.0.0.1:61158/solr sessionTimeout=8000 watcher=org.apache.solr.common.cloud.ConnectionManager@10021d3
[junit4:junit4]   2> 6932 T1373 oascc.ConnectionManager.waitForConnected Waiting for client to connect to ZooKeeper
[junit4:junit4]   2> 6933 T1441 oaz.ClientCnxn$SendThread.logStartConnect Opening socket connection to server 127.0.0.1/127.0.0.1:61158. Will not attempt to authenticate using SASL (access denied (javax.security.auth.AuthPermission getLoginConfiguration))
[junit4:junit4]   2> 6937 T1441 oaz.ClientCnxn$SendThread.primeConnection Socket connection established to 127.0.0.1/127.0.0.1:61158, initiating session
[junit4:junit4]   2> 6937 T1375 oazs.NIOServerCnxnFactory.run Accepted socket connection from /127.0.0.1:61200
[junit4:junit4]   2> 6937 T1375 oazs.ZooKeeperServer.processConnectRequest Client attempting to establish new session at /127.0.0.1:61200
[junit4:junit4]   2> 6939 T1377 oazs.ZooKeeperServer.finishSessionInit Established session 0x13b9111083c0009 with negotiated timeout 8000 for client /127.0.0.1:61200
[junit4:junit4]   2> 6939 T1441 oaz.ClientCnxn$SendThread.onConnected Session establishment complete on server 127.0.0.1/127.0.0.1:61158, sessionid = 0x13b9111083c0009, negotiated timeout = 8000
[junit4:junit4]   2> 6939 T1442 oascc.ConnectionManager.process Watcher org.apache.solr.common.cloud.ConnectionManager@10021d3 name:ZooKeeperConnection Watcher:127.0.0.1:61158/solr got event WatchedEvent state:SyncConnected type:None path:null path:null type:None
[junit4:junit4]   2> 6940 T1373 oascc.ConnectionManager.waitForConnected Client is connected to ZooKeeper
[junit4:junit4]   2> 6941 T1378 oazs.PrepRequestProcessor.pRequest Got user-level KeeperException when processing sessionid:0x13b9111083c0009 type:create cxid:0x1 zxid:0x8f txntype:-1 reqpath:n/a Error Path:/solr/overseer Error:KeeperErrorCode = NodeExists for /solr/overseer
[junit4:junit4]   2> 6942 T1378 oazs.PrepRequestProcessor.pRequest Got user-level KeeperException when processing sessionid:0x13b9111083c0009 type:create cxid:0x2 zxid:0x90 txntype:-1 reqpath:n/a Error Path:/solr/overseer Error:KeeperErrorCode = NodeExists for /solr/overseer
[junit4:junit4]   2> 6944 T1373 oasc.ZkController.createEphemeralLiveNode Register node as live in ZooKeeper:/live_nodes/127.0.0.1:61192_solr
[junit4:junit4]   2> 6950 T1378 oazs.PrepRequestProcessor.pRequest Got user-level KeeperException when processing sessionid:0x13b9111083c0009 type:delete cxid:0x4 zxid:0x91 txntype:-1 reqpath:n/a Error Path:/solr/live_nodes/127.0.0.1:61192_solr Error:KeeperErrorCode = NoNode for /solr/live_nodes/127.0.0.1:61192_solr
[junit4:junit4]   2> 6954 T1373 oascc.SolrZkClient.makePath makePath: /live_nodes/127.0.0.1:61192_solr
[junit4:junit4]   2> 6957 T1427 oascc.ZkStateReader$2.process A cluster state change has occurred - updating... (3)
[junit4:junit4]   2> 6959 T1395 oascc.ZkStateReader$2.process A cluster state change has occurred - updating... (3)
[junit4:junit4]   2> 6959 T1412 oascc.ZkStateReader$3.process Updating live nodes... (4)
[junit4:junit4]   2> 6959 T1412 oascc.ZkStateReader$2.process A cluster state change has occurred - updating... (4)
[junit4:junit4]   2> 6961 T1373 oashc.HttpShardHandlerFactory.getParameter Setting socketTimeout to: 0
[junit4:junit4]   2> 6963 T1427 oascc.ZkStateReader$3.process Updating live nodes... (4)
[junit4:junit4]   2> 6963 T1373 oashc.HttpShardHandlerFactory.getParameter Setting urlScheme to: http://
[junit4:junit4]   2> 6963 T1373 oashc.HttpShardHandlerFactory.getParameter Setting connTimeout to: 0
[junit4:junit4]   2> 6963 T1395 oascc.ZkStateReader$3.process Updating live nodes... (4)
[junit4:junit4]   2> 6964 T1373 oashc.HttpShardHandlerFactory.getParameter Setting maxConnectionsPerHost to: 20
[junit4:junit4]   2> 6964 T1373 oashc.HttpShardHandlerFactory.getParameter Setting corePoolSize to: 0
[junit4:junit4]   2> 6964 T1373 oashc.HttpShardHandlerFactory.getParameter Setting maximumPoolSize to: 2147483647
[junit4:junit4]   2> 6964 T1373 oashc.HttpShardHandlerFactory.getParameter Setting maxThreadIdleTime to: 5
[junit4:junit4]   2> 6966 T1373 oashc.HttpShardHandlerFactory.getParameter Setting sizeOfQueue to: -1
[junit4:junit4]   2> 6966 T1373 oashc.HttpShardHandlerFactory.getParameter Setting fairnessPolicy to: false
[junit4:junit4]   2> 6966 T1373 oascsi.HttpClientUtil.createClient Creating new http client, config:maxConnectionsPerHost=20&maxConnections=10000&socketTimeout=0&connTimeout=0&retry=false
[junit4:junit4]   2> 6967 T1396 oascc.ZkStateReader.updateClusterState Updating cloud state from ZooKeeper... 
[junit4:junit4]   2> 6968 T1396 oasc.Overseer$ClusterStateUpdater.updateState Update state numShards=2 message={
[junit4:junit4]   2> 	  "operation":"state",
[junit4:junit4]   2> 	  "numShards":"2",
[junit4:junit4]   2> 	  "shard":"shard2",
[junit4:junit4]   2> 	  "roles":null,
[junit4:junit4]   2> 	  "state":"active",
[junit4:junit4]   2> 	  "core":"collection1",
[junit4:junit4]   2> 	  "collection":"collection1",
[junit4:junit4]   2> 	  "node_name":"127.0.0.1:61183_solr",
[junit4:junit4]   2> 	  "base_url":"http://127.0.0.1:61183/solr"}
[junit4:junit4]   2> 6976 T1412 oascc.ZkStateReader$2.process A cluster state change has occurred - updating... (4)
[junit4:junit4]   2> 6977 T1395 oascc.ZkStateReader$2.process A cluster state change has occurred - updating... (4)
[junit4:junit4]   2> 6977 T1427 oascc.ZkStateReader$2.process A cluster state change has occurred - updating... (4)
[junit4:junit4]   2> 6983 T1373 oascc.ZkStateReader.createClusterStateWatchersAndUpdate Updating cluster state from ZooKeeper... 
[junit4:junit4]   2> 6992 T1443 oasc.CoreContainer.create Creating SolrCore 'collection1' using instanceDir: C:\Users\JenkinsSlave\workspace\Lucene-Solr-4.x-Windows\solr\build\solr-core\test\J0\.\solrtest-jetty3-1355348517300\collection1
[junit4:junit4]   2> 6992 T1443 oasc.ZkController.createCollectionZkNode Check for collection zkNode:collection1
[junit4:junit4]   2> 6993 T1443 oasc.ZkController.createCollectionZkNode Collection zkNode exists
[junit4:junit4]   2> 6993 T1443 oasc.ZkController.readConfigName Load collection config from:/collections/collection1
[junit4:junit4]   2> 6995 T1443 oasc.SolrResourceLoader.<init> new SolrResourceLoader for directory: 'C:\Users\JenkinsSlave\workspace\Lucene-Solr-4.x-Windows\solr\build\solr-core\test\J0\.\solrtest-jetty3-1355348517300\collection1\'
[junit4:junit4]   2> 6997 T1443 oasc.SolrResourceLoader.replaceClassLoader Adding 'file:/C:/Users/JenkinsSlave/workspace/Lucene-Solr-4.x-Windows/solr/build/solr-core/test/J0/solrtest-jetty3-1355348517300/collection1/lib/classes/' to classloader
[junit4:junit4]   2> 6998 T1443 oasc.SolrResourceLoader.replaceClassLoader Adding 'file:/C:/Users/JenkinsSlave/workspace/Lucene-Solr-4.x-Windows/solr/build/solr-core/test/J0/solrtest-jetty3-1355348517300/collection1/lib/README' to classloader
[junit4:junit4]   2> 7055 T1443 oasc.SolrConfig.<init> Using Lucene MatchVersion: LUCENE_41
[junit4:junit4]   2> 7135 T1443 oasc.SolrConfig.<init> Loaded SolrConfig: solrconfig.xml
[junit4:junit4]   2> 7136 T1443 oass.IndexSchema.readSchema Reading Solr Schema
[junit4:junit4]   2> 7141 T1443 oass.IndexSchema.readSchema Schema name=test
[junit4:junit4]   2> 7851 T1443 oass.OpenExchangeRatesOrgProvider.init Initialized with rates=open-exchange-rates.json, refreshInterval=1440.
[junit4:junit4]   2> 7861 T1443 oass.IndexSchema.readSchema default search field in schema is text
[junit4:junit4]   2> 7865 T1443 oass.IndexSchema.readSchema unique key field: id
[junit4:junit4]   2> 7885 T1443 oass.FileExchangeRateProvider.reload Reloading exchange rates from file currency.xml
[junit4:junit4]   2> 7889 T1443 oass.FileExchangeRateProvider.reload Reloading exchange rates from file currency.xml
[junit4:junit4]   2> 7895 T1443 oass.OpenExchangeRatesOrgProvider.reload Reloading exchange rates from open-exchange-rates.json
[junit4:junit4]   2> 7897 T1443 oass.OpenExchangeRatesOrgProvider.reload Reloading exchange rates from open-exchange-rates.json
[junit4:junit4]   2> 7900 T1443 oasc.SolrCore.<init> [collection1] Opening new SolrCore at C:\Users\JenkinsSlave\workspace\Lucene-Solr-4.x-Windows\solr\build\solr-core\test\J0\.\solrtest-jetty3-1355348517300\collection1\, dataDir=.\org.apache.solr.cloud.BasicDistributedZkTest-1355348510767/jetty3\
[junit4:junit4]   2> 7900 T1443 oasc.JmxMonitoredMap.<init> JMX monitoring is enabled. Adding Solr mbeans to JMX Server: com.sun.jmx.mbeanserver.JmxMBeanServer@1759d12
[junit4:junit4]   2> 7901 T1443 oasc.SolrCore.getNewIndexDir New index directory detected: old=null new=.\org.apache.solr.cloud.BasicDistributedZkTest-1355348510767/jetty3\index/
[junit4:junit4]   2> 7902 T1443 oasc.SolrCore.initIndex WARNING [collection1] Solr index directory '.\org.apache.solr.cloud.BasicDistributedZkTest-1355348510767\jetty3\index' doesn't exist. Creating new index...
[junit4:junit4]   2> 7903 T1443 oasc.CachingDirectoryFactory.get return new directory for C:\Users\JenkinsSlave\workspace\Lucene-Solr-4.x-Windows\solr\build\solr-core\test\J0\.\org.apache.solr.cloud.BasicDistributedZkTest-1355348510767\jetty3\index forceNew:false
[junit4:junit4]   2> 7920 T1443 oasc.SolrDeletionPolicy.onCommit SolrDeletionPolicy.onCommit: commits:num=1
[junit4:junit4]   2> 		commit{dir=RateLimitedDirectoryWrapper(NRTCachingDirectory(org.apache.lucene.store.SimpleFSDirectory@C:\Users\JenkinsSlave\workspace\Lucene-Solr-4.x-Windows\solr\build\solr-core\test\J0\org.apache.solr.cloud.BasicDistributedZkTest-1355348510767\jetty3\index lockFactory=org.apache.lucene.store.NativeFSLockFactory@184425c; maxCacheMB=48.0 maxMergeSizeMB=4.0)),segFN=segments_1,generation=1,filenames=[segments_1]
[junit4:junit4]   2> 7921 T1443 oasc.SolrDeletionPolicy.updateCommits newest commit = 1
[junit4:junit4]   2> 7924 T1443 oasc.SolrCore.initWriters created xml: solr.XMLResponseWriter
[junit4:junit4]   2> 7925 T1443 oasup.UpdateRequestProcessorChain.init inserting DistributedUpdateProcessorFactory into updateRequestProcessorChain "dedupe"
[junit4:junit4]   2> 7925 T1443 oasup.UpdateRequestProcessorChain.init inserting DistributedUpdateProcessorFactory into updateRequestProcessorChain "dedupe-allfields"
[junit4:junit4]   2> 7925 T1443 oasup.UpdateRequestProcessorChain.init inserting DistributedUpdateProcessorFactory into updateRequestProcessorChain "stored_sig"
[junit4:junit4]   2> 7925 T1443 oasup.UpdateRequestProcessorChain.init inserting DistributedUpdateProcessorFactory into updateRequestProcessorChain "uniq-fields"
[junit4:junit4]   2> 7927 T1443 oasup.UpdateRequestProcessorChain.init inserting DistributedUpdateProcessorFactory into updateRequestProcessorChain "distrib-dup-test-chain-implicit"
[junit4:junit4]   2> 7927 T1443 oasc.RequestHandlers.initHandlersFromConfig adding lazy requestHandler: solr.ReplicationHandler
[junit4:junit4]   2> 7927 T1443 oasc.RequestHandlers.initHandlersFromConfig created /replication: solr.ReplicationHandler
[junit4:junit4]   2> 7928 T1443 oasc.RequestHandlers.initHandlersFromConfig created standard: solr.StandardRequestHandler
[junit4:junit4]   2> 7928 T1443 oasc.RequestHandlers.initHandlersFromConfig created /get: solr.RealTimeGetHandler
[junit4:junit4]   2> 7935 T1443 oasc.RequestHandlers.initHandlersFromConfig created dismax: solr.SearchHandler
[junit4:junit4]   2> 7936 T1443 oasc.RequestHandlers.initHandlersFromConfig created mock: org.apache.solr.core.MockQuerySenderListenerReqHandler
[junit4:junit4]   2> 7936 T1443 oasc.RequestHandlers.initHandlersFromConfig created /admin/: org.apache.solr.handler.admin.AdminHandlers
[junit4:junit4]   2> 7937 T1443 oasc.RequestHandlers.initHandlersFromConfig created defaults: solr.StandardRequestHandler
[junit4:junit4]   2> 7937 T1443 oasc.RequestHandlers.initHandlersFromConfig adding lazy requestHandler: solr.StandardRequestHandler
[junit4:junit4]   2> 7937 T1443 oasc.RequestHandlers.initHandlersFromConfig created lazy: solr.StandardRequestHandler
[junit4:junit4]   2> 7938 T1443 oasc.RequestHandlers.initHandlersFromConfig created /update: solr.UpdateRequestHandler
[junit4:junit4]   2> 7938 T1443 oasc.RequestHandlers.initHandlersFromConfig created /terms: org.apache.solr.handler.component.SearchHandler
[junit4:junit4]   2> 7938 T1443 oasc.RequestHandlers.initHandlersFromConfig created spellCheckCompRH: org.apache.solr.handler.component.SearchHandler
[junit4:junit4]   2> 7939 T1443 oasc.RequestHandlers.initHandlersFromConfig created spellCheckCompRH_Direct: org.apache.solr.handler.component.SearchHandler
[junit4:junit4]   2> 7940 T1443 oasc.RequestHandlers.initHandlersFromConfig created spellCheckWithWordbreak: org.apache.solr.handler.component.SearchHandler
[junit4:junit4]   2> 7941 T1443 oasc.RequestHandlers.initHandlersFromConfig created spellCheckWithWordbreak_Direct: org.apache.solr.handler.component.SearchHandler
[junit4:junit4]   2> 7942 T1443 oasc.RequestHandlers.initHandlersFromConfig created spellCheckCompRH1: org.apache.solr.handler.component.SearchHandler
[junit4:junit4]   2> 7942 T1443 oasc.RequestHandlers.initHandlersFromConfig created tvrh: org.apache.solr.handler.component.SearchHandler
[junit4:junit4]   2> 7944 T1443 oasc.RequestHandlers.initHandlersFromConfig created /mlt: solr.MoreLikeThisHandler
[junit4:junit4]   2> 7945 T1443 oasc.RequestHandlers.initHandlersFromConfig created /debug/dump: solr.DumpRequestHandler
[junit4:junit4]   2> 7954 T1443 oashl.XMLLoader.init xsltCacheLifetimeSeconds=60
[junit4:junit4]   2> 7959 T1443 oasc.SolrCore.initDeprecatedSupport WARNING solrconfig.xml uses deprecated <admin/gettableFiles>, Please update your config to use the ShowFileRequestHandler.
[junit4:junit4]   2> 7961 T1443 oasc.SolrCore.initDeprecatedSupport WARNING adding ShowFileRequestHandler with hidden files: [SCHEMA.XML, OLD_SYNONYMS.TXT, STOPWORDS.TXT, PROTWORDS.TXT, OPEN-EXCHANGE-RATES.JSON, SYNONYMS.TXT, CURRENCY.XML, MAPPING-ISOLATIN1ACCENT.TXT]
[junit4:junit4]   2> 7966 T1443 oass.SolrIndexSearcher.<init> Opening Searcher@12d0633 main
[junit4:junit4]   2> 7967 T1443 oass.SolrIndexSearcher.getIndexDir WARNING WARNING: Directory impl does not support setting indexDir: org.apache.lucene.store.RateLimitedDirectoryWrapper
[junit4:junit4]   2> 7968 T1443 oasu.CommitTracker.<init> Hard AutoCommit: disabled
[junit4:junit4]   2> 7969 T1443 oasu.CommitTracker.<init> Soft AutoCommit: disabled
[junit4:junit4]   2> 7969 T1443 oashc.SpellCheckComponent.inform Initializing spell checkers
[junit4:junit4]   2> 7982 T1443 oass.DirectSolrSpellChecker.init init: {name=direct,classname=DirectSolrSpellChecker,field=lowerfilt,minQueryLength=3}
[junit4:junit4]   2> 8036 T1444 oasc.SolrCore.registerSearcher [collection1] Registered new searcher Searcher@12d0633 main{StandardDirectoryReader(segments_1:1)}
[junit4:junit4]   2> 8042 T1443 oasc.ZkController.publish publishing core=collection1 state=down
[junit4:junit4]   2> 8042 T1443 oasc.ZkController.publish numShards not found on descriptor - reading it from system property
[junit4:junit4]   2> 8437 T1396 oascc.ZkStateReader.updateClusterState Updating cloud state from ZooKeeper... 
[junit4:junit4]   2> 8438 T1396 oasc.Overseer$ClusterStateUpdater.updateState Update state numShards=2 message={
[junit4:junit4]   2> 	  "operation":"state",
[junit4:junit4]   2> 	  "numShards":"2",
[junit4:junit4]   2> 	  "shard":null,
[junit4:junit4]   2> 	  "roles":null,
[junit4:junit4]   2> 	  "state":"down",
[junit4:junit4]   2> 	  "core":"collection1",
[junit4:junit4]   2> 	  "collection":"collection1",
[junit4:junit4]   2> 	  "node_name":"127.0.0.1:61192_solr",
[junit4:junit4]   2> 	  "base_url":"http://127.0.0.1:61192/solr"}
[junit4:junit4]   2> 8438 T1396 oasc.Overseer$ClusterStateUpdater.updateState Collection already exists with numShards=2
[junit4:junit4]   2> 8439 T1396 oasc.Overseer$ClusterStateUpdater.updateState Assigning new node to shard shard=shard1
[junit4:junit4]   2> 8446 T1412 oascc.ZkStateReader$2.process A cluster state change has occurred - updating... (4)
[junit4:junit4]   2> 8446 T1442 oascc.ZkStateReader$2.process A cluster state change has occurred - updating... (4)
[junit4:junit4]   2> 8447 T1395 oascc.ZkStateReader$2.process A cluster state change has occurred - updating... (4)
[junit4:junit4]   2> 8447 T1427 oascc.ZkStateReader$2.process A cluster state change has occurred - updating... (4)
[junit4:junit4]   2> 8527 T1443 oasc.CoreContainer.register registering core: collection1
[junit4:junit4]   2> 8527 T1443 oasc.ZkController.register Register shard - core:collection1 address:http://127.0.0.1:61192/solr shardId:shard1
[junit4:junit4]   2> 8532 T1443 oasc.ZkController.register We are http://127.0.0.1:61192/solr/collection1/ and leader is http://127.0.0.1:61174/solr/collection1/
[junit4:junit4]   2> 8532 T1443 oasc.ZkController.register No LogReplay needed for core=collection1 baseURL=http://127.0.0.1:61192/solr
[junit4:junit4]   2> 8532 T1443 oasc.ZkController.checkRecovery Core needs to recover:collection1
[junit4:junit4]   2> 8532 T1443 oasu.DefaultSolrCoreState.doRecovery Running recovery - first canceling any ongoing recovery
[junit4:junit4]   2> ASYNC  NEW_CORE C108 name=collection1 org.apache.solr.core.SolrCore@9663f1 url=http://127.0.0.1:61192/solr/collection1 node=127.0.0.1:61192_solr
[junit4:junit4]   2> 8533 T1445 C108 P61192 oasc.RecoveryStrategy.run Starting recovery process.  core=collection1 recoveringAfterStartup=true
[junit4:junit4]   2> 8534 T1445 C108 P61192 oasc.RecoveryStrategy.doRecovery ###### startupVersions=[]
[junit4:junit4]   2> 8534 T1445 C108 P61192 oasc.ZkController.publish publishing core=collection1 state=recovering
[junit4:junit4]   2> 8534 T1445 C108 P61192 oasc.ZkController.publish numShards not found on descriptor - reading it from system property
[junit4:junit4]   2> 8535 T1443 oascc.ZkStateReader.updateClusterState Updating cloud state from ZooKeeper... 
[junit4:junit4]   2> 8537 T1445 C108 P61192 oasc.RecoveryStrategy.doRecovery Attempting to PeerSync from http://127.0.0.1:61174/solr/collection1/ core=collection1 - recoveringAfterStartup=true
[junit4:junit4]   2> 8538 T1445 C108 P61192 oasu.PeerSync.sync PeerSync: core=collection1 url=http://127.0.0.1:61192/solr START replicas=[http://127.0.0.1:61174/solr/collection1/] nUpdates=100
[junit4:junit4]   2> 8538 T1445 C108 P61192 oasu.PeerSync.sync WARNING no frame of reference to tell of we've missed updates
[junit4:junit4]   2> 8538 T1445 C108 P61192 oasc.RecoveryStrategy.doRecovery PeerSync Recovery was not successful - trying replication. core=collection1
[junit4:junit4]   2> 8539 T1445 C108 P61192 oasc.RecoveryStrategy.doRecovery Starting Replication Recovery. core=collection1
[junit4:junit4]   2> 8539 T1445 C108 P61192 oascsi.HttpClientUtil.createClient Creating new http client, config:maxConnections=128&maxConnectionsPerHost=32&followRedirects=false
[junit4:junit4]   2> 8540 T1373 oass.SolrDispatchFilter.init user.dir=C:\Users\JenkinsSlave\workspace\Lucene-Solr-4.x-Windows\solr\build\solr-core\test\J0
[junit4:junit4]   2> 8541 T1373 oass.SolrDispatchFilter.init SolrDispatchFilter.init() done
[junit4:junit4]   2> 8541 T1373 oascsi.HttpClientUtil.createClient Creating new http client, config:maxConnections=128&maxConnectionsPerHost=32&followRedirects=false
[junit4:junit4]   2> ASYNC  NEW_CORE C109 name=collection1 org.apache.solr.core.SolrCore@1a26e54 url=http://127.0.0.1:61174/solr/collection1 node=127.0.0.1:61174_solr
[junit4:junit4]   2> 8558 T1404 C109 P61174 REQ /get {distrib=false&qt=/get&wt=javabin&version=2&getVersions=100} status=0 QTime=1 
[junit4:junit4]   2> 8844 T1373 oejs.Server.doStart jetty-8.1.8.v20121106
[junit4:junit4]   2> 8847 T1373 oejs.AbstractConnector.doStart Started SelectChannelConnector@0.0.0.0:61203
[junit4:junit4]   2> 8848 T1373 oasc.SolrResourceLoader.locateSolrHome JNDI not configured for solr (NoInitialContextEx)
[junit4:junit4]   2> 8848 T1373 oasc.SolrResourceLoader.locateSolrHome using system property solr.solr.home: C:\Users\JenkinsSlave\workspace\Lucene-Solr-4.x-Windows\solr\build\solr-core\test\J0\.\solrtest-jetty4-1355348519316
[junit4:junit4]   2> 8849 T1373 oasc.SolrResourceLoader.<init> new SolrResourceLoader for deduced Solr Home: 'C:\Users\JenkinsSlave\workspace\Lucene-Solr-4.x-Windows\solr\build\solr-core\test\J0\.\solrtest-jetty4-1355348519316\'
[junit4:junit4]   2> 8883 T1373 oass.SolrDispatchFilter.init SolrDispatchFilter.init()
[junit4:junit4]   2> 8884 T1373 oasc.SolrResourceLoader.locateSolrHome JNDI not configured for solr (NoInitialContextEx)
[junit4:junit4]   2> 8884 T1373 oasc.SolrResourceLoader.locateSolrHome using system property solr.solr.home: C:\Users\JenkinsSlave\workspace\Lucene-Solr-4.x-Windows\solr\build\solr-core\test\J0\.\solrtest-jetty4-1355348519316
[junit4:junit4]   2> 8885 T1373 oasc.CoreContainer$Initializer.initialize looking for solr.xml: C:\Users\JenkinsSlave\workspace\Lucene-Solr-4.x-Windows\solr\build\solr-core\test\J0\.\solrtest-jetty4-1355348519316\solr.xml
[junit4:junit4]   2> 8885 T1373 oasc.CoreContainer.<init> New CoreContainer 16923017
[junit4:junit4]   2> 8886 T1373 oasc.CoreContainer.load Loading CoreContainer using Solr Home: 'C:\Users\JenkinsSlave\workspace\Lucene-Solr-4.x-Windows\solr\build\solr-core\test\J0\.\solrtest-jetty4-1355348519316\'
[junit4:junit4]   2> 8886 T1373 oasc.SolrResourceLoader.<init> new SolrResourceLoader for directory: 'C:\Users\JenkinsSlave\workspace\Lucene-Solr-4.x-Windows\solr\build\solr-core\test\J0\.\solrtest-jetty4-1355348519316\'
[junit4:junit4]   2> 8908 T1373 oasc.CoreContainer.load Registering Log Listener
[junit4:junit4]   2> 8936 T1373 oasc.CoreContainer.initZooKeeper Zookeeper client=127.0.0.1:61158/solr
[junit4:junit4]   2> 8937 T1373 oasc.ZkController.checkChrootPath zkHost includes chroot
[junit4:junit4]   2> 8937 T1373 oaz.ZooKeeper.<init> Initiating client connection, connectString=127.0.0.1:61158 sessionTimeout=60000 watcher=org.apache.solr.common.cloud.ConnectionManager@2047ce
[junit4:junit4]   2> 8939 T1396 oascc.ZkStateReader.updateClusterState Updating cloud state from ZooKeeper... 
[junit4:junit4]   2> 8939 T1373 oascc.ConnectionManager.waitForConnected Waiting for client to connect to ZooKeeper
[junit4:junit4]   2> 8941 T1456 oaz.ClientCnxn$SendThread.logStartConnect Opening socket connection to server 127.0.0.1/127.0.0.1:61158. Will not attempt to authenticate using SASL (access denied (javax.security.auth.AuthPermission getLoginConfiguration))
[junit4:junit4]   2> 8942 T1456 oaz.ClientCnxn$SendThread.primeConnection Socket connection established to 127.0.0.1/127.0.0.1:61158, initiating session
[junit4:junit4]   2> 8942 T1375 oazs.NIOServerCnxnFactory.run Accepted socket connection from /127.0.0.1:61208
[junit4:junit4]   2> 8942 T1375 oazs.ZooKeeperServer.processConnectRequest Client attempting to establish new session at /127.0.0.1:61208
[junit4:junit4]   2> 8942 T1396 oasc.Overseer$ClusterStateUpdater.updateState Update state numShards=2 message={
[junit4:junit4]   2> 	  "operation":"state",
[junit4:junit4]   2> 	  "numShards":"2",
[junit4:junit4]   2> 	  "shard":"shard1",
[junit4:junit4]   2> 	  "roles":null,
[junit4:junit4]   2> 	  "state":"recovering",
[junit4:junit4]   2> 	  "core":"collection1",
[junit4:junit4]   2> 	  "collection":"collection1",
[junit4:junit4]   2> 	  "node_name":"127.0.0.1:61192_solr",
[junit4:junit4]   2> 	  "base_url":"http://127.0.0.1:61192/solr"}
[junit4:junit4]   2> 8956 T1377 oazs.ZooKeeperServer.finishSessionInit Established session 0x13b9111083c000a with negotiated timeout 20000 for client /127.0.0.1:61208
[junit4:junit4]   2> 8956 T1456 oaz.ClientCnxn$SendThread.onConnected Session establishment complete on server 127.0.0.1/127.0.0.1:61158, sessionid = 0x13b9111083c000a, negotiated timeout = 20000
[junit4:junit4]   2> 8956 T1457 oascc.ConnectionManager.process Watcher org.apache.solr.common.cloud.ConnectionManager@2047ce name:ZooKeeperConnection Watcher:127.0.0.1:61158 got event WatchedEvent state:SyncConnected type:None path:null path:null type:None
[junit4:junit4]   2> 8957 T1373 oascc.ConnectionManager.waitForConnected Client is connected to ZooKeeper
[junit4:junit4]   2> 8959 T1378 oazs.PrepRequestProcessor.pRequest2Txn Processed session termination for sessionid: 0x13b9111083c000a
[junit4:junit4]   2> 8961 T1375 oazs.NIOServerCnxn.closeSock Closed socket connection for client /127.0.0.1:61208 which had sessionid 0x13b9111083c000a
[junit4:junit4]   2> 8962 T1457 oaz.ClientCnxn$EventThread.run EventThread shut down
[junit4:junit4]   2> 8961 T1373 oaz.ZooKeeper.close Session: 0x13b9111083c000a closed
[junit4:junit4]   2> 8963 T1373 oaz.ZooKeeper.<init> Initiating client connection, connectString=127.0.0.1:61158/solr sessionTimeout=8000 watcher=org.apache.solr.common.cloud.ConnectionManager@226250
[junit4:junit4]   2> 8965 T1373 oascc.ConnectionManager.waitForConnected Waiting for client to connect to ZooKeeper
[junit4:junit4]   2> 8967 T1458 oaz.ClientCnxn$SendThread.logStartConnect Opening socket connection to server 127.0.0.1/127.0.0.1:61158. Will not attempt to authenticate using SASL (access denied (javax.security.auth.AuthPermission getLoginConfiguration))
[junit4:junit4]   2> 8968 T1458 oaz.ClientCnxn$SendThread.primeConnection Socket connection established to 127.0.0.1/127.0.0.1:61158, initiating session
[junit4:junit4]   2> 8968 T1375 oazs.NIOServerCnxnFactory.run Accepted socket connection from /127.0.0.1:61211
[junit4:junit4]   2> 8969 T1375 oazs.ZooKeeperServer.processConnectRequest Client attempting to establish new session at /127.0.0.1:61211
[junit4:junit4]   2> 8969 T1412 oascc.ZkStateReader$2.process A cluster state change has occurred - updating... (4)
[junit4:junit4]   2> 8969 T1442 oascc.ZkStateReader$2.process A cluster state change has occurred - updating... (4)
[junit4:junit4]   2> 8970 T1427 oascc.ZkStateReader$2.process A cluster state change has occurred - updating... (4)
[junit4:junit4]   2> 8971 T1395 oascc.ZkStateReader$2.process A cluster state change has occurred - updating... (4)
[junit4:junit4]   2> 8972 T1377 oazs.ZooKeeperServer.finishSessionInit Established session 0x13b9111083c000b with negotiated timeout 8000 for client /127.0.0.1:61211
[junit4:junit4]   2> 8972 T1458 oaz.ClientCnxn$SendThread.onConnected Session establishment complete on server 127.0.0.1/127.0.0.1:61158, sessionid = 0x13b9111083c000b, negotiated timeout = 8000
[junit4:junit4]   2> 8972 T1459 oascc.ConnectionManager.process Watcher org.apache.solr.common.cloud.ConnectionManager@226250 name:ZooKeeperConnection Watcher:127.0.0.1:61158/solr got event WatchedEvent state:SyncConnected type:None path:null path:null type:None
[junit4:junit4]   2> 8972 T1373 oascc.ConnectionManager.waitForConnected Client is connected to ZooKeeper
[junit4:junit4]   2> 8974 T1378 oazs.PrepRequestProcessor.pRequest Got user-level KeeperException when processing sessionid:0x13b9111083c000b type:create cxid:0x1 zxid:0xa5 txntype:-1 reqpath:n/a Error Path:/solr/overseer Error:KeeperErrorCode = NodeExists for /solr/overseer
[junit4:junit4]   2> 8977 T1378 oazs.PrepRequestProcessor.pRequest Got user-level KeeperException when processing sessionid:0x13b9111083c000b type:create cxid:0x2 zxid:0xa7 txntype:-1 reqpath:n/a Error Path:/solr/overseer Error:KeeperErrorCode = NodeExists for /solr/overseer
[junit4:junit4]   2> 8979 T1373 oasc.ZkController.createEphemeralLiveNode Register node as live in ZooKeeper:/live_nodes/127.0.0.1:61203_solr
[junit4:junit4]   2> 8981 T1378 oazs.PrepRequestProcessor.pRequest Got user-level KeeperException when processing sessionid:0x13b9111083c000b type:delete cxid:0x4 zxid:0xa8 txntype:-1 reqpath:n/a Error Path:/solr/live_nodes/127.0.0.1:61203_solr Error:KeeperErrorCode = NoNode for /solr/live_nodes/127.0.0.1:61203_solr
[junit4:junit4]   2> 8983 T1373 oascc.SolrZkClient.makePath makePath: /live_nodes/127.0.0.1:61203_solr
[junit4:junit4]   2> 8987 T1427 oascc.ZkStateReader$2.process A cluster state change has occurred - updating... (4)
[junit4:junit4]   2> 8988 T1395 oascc.ZkStateReader$2.process A cluster state change has occurred - updating... (4)
[junit4:junit4]   2> 8988 T1412 oascc.ZkStateReader$3.process Updating live nodes... (5)
[junit4:junit4]   2> 8989 T1412 oascc.ZkStateReader$2.process A cluster state change has occurred - updating... (5)
[junit4:junit4]   2> 8989 T1442 oascc.ZkStateReader$3.process Updating live nodes... (5)
[junit4:junit4]   2> 8989 T1442 oascc.ZkStateReader$2.process A cluster state change has occurred - updating... (5)
[junit4:junit4]   2> 8989 T1373 oashc.HttpShardHandlerFactory.getParameter Setting socketTimeout to: 0
[junit4:junit4]   2> 8990 T1373 oashc.HttpShardHandlerFactory.getParameter Setting urlScheme to: http://
[junit4:junit4]   2> 8990 T1373 oashc.HttpShardHandlerFactory.getParameter Setting connTimeout to: 0
[junit4:junit4]   2> 8991 T1373 oashc.HttpShardHandlerFactory.getParameter Setting maxConnectionsPerHost to: 20
[junit4:junit4]   2> 8991 T1373 oashc.HttpShardHandlerFactory.getParameter Setting corePoolSize to: 0
[junit4:junit4]   2> 8991 T1373 oashc.HttpShardHandlerFactory.getParameter Setting maximumPoolSize to: 2147483647
[junit4:junit4]   2> 8991 T1373 oashc.HttpShardHandlerFactory.getParameter Setting maxThreadIdleTime to: 5
[junit4:junit4]   2> 8992 T1373 oashc.HttpShardHandlerFactory.getParameter Setting sizeOfQueue to: -1
[junit4:junit4]   2> 8993 T1373 oashc.HttpShardHandlerFactory.getParameter Setting fairnessPolicy to: false
[junit4:junit4]   2> 8993 T1373 oascsi.HttpClientUtil.createClient Creating new http client, config:maxConnectionsPerHost=20&maxConnections=10000&socketTimeout=0&connTimeout=0&retry=false
[junit4:junit4]   2> 8994 T1427 oascc.ZkStateReader$3.process Updating live nodes... (5)
[junit4:junit4]   2> 8994 T1395 oascc.ZkStateReader$3.process Updating live nodes... (5)
[junit4:junit4]   2> 9005 T1373 oascc.ZkStateReader.createClusterStateWatchersAndUpdate Updating cluster state from ZooKeeper... 
[junit4:junit4]   2> 9015 T1460 oasc.CoreContainer.create Creating SolrCore 'collection1' using instanceDir: C:\Users\JenkinsSlave\workspace\Lucene-Solr-4.x-Windows\solr\build\solr-core\test\J0\.\solrtest-jetty4-1355348519316\collection1
[junit4:junit4]   2> 9015 T1460 oasc.ZkController.createCollectionZkNode Check for collection zkNode:collection1
[junit4:junit4]   2> 9017 T1460 oasc.ZkController.createCollectionZkNode Collection zkNode exists
[junit4:junit4]   2> 9017 T1460 oasc.ZkController.readConfigName Load collection config from:/collections/collection1
[junit4:junit4]   2> 9019 T1460 oasc.SolrResourceLoader.<init> new SolrResourceLoader for directory: 'C:\Users\JenkinsSlave\workspace\Lucene-Solr-4.x-Windows\solr\build\solr-core\test\J0\.\solrtest-jetty4-1355348519316\collection1\'
[junit4:junit4]   2> 9021 T1460 oasc.SolrResourceLoader.replaceClassLoader Adding 'file:/C:/Users/JenkinsSlave/workspace/Lucene-Solr-4.x-Windows/solr/build/solr-core/test/J0/solrtest-jetty4-1355348519316/collection1/lib/classes/' to classloader
[junit4:junit4]   2> 9021 T1460 oasc.SolrResourceLoader.replaceClassLoader Adding 'file:/C:/Users/JenkinsSlave/workspace/Lucene-Solr-4.x-Windows/solr/build/solr-core/test/J0/solrtest-jetty4-1355348519316/collection1/lib/README' to classloader
[junit4:junit4]   2> 9089 T1460 oasc.SolrConfig.<init> Using Lucene MatchVersion: LUCENE_41
[junit4:junit4]   2> 9183 T1460 oasc.SolrConfig.<init> Loaded SolrConfig: solrconfig.xml
[junit4:junit4]   2> 9185 T1460 oass.IndexSchema.readSchema Reading Solr Schema
[junit4:junit4]   2> 9191 T1460 oass.IndexSchema.readSchema Schema name=test
[junit4:junit4]   2> 9938 T1460 oass.OpenExchangeRatesOrgProvider.init Initialized with rates=open-exchange-rates.json, refreshInterval=1440.
[junit4:junit4]   2> 9949 T1460 oass.IndexSchema.readSchema default search field in schema is text
[junit4:junit4]   2> 9954 T1460 oass.IndexSchema.readSchema unique key field: id
[junit4:junit4]   2> 9973 T1460 oass.FileExchangeRateProvider.reload Reloading exchange rates from file currency.xml
[junit4:junit4]   2> 9977 T1460 oass.FileExchangeRateProvider.reload Reloading exchange rates from file currency.xml
[junit4:junit4]   2> 9987 T1460 oass.OpenExchangeRatesOrgProvider.reload Reloading exchange rates from open-exchange-rates.json
[junit4:junit4]   2> 9990 T1460 oass.OpenExchangeRatesOrgProvider.reload Reloading exchange rates from open-exchange-rates.json
[junit4:junit4]   2> 9992 T1460 oasc.SolrCore.<init> [collection1] Opening new SolrCore at C:\Users\JenkinsSlave\workspace\Lucene-Solr-4.x-Windows\solr\build\solr-core\test\J0\.\solrtest-jetty4-1355348519316\collection1\, dataDir=.\org.apache.solr.cloud.BasicDistributedZkTest-1355348510767/jetty4\
[junit4:junit4]   2> 9992 T1460 oasc.JmxMonitoredMap.<init> JMX monitoring is enabled. Adding Solr mbeans to JMX Server: com.sun.jmx.mbeanserver.JmxMBeanServer@1759d12
[junit4:junit4]   2> 9994 T1460 oasc.SolrCore.getNewIndexDir New index directory detected: old=null new=.\org.apache.solr.cloud.BasicDistributedZkTest-1355348510767/jetty4\index/
[junit4:junit4]   2> 9995 T1460 oasc.SolrCore.initIndex WARNING [collection1] Solr index directory '.\org.apache.solr.cloud.BasicDistributedZkTest-1355348510767\jetty4\index' doesn't exist. Creating new index...
[junit4:junit4]   2> 9995 T1460 oasc.CachingDirectoryFactory.get return new directory for C:\Users\JenkinsSlave\workspace\Lucene-Solr-4.x-Windows\solr\build\solr-core\test\J0\.\org.apache.solr.cloud.BasicDistributedZkTest-1355348510767\jetty4\index forceNew:false
[junit4:junit4]   2> 10024 T1460 oasc.SolrDeletionPolicy.onCommit SolrDeletionPolicy.onCommit: commits:num=1
[junit4:junit4]   2> 		commit{dir=RateLimitedDirectoryWrapper(NRTCachingDirectory(org.apache.lucene.store.SimpleFSDirectory@C:\Users\JenkinsSlave\workspace\Lucene-Solr-4.x-Windows\solr\build\solr-core\test\J0\org.apache.solr.cloud.BasicDistributedZkTest-1355348510767\jetty4\index lockFactory=org.apache.lucene.store.NativeFSLockFactory@101d898; maxCacheMB=48.0 maxMergeSizeMB=4.0)),segFN=segments_1,generation=1,filenames=[segments_1]
[junit4:junit4]   2> 10025 T1460 oasc.SolrDeletionPolicy.updateCommits newest commit = 1
[junit4:junit4]   2> 10027 T1460 oasc.SolrCore.initWriters created xml: solr.XMLResponseWriter
[junit4:junit4]   2> 10029 T1460 oasup.UpdateRequestProcessorChain.init inserting DistributedUpdateProcessorFactory into updateRequestProcessorChain "dedupe"
[junit4:junit4]   2> 10030 T1460 oasup.UpdateRequestProcessorChain.init inserting DistributedUpdateProcessorFactory into updateRequestProcessorChain "dedupe-allfields"
[junit4:junit4]   2> 10030 T1460 oasup.UpdateRequestProcessorChain.init inserting DistributedUpdateProcessorFactory into updateRequestProcessorChain "stored_sig"
[junit4:junit4]   2> 10030 T1460 oasup.UpdateRequestProcessorChain.init inserting DistributedUpdateProcessorFactory into updateRequestProcessorChain "uniq-fields"
[junit4:junit4]   2> 10030 T1460 oasup.UpdateRequestProcessorChain.init inserting DistributedUpdateProcessorFactory into updateRequestProcessorChain "distrib-dup-test-chain-implicit"
[junit4:junit4]   2> 10032 T1460 oasc.RequestHandlers.initHandlersFromConfig adding lazy requestHandler: solr.ReplicationHandler
[junit4:junit4]   2> 10032 T1460 oasc.RequestHandlers.initHandlersFromConfig created /replication: solr.ReplicationHandler
[junit4:junit4]   2> 10037 T1460 oasc.RequestHandlers.initHandlersFromConfig created standard: solr.StandardRequestHandler
[junit4:junit4]   2> 10038 T1460 oasc.RequestHandlers.initHandlersFromConfig created /get: solr.RealTimeGetHandler
[junit4:junit4]   2> 10039 T1460 oasc.RequestHandlers.initHandlersFromConfig created dismax: solr.SearchHandler
[junit4:junit4]   2> 10039 T1460 oasc.RequestHandlers.initHandlersFromConfig created mock: org.apache.solr.core.MockQuerySenderListenerReqHandler
[junit4:junit4]   2> 10040 T1460 oasc.RequestHandlers.initHandlersFromConfig created /admin/: org.apache.solr.handler.admin.AdminHandlers
[junit4:junit4]   2> 10040 T1460 oasc.RequestHandlers.initHandlersFromConfig created defaults: solr.StandardRequestHandler
[junit4:junit4]   2> 10040 T1460 oasc.RequestHandlers.initHandlersFromConfig adding lazy requestHandler: solr.StandardRequestHandler
[junit4:junit4]   2> 10040 T1460 oasc.RequestHandlers.initHandlersFromConfig created lazy: solr.StandardRequestHandler
[junit4:junit4]   2> 10040 T1460 oasc.RequestHandlers.initHandlersFromConfig created /update: solr.UpdateRequestHandler
[junit4:junit4]   2> 10042 T1460 oasc.RequestHandlers.initHandlersFromConfig created /terms: org.apache.solr.handler.component.SearchHandler
[junit4:junit4]   2> 10046 T1460 oasc.RequestHandlers.initHandlersFromConfig created spellCheckCompRH: org.apache.solr.handler.component.SearchHandler
[junit4:junit4]   2> 10047 T1460 oasc.RequestHandlers.initHandlersFromConfig created spellCheckCompRH_Direct: org.apache.solr.handler.component.SearchHandler
[junit4:junit4]   2> 10047 T1460 oasc.RequestHandlers.initHandlersFromConfig created spellCheckWithWordbreak: org.apache.solr.handler.component.SearchHandler
[junit4:junit4]   2> 10052 T1460 oasc.RequestHandlers.initHandlersFromConfig created spellCheckWithWordbreak_Direct: org.apache.solr.handler.component.SearchHandler
[junit4:junit4]   2> 10054 T1460 oasc.RequestHandlers.initHandlersFromConfig created spellCheckCompRH1: org.apache.solr.handler.component.SearchHandler
[junit4:junit4]   2> 10055 T1460 oasc.RequestHandlers.initHandlersFromConfig created tvrh: org.apache.solr.handler.component.SearchHandler
[junit4:junit4]   2> 10056 T1460 oasc.RequestHandlers.initHandlersFromConfig created /mlt: solr.MoreLikeThisHandler
[junit4:junit4]   2> 10056 T1460 oasc.RequestHandlers.initHandlersFromConfig created /debug/dump: solr.DumpRequestHandler
[junit4:junit4]   2> 10066 T1460 oashl.XMLLoader.init xsltCacheLifetimeSeconds=60
[junit4:junit4]   2> 10072 T1460 oasc.SolrCore.initDeprecatedSupport WARNING solrconfig.xml uses deprecated <admin/gettableFiles>, Please update your config to use the ShowFileRequestHandler.
[junit4:junit4]   2> 10072 T1460 oasc.SolrCore.initDeprecatedSupport WARNING adding ShowFileRequestHandler with hidden files: [SCHEMA.XML, OLD_SYNONYMS.TXT, STOPWORDS.TXT, PROTWORDS.TXT, OPEN-EXCHANGE-RATES.JSON, SYNONYMS.TXT, CURRENCY.XML, MAPPING-ISOLATIN1ACCENT.TXT]
[junit4:junit4]   2> 10083 T1460 oass.SolrIndexSearcher.<init> Opening Searcher@11f64d5 main
[junit4:junit4]   2> 10084 T1460 oass.SolrIndexSearcher.getIndexDir WARNING WARNING: Directory impl does not support setting indexDir: org.apache.lucene.store.RateLimitedDirectoryWrapper
[junit4:junit4]   2> 10086 T1460 oasu.CommitTracker.<init> Hard AutoCommit: disabled
[junit4:junit4]   2> 10086 T1460 oasu.CommitTracker.<init> Soft AutoCommit: disabled
[junit4:junit4]   2> 10086 T1460 oashc.SpellCheckComponent.inform Initializing spell checkers
[junit4:junit4]   2> 10097 T1460 oass.DirectSolrSpellChecker.init init: {name=direct,classname=DirectSolrSpellChecker,field=lowerfilt,minQueryLength=3}
[junit4:junit4]   2> 10173 T1461 oasc.SolrCore.registerSearcher [collection1] Registered new searcher Searcher@11f64d5 main{StandardDirectoryReader(segments_1:1)}
[junit4:junit4]   2> 10178 T1460 oasc.ZkController.publish publishing core=collection1 state=down
[junit4:junit4]   2> 10178 T1460 oasc.ZkController.publish numShards not found on descriptor - reading it from system property
[junit4:junit4]   2> 10434 T1396 oascc.ZkStateReader.updateClusterState Updating cloud state from ZooKeeper... 
[junit4:junit4]   2> 10435 T1396 oasc.Overseer$ClusterStateUpdater.updateState Update state numShards=2 message={
[junit4:junit4]   2> 	  "operation":"state",
[junit4:junit4]   2> 	  "numShards":"2",
[junit4:junit4]   2> 	  "shard":null,
[junit4:junit4]   2> 	  "roles":null,
[junit4:junit4]   2> 	  "state":"down",
[junit4:junit4]   2> 	  "core":"collection1",
[junit4:junit4]   2> 	  "collection":"collection1",
[junit4:junit4]   2> 	  "node_name":"127.0.0.1:61203_solr",
[junit4:junit4]   2> 	  "base_url":"http://127.0.0.1:61203/solr"}
[junit4:junit4]   2> 10435 T1396 oasc.Overseer$ClusterStateUpdater.updateState Collection already exists with numShards=2
[junit4:junit4]   2> 10435 T1396 oasc.Overseer$ClusterStateUpdater.updateState Assigning new node to shard shard=shard2
[junit4:junit4]   2> 10448 T1427 oascc.ZkStateReader$2.process A cluster state change has occurred - updating... (5)
[junit4:junit4]   2> 10449 T1395 oascc.ZkStateReader$2.process A cluster state change has occurred - updating... (5)
[junit4:junit4]   2> 10449 T1412 oascc.ZkStateReader$2.process A cluster state change has occurred - updating... (5)
[junit4:junit4]   2> 10450 T1459 oascc.ZkStateReader$2.process A cluster state change has occurred - updating... (5)
[junit4:junit4]   2> 10450 T1442 oascc.ZkStateReader$2.process A cluster state change has occurred - updating... (5)
[junit4:junit4]   2> 10664 T1460 oasc.CoreContainer.register registering core: collection1
[junit4:junit4]   2> 10664 T1460 oasc.ZkController.register Register shard - core:collection1 address:http://127.0.0.1:61203/solr shardId:shard2
[junit4:junit4]   2> 10669 T1460 oasc.ZkController.register We are http://127.0.0.1:61203/solr/collection1/ and leader is http://127.0.0.1:61183/solr/collection1/
[junit4:junit4]   2> 10669 T1460 oasc.ZkController.register No LogReplay needed for core=collection1 baseURL=http://127.0.0.1:61203/solr
[junit4:junit4]   2> 10669 T1460 oasc.ZkController.checkRecovery Core needs to recover:collection1
[junit4:junit4]   2> 10670 T1460 oasu.DefaultSolrCoreState.doRecovery Running recovery - first canceling any ongoing recovery
[junit4:junit4]   2> ASYNC  NEW_CORE C110 name=collection1 org.apache.solr.core.SolrCore@8c7858 url=http://127.0.0.1:61203/solr/collection1 node=127.0.0.1:61203_solr
[junit4:junit4]   2> 10670 T1462 C110 P61203 oasc.RecoveryStrategy.run Starting recovery process.  core=collection1 recoveringAfterStartup=true
[junit4:junit4]   2> 10672 T1460 oascc.ZkStateReader.updateClusterState Updating cloud state from ZooKeeper... 
[junit4:junit4]   2> 10672 T1462 C110 P61203 oasc.RecoveryStrategy.doRecovery ###### startupVersions=[]
[junit4:junit4]   2> 10673 T1462 C110 P61203 oasc.ZkController.publish publishing core=collection1 state=recovering
[junit4:junit4]   2> 10673 T1462 C110 P61203 oasc.ZkController.publish numShards not found on descriptor - reading it from system property
[junit4:junit4]   2> 10673 T1373 oass.SolrDispatchFilter.init user.dir=C:\Users\JenkinsSlave\workspace\Lucene-Solr-4.x-Windows\solr\build\solr-core\test\J0
[junit4:junit4]   2> 10674 T1373 oass.SolrDispatchFilter.init SolrDispatchFilter.init() done
[junit4:junit4]   2> 10675 T1373 oascsi.HttpClientUtil.createClient Creating new http client, config:maxConnections=128&maxConnectionsPerHost=32&followRedirects=false
[junit4:junit4]   2> 10675 T1462 C110 P61203 oasc.RecoveryStrategy.doRecovery Attempting to PeerSync from http://127.0.0.1:61183/solr/collection1/ core=collection1 - recoveringAfterStartup=true
[junit4:junit4]   2> 10675 T1462 C110 P61203 oasu.PeerSync.sync PeerSync: core=collection1 url=http://127.0.0.1:61203/solr START replicas=[http://127.0.0.1:61183/solr/collection1/] nUpdates=100
[junit4:junit4]   2> 10676 T1462 C110 P61203 oasu.PeerSync.sync WARNING no frame of reference to tell of we've missed updates
[junit4:junit4]   2> 10677 T1462 C110 P61203 oasc.RecoveryStrategy.doRecovery PeerSync Recovery was not successful - trying replication. core=collection1
[junit4:junit4]   2> 10677 T1462 C110 P61203 oasc.RecoveryStrategy.doRecovery Starting Replication Recovery. core=collection1
[junit4:junit4]   2> 10677 T1462 C110 P61203 oascsi.HttpClientUtil.createClient Creating new http client, config:maxConnections=128&maxConnectionsPerHost=32&followRedirects=false
[junit4:junit4]   2> 10690 T1373 oaz.ZooKeeper.<init> Initiating client connection, connectString=127.0.0.1:61158/solr sessionTimeout=10000 watcher=org.apache.solr.common.cloud.ConnectionManager@4bd0b6
[junit4:junit4]   2> 10692 T1373 oascc.ConnectionManager.waitForConnected Waiting for client to connect to ZooKeeper
[junit4:junit4]   2> 10693 T1464 oaz.ClientCnxn$SendThread.logStartConnect Opening socket connection to server 127.0.0.1/127.0.0.1:61158. Will not attempt to authenticate using SASL (access denied (javax.security.auth.AuthPermission getLoginConfiguration))
[junit4:junit4]   2> 10694 T1464 oaz.ClientCnxn$SendThread.primeConnection Socket connection established to 127.0.0.1/127.0.0.1:61158, initiating session
[junit4:junit4]   2> 10694 T1375 oazs.NIOServerCnxnFactory.run Accepted socket connection from /127.0.0.1:61216
[junit4:junit4]   2> 10695 T1375 oazs.ZooKeeperServer.processConnectRequest Client attempting to establish new session at /127.0.0.1:61216
[junit4:junit4]   2> 10703 T1377 oazs.ZooKeeperServer.finishSessionInit Established session 0x13b9111083c000c with negotiated timeout 10000 for client /127.0.0.1:61216
[junit4:junit4]   2> 10704 T1464 oaz.ClientCnxn$SendThread.onConnected Session establishment complete on server 127.0.0.1/127.0.0.1:61158, sessionid = 0x13b9111083c000c, negotiated timeout = 10000
[junit4:junit4]   2> ASYNC  NEW_CORE C111 name=collection1 org.apache.solr.core.SolrCore@a4e33 url=http://127.0.0.1:61183/solr/collection1 node=127.0.0.1:61183_solr
[junit4:junit4]   2> 10704 T1420 C111 P61183 REQ /get {distrib=false&qt=/get&wt=javabin&version=2&getVersions=100} status=0 QTime=1 
[junit4:junit4]   2> 10704 T1465 oascc.ConnectionManager.process Watcher org.apache.solr.common.cloud.ConnectionManager@4bd0b6 name:ZooKeeperConnection Watcher:127.0.0.1:61158/solr got event WatchedEvent state:SyncConnected type:None path:null path:null type:None
[junit4:junit4]   2> 10705 T1373 oascc.ConnectionManager.waitForConnected Client is connected to ZooKeeper
[junit4:junit4]   2> 10706 T1373 oascc.ZkStateReader.createClusterStateWatchersAndUpdate Updating cluster state from ZooKeeper... 
[junit4:junit4]   2> 10708 T1373 oasc.ChaosMonkey.monkeyLog monkey: init - expire sessions:true cause connection loss:true
[junit4:junit4]   2> 10708 T1373 oascsi.HttpClientUtil.createClient Creating new http client, config:
[junit4:junit4]   2> 10713 T1373 oascc.ZkStateReader.updateClusterState Updating cloud state from ZooKeeper... 
[junit4:junit4]   2> 10714 T1373 oasc.AbstractDistribZkTestBase.waitForRecoveriesToFinish Wait for recoveries to finish - collection: collection1 failOnTimeout:true timeout (sec):180
[junit4:junit4]   2> 10717 T1373 oascc.ZkStateReader.updateClusterState Updating cloud state from ZooKeeper... 
[junit4:junit4]   2> 10955 T1396 oascc.ZkStateReader.updateClusterState Updating cloud state from ZooKeeper... 
[junit4:junit4]   2> 10956 T1396 oasc.Overseer$ClusterStateUpdater.updateState Update state numShards=2 message={
[junit4:junit4]   2> 	  "operation":"state",
[junit4:junit4]   2> 	  "numShards":"2",
[junit4:junit4]   2> 	  "shard":"shard2",
[junit4:junit4]   2> 	  "roles":null,
[junit4:junit4]   2> 	  "state":"recovering",
[junit4:junit4]   2> 	  "core":"collection1",
[junit4:junit4]   2> 	  "collection":"collection1",
[junit4:junit4]   2> 	  "node_name":"127.0.0.1:61203_solr",
[junit4:junit4]   2> 	  "base_url":"http://127.0.0.1:61203/solr"}
[junit4:junit4]   2> 10970 T1412 oascc.ZkStateReader$2.process A cluster state change has occurred - updating... (5)
[junit4:junit4]   2> 10971 T1442 oascc.ZkStateReader$2.process A cluster state change has occurred - updating... (5)
[junit4:junit4]   2> 10972 T1395 oascc.ZkStateReader$2.process A cluster state change has occurred - updating... (5)
[junit4:junit4]   2> 10972 T1427 oascc.ZkStateReader$2.process A cluster state change has occurred - updating... (5)
[junit4:junit4]   2> 10972 T1465 oascc.ZkStateReader$2.process A cluster state change has occurred - updating... (5)
[junit4:junit4]   2> 10972 T1459 oascc.ZkStateReader$2.process A cluster state change has occurred - updating... (5)
[junit4:junit4]   2>  C108_STATE=coll:collection1 core:collection1 props:{shard=shard1, roles=null, state=recovering, core=collection1, collection=collection1, node_name=127.0.0.1:61192_solr, base_url=http://127.0.0.1:61192/solr}
[junit4:junit4]   2> 11517 T1445 C108 P61192 oasc.RecoveryStrategy.doRecovery Begin buffering updates. core=collection1
[junit4:junit4]   2> 11517 T1445 C108 P61192 oasu.UpdateLog.bufferUpdates Starting to buffer updates. FSUpdateLog{state=ACTIVE, tlog=null}
[junit4:junit4]   2> 11517 T1445 C108 P61192 oasc.RecoveryStrategy.replicate Attempting to replicate from http://127.0.0.1:61174/solr/collection1/. core=collection1
[junit4:junit4]   2> 11518 T1445 C108 P61192 oascsi.HttpClientUtil.createClient Creating new http client, config:maxConnections=128&maxConnectionsPerHost=32&followRedirects=false
[junit4:junit4]   2> 11531 T1408 C109 P61174 oasu.DirectUpdateHandler2.commit start commit{flags=0,_version_=0,optimize=false,openSearcher=false,waitSearcher=true,expungeDeletes=false,softCommit=false}
[junit4:junit4]   2> 11538 T1408 C109 P61174 oasc.SolrDeletionPolicy.onInit SolrDeletionPolicy.onInit: commits:num=1
[junit4:junit4]   2> 		commit{dir=RateLimitedDirectoryWrapper(NRTCachingDirectory(org.apache.lucene.store.SimpleFSDirectory@C:\Users\JenkinsSlave\workspace\Lucene-Solr-4.x-Windows\solr\build\solr-core\test\J0\org.apache.solr.cloud.BasicDistributedZkTest-1355348510767\jetty1\index lockFactory=org.apache.lucene.store.NativeFSLockFactory@22c013; maxCacheMB=48.0 maxMergeSizeMB=4.0)),segFN=segments_1,generation=1,filenames=[segments_1]
[junit4:junit4]   2> 11540 T1408 C109 P61174 oasc.SolrDeletionPolicy.updateCommits newest commit = 1
[junit4:junit4]   2> 11547 T1408 C109 P61174 oasc.SolrDeletionPolicy.onCommit SolrDeletionPolicy.onCommit: commits:num=2
[junit4:junit4]   2> 		commit{dir=RateLimitedDirectoryWrapper(NRTCachingDirectory(org.apache.lucene.store.SimpleFSDirectory@C:\Users\JenkinsSlave\workspace\Lucene-Solr-4.x-Windows\solr\build\solr-core\test\J0\org.apache.solr.cloud.BasicDistributedZkTest-1355348510767\jetty1\index lockFactory=org.apache.lucene.store.NativeFSLockFactory@22c013; maxCacheMB=48.0 maxMergeSizeMB=4.0)),segFN=segments_1,generation=1,filenames=[segments_1]
[junit4:junit4]   2> 		commit{dir=RateLimitedDirectoryWrapper(NRTCachingDirectory(org.apache.lucene.store.SimpleFSDirectory@C:\Users\JenkinsSlave\workspace\Lucene-Solr-4.x-Windows\solr\build\solr-core\test\J0\org.apache.solr.cloud.BasicDistributedZkTest-1355348510767\jetty1\index lockFactory=org.apache.lucene.store.NativeFSLockFactory@22c013; maxCacheMB=48.0 maxMergeSizeMB=4.0)),segFN=segments_2,generation=2,filenames=[segments_2]
[junit4:junit4]   2> 11547 T1408 C109 P61174 oasc.SolrDeletionPolicy.updateCommits newest commit = 2
[junit4:junit4]   2> 11550 T1408 C109 P61174 oass.SolrIndexSearcher.<init> Opening Searcher@198ec0f realtime
[junit4:junit4]   2> 11550 T1408 C109 P61174 oass.SolrIndexSearcher.getIndexDir WARNING WARNING: Directory impl does not support setting indexDir: org.apache.lucene.store.RateLimitedDirectoryWrapper
[junit4:junit4]   2> 11551 T1408 C109 P61174 oasu.DirectUpdateHandler2.commit end_commit_flush
[junit4:junit4]   2> 11552 T1408 C109 P61174 /update {waitSearcher=true&openSearcher=false&commit=true&commit_end_point=true&wt=javabin&softCommit=false&version=2} {commit=} 0 21
[junit4:junit4]   2> 11553 T1445 C108 P61192 oash.ReplicationHandler.inform Commits will be reserved for  10000
[junit4:junit4]   2> 11553 T1445 C108 P61192 oash.SnapPuller.<init>  No value set for 'pollInterval'. Timer Task not started.
[junit4:junit4]   2> 11556 T1407 C109 P61174 oash.ReplicationHandler.inform Commits will be reserved for  10000
[junit4:junit4]   2> 11556 T1407 C109 P61174 REQ /replication {command=indexversion&wt=javabin&qt=/replication&version=2} status=0 QTime=2 
[junit4:junit4]   2> 11557 T1445 C108 P61192 oash.SnapPuller.fetchLatestIndex Master's generation: 2
[junit4:junit4]   2> 11557 T1445 C108 P61192 oash.SnapPuller.fetchLatestIndex Slave's generation: 1
[junit4:junit4]   2> 11557 T1445 C108 P61192 oash.SnapPuller.fetchLatestIndex Starting replication process
[junit4:junit4]   2> 11561 T1403 C109 P61174 REQ /replication {command=filelist&generation=2&wt=javabin&qt=/replication&version=2} status=0 QTime=1 
[junit4:junit4]   2> 11562 T1445 C108 P61192 oash.SnapPuller.fetchLatestIndex Number of files in latest index in master: 1
[junit4:junit4]   2> 11565 T1445 C108 P61192 oash.SnapPuller.fetchLatestIndex Starting download to .\org.apache.solr.cloud.BasicDistributedZkTest-1355348510767\jetty3\index.20121212164202330 fullCopy=true
[junit4:junit4]   2> 11569 T1405 C109 P61174 REQ /replication {file=segments_2&command=filecontent&checksum=true&generation=2&qt=/replication&wt=filestream} status=0 QTime=0 
[junit4:junit4]   2> 11572 T1445 C108 P61192 oash.SnapPuller.fetchLatestIndex Total time taken for download : 0 secs
[junit4:junit4]   2> 11575 T1445 C108 P61192 oash.SnapPuller.modifyIndexProps New index installed. Updating index properties... index=index.20121212164202330
[junit4:junit4]   2> 11576 T1445 C108 P61192 oasc.SolrCore.getNewIndexDir New index directory detected: old=.\org.apache.solr.cloud.BasicDistributedZkTest-1355348510767/jetty3\index/ new=.\org.apache.solr.cloud.BasicDistributedZkTest-1355348510767/jetty3\index.20121212164202330
[junit4:junit4]   2> 11576 T1445 C108 P61192 oasc.CachingDirectoryFactory.get return new directory for C:\Users\JenkinsSlave\workspace\Lucene-Solr-4.x-Windows\solr\build\solr-core\test\J0\.\org.apache.solr.cloud.BasicDistributedZkTest-1355348510767\jetty3\index.20121212164202330 forceNew:false
[junit4:junit4]   2> 11582 T1445 C108 P61192 oasc.SolrDeletionPolicy.onInit SolrDeletionPolicy.onInit: commits:num=1
[junit4:junit4]   2> 		commit{dir=RateLimitedDirectoryWrapper(NRTCachingDirectory(org.apache.lucene.store.SimpleFSDirectory@C:\Users\JenkinsSlave\workspace\Lucene-Solr-4.x-Windows\solr\build\solr-core\test\J0\org.apache.solr.cloud.BasicDistributedZkTest-1355348510767\jetty3\index.20121212164202330 lockFactory=org.apache.lucene.store.NativeFSLockFactory@18e3c96; maxCacheMB=48.0 maxMergeSizeMB=4.0)),segFN=segments_2,generation=2,filenames=[segments_2]
[junit4:junit4]   2> 11583 T1445 C108 P61192 oasc.SolrDeletionPolicy.updateCommits newest commit = 2
[junit4:junit4]   2> 11585 T1445 C108 P61192 oasu.DefaultSolrCoreState.newIndexWriter Creating new IndexWriter...
[junit4:junit4]   2> 11585 T1445 C108 P61192 oasu.DefaultSolrCoreState.newIndexWriter Waiting until IndexWriter is unused... core=collection1
[junit4:junit4]   2> 11585 T1445 C108 P61192 oasu.DefaultSolrCoreState.newIndexWriter Rollback old IndexWriter... core=collection1
[junit4:junit4]   2> 11587 T1445 C108 P61192 oasc.CachingDirectoryFactory.close Closing directory:C:\Users\JenkinsSlave\workspace\Lucene-Solr-4.x-Windows\solr\build\solr-core\test\J0\.\org.apache.solr.cloud.BasicDistributedZkTest-1355348510767\jetty3\index.20121212164202330
[junit4:junit4]   2> 11587 T1445 C108 P61192 oash.SnapPuller$2.onClose removing old index directory .\org.apache.solr.cloud.BasicDistributedZkTest-1355348510767\jetty3\index
[junit4:junit4]   2> 11595 T1445 C108 P61192 oasc.CachingDirectoryFactory.get return new directory for C:\Users\JenkinsSlave\workspace\Lucene-Solr-4.x-Windows\solr\build\solr-core\test\J0\.\org.apache.solr.cloud.BasicDistributedZkTest-1355348510767\jetty3\index.20121212164202330 forceNew:true
[junit4:junit4]   2> 11598 T1445 C108 P61192 oasc.SolrDeletionPolicy.onInit SolrDeletionPolicy.onInit: commits:num=1
[junit4:junit4]   2> 		commit{dir=RateLimitedDirectoryWrapper(NRTCachingDirectory(org.apache.lucene.store.SimpleFSDirectory@C:\Users\JenkinsSlave\workspace\Lucene-Solr-4.x-Windows\solr\build\solr-core\test\J0\org.apache.solr.cloud.BasicDistributedZkTest-1355348510767\jetty3\index.20121212164202330 lockFactory=org.apache.lucene.store.NativeFSLockFactory@1f1fe36; maxCacheMB=48.0 maxMergeSizeMB=4.0)),segFN=segments_2,generation=2,filenames=[segments_2]
[junit4:junit4]   2> 11598 T1445 C108 P61192 oasc.SolrDeletionPolicy.updateCommits newest commit = 2
[junit4:junit4]   2> 11599 T1445 C108 P61192 oasu.DefaultSolrCoreState.newIndexWriter New IndexWriter is ready to be used.
[junit4:junit4]   2> 11599 T1445 C108 P61192 oass.SolrIndexSearcher.<init> Opening Searcher@2c2e60 main
[junit4:junit4]   2> 11599 T1445 C108 P61192 oass.SolrIndexSearcher.getIndexDir WARNING WARNING: Directory impl does not support setting indexDir: org.apache.lucene.store.RateLimitedDirectoryWrapper
[junit4:junit4]   2> 11601 T1444 oasc.SolrCore.registerSearcher [collection1] Registered new searcher Searcher@2c2e60 main{StandardDirectoryReader(segments_2:1:nrt)}
[junit4:junit4]   2> 11601 T1445 C108 P61192 oasu.DirectUpdateHandler2.commit start commit{flags=0,_version_=0,optimize=false,openSearcher=false,waitSearcher=false,expungeDeletes=false,softCommit=false}
[junit4:junit4]   2> 11609 T1445 C108 P61192 oasc.SolrDeletionPolicy.onCommit SolrDeletionPolicy.onCommit: commits:num=2
[junit4:junit4]   2> 		commit{dir=RateLimitedDirectoryWrapper(NRTCachingDirectory(org.apache.lucene.store.SimpleFSDirectory@C:\Users\JenkinsSlave\workspace\Lucene-Solr-4.x-Windows\solr\build\solr-core\test\J0\org.apache.solr.cloud.BasicDistributedZkTest-1355348510767\jetty3\index.20121212164202330 lockFactory=org.apache.lucene.store.NativeFSLockFactory@1f1fe36; maxCacheMB=48.0 maxMergeSizeMB=4.0)),segFN=segments_2,generation=2,filenames=[segments_2]
[junit4:junit4]   2> 		commit{dir=RateLimitedDirectoryWrapper(NRTCachingDirectory(org.apache.lucene.store.SimpleFSDirectory@C:\Users\JenkinsSlave\workspace\Lucene-Solr-4.x-Windows\solr\build\solr-core\test\J0\org.apache.solr.cloud.BasicDistributedZkTest-1355348510767\jetty3\index.20121212164202330 lockFactory=org.apache.lucene.store.NativeFSLockFactory@1f1fe36; maxCacheMB=48.0 maxMergeSizeMB=4.0)),segFN=segments_3,generation=3,filenames=[segments_3]
[junit4:junit4]   2> 11609 T1445 C108 P61192 oasc.SolrDeletionPolicy.updateCommits newest commit = 3
[junit4:junit4]   2> 11612 T1445 C108 P61192 oasu.DirectUpdateHandler2.commit end_commit_flush
[junit4:junit4]   2> 11612 T1445 C108 P61192 oasc.RecoveryStrategy.replay No replay needed. core=collection1
[junit4:junit4]   2> 11612 T1445 C108 P61192 oasc.RecoveryStrategy.doRecovery Replication Recovery was successful - registering as Active. core=collection1
[junit4:junit4]   2> 11612 T1445 C108 P61192 oasc.ZkController.publish publishing core=collection1 state=active
[junit4:junit4]   2> 11612 T1445 C108 P61192 oasc.ZkController.publish numShards not found on descriptor - reading it from system property
[junit4:junit4]   2> 11618 T1445 C108 P61192 oasc.RecoveryStrategy.doRecovery Finished recovery process. core=collection1
[junit4:junit4]   2> 11773 T1373 oascc.ZkStateReader.updateClusterState Updating cloud state from ZooKeeper... 
[junit4:junit4]   2> 12051 T1396 oascc.ZkStateReader.updateClusterState Updating cloud state from ZooKeeper... 
[junit4:junit4]   2> 12052 T1396 oasc.Overseer$ClusterStateUpdater.updateState Update state numShards=2 message={
[junit4:junit4]   2> 	  "operation":"state",
[junit4:junit4]   2> 	  "numShards":"2",
[junit4:junit4]   2> 	  "shard":"shard1",
[junit4:junit4]   2> 	  "roles":null,
[junit4:junit4]   2> 	  "state":"active",
[junit4:junit4]   2> 	  "core":"collection1",
[junit4:junit4]   2> 	  "collection":"collection1",
[junit4:junit4]   2> 	  "node_name":"127.0.0.1:61192_solr",
[junit4:junit4]   2> 	  "base_url":"http://127.0.0.1:61192/solr"}
[junit4:junit4]   2> 12072 T1412 oascc.ZkStateReader$2.process A cluster state change has occurred - updating... (5)
[junit4:junit4]   2> 12072 T1395 oascc.ZkStateReader$2.process A cluster state change has occurred - updating... (5)
[junit4:junit4]   2> 12072 T1465 oascc.ZkStateReader$2.process A cluster state change has occurred - updating... (5)
[junit4:junit4]   2> 12072 T1442 oascc.ZkStateReader$2.process A cluster state change has occurred - updating... (5)
[junit4:junit4]   2> 12072 T1459 oascc.ZkStateReader$2.process A cluster state change has occurred - updating... (5)
[junit4:junit4]   2> 12072 T1427 oascc.ZkStateReader$2.process A cluster state change has occurred - updating... (5)
[junit4:junit4]   2> 12839 T1373 oascc.ZkStateReader.updateClusterState Updating cloud state from ZooKeeper... 
[junit4:junit4]   2>  C110_STATE=coll:collection1 core:collection1 props:{shard=shard2, roles=null, state=recovering, core=collection1, collection=collection1, node_name=127.0.0.1:61203_solr, base_url=http://127.0.0.1:61203/solr}
[junit4:junit4]   2> 13868 T1462 C110 P61203 oasc.RecoveryStrategy.doRecovery Begin buffering updates. core=collection1
[junit4:junit4]   2> 13868 T1462 C110 P61203 oasu.UpdateLog.bufferUpdates Starting to buffer updates. FSUpdateLog{state=ACTIVE, tlog=null}
[junit4:junit4]   2> 13868 T1462 C110 P61203 oasc.RecoveryStrategy.replicate Attempting to replicate from http://127.0.0.1:61183/solr/collection1/. core=collection1
[junit4:junit4]   2> 13868 T1462 C110 P61203 oascsi.HttpClientUtil.createClient Creating new http client, config:maxConnections=128&maxConnectionsPerHost=32&followRedirects=false
[junit4:junit4]   2> 13879 T1421 C111 P61183 oasu.DirectUpdateHandler2.commit start commit{flags=0,_version_=0,optimize=false,openSearcher=false,waitSearcher=true,expungeDeletes=false,softCommit=false}
[junit4:junit4]   2> 13885 T1421 C111 P61183 oasc.SolrDeletionPolicy.onInit SolrDeletionPolicy.onInit: commits:num=1
[junit4:junit4]   2> 		commit{dir=RateLimitedDirectoryWrapper(NRTCachingDirectory(org.apache.lucene.store.SimpleFSDirectory@C:\Users\JenkinsSlave\workspace\Lucene-Solr-4.x-Windows\solr\build\solr-core\test\J0\org.apache.solr.cloud.BasicDistributedZkTest-1355348510767\jetty2\index lockFactory=org.apache.lucene.store.NativeFSLockFactory@8fbe3; maxCacheMB=48.0 maxMergeSizeMB=4.0)),segFN=segments_1,generation=1,filenames=[segments_1]
[junit4:junit4]   2> 13886 T1421 C111 P61183 oasc.SolrDeletionPolicy.updateCommits newest commit = 1
[junit4:junit4]   2> 13894 T1421 C111 P61183 oasc.SolrDeletionPolicy.onCommit SolrDeletionPolicy.onCommit: commits:num=2
[junit4:junit4]   2> 		commit{dir=RateLimitedDirectoryWrapper(NRTCachingDirectory(org.apache.lucene.store.SimpleFSDirectory@C:\Users\JenkinsSlave\workspace\Lucene-Solr-4.x-Windows\solr\build\solr-core\test\J0\org.apache.solr.cloud.BasicDistributedZkTest-1355348510767\jetty2\index lockFactory=org.apache.lucene.store.NativeFSLockFactory@8fbe3; maxCacheMB=48.0 maxMergeSizeMB=4.0)),segFN=segments_1,generation=1,filenames=[segments_1]
[junit4:junit4]   2> 		commit{dir=RateLimitedDirectoryWrapper(NRTCachingDirectory(org.apache.lucene.store.SimpleFSDirectory@C:\Users\JenkinsSlave\workspace\Lucene-Solr-4.x-Windows\solr\build\solr-core\test\J0\org.apache.solr.cloud.BasicDistributedZkTest-1355348510767\jetty2\index lockFactory=org.apache.lucene.store.NativeFSLockFactory@8fbe3; maxCacheMB=48.0 maxMergeSizeMB=4.0)),segFN=segments_2,generation=2,filenames=[segments_2]
[junit4:junit4]   2> 13895 T1421 C111 P61183 oasc.SolrDeletionPolicy.updateCommits newest commit = 2
[junit4:junit4]   2> 13897 T1421 C111 P61183 oass.SolrIndexSearcher.<init> Opening Searcher@67b8c3 realtime
[junit4:junit4]   2> 13897 T1421 C111 P61183 oass.SolrIndexSearcher.getIndexDir WARNING WARNING: Directory impl does not support setting indexDir: org.apache.lucene.store.RateLimitedDirectoryWrapper
[junit4:junit4]   2> 13898 T1421 C111 P61183 oasu.DirectUpdateHandler2.commit end_commit_flush
[junit4:junit4]   2> 13898 T1421 C111 P61183 /update {waitSearcher=true&openSearcher=false&commit=true&commit_end_point=true&wt=javabin&softCommit=false&version=2} {commit=} 0 19
[junit4:junit4]   2> 13900 T1462 C110 P61203 oash.ReplicationHandler.inform Commits will be reserved for  10000
[junit4:junit4]   2> 13900 T1462 C110 P61203 oash.SnapPuller.<init>  No value set for 'pollInterval'. Timer Task not started.
[junit4:junit4]   2> 13902 T1373 oascc.ZkStateReader.updateClusterState Updating cloud state from ZooKeeper... 
[junit4:junit4]   2> 13904 T1419 C111 P61183 oash.ReplicationHandler.inform Commits will be reserved for  10000
[junit4:junit4]   2> 13905 T1419 C111 P61183 REQ /replication {command=indexversion&wt=javabin&qt=/replication&version=2} status=0 QTime=1 
[junit4:junit4]   2> 13906 T1462 C110 P61203 oash.SnapPuller.fetchLatestIndex Master's generation: 2
[junit4:junit4]   2> 13906 T1462 C110 P61203 oash.SnapPuller.fetchLatestIndex Slave's generation: 1
[junit4:junit4]   2> 13907 T1462 C110 P61203 oash.SnapPuller.fetchLatestIndex Starting replication process
[junit4:junit4]   2> 13911 T1420 C111 P61183 REQ /replication {command=filelist&generation=2&wt=javabin&qt=/replication&version=2} status=0 QTime=1 
[junit4:junit4]   2> 13911 T1462 C110 P61203 oash.SnapPuller.fetchLatestIndex Number of files in latest index in master: 1
[junit4:junit4]   2> 13915 T1462 C110 P61203 oash.SnapPuller.fetchLatestIndex Starting download to .\org.apache.solr.cloud.BasicDistributedZkTest-1355348510767\jetty4\index.20121212164204678 fullCopy=true
[junit4:junit4]   2> 13922 T1422 C111 P61183 REQ /replication {file=segments_2&command=filecontent&checksum=true&generation=2&qt=/replication&wt=filestream} status=0 QTime=0 
[junit4:junit4]   2> 13926 T1462 C110 P61203 oash.SnapPuller.fetchLatestIndex Total time taken for download : 0 secs
[junit4:junit4]   2> 13928 T1462 C110 P61203 oash.SnapPuller.modifyIndexProps New index installed. Updating index properties... index=index.20121212164204678
[junit4:junit4]   2> 13929 T1462 C110 P61203 oasc.SolrCore.getNewIndexDir New index directory detected: old=.\org.apache.solr.cloud.BasicDistributedZkTest-1355348510767/jetty4\index/ new=.\org.apache.solr.cloud.BasicDistributedZkTest-1355348510767/jetty4\index.20121212164204678
[junit4:junit4]   2> 13930 T1462 C110 P61203 oasc.CachingDirectoryFactory.get return new directory for C:\Users\JenkinsSlave\workspace\Lucene-Solr-4.x-Windows\solr\build\solr-core\test\J0\.\org.apache.solr.cloud.BasicDistributedZkTest-1355348510767\jetty4\index.20121212164204678 forceNew:false
[junit4:junit4]   2> 13933 T1462 C110 P61203 oasc.SolrDeletionPolicy.onInit SolrDeletionPolicy.onInit: commits:num=1
[junit4:junit4]   2> 		commit{dir=RateLimitedDirectoryWrapper(NRTCachingDirectory(org.apache.lucene.store.SimpleFSDirectory@C:\Users\JenkinsSlave\workspace\Lucene-Solr-4.x-Windows\solr\build\solr-core\test\J0\org.apache.solr.cloud.BasicDistributedZkTest-1355348510767\jetty4\index.20121212164204678 lockFactory=org.apache.lucene.store.NativeFSLockFactory@1fe86fc; maxCacheMB=48.0 maxMergeSizeMB=4.0)),segFN=segments_2,generation=2,filenames=[segments_2]
[junit4:junit4]   2> 13933 T1462 C110 P61203 oasc.SolrDeletionPolicy.updateCommits newest commit = 2
[junit4:junit4]   2> 13936 T1462 C110 P61203 oasu.DefaultSolrCoreState.newIndexWriter Creating new IndexWriter...
[junit4:junit4]   2> 13936 T1462 C110 P61203 oasu.DefaultSolrCoreState.newIndexWriter Waiting until IndexWriter is unused... core=collection1
[junit4:junit4]   2> 13937 T1462 C110 P61203 oasu.DefaultSolrCoreState.newIndexWriter Rollback old IndexWriter... core=collection1
[junit4:junit4]   2> 13938 T1462 C110 P61203 oasc.CachingDirectoryFactory.close Closing directory:C:\Users\JenkinsSlave\workspace\Lucene-Solr-4.x-Windows\solr\build\solr-core\test\J0\.\org.apache.solr.cloud.BasicDistributedZkTest-1355348510767\jetty4\index.20121212164204678
[junit4:junit4]   2> 13938 T1462 C110 P61203 oash.SnapPuller$2.onClose removing old index directory .\org.apache.solr.cloud.BasicDistributedZkTest-1355348510767\jetty4\index
[junit4:junit4]   2> 13949 T1462 C110 P61203 oasc.CachingDirectoryFactory.get return new directory for C:\Users\JenkinsSlave\workspace\Lucene-Solr-4.x-Windows\solr\build\solr-core\test\J0\.\org.apache.solr.cloud.BasicDistributedZkTest-1355348510767\jetty4\index.20121212164204678 forceNew:true
[junit4:junit4]   2> 13954 T1462 C110 P61203 oasc.SolrDeletionPolicy.onInit SolrDeletionPolicy.onInit: commits:num=1
[junit4:junit4]   2> 		commit{dir=RateLimitedDirectoryWrapper(NRTCachingDirectory(org.apache.lucene.store.SimpleFSDirectory@C:\Users\JenkinsSlave\workspace\Lucene-Solr-4.x-Windows\solr\build\solr-core\test\J0\org.apache.solr.cloud.BasicDistributedZkTest-1355348510767\jetty4\index.20121212164204678 lockFactory=org.apache.lucene.store.NativeFSLockFactory@140be79; maxCacheMB=48.0 maxMergeSizeMB=4.0)),segFN=segments_2,generation=2,filenames=[segments_2]
[junit4:junit4]   2> 13955 T1462 C110 P61203 oasc.SolrDeletionPolicy.updateCommits newest commit = 2
[junit4:junit4]   2> 13955 T1462 C110 P61203 oasu.DefaultSolrCoreState.newIndexWriter New IndexWriter is ready to be used.
[junit4:junit4]   2> 13955 T1462 C110 P61203 oass.SolrIndexSearcher.<init> Opening Searcher@141f27c main
[junit4:junit4]   2> 13956 T1462 C110 P61203 oass.SolrIndexSearcher.getIndexDir WARNING WARNING: Directory impl does not support setting indexDir: org.apache.lucene.store.RateLimitedDirectoryWrapper
[junit4:junit4]   2> 13970 T1461 oasc.SolrCore.registerSearcher [collection1] Registered new searcher Searcher@141f27c main{StandardDirectoryReader(segments_2:1:nrt)}
[junit4:junit4]   2> 13971 T1462 C110 P61203 oasu.DirectUpdateHandler2.commit start commit{flags=0,_version_=0,optimize=false,openSearcher=false,waitSearcher=false,expungeDeletes=false,softCommit=false}
[junit4:junit4]   2> 13980 T1462 C110 P61203 oasc.SolrDeletionPolicy.onCommit SolrDeletionPolicy.onCommit: commits:num=2
[junit4:junit4]   2> 		commit{dir=RateLimitedDirectoryWrapper(NRTCachingDirectory(org.apache.lucene.store.SimpleFSDirectory@C:\Users\JenkinsSlave\workspace\Lucene-Solr-4.x-Windows\solr\build\solr-core\test\J0\org.apache.solr.cloud.BasicDistributedZkTest-1355348510767\jetty4\index.20121212164204678 lockFactory=org.apache.lucene.store.NativeFSLockFactory@140be79; maxCacheMB=48.0 maxMergeSizeMB=4.0)),segFN=segments_2,generation=2,filenames=[segments_2]
[junit4:junit4]   2> 		commit{dir=RateLimitedDirectoryWrapper(NRTCachingDirectory(org.apache.lucene.store.SimpleFSDirectory@C:\Users\JenkinsSlave\workspace\Lucene-Solr-4.x-Windows\solr\build\solr-core\test\J0\org.apache.solr.cloud.BasicDistributedZkTest-1355348510767\jetty4\index.20121212164204678 lockFactory=org.apache.lucene.store.NativeFSLockFactory@140be79; maxCacheMB=48.0 maxMergeSizeMB=4.0)),segFN=segments_3,generation=3,filenames=[segments_3]
[junit4:junit4]   2> 13980 T1462 C110 P61203 oasc.SolrDeletionPolicy.updateCommits newest commit = 3
[junit4:junit4]   2> 13984 T1462 C110 P61203 oasu.DirectUpdateHandler2.commit end_commit_flush
[junit4:junit4]   2> 13984 T1462 C110 P61203 oasc.RecoveryStrategy.replay No replay needed. core=collection1
[junit4:junit4]   2> 13984 T1462 C110 P61203 oasc.RecoveryStrategy.doRecovery Replication Recovery was successful - registering as Active. core=collection1
[junit4:junit4]   2> 13984 T1462 C110 P61203 oasc.ZkController.publish publishing core=collection1 state=active
[junit4:junit4]   2> 13984 T1462 C110 P61203 oasc.ZkController.publish numShards not found on descriptor - reading it from system property
[junit4:junit4]   2> 13988 T1462 C110 P61203 oasc.RecoveryStrategy.doRecovery Finished recovery process. core=collection1
[junit4:junit4]   2> 14213 T1396 oascc.ZkStateReader.updateClusterState Updating cloud state from ZooKeeper... 
[junit4:junit4]   2> 14214 T1396 oasc.Overseer$ClusterStateUpdater.updateState Update state numShards=2 message={
[junit4:junit4]   2> 	  "operation":"state",
[junit4:junit4]   2> 	  "numShards":"2",
[junit4:junit4]   2> 	  "shard":"shard2",
[junit4:junit4]   2> 	  "roles":null,
[junit4:junit4]   2> 	  "state":"active",
[junit4:junit4]   2> 	  "core":"collection1",
[junit4:junit4]   2> 	  "collection":"collection1",
[junit4:junit4]   2> 	  "node_name":"127.0.0.1:61203_solr",
[junit4:junit4]   2> 	  "base_url":"http://127.0.0.1:61203/solr"}
[junit4:junit4]   2> 14237 T1412 oascc.ZkStateReader$2.process A cluster state change has occurred - updating... (5)
[junit4:junit4]   2> 14237 T1395 oascc.ZkStateReader$2.process A cluster state change has occurred - updating... (5)
[junit4:junit4]   2> 14237 T1442 oascc.ZkStateReader$2.process A cluster state change has occurred - updating... (5)
[junit4:junit4]   2> 14237 T1459 oascc.ZkStateReader$2.process A cluster state change has occurred - updating... (5)
[junit4:junit4]   2> 14237 T1465 oascc.ZkStateReader$2.process A cluster state change has occurred - updating... (5)
[junit4:junit4]   2> 14237 T1427 oascc.ZkStateReader$2.process A cluster state change has occurred - updating... (5)
[junit4:junit4]   2> 14967 T1373 oascc.ZkStateReader.updateClusterState Updating cloud state from ZooKeeper... 
[junit4:junit4]   2> ASYNC  NEW_CORE C112 name=collection1 org.apache.solr.core.SolrCore@fec5df url=http://127.0.0.1:61165/solr/collection1 node=127.0.0.1:61165_solr
[junit4:junit4]   2> 14988 T1390 C112 P61165 oasc.SolrDeletionPolicy.onInit SolrDeletionPolicy.onInit: commits:num=1
[junit4:junit4]   2> 		commit{dir=RateLimitedDirectoryWrapper(NRTCachingDirectory(org.apache.lucene.store.SimpleFSDirectory@C:\Users\JenkinsSlave\workspace\Lucene-Solr-4.x-Windows\solr\build\solr-core\test\J0\org.apache.solr.cloud.BasicDistributedZkTest-1355348510767\control\data\index lockFactory=org.apache.lucene.store.NativeFSLockFactory@a9fac1; maxCacheMB=48.0 maxMergeSizeMB=4.0)),segFN=segments_1,generation=1,filenames=[segments_1]
[junit4:junit4]   2> 14988 T1390 C112 P61165 oasc.SolrDeletionPolicy.updateCommits newest commit = 1
[junit4:junit4]   2> 14991 T1390 C112 P61165 oass.SolrIndexSearcher.<init> Opening Searcher@78ece realtime
[junit4:junit4]   2> 14991 T1390 C112 P61165 oass.SolrIndexSearcher.getIndexDir WARNING WARNING: Directory impl does not support setting indexDir: org.apache.lucene.store.RateLimitedDirectoryWrapper
[junit4:junit4]   2> 14992 T1390 C112 P61165 /update {wt=javabin&version=2} {deleteByQuery=*:* (-1421185935733686272)} 0 12
[junit4:junit4]   2> 14992 T1373 oaz.ZooKeeper.<init> Initiating client connection, connectString=127.0.0.1:61158/solr sessionTimeout=10000 watcher=org.apache.solr.common.cloud.ConnectionManager@309d61
[junit4:junit4]   2> 14994 T1373 oascc.ConnectionManager.waitForConnected Waiting for client to connect to ZooKeeper
[junit4:junit4]   2> 14995 T1468 oaz.ClientCnxn$SendThread.logStartConnect Opening socket connection to server 127.0.0.1/127.0.0.1:61158. Will not attempt to authenticate using SASL (access denied (javax.security.auth.AuthPermission getLoginConfiguration))
[junit4:junit4]   2> 14996 T1468 oaz.ClientCnxn$SendThread.primeConnection Socket connection established to 127.0.0.1/127.0.0.1:61158, initiating session
[junit4:junit4]   2> 14996 T1375 oazs.NIOServerCnxnFactory.run Accepted socket connection from /127.0.0.1:61224
[junit4:junit4]   2> 14996 T1375 oazs.ZooKeeperServer.processConnectRequest Client attempting to establish new session at /127.0.0.1:61224
[junit4:junit4]   2> 14999 T1377 oazs.ZooKeeperServer.finishSessionInit Established session 0x13b9111083c000d with negotiated timeout 10000 for client /127.0.0.1:61224
[junit4:junit4]   2> 14999 T1468 oaz.ClientCnxn$SendThread.onConnected Session establishment complete on server 127.0.0.1/127.0.0.1:61158, sessionid = 0x13b9111083c000d, negotiated timeout = 10000
[junit4:junit4]   2> 14999 T1469 oascc.ConnectionManager.process Watcher org.apache.solr.common.cloud.ConnectionManager@309d61 name:ZooKeeperConnection Watcher:127.0.0.1:61158/solr got event WatchedEvent state:SyncConnected type:None path:null path:null type:None
[junit4:junit4]   2> 14999 T1373 oascc.ConnectionManager.waitForConnected Client is connected to ZooKeeper
[junit4:junit4]   2> 15000 T1373 oascc.ZkStateReader.createClusterStateWatchersAndUpdate Updating cluster state from ZooKeeper... 
[junit4:junit4]   2>  C110_STATE=coll:collection1 core:collection1 props:{shard=shard2, roles=null, state=active, core=collection1, collection=collection1, node_name=127.0.0.1:61203_solr, base_url=http://127.0.0.1:61203/solr}
[junit4:junit4]   2> 15021 T1450 C110 P61203 REQ /update {update.distrib=FROMLEADER&_version_=-1421185935758852096&update.from=http://127.0.0.1:61183/solr/collection1/&wt=javabin&version=2} status=0 QTime=4 
[junit4:junit4]   2>  C108_STATE=coll:collection1 core:collection1 props:{shard=shard1, roles=null, state=active, core=collection1, collection=collection1, node_name=127.0.0.1:61192_solr, base_url=http://127.0.0.1:61192/solr}
[junit4:junit4]   2> 15030 T1436 C108 P61192 REQ /update {update.distrib=FROMLEADER&_version_=-1421185935765143552&update.from=http://127.0.0.1:61174/solr/collection1/&wt=javabin&version=2} status=0 QTime=5 
[junit4:junit4]   2> 15030 T1406 C109 P61174 REQ /update {update.distrib=TOLEADER&wt=javabin&version=2} status=0 QTime=20 
[junit4:junit4]   2> 15031 T1418 C111 P61183 /update {wt=javabin&version=2} {deleteByQuery=*:* (-1421185935758852096)} 0 27
[junit4:junit4]   2> 15037 T1391 C112 P61165 /update {wt=javabin&version=2} {add=[1 (1421185935790309376)]} 0 3
[junit4:junit4]   2> 15051 T1437 C108 P61192 REQ /update {distrib.from=http://127.0.0.1:61174/solr/collection1/&update.distrib=FROMLEADER&wt=javabin&version=2} status=0 QTime=3 
[junit4:junit4]   2> 15052 T1407 C109 P61174 REQ /update {distrib.from=http://127.0.0.1:61183/solr/collection1/&update.distrib=TOLEADER&wt=javabin&version=2} status=0 QTime=9 
[junit4:junit4]   2> 15054 T1419 C111 P61183 /update {wt=javabin&version=2} {add=[1]} 0 14
[junit4:junit4]   2> 15059 T1386 C112 P61165 /update {wt=javabin&version=2} {add=[2 (1421185935814426624)]} 0 2
[junit4:junit4]   2> 15071 T1451 C110 P61203 REQ /update {distrib.from=http://127.0.0.1:61183/solr/collection1/&update.distrib=FROMLEADER&wt=javabin&version=2} status=0 QTime=4 
[junit4:junit4]   2> 15072 T1420 C111 P61183 REQ /update {distrib.from=http://127.0.0.1:61174/solr/collection1/&update.distrib=TOLEADER&wt=javabin&version=2} status=0 QTime=10 
[junit4:junit4]   2> 15072 T1403 C109 P61174 /update {wt=javabin&version=2} {add=[2]} 0 12
[junit4:junit4]   2> 15076 T1387 C112 P61165 /update {wt=javabin&version=2} {add=[3 (1421185935833300992)]} 0 1
[junit4:junit4]   2> 15088 T1452 C110 P61203 REQ /update {distrib.from=http://127.0.0.1:61183/solr/collection1/&update.distrib=FROMLEADER&wt=javabin&version=2} status=0 QTime=1 
[junit4:junit4]   2> 15089 T1422 C111 P61183 REQ /update {distrib.from=http://127.0.0.1:61174/solr/collection1/&update.distrib=TOLEADER&wt=javabin&version=2} status=0 QTime=6 
[junit4:junit4]   2> 15089 T1405 C109 P61174 /update {wt=javabin&version=2} {add=[3]} 0 9
[junit4:junit4]   2> 15093 T1388 C112 P61165 /update {wt=javabin&version=2} {add=[4 (1421185935852175360)]} 0 0
[junit4:junit4]   2> 15102 T1438 C108 P61192 REQ /update {distrib.from=http://127.0.0.1:61174/solr/collection1/&update.distrib=FROMLEADER&wt=javabin&version=2} status=0 QTime=1 
[junit4:junit4]   2> 15119 T1404 C109 P61174 /update {wt=javabin&version=2} {add=[4 (1421185935856369664)]} 0 22
[junit4:junit4]   2> 15123 T1390 C112 P61165 /update {wt=javabin&version=2} {add=[5 (1421185935882584064)]} 0 1
[junit4:junit4]   2> 15134 T1453 C110 P61203 REQ /update {distrib.from=http://127.0.0.1:61183/solr/collection1/&update.distrib=FROMLEADER&wt=javabin&version=2} status=0 QTime=1 
[junit4:junit4]   2> 15135 T1423 C111 P61183 REQ /update {distrib.from=http://127.0.0.1:61174/solr/collection1/&update.distrib=TOLEADER&wt=javabin&version=2} status=0 QTime=6 
[junit4:junit4]   2> 15135 T1408 C109 P61174 /update {wt=javabin&version=2} {add=[5]} 0 8
[junit4:junit4]   2> 15139 T1391 C112 P61165 /update {wt=javabin&version=2} {add=[6 (1421185935899361280)]} 0 1
[junit4:junit4]   2> 15147 T1454 C110 P61203 REQ /update {distrib.from=http://127.0.0.1:61183/solr/collection1/&update.distrib=FROMLEADER&wt=javabin&version=2} status=0 QTime=1 
[junit4:junit4]   2> 15148 T1421 C111 P61183 REQ /update {distrib.from=http://127.0.0.1:61174/solr/collection1/&update.distrib=TOLEADER&wt=javabin&version=2} status=0 QTime=5 
[junit4:junit4]   2> 15149 T1406 C109 P61174 /update {wt=javabin&version=2} {add=[6]} 0 8
[junit4:junit4]   2> 15153 T1386 C112 P61165 /update {wt=javabin&version=2} {add=[7 (1421185935914041344)]} 0 1
[junit4:junit4]   2> 15164 T1455 C110 P61203 REQ /update {distrib.from=http://127.0.0.1:61183/solr/collection1/&update.distrib=FROMLEADER&wt=javabin&version=2} status=0 QTime=1 
[junit4:junit4]   2> 15165 T1418 C111 P61183 REQ /update {distrib.from=http://127.0.0.1:61174/solr/collection1/&update.distrib=TOLEADER&wt=javabin&version=2} status=0 QTime=6 
[junit4:junit4]   2> 15165 T1407 C109 P61174 /update {wt=javabin&version=2} {add=[7]} 0 8
[junit4:junit4]   2> 15169 T1387 C112 P61165 /update {wt=javabin&version=2} {add=[8 (1421185935930818560)]} 0 1
[junit4:junit4]   2> 15176 T1433 C108 P61192 REQ /update {distrib.from=http://127.0.0.1:61174/solr/collection1/&update.distrib=FROMLEADER&wt=javabin&version=2} status=0 QTime=1 
[junit4:junit4]   2> 15176 T1403 C109 P61174 /update {wt=javabin&version=2} {add=[8 (1421185935935012864)]} 0 4
[junit4:junit4]   2> 15180 T1388 C112 P61165 /update {wt=javabin&version=2} {add=[9 (1421185935942352896)]} 0 1
[junit4:junit4]   2> 15191 T1450 C110 P61203 REQ /update {distrib.from=http://127.0.0.1:61183/solr/collection1/&update.distrib=FROMLEADER&wt=javabin&version=2} status=0 QTime=1 
[junit4:junit4]   2> 15192 T1419 C111 P61183 REQ /update {distrib.from=http://127.0.0.1:61174/solr/collection1/&update.distrib=TOLEADER&wt=javabin&version=2} status=0 QTime=6 
[junit4:junit4]   2> 15192 T1405 C109 P61174 /update {wt=javabin&version=2} {add=[9]} 0 10
[junit4:junit4]   2> 15203 T1389 C112 P61165 /update {wt=javabin&version=2} {add=[10 (1421185935959130112)]} 0 8
[junit4:junit4]   2> 15209 T1434 C108 P61192 REQ /update {distrib.from=http://127.0.0.1:61174/solr/collection1/&update.distrib=FROMLEADER&wt=javabin&version=2} status=0 QTime=0 
[junit4:junit4]   2> 15210 T1404 C109 P61174 /update {wt=javabin&version=2} {add=[10 (1421185935970664448)]} 0 4
[junit4:junit4]   2> 15216 T1390 C112 P61165 /update {wt=javabin&version=2} {add=[11 (1421185935979053056)]} 0 2
[junit4:junit4]   2> 15224 T1435 C108 P61192 REQ /update {distrib.from=http://127.0.0.1:61174/solr/collection1/&update.distrib=FROMLEADER&wt=javabin&version=2} status=0 QTime=1 
[junit4:junit4]   2> 15225 T1408 C109 P61174 /update {wt=javabin&version=2} {add=[11 (1421185935985344512)]} 0 5
[junit4:junit4]   2> 15228 T1391 C112 P61165 /update {wt=javabin&version=2} {add=[12 (1421185935992684544)]} 0 1
[junit4:junit4]   2> 15234 T1436 C108 P61192 REQ /update {distrib.from=http://127.0.0.1:61174/solr/collection1/&update.distrib=FROMLEADER&wt=javabin&version=2} status=0 QTime=1 
[junit4:junit4]   2> 15235 T1406 C109 P61174 /update {wt=javabin&version=2} {add=[12 (1421185935995830272)]} 0 5
[junit4:junit4]   2> 15238 T1386 C112 P61165 /update {wt=javabin&version=2} {add=[13 (1421185936003170304)]} 0 1
[junit4:junit4]   2> 15247 T1437 C108 P61192 REQ /update {distrib.from=http://127.0.0.1:61174/solr/collection1/&update.distrib=FROMLEADER&wt=javabin&version=2} status=0 QTime=1 
[junit4:junit4]   2> 15247 T1407 C109 P61174 REQ /update {distrib.from=http://127.0.0.1:61183/solr/collection1/&update.distrib=TOLEADER&wt=javabin&version=2} status=0 QTime=4 
[junit4:junit4]   2> 15247 T1422 C111 P61183 /update {wt=javabin&version=2} {add=[13]} 0 6
[junit4:junit4]   2> 15253 T1387 C112 P61165 /update {wt=javabin&version=2} {add=[14 (1421185936018898944)]} 0 1
[junit4:junit4]   2> 15261 T1438 C108 P61192 REQ /update {distrib.from=http://127.0.0.1:61174/solr/collection1/&update.distrib=FROMLEADER&wt=javabin&version=2} status=0 QTime=1 
[junit4:junit4]   2> 15262 T1403 C109 P61174 REQ /update {distrib.from=http://127.0.0.1:61183/solr/collection1/&update.distrib=TOLEADER&wt=javabin&version=2} status=0 QTime=5 
[junit4:junit4]   2> 15262 T1423 C111 P61183 /update {wt=javabin&version=2} {add=[14]} 0 7
[junit4:junit4]   2> 15266 T1388 C112 P61165 /update {wt=javabin&version=2} {add=[15 (1421185936032530432)]} 0 1
[junit4:junit4]   2> 15272 T1433 C108 P61192 REQ /update {distrib.from=http://127.0.0.1:61174/solr/collection1/&update.distrib=FROMLEADER&wt=javabin&version=2} status=0 QTime=0 
[junit4:junit4]   2> 15273 T1405 C109 P61174 /update {wt=javabin&version=2} {add=[15 (1421185936036724736)]} 0 4
[junit4:junit4]   2> 15276 T1389 C112 P61165 /update {wt=javabin&version=2} {add=[16 (1421185936044064768)]} 0 0
[junit4:junit4]   2> 15302 T1434 C108 P61192 REQ /update {distrib.

[...truncated too long message...]

java:50)
[junit4:junit4]    > 	at org.apache.lucene.util.TestRuleFieldCacheSanity$1.evaluate(TestRuleFieldCacheSanity.java:51)
[junit4:junit4]    > 	at org.apache.lucene.util.AbstractBeforeAfterRule$1.evaluate(AbstractBeforeAfterRule.java:46)
[junit4:junit4]    > 	at com.carrotsearch.randomizedtesting.rules.SystemPropertiesInvariantRule$1.evaluate(SystemPropertiesInvariantRule.java:55)
[junit4:junit4]    > 	at org.apache.lucene.util.TestRuleThreadAndTestName$1.evaluate(TestRuleThreadAndTestName.java:49)
[junit4:junit4]    > 	at org.apache.lucene.util.TestRuleIgnoreAfterMaxFailures$1.evaluate(TestRuleIgnoreAfterMaxFailures.java:70)
[junit4:junit4]    > 	at org.apache.lucene.util.TestRuleMarkFailure$1.evaluate(TestRuleMarkFailure.java:48)
[junit4:junit4]    > 	at com.carrotsearch.randomizedtesting.rules.StatementAdapter.evaluate(StatementAdapter.java:36)
[junit4:junit4]    > 	at com.carrotsearch.randomizedtesting.ThreadLeakControl$StatementRunner.run(ThreadLeakControl.java:358)
[junit4:junit4]    > 	at com.carrotsearch.randomizedtesting.ThreadLeakControl.forkTimeoutingTask(ThreadLeakControl.java:782)
[junit4:junit4]    > 	at com.carrotsearch.randomizedtesting.ThreadLeakControl$3.evaluate(ThreadLeakControl.java:442)
[junit4:junit4]    > 	at com.carrotsearch.randomizedtesting.RandomizedRunner.runSingleTest(RandomizedRunner.java:746)
[junit4:junit4]    > 	at com.carrotsearch.randomizedtesting.RandomizedRunner$3.evaluate(RandomizedRunner.java:648)
[junit4:junit4]    > 	at com.carrotsearch.randomizedtesting.RandomizedRunner$4.evaluate(RandomizedRunner.java:682)
[junit4:junit4]    > 	at com.carrotsearch.randomizedtesting.RandomizedRunner$5.evaluate(RandomizedRunner.java:693)
[junit4:junit4]    > 	at com.carrotsearch.randomizedtesting.rules.StatementAdapter.evaluate(StatementAdapter.java:36)
[junit4:junit4]    > 	at com.carrotsearch.randomizedtesting.rules.SystemPropertiesRestoreRule$1.evaluate(SystemPropertiesRestoreRule.java:53)
[junit4:junit4]    > 	at org.apache.lucene.util.AbstractBeforeAfterRule$1.evaluate(AbstractBeforeAfterRule.java:46)
[junit4:junit4]    > 	at org.apache.lucene.util.TestRuleStoreClassName$1.evaluate(TestRuleStoreClassName.java:42)
[junit4:junit4]    > 	at com.carrotsearch.randomizedtesting.rules.SystemPropertiesInvariantRule$1.evaluate(SystemPropertiesInvariantRule.java:55)
[junit4:junit4]    > 	at com.carrotsearch.randomizedtesting.rules.NoShadowingOrOverridesOnMethodsRule$1.evaluate(NoShadowingOrOverridesOnMethodsRule.java:39)
[junit4:junit4]    > 	at com.carrotsearch.randomizedtesting.rules.NoShadowingOrOverridesOnMethodsRule$1.evaluate(NoShadowingOrOverridesOnMethodsRule.java:39)
[junit4:junit4]    > 	at com.carrotsearch.randomizedtesting.rules.StatementAdapter.evaluate(StatementAdapter.java:36)
[junit4:junit4]    > 	at org.apache.lucene.util.TestRuleAssertionsRequired$1.evaluate(TestRuleAssertionsRequired.java:43)
[junit4:junit4]    > 	at org.apache.lucene.util.TestRuleMarkFailure$1.evaluate(TestRuleMarkFailure.java:48)
[junit4:junit4]    > 	at org.apache.lucene.util.TestRuleIgnoreAfterMaxFailures$1.evaluate(TestRuleIgnoreAfterMaxFailures.java:70)
[junit4:junit4]    > 	at org.apache.lucene.util.TestRuleIgnoreTestSuites$1.evaluate(TestRuleIgnoreTestSuites.java:55)
[junit4:junit4]    > 	at com.carrotsearch.randomizedtesting.rules.StatementAdapter.evaluate(StatementAdapter.java:36)
[junit4:junit4]    > 	at com.carrotsearch.randomizedtesting.ThreadLeakControl$StatementRunner.run(ThreadLeakControl.java:358)
[junit4:junit4]    > 	at java.lang.Thread.run(Thread.java:662)
[junit4:junit4]   2> 238487 T3768 oas.SolrTestCaseJ4.deleteCore ###deleteCore
[junit4:junit4]   2> NOTE: test params are: codec=Asserting, sim=RandomSimilarityProvider(queryNorm=true,coord=crazy): {}, locale=es_PA, timezone=Arctic/Longyearbyen
[junit4:junit4]   2> NOTE: Windows 7 6.1 x86/Sun Microsystems Inc. 1.6.0_37 (32-bit)/cpus=2,threads=1,free=220409000,total=383139840
[junit4:junit4]   2> NOTE: All tests run in this JVM: [StatsComponentTest, TestLMJelinekMercerSimilarityFactory, SolrIndexConfigTest, TestSuggestSpellingConverter, TestPropInject, DocumentBuilderTest, SimplePostToolTest, SpellCheckCollatorTest, BadComponentTest, TestCollationKeyRangeQueries, TestQuerySenderNoQuery, MultiTermTest, JSONWriterTest, BadIndexSchemaTest, TestDocSet, SolrRequestParserTest, SampleTest, TestPerFieldSimilarity, DirectSolrConnectionTest, SystemInfoHandlerTest, WordBreakSolrSpellCheckerTest, SolrInfoMBeanTest, OpenExchangeRatesOrgProviderTest, SearchHandlerTest, StandardRequestHandlerTest, SolrCoreCheckLockOnStartupTest, TestSystemIdResolver, TestFunctionQuery, HighlighterConfigTest, TestStressLucene, TestTrie, TestFastWriter, TestSearchPerf, AnalysisAfterCoreReloadTest, NoCacheHeaderTest, TestJmxMonitoredMap, TestSolrDeletionPolicy2, TestStressReorder, CoreContainerCoreInitFailuresTest, TestSolrCoreProperties, SortByFunctionTest, TestIndexSearcher, ClusterStateUpdateTest, TestWordDelimiterFilterFactory, TestPhraseSuggestions, TestReload, AlternateDirectoryTest, DistributedSpellCheckComponentTest, TestSolrJ, IndexSchemaTest, TestFuzzyAnalyzedSuggestions, TestFastLRUCache, NumericFieldsTest, ResourceLoaderTest, TestDFRSimilarityFactory, TestPseudoReturnFields, HighlighterTest, TestPluginEnable, ClusterStateTest, PreAnalyzedFieldTest, CoreAdminHandlerTest, PluginInfoTest, FullSolrCloudDistribCmdsTest, PathHierarchyTokenizerFactoryTest, CacheHeaderTest, ZkNodePropsTest, URLClassifyProcessorTest, TermVectorComponentTest, CircularListTest, TestReversedWildcardFilterFactory, SOLR749Test, TestQueryTypes, NotRequiredUniqueKeyTest, TestIndexingPerformance, CurrencyFieldTest, TestRTGBase, AutoCommitTest, SolrPluginUtilsTest, LegacyHTMLStripCharFilterTest, TestArbitraryIndexDir, ZkControllerTest, DistributedTermsComponentTest, IndexReaderFactoryTest, TestRandomFaceting, CSVRequestHandlerTest, SimpleFacetsTest, TimeZoneUtilsTest, UniqFieldsUpdateProcessorFactoryTest, SpatialFilterTest, TestFastOutputStream, TestRealTimeGet, TestFoldingMultitermQuery, MinimalSchemaTest, SpellCheckComponentTest, ScriptEngineTest, CopyFieldTest, ResponseLogComponentTest, PolyFieldTest, TestMultiCoreConfBootstrap, UpdateParamsTest, TestPropInjectDefaults, ConvertedLegacyTest, PeerSyncTest, TestQuerySenderListener, LeaderElectionIntegrationTest, TestBadConfig, StatelessScriptUpdateProcessorFactoryTest, FieldMutatingUpdateProcessorTest, TestValueSourceCache, TestDistributedSearch, RAMDirectoryFactoryTest, UpdateRequestProcessorFactoryTest, TestLRUCache, SpellPossibilityIteratorTest, TestFaceting, BasicDistributedZkTest, OverseerTest, RecoveryZkTest, TestReplicationHandler, LeaderElectionTest, TestDistributedGrouping, TestExtendedDismaxParser, SoftAutoCommitTest, BasicZkTest, ZkSolrClientTest, TestHashPartitioner, TestRecovery, TestJoin, SolrCoreTest, IndexBasedSpellCheckerTest, TestRangeQuery, DirectUpdateHandlerTest, TestCoreContainer, LukeRequestHandlerTest, TestSort, TestGroupingSearch, DirectSolrSpellCheckerTest, TestFiltering, FileBasedSpellCheckerTest, QueryElevationComponentTest, BasicFunctionalityTest, SignatureUpdateProcessorFactoryTest, TestBinaryResponseWriter, TestJmxIntegration, TestRemoteStreaming, QueryEqualityTest, TestCSVLoader, TestCSVResponseWriter, MoreLikeThisHandlerTest, MBeansHandlerTest, DistributedQueryElevationComponentTest, DisMaxRequestHandlerTest, BinaryUpdateRequestHandlerTest, QueryParsingTest, TermsComponentTest, DistanceFunctionTest, XsltUpdateRequestHandlerTest, TestPHPSerializedResponseWriter, XmlUpdateRequestHandlerTest, FieldAnalysisRequestHandlerTest, PingRequestHandlerTest, SuggesterWFSTTest, JsonLoaderTest, TestSurroundQueryParser, DocumentAnalysisRequestHandlerTest, DirectUpdateHandlerOptimizeTest, IndexSchemaRuntimeFieldTest, TestSolrQueryParser, FastVectorHighlighterTest, DebugComponentTest, ReturnFieldsTest, RequestHandlersTest, RequiredFieldsTest, TestOmitPositions, SuggesterFSTTest, TestQueryUtils, LoggingHandlerTest, SuggesterTSTTest, SolrCmdDistributorTest, SuggesterTest, ShowFileRequestHandlerTest, TestSolrDeletionPolicy1, TestLuceneMatchVersion, TestWriterPerf, PrimitiveFieldTypeTest, TestUpdate, TestBinaryField, DefaultValueUpdateProcessorTest, TestMergePolicyConfig, TestXIncludeConfig, TestLFUCache, TestCollationField, OutputWriterTest, TestNumberUtils, TestConfig, EchoParamsTest, TestBM25SimilarityFactory, TestLMDirichletSimilarityFactory, TestIBSimilarityFactory, TestCodecSupport, TestDefaultSimilarityFactory, DateMathParserTest, PrimUtilsTest, FileUtilsTest, TestSolrXMLSerializer, DateFieldTest, SpellingQueryConverterTest, DOMUtilTest, UUIDFieldTest, TestUtils, TestDocumentBuilder, TestCharFilters, BasicDistributedZk2Test, OverseerCollectionProcessorTest, SyncSliceTest]
[junit4:junit4] Completed in 238.52s, 1 test, 1 failure <<< FAILURES!

[...truncated 51 lines...]
BUILD FAILED
C:\Users\JenkinsSlave\workspace\Lucene-Solr-4.x-Windows\build.xml:352: The following error occurred while executing this line:
C:\Users\JenkinsSlave\workspace\Lucene-Solr-4.x-Windows\build.xml:39: The following error occurred while executing this line:
C:\Users\JenkinsSlave\workspace\Lucene-Solr-4.x-Windows\solr\build.xml:178: The following error occurred while executing this line:
C:\Users\JenkinsSlave\workspace\Lucene-Solr-4.x-Windows\solr\common-build.xml:438: The following error occurred while executing this line:
C:\Users\JenkinsSlave\workspace\Lucene-Solr-4.x-Windows\lucene\common-build.xml:1175: The following error occurred while executing this line:
C:\Users\JenkinsSlave\workspace\Lucene-Solr-4.x-Windows\lucene\common-build.xml:839: There were test failures: 239 suites, 994 tests, 1 error, 2 failures, 12 ignored (7 assumptions)

Total time: 47 minutes 26 seconds
Build step 'Invoke Ant' marked build as failure
Archiving artifacts
Recording test results
Description set: Java: 32bit/jdk1.6.0_37 -server -XX:+UseConcMarkSweepGC
Email was triggered for: Failure
Sending email for trigger: Failure



Mime
View raw message