lucene-dev mailing list archives

Site index · List index
Message view « Date » · « Thread »
Top « Date » · « Thread »
From Apache Jenkins Server <jenk...@builds.apache.org>
Subject [JENKINS] Lucene-Solr-Tests-trunk-java7 - Build # 3579 - Failure
Date Wed, 26 Dec 2012 06:42:37 GMT
Build: https://builds.apache.org/job/Lucene-Solr-Tests-trunk-java7/3579/

2 tests failed.
REGRESSION:  org.apache.solr.cloud.BasicDistributedZkTest.testDistribSearch

Error Message:
Test abandoned because suite timeout was reached.

Stack Trace:
java.lang.Exception: Test abandoned because suite timeout was reached.
	at __randomizedtesting.SeedInfo.seed([C714D129BCBD2EDE]:0)


FAILED:  junit.framework.TestSuite.org.apache.solr.cloud.BasicDistributedZkTest

Error Message:
Suite timeout exceeded (>= 7200000 msec).

Stack Trace:
java.lang.Exception: Suite timeout exceeded (>= 7200000 msec).
	at __randomizedtesting.SeedInfo.seed([C714D129BCBD2EDE]:0)




Build Log:
[...truncated 9555 lines...]
[junit4:junit4] Suite: org.apache.solr.cloud.BasicDistributedZkTest
[junit4:junit4]   2> 0 T1417 oas.BaseDistributedSearchTestCase.initHostContext Setting hostContext system property: /
[junit4:junit4]   2> 6 T1417 oas.SolrTestCaseJ4.setUp ###Starting testDistribSearch
[junit4:junit4]   2> Creating dataDir: /usr/home/hudson/hudson-slave/workspace/Lucene-Solr-Tests-trunk-java7/solr/build/solr-core/test/J1/./solrtest-BasicDistributedZkTest-1356496914830
[junit4:junit4]   2> 7 T1417 oasc.ZkTestServer.run STARTING ZK TEST SERVER
[junit4:junit4]   2> 8 T1418 oasc.ZkTestServer$ZKServerMain.runFromConfig Starting server
[junit4:junit4]   2> 10 T1418 oazs.ZooKeeperServer.setTickTime tickTime set to 1000
[junit4:junit4]   2> 10 T1418 oazs.ZooKeeperServer.setMinSessionTimeout minSessionTimeout set to -1
[junit4:junit4]   2> 11 T1418 oazs.ZooKeeperServer.setMaxSessionTimeout maxSessionTimeout set to -1
[junit4:junit4]   2> 11 T1418 oazs.NIOServerCnxnFactory.configure binding to port 0.0.0.0/0.0.0.0:0
[junit4:junit4]   2> 12 T1418 oazsp.FileTxnSnapLog.save Snapshotting: 0x0 to /usr/home/hudson/hudson-slave/workspace/Lucene-Solr-Tests-trunk-java7/solr/build/solr-core/test/J1/./org.apache.solr.cloud.BasicDistributedZkTest-1356496914830/zookeeper/server1/data/version-2/snapshot.0
[junit4:junit4]   2> 109 T1417 oasc.ZkTestServer.run start zk server on port:28188
[junit4:junit4]   2> 110 T1417 oaz.ZooKeeper.<init> Initiating client connection, connectString=127.0.0.1:28188 sessionTimeout=10000 watcher=org.apache.solr.common.cloud.ConnectionManager@2a2b9750
[junit4:junit4]   2> 112 T1417 oascc.ConnectionManager.waitForConnected Waiting for client to connect to ZooKeeper
[junit4:junit4]   2> 112 T1423 oaz.ClientCnxn$SendThread.logStartConnect Opening socket connection to server localhost/127.0.0.1:28188. Will not attempt to authenticate using SASL (access denied ("javax.security.auth.AuthPermission" "getLoginConfiguration"))
[junit4:junit4]   2> 113 T1423 oaz.ClientCnxn$SendThread.primeConnection Socket connection established to localhost/127.0.0.1:28188, initiating session
[junit4:junit4]   2> 113 T1419 oazs.NIOServerCnxnFactory.run Accepted socket connection from /140.211.11.196:28189
[junit4:junit4]   2> 114 T1419 oazs.ZooKeeperServer.processConnectRequest Client attempting to establish new session at /140.211.11.196:28189
[junit4:junit4]   2> 114 T1421 oazsp.FileTxnLog.append Creating new log file: log.1
[junit4:junit4]   2> 118 T1421 oazs.ZooKeeperServer.finishSessionInit Established session 0x13bd58449930000 with negotiated timeout 10000 for client /140.211.11.196:28189
[junit4:junit4]   2> 118 T1423 oaz.ClientCnxn$SendThread.onConnected Session establishment complete on server localhost/127.0.0.1:28188, sessionid = 0x13bd58449930000, negotiated timeout = 10000
[junit4:junit4]   2> 119 T1424 oascc.ConnectionManager.process Watcher org.apache.solr.common.cloud.ConnectionManager@2a2b9750 name:ZooKeeperConnection Watcher:127.0.0.1:28188 got event WatchedEvent state:SyncConnected type:None path:null path:null type:None
[junit4:junit4]   2> 119 T1417 oascc.ConnectionManager.waitForConnected Client is connected to ZooKeeper
[junit4:junit4]   2> 120 T1417 oascc.SolrZkClient.makePath makePath: /solr
[junit4:junit4]   2> 125 T1422 oazs.PrepRequestProcessor.pRequest2Txn Processed session termination for sessionid: 0x13bd58449930000
[junit4:junit4]   2> 126 T1424 oaz.ClientCnxn$EventThread.run EventThread shut down
[junit4:junit4]   2> 126 T1419 oazs.NIOServerCnxn.closeSock Closed socket connection for client /140.211.11.196:28189 which had sessionid 0x13bd58449930000
[junit4:junit4]   2> 126 T1417 oaz.ZooKeeper.close Session: 0x13bd58449930000 closed
[junit4:junit4]   2> 127 T1417 oaz.ZooKeeper.<init> Initiating client connection, connectString=127.0.0.1:28188/solr sessionTimeout=10000 watcher=org.apache.solr.common.cloud.ConnectionManager@118d2ea
[junit4:junit4]   2> 129 T1425 oaz.ClientCnxn$SendThread.logStartConnect Opening socket connection to server localhost/127.0.0.1:28188. Will not attempt to authenticate using SASL (access denied ("javax.security.auth.AuthPermission" "getLoginConfiguration"))
[junit4:junit4]   2> 128 T1417 oascc.ConnectionManager.waitForConnected Waiting for client to connect to ZooKeeper
[junit4:junit4]   2> 129 T1425 oaz.ClientCnxn$SendThread.primeConnection Socket connection established to localhost/127.0.0.1:28188, initiating session
[junit4:junit4]   2> 129 T1419 oazs.NIOServerCnxnFactory.run Accepted socket connection from /140.211.11.196:28190
[junit4:junit4]   2> 130 T1419 oazs.ZooKeeperServer.processConnectRequest Client attempting to establish new session at /140.211.11.196:28190
[junit4:junit4]   2> 144 T1421 oazs.ZooKeeperServer.finishSessionInit Established session 0x13bd58449930001 with negotiated timeout 10000 for client /140.211.11.196:28190
[junit4:junit4]   2> 144 T1425 oaz.ClientCnxn$SendThread.onConnected Session establishment complete on server localhost/127.0.0.1:28188, sessionid = 0x13bd58449930001, negotiated timeout = 10000
[junit4:junit4]   2> 145 T1426 oascc.ConnectionManager.process Watcher org.apache.solr.common.cloud.ConnectionManager@118d2ea name:ZooKeeperConnection Watcher:127.0.0.1:28188/solr got event WatchedEvent state:SyncConnected type:None path:null path:null type:None
[junit4:junit4]   2> 145 T1417 oascc.ConnectionManager.waitForConnected Client is connected to ZooKeeper
[junit4:junit4]   2> 146 T1417 oascc.SolrZkClient.makePath makePath: /collections/collection1
[junit4:junit4]   2> 151 T1417 oascc.SolrZkClient.makePath makePath: /collections/collection1/shards
[junit4:junit4]   2> 160 T1417 oascc.SolrZkClient.makePath makePath: /collections/control_collection
[junit4:junit4]   2> 163 T1417 oascc.SolrZkClient.makePath makePath: /collections/control_collection/shards
[junit4:junit4]   2> 167 T1417 oasc.AbstractZkTestCase.putConfig put /usr/home/hudson/hudson-slave/workspace/Lucene-Solr-Tests-trunk-java7/solr/build/solr-core/test-files/solr/collection1/conf/solrconfig.xml to /configs/conf1/solrconfig.xml
[junit4:junit4]   2> 168 T1417 oascc.SolrZkClient.makePath makePath: /configs/conf1/solrconfig.xml
[junit4:junit4]   2> 182 T1417 oasc.AbstractZkTestCase.putConfig put /usr/home/hudson/hudson-slave/workspace/Lucene-Solr-Tests-trunk-java7/solr/build/solr-core/test-files/solr/collection1/conf/schema.xml to /configs/conf1/schema.xml
[junit4:junit4]   2> 183 T1417 oascc.SolrZkClient.makePath makePath: /configs/conf1/schema.xml
[junit4:junit4]   2> 312 T1417 oasc.AbstractZkTestCase.putConfig put /usr/home/hudson/hudson-slave/workspace/Lucene-Solr-Tests-trunk-java7/solr/build/solr-core/test-files/solr/collection1/conf/stopwords.txt to /configs/conf1/stopwords.txt
[junit4:junit4]   2> 314 T1417 oascc.SolrZkClient.makePath makePath: /configs/conf1/stopwords.txt
[junit4:junit4]   2> 332 T1417 oasc.AbstractZkTestCase.putConfig put /usr/home/hudson/hudson-slave/workspace/Lucene-Solr-Tests-trunk-java7/solr/build/solr-core/test-files/solr/collection1/conf/protwords.txt to /configs/conf1/protwords.txt
[junit4:junit4]   2> 333 T1417 oascc.SolrZkClient.makePath makePath: /configs/conf1/protwords.txt
[junit4:junit4]   2> 365 T1417 oasc.AbstractZkTestCase.putConfig put /usr/home/hudson/hudson-slave/workspace/Lucene-Solr-Tests-trunk-java7/solr/build/solr-core/test-files/solr/collection1/conf/currency.xml to /configs/conf1/currency.xml
[junit4:junit4]   2> 367 T1417 oascc.SolrZkClient.makePath makePath: /configs/conf1/currency.xml
[junit4:junit4]   2> 393 T1417 oasc.AbstractZkTestCase.putConfig put /usr/home/hudson/hudson-slave/workspace/Lucene-Solr-Tests-trunk-java7/solr/build/solr-core/test-files/solr/collection1/conf/open-exchange-rates.json to /configs/conf1/open-exchange-rates.json
[junit4:junit4]   2> 394 T1417 oascc.SolrZkClient.makePath makePath: /configs/conf1/open-exchange-rates.json
[junit4:junit4]   2> 406 T1417 oasc.AbstractZkTestCase.putConfig put /usr/home/hudson/hudson-slave/workspace/Lucene-Solr-Tests-trunk-java7/solr/build/solr-core/test-files/solr/collection1/conf/mapping-ISOLatin1Accent.txt to /configs/conf1/mapping-ISOLatin1Accent.txt
[junit4:junit4]   2> 407 T1417 oascc.SolrZkClient.makePath makePath: /configs/conf1/mapping-ISOLatin1Accent.txt
[junit4:junit4]   2> 430 T1417 oasc.AbstractZkTestCase.putConfig put /usr/home/hudson/hudson-slave/workspace/Lucene-Solr-Tests-trunk-java7/solr/build/solr-core/test-files/solr/collection1/conf/old_synonyms.txt to /configs/conf1/old_synonyms.txt
[junit4:junit4]   2> 431 T1417 oascc.SolrZkClient.makePath makePath: /configs/conf1/old_synonyms.txt
[junit4:junit4]   2> 435 T1417 oasc.AbstractZkTestCase.putConfig put /usr/home/hudson/hudson-slave/workspace/Lucene-Solr-Tests-trunk-java7/solr/build/solr-core/test-files/solr/collection1/conf/synonyms.txt to /configs/conf1/synonyms.txt
[junit4:junit4]   2> 436 T1417 oascc.SolrZkClient.makePath makePath: /configs/conf1/synonyms.txt
[junit4:junit4]   2> 467 T1422 oazs.PrepRequestProcessor.pRequest2Txn Processed session termination for sessionid: 0x13bd58449930001
[junit4:junit4]   2> 468 T1426 oaz.ClientCnxn$EventThread.run EventThread shut down
[junit4:junit4]   2> 468 T1419 oazs.NIOServerCnxn.closeSock Closed socket connection for client /140.211.11.196:28190 which had sessionid 0x13bd58449930001
[junit4:junit4]   2> 468 T1417 oaz.ZooKeeper.close Session: 0x13bd58449930001 closed
[junit4:junit4]   2> 722 T1417 oejs.Server.doStart jetty-8.1.8.v20121106
[junit4:junit4]   2> 728 T1417 oejs.AbstractConnector.doStart Started SocketConnector@127.0.0.1:28191
[junit4:junit4]   2> 729 T1417 oasc.SolrResourceLoader.locateSolrHome JNDI not configured for solr (NoInitialContextEx)
[junit4:junit4]   2> 730 T1417 oasc.SolrResourceLoader.locateSolrHome using system property solr.solr.home: /usr/home/hudson/hudson-slave/workspace/Lucene-Solr-Tests-trunk-java7/solr/build/solr-core/test/J1/./org.apache.solr.cloud.BasicDistributedZkTest-controljetty-1356496915293
[junit4:junit4]   2> 731 T1417 oasc.SolrResourceLoader.<init> new SolrResourceLoader for deduced Solr Home: '/usr/home/hudson/hudson-slave/workspace/Lucene-Solr-Tests-trunk-java7/solr/build/solr-core/test/J1/./org.apache.solr.cloud.BasicDistributedZkTest-controljetty-1356496915293/'
[junit4:junit4]   2> 779 T1417 oass.SolrDispatchFilter.init SolrDispatchFilter.init()
[junit4:junit4]   2> 781 T1417 oasc.SolrResourceLoader.locateSolrHome JNDI not configured for solr (NoInitialContextEx)
[junit4:junit4]   2> 782 T1417 oasc.SolrResourceLoader.locateSolrHome using system property solr.solr.home: /usr/home/hudson/hudson-slave/workspace/Lucene-Solr-Tests-trunk-java7/solr/build/solr-core/test/J1/./org.apache.solr.cloud.BasicDistributedZkTest-controljetty-1356496915293
[junit4:junit4]   2> 782 T1417 oasc.CoreContainer$Initializer.initialize looking for solr.xml: /usr/home/hudson/hudson-slave/workspace/Lucene-Solr-Tests-trunk-java7/solr/build/solr-core/test/J1/./org.apache.solr.cloud.BasicDistributedZkTest-controljetty-1356496915293/solr.xml
[junit4:junit4]   2> 783 T1417 oasc.CoreContainer.<init> New CoreContainer 1390120959
[junit4:junit4]   2> 784 T1417 oasc.CoreContainer.load Loading CoreContainer using Solr Home: '/usr/home/hudson/hudson-slave/workspace/Lucene-Solr-Tests-trunk-java7/solr/build/solr-core/test/J1/./org.apache.solr.cloud.BasicDistributedZkTest-controljetty-1356496915293/'
[junit4:junit4]   2> 785 T1417 oasc.SolrResourceLoader.<init> new SolrResourceLoader for directory: '/usr/home/hudson/hudson-slave/workspace/Lucene-Solr-Tests-trunk-java7/solr/build/solr-core/test/J1/./org.apache.solr.cloud.BasicDistributedZkTest-controljetty-1356496915293/'
[junit4:junit4]   2> 826 T1417 oashc.HttpShardHandlerFactory.getParameter Setting socketTimeout to: 30000
[junit4:junit4]   2> 828 T1417 oashc.HttpShardHandlerFactory.getParameter Setting urlScheme to: http://
[junit4:junit4]   2> 829 T1417 oashc.HttpShardHandlerFactory.getParameter Setting connTimeout to: 15000
[junit4:junit4]   2> 829 T1417 oashc.HttpShardHandlerFactory.getParameter Setting maxConnectionsPerHost to: 20
[junit4:junit4]   2> 830 T1417 oashc.HttpShardHandlerFactory.getParameter Setting corePoolSize to: 0
[junit4:junit4]   2> 832 T1417 oashc.HttpShardHandlerFactory.getParameter Setting maximumPoolSize to: 2147483647
[junit4:junit4]   2> 833 T1417 oashc.HttpShardHandlerFactory.getParameter Setting maxThreadIdleTime to: 5
[junit4:junit4]   2> 834 T1417 oashc.HttpShardHandlerFactory.getParameter Setting sizeOfQueue to: -1
[junit4:junit4]   2> 835 T1417 oashc.HttpShardHandlerFactory.getParameter Setting fairnessPolicy to: false
[junit4:junit4]   2> 836 T1417 oascsi.HttpClientUtil.createClient Creating new http client, config:maxConnectionsPerHost=20&maxConnections=10000&socketTimeout=30000&connTimeout=15000&retry=false
[junit4:junit4]   2> 864 T1417 oasc.CoreContainer.load Registering Log Listener
[junit4:junit4]   2> 886 T1417 oasc.CoreContainer.initZooKeeper Zookeeper client=127.0.0.1:28188/solr
[junit4:junit4]   2> 888 T1417 oasc.ZkController.checkChrootPath zkHost includes chroot
[junit4:junit4]   2> 889 T1417 oaz.ZooKeeper.<init> Initiating client connection, connectString=127.0.0.1:28188 sessionTimeout=60000 watcher=org.apache.solr.common.cloud.ConnectionManager@7fcb9950
[junit4:junit4]   2> 891 T1436 oaz.ClientCnxn$SendThread.logStartConnect Opening socket connection to server localhost/127.0.0.1:28188. Will not attempt to authenticate using SASL (access denied ("javax.security.auth.AuthPermission" "getLoginConfiguration"))
[junit4:junit4]   2> 890 T1417 oascc.ConnectionManager.waitForConnected Waiting for client to connect to ZooKeeper
[junit4:junit4]   2> 892 T1436 oaz.ClientCnxn$SendThread.primeConnection Socket connection established to localhost/127.0.0.1:28188, initiating session
[junit4:junit4]   2> 892 T1419 oazs.NIOServerCnxnFactory.run Accepted socket connection from /140.211.11.196:28192
[junit4:junit4]   2> 892 T1419 oazs.ZooKeeperServer.processConnectRequest Client attempting to establish new session at /140.211.11.196:28192
[junit4:junit4]   2> 902 T1421 oazs.ZooKeeperServer.finishSessionInit Established session 0x13bd58449930002 with negotiated timeout 20000 for client /140.211.11.196:28192
[junit4:junit4]   2> 902 T1436 oaz.ClientCnxn$SendThread.onConnected Session establishment complete on server localhost/127.0.0.1:28188, sessionid = 0x13bd58449930002, negotiated timeout = 20000
[junit4:junit4]   2> 903 T1437 oascc.ConnectionManager.process Watcher org.apache.solr.common.cloud.ConnectionManager@7fcb9950 name:ZooKeeperConnection Watcher:127.0.0.1:28188 got event WatchedEvent state:SyncConnected type:None path:null path:null type:None
[junit4:junit4]   2> 903 T1417 oascc.ConnectionManager.waitForConnected Client is connected to ZooKeeper
[junit4:junit4]   2> 905 T1422 oazs.PrepRequestProcessor.pRequest2Txn Processed session termination for sessionid: 0x13bd58449930002
[junit4:junit4]   2> 1047 T1437 oaz.ClientCnxn$EventThread.run EventThread shut down
[junit4:junit4]   2> 1047 T1419 oazs.NIOServerCnxn.closeSock Closed socket connection for client /140.211.11.196:28192 which had sessionid 0x13bd58449930002
[junit4:junit4]   2> 1047 T1417 oaz.ZooKeeper.close Session: 0x13bd58449930002 closed
[junit4:junit4]   2> 1049 T1417 oascsi.HttpClientUtil.createClient Creating new http client, config:maxConnections=500&maxConnectionsPerHost=16&socketTimeout=15000&connTimeout=30000
[junit4:junit4]   2> 1061 T1417 oaz.ZooKeeper.<init> Initiating client connection, connectString=127.0.0.1:28188/solr sessionTimeout=30000 watcher=org.apache.solr.common.cloud.ConnectionManager@28292ab4
[junit4:junit4]   2> 1063 T1438 oaz.ClientCnxn$SendThread.logStartConnect Opening socket connection to server localhost/127.0.0.1:28188. Will not attempt to authenticate using SASL (access denied ("javax.security.auth.AuthPermission" "getLoginConfiguration"))
[junit4:junit4]   2> 1063 T1417 oascc.ConnectionManager.waitForConnected Waiting for client to connect to ZooKeeper
[junit4:junit4]   2> 1063 T1438 oaz.ClientCnxn$SendThread.primeConnection Socket connection established to localhost/127.0.0.1:28188, initiating session
[junit4:junit4]   2> 1064 T1419 oazs.NIOServerCnxnFactory.run Accepted socket connection from /140.211.11.196:28193
[junit4:junit4]   2> 1064 T1419 oazs.ZooKeeperServer.processConnectRequest Client attempting to establish new session at /140.211.11.196:28193
[junit4:junit4]   2> 1066 T1421 oazs.ZooKeeperServer.finishSessionInit Established session 0x13bd58449930003 with negotiated timeout 20000 for client /140.211.11.196:28193
[junit4:junit4]   2> 1066 T1438 oaz.ClientCnxn$SendThread.onConnected Session establishment complete on server localhost/127.0.0.1:28188, sessionid = 0x13bd58449930003, negotiated timeout = 20000
[junit4:junit4]   2> 1066 T1439 oascc.ConnectionManager.process Watcher org.apache.solr.common.cloud.ConnectionManager@28292ab4 name:ZooKeeperConnection Watcher:127.0.0.1:28188/solr got event WatchedEvent state:SyncConnected type:None path:null path:null type:None
[junit4:junit4]   2> 1066 T1417 oascc.ConnectionManager.waitForConnected Client is connected to ZooKeeper
[junit4:junit4]   2> 1109 T1422 oazs.PrepRequestProcessor.pRequest Got user-level KeeperException when processing sessionid:0x13bd58449930003 type:create cxid:0x2 zxid:0x1a txntype:-1 reqpath:n/a Error Path:/solr/overseer Error:KeeperErrorCode = NodeExists for /solr/overseer
[junit4:junit4]   2> 1164 T1417 oascc.SolrZkClient.makePath makePath: /live_nodes
[junit4:junit4]   2> 1194 T1417 oasc.ZkController.createEphemeralLiveNode Register node as live in ZooKeeper:/live_nodes/127.0.0.1:28191_
[junit4:junit4]   2> 1196 T1422 oazs.PrepRequestProcessor.pRequest Got user-level KeeperException when processing sessionid:0x13bd58449930003 type:delete cxid:0x7 zxid:0x1c txntype:-1 reqpath:n/a Error Path:/solr/live_nodes/127.0.0.1:28191_ Error:KeeperErrorCode = NoNode for /solr/live_nodes/127.0.0.1:28191_
[junit4:junit4]   2> 1223 T1417 oascc.SolrZkClient.makePath makePath: /live_nodes/127.0.0.1:28191_
[junit4:junit4]   2> 1228 T1417 oascc.SolrZkClient.makePath makePath: /overseer_elect/election
[junit4:junit4]   2> 1304 T1422 oazs.PrepRequestProcessor.pRequest Got user-level KeeperException when processing sessionid:0x13bd58449930003 type:delete cxid:0x15 zxid:0x21 txntype:-1 reqpath:n/a Error Path:/solr/overseer_elect/leader Error:KeeperErrorCode = NoNode for /solr/overseer_elect/leader
[junit4:junit4]   2> 1305 T1417 oascc.SolrZkClient.makePath makePath: /overseer_elect/leader
[junit4:junit4]   2> 1310 T1417 oasc.Overseer.start Overseer (id=88899381810626563-127.0.0.1:28191_-n_0000000000) starting
[junit4:junit4]   2> 1311 T1422 oazs.PrepRequestProcessor.pRequest Got user-level KeeperException when processing sessionid:0x13bd58449930003 type:create cxid:0x1a zxid:0x23 txntype:-1 reqpath:n/a Error Path:/solr/overseer Error:KeeperErrorCode = NodeExists for /solr/overseer
[junit4:junit4]   2> 1313 T1422 oazs.PrepRequestProcessor.pRequest Got user-level KeeperException when processing sessionid:0x13bd58449930003 type:create cxid:0x1b zxid:0x24 txntype:-1 reqpath:n/a Error Path:/solr/overseer Error:KeeperErrorCode = NodeExists for /solr/overseer
[junit4:junit4]   2> 1348 T1422 oazs.PrepRequestProcessor.pRequest Got user-level KeeperException when processing sessionid:0x13bd58449930003 type:create cxid:0x1c zxid:0x25 txntype:-1 reqpath:n/a Error Path:/solr/overseer Error:KeeperErrorCode = NodeExists for /solr/overseer
[junit4:junit4]   2> 1350 T1422 oazs.PrepRequestProcessor.pRequest Got user-level KeeperException when processing sessionid:0x13bd58449930003 type:create cxid:0x1d zxid:0x26 txntype:-1 reqpath:n/a Error Path:/solr/overseer Error:KeeperErrorCode = NodeExists for /solr/overseer
[junit4:junit4]   2> 1352 T1441 oasc.OverseerCollectionProcessor.run Process current queue of collection messages
[junit4:junit4]   2> 1353 T1417 oascc.SolrZkClient.makePath makePath: /clusterstate.json
[junit4:junit4]   2> 1368 T1417 oascc.ZkStateReader.createClusterStateWatchersAndUpdate Updating cluster state from ZooKeeper... 
[junit4:junit4]   2> 1371 T1440 oasc.Overseer$ClusterStateUpdater.run Starting to work on the main queue
[junit4:junit4]   2> 1378 T1442 oasc.CoreContainer.create Creating SolrCore 'collection1' using instanceDir: /usr/home/hudson/hudson-slave/workspace/Lucene-Solr-Tests-trunk-java7/solr/build/solr-core/test/J1/./org.apache.solr.cloud.BasicDistributedZkTest-controljetty-1356496915293/collection1
[junit4:junit4]   2> 1378 T1442 oasc.ZkController.createCollectionZkNode Check for collection zkNode:control_collection
[junit4:junit4]   2> 1379 T1442 oasc.ZkController.createCollectionZkNode Collection zkNode exists
[junit4:junit4]   2> 1380 T1442 oasc.ZkController.readConfigName Load collection config from:/collections/control_collection
[junit4:junit4]   2> 1381 T1442 oasc.SolrResourceLoader.<init> new SolrResourceLoader for directory: '/usr/home/hudson/hudson-slave/workspace/Lucene-Solr-Tests-trunk-java7/solr/build/solr-core/test/J1/./org.apache.solr.cloud.BasicDistributedZkTest-controljetty-1356496915293/collection1/'
[junit4:junit4]   2> 1382 T1442 oasc.SolrResourceLoader.replaceClassLoader Adding 'file:/usr/home/hudson/hudson-slave/workspace/Lucene-Solr-Tests-trunk-java7/solr/build/solr-core/test/J1/org.apache.solr.cloud.BasicDistributedZkTest-controljetty-1356496915293/collection1/lib/README' to classloader
[junit4:junit4]   2> 1382 T1442 oasc.SolrResourceLoader.replaceClassLoader Adding 'file:/usr/home/hudson/hudson-slave/workspace/Lucene-Solr-Tests-trunk-java7/solr/build/solr-core/test/J1/org.apache.solr.cloud.BasicDistributedZkTest-controljetty-1356496915293/collection1/lib/classes/' to classloader
[junit4:junit4]   2> 1420 T1442 oasc.SolrConfig.<init> Using Lucene MatchVersion: LUCENE_50
[junit4:junit4]   2> 1469 T1442 oasc.SolrConfig.<init> Loaded SolrConfig: solrconfig.xml
[junit4:junit4]   2> 1571 T1442 oass.IndexSchema.readSchema Reading Solr Schema
[junit4:junit4]   2> 1576 T1442 oass.IndexSchema.readSchema Schema name=test
[junit4:junit4]   2> 2033 T1442 oass.OpenExchangeRatesOrgProvider.init Initialized with rates=open-exchange-rates.json, refreshInterval=1440.
[junit4:junit4]   2> 2042 T1442 oass.IndexSchema.readSchema default search field in schema is text
[junit4:junit4]   2> 2046 T1442 oass.IndexSchema.readSchema unique key field: id
[junit4:junit4]   2> 2060 T1442 oass.FileExchangeRateProvider.reload Reloading exchange rates from file currency.xml
[junit4:junit4]   2> 2066 T1442 oass.FileExchangeRateProvider.reload Reloading exchange rates from file currency.xml
[junit4:junit4]   2> 2072 T1442 oass.OpenExchangeRatesOrgProvider.reload Reloading exchange rates from open-exchange-rates.json
[junit4:junit4]   2> 2074 T1442 oass.OpenExchangeRatesOrgProvider.reload Reloading exchange rates from open-exchange-rates.json
[junit4:junit4]   2> 2075 T1442 oasc.SolrCore.<init> [collection1] Opening new SolrCore at /usr/home/hudson/hudson-slave/workspace/Lucene-Solr-Tests-trunk-java7/solr/build/solr-core/test/J1/./org.apache.solr.cloud.BasicDistributedZkTest-controljetty-1356496915293/collection1/, dataDir=./org.apache.solr.cloud.BasicDistributedZkTest-1356496914830/control/data/
[junit4:junit4]   2> 2075 T1442 oasc.JmxMonitoredMap.<init> JMX monitoring is enabled. Adding Solr mbeans to JMX Server: com.sun.jmx.mbeanserver.JmxMBeanServer@25c5b6e
[junit4:junit4]   2> 2076 T1442 oasc.SolrCore.initDirectoryFactory solr.NRTCachingDirectoryFactory
[junit4:junit4]   2> 2101 T1442 oasc.CachingDirectoryFactory.get return new directory for /usr/home/hudson/hudson-slave/workspace/Lucene-Solr-Tests-trunk-java7/solr/build/solr-core/test/J1/./org.apache.solr.cloud.BasicDistributedZkTest-1356496914830/control/data forceNew:false
[junit4:junit4]   2> 2102 T1442 oasc.CachingDirectoryFactory.close Releasing directory:/usr/home/hudson/hudson-slave/workspace/Lucene-Solr-Tests-trunk-java7/solr/build/solr-core/test/J1/./org.apache.solr.cloud.BasicDistributedZkTest-1356496914830/control/data
[junit4:junit4]   2> 2102 T1442 oasc.SolrCore.getNewIndexDir New index directory detected: old=null new=./org.apache.solr.cloud.BasicDistributedZkTest-1356496914830/control/data/index/
[junit4:junit4]   2> 2103 T1442 oasc.SolrCore.initIndex WARNING [collection1] Solr index directory './org.apache.solr.cloud.BasicDistributedZkTest-1356496914830/control/data/index' doesn't exist. Creating new index...
[junit4:junit4]   2> 2104 T1442 oasc.CachingDirectoryFactory.get return new directory for /usr/home/hudson/hudson-slave/workspace/Lucene-Solr-Tests-trunk-java7/solr/build/solr-core/test/J1/./org.apache.solr.cloud.BasicDistributedZkTest-1356496914830/control/data/index forceNew:false
[junit4:junit4]   2> 2136 T1442 oasc.SolrDeletionPolicy.onCommit SolrDeletionPolicy.onCommit: commits:num=1
[junit4:junit4]   2> 		commit{dir=RateLimitedDirectoryWrapper(NRTCachingDirectory(org.apache.lucene.store.NIOFSDirectory@/usr/home/hudson/hudson-slave/workspace/Lucene-Solr-Tests-trunk-java7/solr/build/solr-core/test/J1/org.apache.solr.cloud.BasicDistributedZkTest-1356496914830/control/data/index lockFactory=org.apache.lucene.store.NativeFSLockFactory@69d57ede; maxCacheMB=48.0 maxMergeSizeMB=4.0)),segFN=segments_1,generation=1,filenames=[segments_1]
[junit4:junit4]   2> 2137 T1442 oasc.SolrDeletionPolicy.updateCommits newest commit = 1[segments_1]
[junit4:junit4]   2> 2138 T1442 oasc.CachingDirectoryFactory.close Releasing directory:/usr/home/hudson/hudson-slave/workspace/Lucene-Solr-Tests-trunk-java7/solr/build/solr-core/test/J1/./org.apache.solr.cloud.BasicDistributedZkTest-1356496914830/control/data/index
[junit4:junit4]   2> 2138 T1442 oasc.SolrCore.initWriters created xml: solr.XMLResponseWriter
[junit4:junit4]   2> 2140 T1442 oasup.UpdateRequestProcessorChain.init inserting DistributedUpdateProcessorFactory into updateRequestProcessorChain "dedupe"
[junit4:junit4]   2> 2140 T1442 oasup.UpdateRequestProcessorChain.init inserting DistributedUpdateProcessorFactory into updateRequestProcessorChain "dedupe-allfields"
[junit4:junit4]   2> 2141 T1442 oasup.UpdateRequestProcessorChain.init inserting DistributedUpdateProcessorFactory into updateRequestProcessorChain "stored_sig"
[junit4:junit4]   2> 2141 T1442 oasup.UpdateRequestProcessorChain.init inserting DistributedUpdateProcessorFactory into updateRequestProcessorChain "uniq-fields"
[junit4:junit4]   2> 2141 T1442 oasup.UpdateRequestProcessorChain.init inserting DistributedUpdateProcessorFactory into updateRequestProcessorChain "distrib-dup-test-chain-implicit"
[junit4:junit4]   2> 2142 T1442 oasc.RequestHandlers.initHandlersFromConfig adding lazy requestHandler: solr.ReplicationHandler
[junit4:junit4]   2> 2142 T1442 oasc.RequestHandlers.initHandlersFromConfig created /replication: solr.ReplicationHandler
[junit4:junit4]   2> 2143 T1442 oasc.RequestHandlers.initHandlersFromConfig created standard: solr.StandardRequestHandler
[junit4:junit4]   2> 2143 T1442 oasc.RequestHandlers.initHandlersFromConfig created /get: solr.RealTimeGetHandler
[junit4:junit4]   2> 2144 T1442 oasc.RequestHandlers.initHandlersFromConfig created dismax: solr.SearchHandler
[junit4:junit4]   2> 2145 T1442 oasc.RequestHandlers.initHandlersFromConfig created mock: org.apache.solr.core.MockQuerySenderListenerReqHandler
[junit4:junit4]   2> 2145 T1442 oasc.RequestHandlers.initHandlersFromConfig created /admin/: org.apache.solr.handler.admin.AdminHandlers
[junit4:junit4]   2> 2146 T1442 oasc.RequestHandlers.initHandlersFromConfig created defaults: solr.StandardRequestHandler
[junit4:junit4]   2> 2146 T1442 oasc.RequestHandlers.initHandlersFromConfig adding lazy requestHandler: solr.StandardRequestHandler
[junit4:junit4]   2> 2146 T1442 oasc.RequestHandlers.initHandlersFromConfig created lazy: solr.StandardRequestHandler
[junit4:junit4]   2> 2147 T1442 oasc.RequestHandlers.initHandlersFromConfig created /update: solr.UpdateRequestHandler
[junit4:junit4]   2> 2148 T1442 oasc.RequestHandlers.initHandlersFromConfig created /terms: org.apache.solr.handler.component.SearchHandler
[junit4:junit4]   2> 2148 T1442 oasc.RequestHandlers.initHandlersFromConfig created spellCheckCompRH: org.apache.solr.handler.component.SearchHandler
[junit4:junit4]   2> 2149 T1442 oasc.RequestHandlers.initHandlersFromConfig created spellCheckCompRH_Direct: org.apache.solr.handler.component.SearchHandler
[junit4:junit4]   2> 2150 T1442 oasc.RequestHandlers.initHandlersFromConfig created spellCheckWithWordbreak: org.apache.solr.handler.component.SearchHandler
[junit4:junit4]   2> 2150 T1442 oasc.RequestHandlers.initHandlersFromConfig created spellCheckWithWordbreak_Direct: org.apache.solr.handler.component.SearchHandler
[junit4:junit4]   2> 2151 T1442 oasc.RequestHandlers.initHandlersFromConfig created spellCheckCompRH1: org.apache.solr.handler.component.SearchHandler
[junit4:junit4]   2> 2152 T1442 oasc.RequestHandlers.initHandlersFromConfig created mltrh: org.apache.solr.handler.component.SearchHandler
[junit4:junit4]   2> 2152 T1442 oasc.RequestHandlers.initHandlersFromConfig created tvrh: org.apache.solr.handler.component.SearchHandler
[junit4:junit4]   2> 2153 T1442 oasc.RequestHandlers.initHandlersFromConfig created /mlt: solr.MoreLikeThisHandler
[junit4:junit4]   2> 2153 T1442 oasc.RequestHandlers.initHandlersFromConfig created /debug/dump: solr.DumpRequestHandler
[junit4:junit4]   2> 2162 T1442 oashl.XMLLoader.init xsltCacheLifetimeSeconds=60
[junit4:junit4]   2> 2166 T1442 oasc.SolrCore.initDeprecatedSupport WARNING solrconfig.xml uses deprecated <admin/gettableFiles>, Please update your config to use the ShowFileRequestHandler.
[junit4:junit4]   2> 2168 T1442 oasc.SolrCore.initDeprecatedSupport WARNING adding ShowFileRequestHandler with hidden files: [SCHEMA.XML, OLD_SYNONYMS.TXT, STOPWORDS.TXT, PROTWORDS.TXT, OPEN-EXCHANGE-RATES.JSON, SYNONYMS.TXT, CURRENCY.XML, MAPPING-ISOLATIN1ACCENT.TXT]
[junit4:junit4]   2> 2170 T1442 oasc.CachingDirectoryFactory.close Releasing directory:/usr/home/hudson/hudson-slave/workspace/Lucene-Solr-Tests-trunk-java7/solr/build/solr-core/test/J1/./org.apache.solr.cloud.BasicDistributedZkTest-1356496914830/control/data
[junit4:junit4]   2> 2171 T1442 oass.SolrIndexSearcher.<init> Opening Searcher@5bb8b48 main
[junit4:junit4]   2> 2172 T1442 oasu.CommitTracker.<init> Hard AutoCommit: disabled
[junit4:junit4]   2> 2173 T1442 oasu.CommitTracker.<init> Soft AutoCommit: disabled
[junit4:junit4]   2> 2173 T1442 oashc.SpellCheckComponent.inform Initializing spell checkers
[junit4:junit4]   2> 2179 T1442 oass.DirectSolrSpellChecker.init init: {name=direct,classname=DirectSolrSpellChecker,field=lowerfilt,minQueryLength=3}
[junit4:junit4]   2> 2237 T1443 oasc.SolrCore.registerSearcher [collection1] Registered new searcher Searcher@5bb8b48 main{StandardDirectoryReader(segments_1:1)}
[junit4:junit4]   2> 2242 T1442 oasc.ZkController.publish publishing core=collection1 state=down
[junit4:junit4]   2> 2242 T1442 oasc.ZkController.publish numShards not found on descriptor - reading it from system property
[junit4:junit4]   2> 2243 T1422 oazs.PrepRequestProcessor.pRequest Got user-level KeeperException when processing sessionid:0x13bd58449930003 type:create cxid:0x53 zxid:0x29 txntype:-1 reqpath:n/a Error Path:/solr/overseer/queue Error:KeeperErrorCode = NoNode for /solr/overseer/queue
[junit4:junit4]   2> 2378 T1440 oascc.ZkStateReader.updateClusterState Updating cloud state from ZooKeeper... 
[junit4:junit4]   2> 2379 T1440 oasc.Overseer$ClusterStateUpdater.updateState Update state numShards=1 message={
[junit4:junit4]   2> 	  "operation":"state",
[junit4:junit4]   2> 	  "numShards":"1",
[junit4:junit4]   2> 	  "shard":null,
[junit4:junit4]   2> 	  "roles":null,
[junit4:junit4]   2> 	  "state":"down",
[junit4:junit4]   2> 	  "core":"collection1",
[junit4:junit4]   2> 	  "collection":"control_collection",
[junit4:junit4]   2> 	  "node_name":"127.0.0.1:28191_",
[junit4:junit4]   2> 	  "base_url":"http://127.0.0.1:28191"}
[junit4:junit4]   2> 2379 T1440 oasc.Overseer$ClusterStateUpdater.createCollection Create collection control_collection with numShards 1
[junit4:junit4]   2> 2379 T1440 oasc.Overseer$ClusterStateUpdater.updateState Assigning new node to shard shard=shard1
[junit4:junit4]   2> 2380 T1422 oazs.PrepRequestProcessor.pRequest Got user-level KeeperException when processing sessionid:0x13bd58449930003 type:create cxid:0x5b zxid:0x2c txntype:-1 reqpath:n/a Error Path:/solr/overseer/queue-work Error:KeeperErrorCode = NoNode for /solr/overseer/queue-work
[junit4:junit4]   2> 2418 T1439 oascc.ZkStateReader$2.process A cluster state change: WatchedEvent state:SyncConnected type:NodeDataChanged path:/clusterstate.json, has occurred - updating... (live nodes size: 1)
[junit4:junit4]   2> 3256 T1442 oasc.CoreContainer.registerCore registering core: collection1
[junit4:junit4]   2> 3256 T1442 oasc.ZkController.register Register replica - core:collection1 address:http://127.0.0.1:28191 collection:control_collection shard:shard1
[junit4:junit4]   2> 3257 T1442 oascc.SolrZkClient.makePath makePath: /collections/control_collection/leader_elect/shard1/election
[junit4:junit4]   2> 3302 T1422 oazs.PrepRequestProcessor.pRequest Got user-level KeeperException when processing sessionid:0x13bd58449930003 type:delete cxid:0x78 zxid:0x36 txntype:-1 reqpath:n/a Error Path:/solr/collections/control_collection/leaders Error:KeeperErrorCode = NoNode for /solr/collections/control_collection/leaders
[junit4:junit4]   2> 3303 T1442 oasc.ShardLeaderElectionContext.runLeaderProcess Running the leader process.
[junit4:junit4]   2> 3304 T1422 oazs.PrepRequestProcessor.pRequest Got user-level KeeperException when processing sessionid:0x13bd58449930003 type:create cxid:0x79 zxid:0x37 txntype:-1 reqpath:n/a Error Path:/solr/overseer Error:KeeperErrorCode = NodeExists for /solr/overseer
[junit4:junit4]   2> 3313 T1442 oasc.ShardLeaderElectionContext.waitForReplicasToComeUp Enough replicas found to continue.
[junit4:junit4]   2> 3314 T1442 oasc.ShardLeaderElectionContext.runLeaderProcess I may be the new leader - try and sync
[junit4:junit4]   2> 3314 T1442 oasc.SyncStrategy.sync Sync replicas to http://127.0.0.1:28191/collection1/
[junit4:junit4]   2> 3314 T1442 oasc.SyncStrategy.syncReplicas Sync Success - now sync replicas to me
[junit4:junit4]   2> 3314 T1442 oasc.SyncStrategy.syncToMe http://127.0.0.1:28191/collection1/ has no replicas
[junit4:junit4]   2> 3315 T1442 oasc.ShardLeaderElectionContext.runLeaderProcess I am the new leader: http://127.0.0.1:28191/collection1/
[junit4:junit4]   2> 3315 T1442 oascc.SolrZkClient.makePath makePath: /collections/control_collection/leaders/shard1
[junit4:junit4]   2> 3319 T1422 oazs.PrepRequestProcessor.pRequest Got user-level KeeperException when processing sessionid:0x13bd58449930003 type:create cxid:0x83 zxid:0x3b txntype:-1 reqpath:n/a Error Path:/solr/overseer Error:KeeperErrorCode = NodeExists for /solr/overseer
[junit4:junit4]   2> 3431 T1440 oascc.ZkStateReader.updateClusterState Updating cloud state from ZooKeeper... 
[junit4:junit4]   2> 3450 T1439 oascc.ZkStateReader$2.process A cluster state change: WatchedEvent state:SyncConnected type:NodeDataChanged path:/clusterstate.json, has occurred - updating... (live nodes size: 1)
[junit4:junit4]   2> 3479 T1442 oasc.ZkController.register We are http://127.0.0.1:28191/collection1/ and leader is http://127.0.0.1:28191/collection1/
[junit4:junit4]   2> 3479 T1442 oasc.ZkController.register No LogReplay needed for core=collection1 baseURL=http://127.0.0.1:28191
[junit4:junit4]   2> 3480 T1442 oasc.ZkController.checkRecovery I am the leader, no recovery necessary
[junit4:junit4]   2> 3480 T1442 oasc.ZkController.publish publishing core=collection1 state=active
[junit4:junit4]   2> 3480 T1442 oasc.ZkController.publish numShards not found on descriptor - reading it from system property
[junit4:junit4]   2> 3482 T1442 oascc.ZkStateReader.updateClusterState Updating cloud state from ZooKeeper... 
[junit4:junit4]   2> 3483 T1417 oass.SolrDispatchFilter.init user.dir=/usr/home/hudson/hudson-slave/workspace/Lucene-Solr-Tests-trunk-java7/solr/build/solr-core/test/J1
[junit4:junit4]   2> 3484 T1417 oass.SolrDispatchFilter.init SolrDispatchFilter.init() done
[junit4:junit4]   2> 3484 T1417 oascsi.HttpClientUtil.createClient Creating new http client, config:maxConnections=128&maxConnectionsPerHost=32&followRedirects=false
[junit4:junit4]   2> 3496 T1417 oascsi.HttpClientUtil.createClient Creating new http client, config:
[junit4:junit4]   2> 3502 T1417 oaz.ZooKeeper.<init> Initiating client connection, connectString=127.0.0.1:28188/solr sessionTimeout=10000 watcher=org.apache.solr.common.cloud.ConnectionManager@79bdba45
[junit4:junit4]   2> 3503 T1417 oascc.ConnectionManager.waitForConnected Waiting for client to connect to ZooKeeper
[junit4:junit4]   2> 3504 T1444 oaz.ClientCnxn$SendThread.logStartConnect Opening socket connection to server localhost/127.0.0.1:28188. Will not attempt to authenticate using SASL (access denied ("javax.security.auth.AuthPermission" "getLoginConfiguration"))
[junit4:junit4]   2> 3504 T1444 oaz.ClientCnxn$SendThread.primeConnection Socket connection established to localhost/127.0.0.1:28188, initiating session
[junit4:junit4]   2> 3504 T1419 oazs.NIOServerCnxnFactory.run Accepted socket connection from /140.211.11.196:28194
[junit4:junit4]   2> 3505 T1419 oazs.ZooKeeperServer.processConnectRequest Client attempting to establish new session at /140.211.11.196:28194
[junit4:junit4]   2> 3506 T1421 oazs.ZooKeeperServer.finishSessionInit Established session 0x13bd58449930004 with negotiated timeout 10000 for client /140.211.11.196:28194
[junit4:junit4]   2> 3506 T1444 oaz.ClientCnxn$SendThread.onConnected Session establishment complete on server localhost/127.0.0.1:28188, sessionid = 0x13bd58449930004, negotiated timeout = 10000
[junit4:junit4]   2> 3506 T1445 oascc.ConnectionManager.process Watcher org.apache.solr.common.cloud.ConnectionManager@79bdba45 name:ZooKeeperConnection Watcher:127.0.0.1:28188/solr got event WatchedEvent state:SyncConnected type:None path:null path:null type:None
[junit4:junit4]   2> 3506 T1417 oascc.ConnectionManager.waitForConnected Client is connected to ZooKeeper
[junit4:junit4]   2> 3508 T1417 oascc.ZkStateReader.createClusterStateWatchersAndUpdate Updating cluster state from ZooKeeper... 
[junit4:junit4]   2> 3510 T1417 oasc.ChaosMonkey.monkeyLog monkey: init - expire sessions:true cause connection loss:true
[junit4:junit4]   2> 3691 T1417 oejs.Server.doStart jetty-8.1.8.v20121106
[junit4:junit4]   2> 3694 T1417 oejs.AbstractConnector.doStart Started SocketConnector@127.0.0.1:28195
[junit4:junit4]   2> 3695 T1417 oasc.SolrResourceLoader.locateSolrHome JNDI not configured for solr (NoInitialContextEx)
[junit4:junit4]   2> 3696 T1417 oasc.SolrResourceLoader.locateSolrHome using system property solr.solr.home: /usr/home/hudson/hudson-slave/workspace/Lucene-Solr-Tests-trunk-java7/solr/build/solr-core/test/J1/./org.apache.solr.cloud.BasicDistributedZkTest-jetty1-1356496918333
[junit4:junit4]   2> 3697 T1417 oasc.SolrResourceLoader.<init> new SolrResourceLoader for deduced Solr Home: '/usr/home/hudson/hudson-slave/workspace/Lucene-Solr-Tests-trunk-java7/solr/build/solr-core/test/J1/./org.apache.solr.cloud.BasicDistributedZkTest-jetty1-1356496918333/'
[junit4:junit4]   2> 3744 T1417 oass.SolrDispatchFilter.init SolrDispatchFilter.init()
[junit4:junit4]   2> 3745 T1417 oasc.SolrResourceLoader.locateSolrHome JNDI not configured for solr (NoInitialContextEx)
[junit4:junit4]   2> 3746 T1417 oasc.SolrResourceLoader.locateSolrHome using system property solr.solr.home: /usr/home/hudson/hudson-slave/workspace/Lucene-Solr-Tests-trunk-java7/solr/build/solr-core/test/J1/./org.apache.solr.cloud.BasicDistributedZkTest-jetty1-1356496918333
[junit4:junit4]   2> 3747 T1417 oasc.CoreContainer$Initializer.initialize looking for solr.xml: /usr/home/hudson/hudson-slave/workspace/Lucene-Solr-Tests-trunk-java7/solr/build/solr-core/test/J1/./org.apache.solr.cloud.BasicDistributedZkTest-jetty1-1356496918333/solr.xml
[junit4:junit4]   2> 3748 T1417 oasc.CoreContainer.<init> New CoreContainer 1770265891
[junit4:junit4]   2> 3749 T1417 oasc.CoreContainer.load Loading CoreContainer using Solr Home: '/usr/home/hudson/hudson-slave/workspace/Lucene-Solr-Tests-trunk-java7/solr/build/solr-core/test/J1/./org.apache.solr.cloud.BasicDistributedZkTest-jetty1-1356496918333/'
[junit4:junit4]   2> 3750 T1417 oasc.SolrResourceLoader.<init> new SolrResourceLoader for directory: '/usr/home/hudson/hudson-slave/workspace/Lucene-Solr-Tests-trunk-java7/solr/build/solr-core/test/J1/./org.apache.solr.cloud.BasicDistributedZkTest-jetty1-1356496918333/'
[junit4:junit4]   2> 3781 T1417 oashc.HttpShardHandlerFactory.getParameter Setting socketTimeout to: 30000
[junit4:junit4]   2> 3782 T1417 oashc.HttpShardHandlerFactory.getParameter Setting urlScheme to: http://
[junit4:junit4]   2> 3783 T1417 oashc.HttpShardHandlerFactory.getParameter Setting connTimeout to: 15000
[junit4:junit4]   2> 3784 T1417 oashc.HttpShardHandlerFactory.getParameter Setting maxConnectionsPerHost to: 20
[junit4:junit4]   2> 3785 T1417 oashc.HttpShardHandlerFactory.getParameter Setting corePoolSize to: 0
[junit4:junit4]   2> 3786 T1417 oashc.HttpShardHandlerFactory.getParameter Setting maximumPoolSize to: 2147483647
[junit4:junit4]   2> 3786 T1417 oashc.HttpShardHandlerFactory.getParameter Setting maxThreadIdleTime to: 5
[junit4:junit4]   2> 3787 T1417 oashc.HttpShardHandlerFactory.getParameter Setting sizeOfQueue to: -1
[junit4:junit4]   2> 3788 T1417 oashc.HttpShardHandlerFactory.getParameter Setting fairnessPolicy to: false
[junit4:junit4]   2> 3789 T1417 oascsi.HttpClientUtil.createClient Creating new http client, config:maxConnectionsPerHost=20&maxConnections=10000&socketTimeout=30000&connTimeout=15000&retry=false
[junit4:junit4]   2> 3810 T1417 oasc.CoreContainer.load Registering Log Listener
[junit4:junit4]   2> 3832 T1417 oasc.CoreContainer.initZooKeeper Zookeeper client=127.0.0.1:28188/solr
[junit4:junit4]   2> 3833 T1417 oasc.ZkController.checkChrootPath zkHost includes chroot
[junit4:junit4]   2> 3834 T1417 oaz.ZooKeeper.<init> Initiating client connection, connectString=127.0.0.1:28188 sessionTimeout=60000 watcher=org.apache.solr.common.cloud.ConnectionManager@3c6fc40f
[junit4:junit4]   2> 3837 T1455 oaz.ClientCnxn$SendThread.logStartConnect Opening socket connection to server localhost/127.0.0.1:28188. Will not attempt to authenticate using SASL (access denied ("javax.security.auth.AuthPermission" "getLoginConfiguration"))
[junit4:junit4]   2> 3838 T1455 oaz.ClientCnxn$SendThread.primeConnection Socket connection established to localhost/127.0.0.1:28188, initiating session
[junit4:junit4]   2> 3839 T1419 oazs.NIOServerCnxnFactory.run Accepted socket connection from /140.211.11.196:28196
[junit4:junit4]   2> 3839 T1419 oazs.ZooKeeperServer.processConnectRequest Client attempting to establish new session at /140.211.11.196:28196
[junit4:junit4]   2> 3842 T1421 oazs.ZooKeeperServer.finishSessionInit Established session 0x13bd58449930005 with negotiated timeout 20000 for client /140.211.11.196:28196
[junit4:junit4]   2> 3842 T1455 oaz.ClientCnxn$SendThread.onConnected Session establishment complete on server localhost/127.0.0.1:28188, sessionid = 0x13bd58449930005, negotiated timeout = 20000
[junit4:junit4]   2> 3837 T1417 oascc.ConnectionManager.waitForConnected Waiting for client to connect to ZooKeeper
[junit4:junit4]   2> 3846 T1456 oascc.ConnectionManager.process Watcher org.apache.solr.common.cloud.ConnectionManager@3c6fc40f name:ZooKeeperConnection Watcher:127.0.0.1:28188 got event WatchedEvent state:SyncConnected type:None path:null path:null type:None
[junit4:junit4]   2> 3847 T1417 oascc.ConnectionManager.waitForConnected Client is connected to ZooKeeper
[junit4:junit4]   2> 3848 T1422 oazs.PrepRequestProcessor.pRequest2Txn Processed session termination for sessionid: 0x13bd58449930005
[junit4:junit4]   2> 3849 T1456 oaz.ClientCnxn$EventThread.run EventThread shut down
[junit4:junit4]   2> 3849 T1419 oazs.NIOServerCnxn.closeSock Closed socket connection for client /140.211.11.196:28196 which had sessionid 0x13bd58449930005
[junit4:junit4]   2> 3849 T1417 oaz.ZooKeeper.close Session: 0x13bd58449930005 closed
[junit4:junit4]   2> 3850 T1417 oascsi.HttpClientUtil.createClient Creating new http client, config:maxConnections=500&maxConnectionsPerHost=16&socketTimeout=15000&connTimeout=30000
[junit4:junit4]   2> 3857 T1417 oaz.ZooKeeper.<init> Initiating client connection, connectString=127.0.0.1:28188/solr sessionTimeout=30000 watcher=org.apache.solr.common.cloud.ConnectionManager@5324fee2
[junit4:junit4]   2> 3859 T1417 oascc.ConnectionManager.waitForConnected Waiting for client to connect to ZooKeeper
[junit4:junit4]   2> 3859 T1457 oaz.ClientCnxn$SendThread.logStartConnect Opening socket connection to server localhost/127.0.0.1:28188. Will not attempt to authenticate using SASL (access denied ("javax.security.auth.AuthPermission" "getLoginConfiguration"))
[junit4:junit4]   2> 3860 T1457 oaz.ClientCnxn$SendThread.primeConnection Socket connection established to localhost/127.0.0.1:28188, initiating session
[junit4:junit4]   2> 3860 T1419 oazs.NIOServerCnxnFactory.run Accepted socket connection from /140.211.11.196:28197
[junit4:junit4]   2> 3860 T1419 oazs.ZooKeeperServer.processConnectRequest Client attempting to establish new session at /140.211.11.196:28197
[junit4:junit4]   2> 3862 T1421 oazs.ZooKeeperServer.finishSessionInit Established session 0x13bd58449930006 with negotiated timeout 20000 for client /140.211.11.196:28197
[junit4:junit4]   2> 3862 T1457 oaz.ClientCnxn$SendThread.onConnected Session establishment complete on server localhost/127.0.0.1:28188, sessionid = 0x13bd58449930006, negotiated timeout = 20000
[junit4:junit4]   2> 3862 T1458 oascc.ConnectionManager.process Watcher org.apache.solr.common.cloud.ConnectionManager@5324fee2 name:ZooKeeperConnection Watcher:127.0.0.1:28188/solr got event WatchedEvent state:SyncConnected type:None path:null path:null type:None
[junit4:junit4]   2> 3863 T1417 oascc.ConnectionManager.waitForConnected Client is connected to ZooKeeper
[junit4:junit4]   2> 3864 T1422 oazs.PrepRequestProcessor.pRequest Got user-level KeeperException when processing sessionid:0x13bd58449930006 type:create cxid:0x1 zxid:0x49 txntype:-1 reqpath:n/a Error Path:/solr/overseer Error:KeeperErrorCode = NodeExists for /solr/overseer
[junit4:junit4]   2> 3865 T1422 oazs.PrepRequestProcessor.pRequest Got user-level KeeperException when processing sessionid:0x13bd58449930006 type:create cxid:0x2 zxid:0x4a txntype:-1 reqpath:n/a Error Path:/solr/overseer Error:KeeperErrorCode = NodeExists for /solr/overseer
[junit4:junit4]   2> 3873 T1417 oasc.ZkController.createEphemeralLiveNode Register node as live in ZooKeeper:/live_nodes/127.0.0.1:28195_
[junit4:junit4]   2> 3874 T1422 oazs.PrepRequestProcessor.pRequest Got user-level KeeperException when processing sessionid:0x13bd58449930006 type:delete cxid:0x4 zxid:0x4b txntype:-1 reqpath:n/a Error Path:/solr/live_nodes/127.0.0.1:28195_ Error:KeeperErrorCode = NoNode for /solr/live_nodes/127.0.0.1:28195_
[junit4:junit4]   2> 3875 T1417 oascc.SolrZkClient.makePath makePath: /live_nodes/127.0.0.1:28195_
[junit4:junit4]   2> 3878 T1439 oascc.ZkStateReader$3.process Updating live nodes... (2)
[junit4:junit4]   2> 3878 T1445 oascc.ZkStateReader$3.process Updating live nodes... (2)
[junit4:junit4]   2> 3879 T1439 oascc.ZkStateReader$2.process A cluster state change: WatchedEvent state:SyncConnected type:NodeChildrenChanged path:/live_nodes, has occurred - updating... (live nodes size: 2)
[junit4:junit4]   2> 3887 T1417 oascc.ZkStateReader.createClusterStateWatchersAndUpdate Updating cluster state from ZooKeeper... 
[junit4:junit4]   2> 3894 T1459 oasc.CoreContainer.create Creating SolrCore 'collection1' using instanceDir: /usr/home/hudson/hudson-slave/workspace/Lucene-Solr-Tests-trunk-java7/solr/build/solr-core/test/J1/./org.apache.solr.cloud.BasicDistributedZkTest-jetty1-1356496918333/collection1
[junit4:junit4]   2> 3894 T1459 oasc.ZkController.createCollectionZkNode Check for collection zkNode:collection1
[junit4:junit4]   2> 3895 T1459 oasc.ZkController.createCollectionZkNode Collection zkNode exists
[junit4:junit4]   2> 3896 T1459 oasc.ZkController.readConfigName Load collection config from:/collections/collection1
[junit4:junit4]   2> 3897 T1459 oasc.SolrResourceLoader.<init> new SolrResourceLoader for directory: '/usr/home/hudson/hudson-slave/workspace/Lucene-Solr-Tests-trunk-java7/solr/build/solr-core/test/J1/./org.apache.solr.cloud.BasicDistributedZkTest-jetty1-1356496918333/collection1/'
[junit4:junit4]   2> 3899 T1459 oasc.SolrResourceLoader.replaceClassLoader Adding 'file:/usr/home/hudson/hudson-slave/workspace/Lucene-Solr-Tests-trunk-java7/solr/build/solr-core/test/J1/org.apache.solr.cloud.BasicDistributedZkTest-jetty1-1356496918333/collection1/lib/README' to classloader
[junit4:junit4]   2> 3899 T1459 oasc.SolrResourceLoader.replaceClassLoader Adding 'file:/usr/home/hudson/hudson-slave/workspace/Lucene-Solr-Tests-trunk-java7/solr/build/solr-core/test/J1/org.apache.solr.cloud.BasicDistributedZkTest-jetty1-1356496918333/collection1/lib/classes/' to classloader
[junit4:junit4]   2> 3955 T1459 oasc.SolrConfig.<init> Using Lucene MatchVersion: LUCENE_50
[junit4:junit4]   2> 3962 T1440 oascc.ZkStateReader.updateClusterState Updating cloud state from ZooKeeper... 
[junit4:junit4]   2> 3963 T1440 oasc.Overseer$ClusterStateUpdater.updateState Update state numShards=1 message={
[junit4:junit4]   2> 	  "operation":"state",
[junit4:junit4]   2> 	  "numShards":"1",
[junit4:junit4]   2> 	  "shard":"shard1",
[junit4:junit4]   2> 	  "roles":null,
[junit4:junit4]   2> 	  "state":"active",
[junit4:junit4]   2> 	  "core":"collection1",
[junit4:junit4]   2> 	  "collection":"control_collection",
[junit4:junit4]   2> 	  "node_name":"127.0.0.1:28191_",
[junit4:junit4]   2> 	  "base_url":"http://127.0.0.1:28191"}
[junit4:junit4]   2> 3968 T1439 oascc.ZkStateReader$2.process A cluster state change: WatchedEvent state:SyncConnected type:NodeDataChanged path:/clusterstate.json, has occurred - updating... (live nodes size: 2)
[junit4:junit4]   2> 3968 T1445 oascc.ZkStateReader$2.process A cluster state change: WatchedEvent state:SyncConnected type:NodeDataChanged path:/clusterstate.json, has occurred - updating... (live nodes size: 2)
[junit4:junit4]   2> 3968 T1458 oascc.ZkStateReader$2.process A cluster state change: WatchedEvent state:SyncConnected type:NodeDataChanged path:/clusterstate.json, has occurred - updating... (live nodes size: 2)
[junit4:junit4]   2> 4058 T1459 oasc.SolrConfig.<init> Loaded SolrConfig: solrconfig.xml
[junit4:junit4]   2> 4160 T1459 oass.IndexSchema.readSchema Reading Solr Schema
[junit4:junit4]   2> 4168 T1459 oass.IndexSchema.readSchema Schema name=test
[junit4:junit4]   2> 4817 T1459 oass.OpenExchangeRatesOrgProvider.init Initialized with rates=open-exchange-rates.json, refreshInterval=1440.
[junit4:junit4]   2> 4831 T1459 oass.IndexSchema.readSchema default search field in schema is text
[junit4:junit4]   2> 4835 T1459 oass.IndexSchema.readSchema unique key field: id
[junit4:junit4]   2> 4850 T1459 oass.FileExchangeRateProvider.reload Reloading exchange rates from file currency.xml
[junit4:junit4]   2> 4855 T1459 oass.FileExchangeRateProvider.reload Reloading exchange rates from file currency.xml
[junit4:junit4]   2> 4860 T1459 oass.OpenExchangeRatesOrgProvider.reload Reloading exchange rates from open-exchange-rates.json
[junit4:junit4]   2> 4861 T1459 oass.OpenExchangeRatesOrgProvider.reload Reloading exchange rates from open-exchange-rates.json
[junit4:junit4]   2> 4863 T1459 oasc.SolrCore.<init> [collection1] Opening new SolrCore at /usr/home/hudson/hudson-slave/workspace/Lucene-Solr-Tests-trunk-java7/solr/build/solr-core/test/J1/./org.apache.solr.cloud.BasicDistributedZkTest-jetty1-1356496918333/collection1/, dataDir=./org.apache.solr.cloud.BasicDistributedZkTest-1356496914830/jetty1/
[junit4:junit4]   2> 4863 T1459 oasc.JmxMonitoredMap.<init> JMX monitoring is enabled. Adding Solr mbeans to JMX Server: com.sun.jmx.mbeanserver.JmxMBeanServer@25c5b6e
[junit4:junit4]   2> 4864 T1459 oasc.SolrCore.initDirectoryFactory solr.NRTCachingDirectoryFactory
[junit4:junit4]   2> 4865 T1459 oasc.CachingDirectoryFactory.get return new directory for /usr/home/hudson/hudson-slave/workspace/Lucene-Solr-Tests-trunk-java7/solr/build/solr-core/test/J1/./org.apache.solr.cloud.BasicDistributedZkTest-1356496914830/jetty1 forceNew:false
[junit4:junit4]   2> 4866 T1459 oasc.CachingDirectoryFactory.close Releasing directory:/usr/home/hudson/hudson-slave/workspace/Lucene-Solr-Tests-trunk-java7/solr/build/solr-core/test/J1/./org.apache.solr.cloud.BasicDistributedZkTest-1356496914830/jetty1
[junit4:junit4]   2> 4866 T1459 oasc.SolrCore.getNewIndexDir New index directory detected: old=null new=./org.apache.solr.cloud.BasicDistributedZkTest-1356496914830/jetty1/index/
[junit4:junit4]   2> 4867 T1459 oasc.SolrCore.initIndex WARNING [collection1] Solr index directory './org.apache.solr.cloud.BasicDistributedZkTest-1356496914830/jetty1/index' doesn't exist. Creating new index...
[junit4:junit4]   2> 4868 T1459 oasc.CachingDirectoryFactory.get return new directory for /usr/home/hudson/hudson-slave/workspace/Lucene-Solr-Tests-trunk-java7/solr/build/solr-core/test/J1/./org.apache.solr.cloud.BasicDistributedZkTest-1356496914830/jetty1/index forceNew:false
[junit4:junit4]   2> 4875 T1459 oasc.SolrDeletionPolicy.onCommit SolrDeletionPolicy.onCommit: commits:num=1
[junit4:junit4]   2> 		commit{dir=RateLimitedDirectoryWrapper(NRTCachingDirectory(org.apache.lucene.store.NIOFSDirectory@/usr/home/hudson/hudson-slave/workspace/Lucene-Solr-Tests-trunk-java7/solr/build/solr-core/test/J1/org.apache.solr.cloud.BasicDistributedZkTest-1356496914830/jetty1/index lockFactory=org.apache.lucene.store.NativeFSLockFactory@9627d6f; maxCacheMB=48.0 maxMergeSizeMB=4.0)),segFN=segments_1,generation=1,filenames=[segments_1]
[junit4:junit4]   2> 4876 T1459 oasc.SolrDeletionPolicy.updateCommits newest commit = 1[segments_1]
[junit4:junit4]   2> 4877 T1459 oasc.CachingDirectoryFactory.close Releasing directory:/usr/home/hudson/hudson-slave/workspace/Lucene-Solr-Tests-trunk-java7/solr/build/solr-core/test/J1/./org.apache.solr.cloud.BasicDistributedZkTest-1356496914830/jetty1/index
[junit4:junit4]   2> 4877 T1459 oasc.SolrCore.initWriters created xml: solr.XMLResponseWriter
[junit4:junit4]   2> 4879 T1459 oasup.UpdateRequestProcessorChain.init inserting DistributedUpdateProcessorFactory into updateRequestProcessorChain "dedupe"
[junit4:junit4]   2> 4880 T1459 oasup.UpdateRequestProcessorChain.init inserting DistributedUpdateProcessorFactory into updateRequestProcessorChain "dedupe-allfields"
[junit4:junit4]   2> 4880 T1459 oasup.UpdateRequestProcessorChain.init inserting DistributedUpdateProcessorFactory into updateRequestProcessorChain "stored_sig"
[junit4:junit4]   2> 4881 T1459 oasup.UpdateRequestProcessorChain.init inserting DistributedUpdateProcessorFactory into updateRequestProcessorChain "uniq-fields"
[junit4:junit4]   2> 4882 T1459 oasup.UpdateRequestProcessorChain.init inserting DistributedUpdateProcessorFactory into updateRequestProcessorChain "distrib-dup-test-chain-implicit"
[junit4:junit4]   2> 4882 T1459 oasc.RequestHandlers.initHandlersFromConfig adding lazy requestHandler: solr.ReplicationHandler
[junit4:junit4]   2> 4882 T1459 oasc.RequestHandlers.initHandlersFromConfig created /replication: solr.ReplicationHandler
[junit4:junit4]   2> 4884 T1459 oasc.RequestHandlers.initHandlersFromConfig created standard: solr.StandardRequestHandler
[junit4:junit4]   2> 4885 T1459 oasc.RequestHandlers.initHandlersFromConfig created /get: solr.RealTimeGetHandler
[junit4:junit4]   2> 4886 T1459 oasc.RequestHandlers.initHandlersFromConfig created dismax: solr.SearchHandler
[junit4:junit4]   2> 4887 T1459 oasc.RequestHandlers.initHandlersFromConfig created mock: org.apache.solr.core.MockQuerySenderListenerReqHandler
[junit4:junit4]   2> 4887 T1459 oasc.RequestHandlers.initHandlersFromConfig created /admin/: org.apache.solr.handler.admin.AdminHandlers
[junit4:junit4]   2> 4888 T1459 oasc.RequestHandlers.initHandlersFromConfig created defaults: solr.StandardRequestHandler
[junit4:junit4]   2> 4888 T1459 oasc.RequestHandlers.initHandlersFromConfig adding lazy requestHandler: solr.StandardRequestHandler
[junit4:junit4]   2> 4889 T1459 oasc.RequestHandlers.initHandlersFromConfig created lazy: solr.StandardRequestHandler
[junit4:junit4]   2> 4890 T1459 oasc.RequestHandlers.initHandlersFromConfig created /update: solr.UpdateRequestHandler
[junit4:junit4]   2> 4891 T1459 oasc.RequestHandlers.initHandlersFromConfig created /terms: org.apache.solr.handler.component.SearchHandler
[junit4:junit4]   2> 4892 T1459 oasc.RequestHandlers.initHandlersFromConfig created spellCheckCompRH: org.apache.solr.handler.component.SearchHandler
[junit4:junit4]   2> 4893 T1459 oasc.RequestHandlers.initHandlersFromConfig created spellCheckCompRH_Direct: org.apache.solr.handler.component.SearchHandler
[junit4:junit4]   2> 4894 T1459 oasc.RequestHandlers.initHandlersFromConfig created spellCheckWithWordbreak: org.apache.solr.handler.component.SearchHandler
[junit4:junit4]   2> 4895 T1459 oasc.RequestHandlers.initHandlersFromConfig created spellCheckWithWordbreak_Direct: org.apache.solr.handler.component.SearchHandler
[junit4:junit4]   2> 4896 T1459 oasc.RequestHandlers.initHandlersFromConfig created spellCheckCompRH1: org.apache.solr.handler.component.SearchHandler
[junit4:junit4]   2> 4897 T1459 oasc.RequestHandlers.initHandlersFromConfig created mltrh: org.apache.solr.handler.component.SearchHandler
[junit4:junit4]   2> 4898 T1459 oasc.RequestHandlers.initHandlersFromConfig created tvrh: org.apache.solr.handler.component.SearchHandler
[junit4:junit4]   2> 4899 T1459 oasc.RequestHandlers.initHandlersFromConfig created /mlt: solr.MoreLikeThisHandler
[junit4:junit4]   2> 4900 T1459 oasc.RequestHandlers.initHandlersFromConfig created /debug/dump: solr.DumpRequestHandler
[junit4:junit4]   2> 4915 T1459 oashl.XMLLoader.init xsltCacheLifetimeSeconds=60
[junit4:junit4]   2> 4921 T1459 oasc.SolrCore.initDeprecatedSupport WARNING solrconfig.xml uses deprecated <admin/gettableFiles>, Please update your config to use the ShowFileRequestHandler.
[junit4:junit4]   2> 4924 T1459 oasc.SolrCore.initDeprecatedSupport WARNING adding ShowFileRequestHandler with hidden files: [SCHEMA.XML, OLD_SYNONYMS.TXT, STOPWORDS.TXT, PROTWORDS.TXT, OPEN-EXCHANGE-RATES.JSON, SYNONYMS.TXT, CURRENCY.XML, MAPPING-ISOLATIN1ACCENT.TXT]
[junit4:junit4]   2> 4927 T1459 oasc.CachingDirectoryFactory.close Releasing directory:/usr/home/hudson/hudson-slave/workspace/Lucene-Solr-Tests-trunk-java7/solr/build/solr-core/test/J1/./org.apache.solr.cloud.BasicDistributedZkTest-1356496914830/jetty1
[junit4:junit4]   2> 4929 T1459 oass.SolrIndexSearcher.<init> Opening Searcher@59a74e3e main
[junit4:junit4]   2> 4930 T1459 oasu.CommitTracker.<init> Hard AutoCommit: disabled
[junit4:junit4]   2> 4931 T1459 oasu.CommitTracker.<init> Soft AutoCommit: disabled
[junit4:junit4]   2> 4932 T1459 oashc.SpellCheckComponent.inform Initializing spell checkers
[junit4:junit4]   2> 4939 T1459 oass.DirectSolrSpellChecker.init init: {name=direct,classname=DirectSolrSpellChecker,field=lowerfilt,minQueryLength=3}
[junit4:junit4]   2> 5003 T1460 oasc.SolrCore.registerSearcher [collection1] Registered new searcher Searcher@59a74e3e main{StandardDirectoryReader(segments_1:1)}
[junit4:junit4]   2> 5007 T1459 oasc.ZkController.publish publishing core=collection1 state=down
[junit4:junit4]   2> 5007 T1459 oasc.ZkController.publish numShards not found on descriptor - reading it from system property
[junit4:junit4]   2> 5485 T1440 oascc.ZkStateReader.updateClusterState Updating cloud state from ZooKeeper... 
[junit4:junit4]   2> 5486 T1440 oasc.Overseer$ClusterStateUpdater.updateState Update state numShards=2 message={
[junit4:junit4]   2> 	  "operation":"state",
[junit4:junit4]   2> 	  "numShards":"2",
[junit4:junit4]   2> 	  "shard":null,
[junit4:junit4]   2> 	  "roles":null,
[junit4:junit4]   2> 	  "state":"down",
[junit4:junit4]   2> 	  "core":"collection1",
[junit4:junit4]   2> 	  "collection":"collection1",
[junit4:junit4]   2> 	  "node_name":"127.0.0.1:28195_",
[junit4:junit4]   2> 	  "base_url":"http://127.0.0.1:28195"}
[junit4:junit4]   2> 5486 T1440 oasc.Overseer$ClusterStateUpdater.createCollection Create collection collection1 with numShards 2
[junit4:junit4]   2> 5486 T1440 oasc.Overseer$ClusterStateUpdater.updateState Assigning new node to shard shard=shard1
[junit4:junit4]   2> 5610 T1439 oascc.ZkStateReader$2.process A cluster state change: WatchedEvent state:SyncConnected type:NodeDataChanged path:/clusterstate.json, has occurred - updating... (live nodes size: 2)
[junit4:junit4]   2> 5610 T1445 oascc.ZkStateReader$2.process A cluster state change: WatchedEvent state:SyncConnected type:NodeDataChanged path:/clusterstate.json, has occurred - updating... (live nodes size: 2)
[junit4:junit4]   2> 5610 T1458 oascc.ZkStateReader$2.process A cluster state change: WatchedEvent state:SyncConnected type:NodeDataChanged path:/clusterstate.json, has occurred - updating... (live nodes size: 2)
[junit4:junit4]   2> 6010 T1459 oasc.CoreContainer.registerCore registering core: collection1
[junit4:junit4]   2> 6010 T1459 oasc.ZkController.register Register replica - core:collection1 address:http://127.0.0.1:28195 collection:collection1 shard:shard1
[junit4:junit4]   2> 6012 T1459 oascc.SolrZkClient.makePath makePath: /collections/collection1/leader_elect/shard1/election
[junit4:junit4]   2> 6032 T1422 oazs.PrepRequestProcessor.pRequest Got user-level KeeperException when processing sessionid:0x13bd58449930006 type:delete cxid:0x45 zxid:0x5b txntype:-1 reqpath:n/a Error Path:/solr/collections/collection1/leaders Error:KeeperErrorCode = NoNode for /solr/collections/collection1/leaders
[junit4:junit4]   2> 6032 T1459 oasc.ShardLeaderElectionContext.runLeaderProcess Running the leader process.
[junit4:junit4]   2> 6033 T1422 oazs.PrepRequestProcessor.pRequest Got user-level KeeperException when processing sessionid:0x13bd58449930006 type:create cxid:0x46 zxid:0x5c txntype:-1 reqpath:n/a Error Path:/solr/overseer Error:KeeperErrorCode = NodeExists for /solr/overseer
[junit4:junit4]   2> 6044 T1459 oasc.ShardLeaderElectionContext.waitForReplicasToComeUp Enough replicas found to continue.
[junit4:junit4]   2> 6044 T1459 oasc.ShardLeaderElectionContext.runLeaderProcess I may be the new leader - try and sync
[junit4:junit4]   2> 6044 T1459 oasc.SyncStrategy.sync Sync replicas to http://127.0.0.1:28195/collection1/
[junit4:junit4]   2> 6045 T1459 oasc.SyncStrategy.syncReplicas Sync Success - now sync replicas to me
[junit4:junit4]   2> 6045 T1459 oasc.SyncStrategy.syncToMe http://127.0.0.1:28195/collection1/ has no replicas
[junit4:junit4]   2> 6046 T1459 oasc.ShardLeaderElectionContext.runLeaderProcess I am the new leader: http://127.0.0.1:28195/collection1/
[junit4:junit4]   2> 6046 T1459 oascc.SolrZkClient.makePath makePath: /collections/collection1/leaders/shard1
[junit4:junit4]   2> 6051 T1422 oazs.PrepRequestProcessor.pRequest Got user-level KeeperException when processing sessionid:0x13bd58449930006 type:create cxid:0x50 zxid:0x60 txntype:-1 reqpath:n/a Error Path:/solr/overseer Error:KeeperErrorCode = NodeExists for /solr/overseer
[junit4:junit4]   2> 6116 T1440 oascc.ZkStateReader.updateClusterState Updating cloud state from ZooKeeper... 
[junit4:junit4]   2> 6134 T1445 oascc.ZkStateReader$2.process A cluster state change: WatchedEvent state:SyncConnected type:NodeDataChanged path:/clusterstate.json, has occurred - updating... (live nodes size: 2)
[junit4:junit4]   2> 6134 T1439 oascc.ZkStateReader$2.process A cluster state change: WatchedEvent state:SyncConnected type:NodeDataChanged path:/clusterstate.json, has occurred - updating... (live nodes size: 2)
[junit4:junit4]   2> 6134 T1458 oascc.ZkStateReader$2.process A cluster state change: WatchedEvent state:SyncConnected type:NodeDataChanged path:/clusterstate.json, has occurred - updating... (live nodes size: 2)
[junit4:junit4]   2> 6155 T1459 oasc.ZkController.register We are http://127.0.0.1:28195/collection1/ and leader is http://127.0.0.1:28195/collection1/
[junit4:junit4]   2> 6155 T1459 oasc.ZkController.register No LogReplay needed for core=collection1 baseURL=http://127.0.0.1:28195
[junit4:junit4]   2> 6155 T1459 oasc.ZkController.checkRecovery I am the leader, no recovery necessary
[junit4:junit4]   2> 6156 T1459 oasc.ZkController.publish publishing core=collection1 state=active
[junit4:junit4]   2> 6156 T1459 oasc.ZkController.publish numShards not found on descriptor - reading it from system property
[junit4:junit4]   2> 6158 T1459 oascc.ZkStateReader.updateClusterState Updating cloud state from ZooKeeper... 
[junit4:junit4]   2> 6159 T1417 oass.SolrDispatchFilter.init user.dir=/usr/home/hudson/hudson-slave/workspace/Lucene-Solr-Tests-trunk-java7/solr/build/solr-core/test/J1
[junit4:junit4]   2> 6161 T1417 oass.SolrDispatchFilter.init SolrDispatchFilter.init() done
[junit4:junit4]   2> 6162 T1417 oascsi.HttpClientUtil.createClient Creating new http client, config:maxConnections=128&maxConnectionsPerHost=32&followRedirects=false
[junit4:junit4]   2> 6383 T1417 oejs.Server.doStart jetty-8.1.8.v20121106
[junit4:junit4]   2> 6387 T1417 oejs.AbstractConnector.doStart Started SocketConnector@127.0.0.1:28198
[junit4:junit4]   2> 6388 T1417 oasc.SolrResourceLoader.locateSolrHome JNDI not configured for solr (NoInitialContextEx)
[junit4:junit4]   2> 6389 T1417 oasc.SolrResourceLoader.locateSolrHome using system property solr.solr.home: /usr/home/hudson/hudson-slave/workspace/Lucene-Solr-Tests-trunk-java7/solr/build/solr-core/test/J1/./org.apache.solr.cloud.BasicDistributedZkTest-jetty2-1356496921029
[junit4:junit4]   2> 6390 T1417 oasc.SolrResourceLoader.<init> new SolrResourceLoader for deduced Solr Home: '/usr/home/hudson/hudson-slave/workspace/Lucene-Solr-Tests-trunk-java7/solr/build/solr-core/test/J1/./org.apache.solr.cloud.BasicDistributedZkTest-jetty2-1356496921029/'
[junit4:junit4]   2> 6434 T1417 oass.SolrDispatchFilter.init SolrDispatchFilter.init()
[junit4:junit4]   2> 6435 T1417 oasc.SolrResourceLoader.locateSolrHome JNDI not configured for solr (NoInitialContextEx)
[junit4:junit4]   2> 6436 T1417 oasc.SolrResourceLoader.locateSolrHome using system property solr.solr.home: /usr/home/hudson/hudson-slave/workspace/Lucene-Solr-Tests-trunk-java7/solr/build/solr-core/test/J1/./org.apache.solr.cloud.BasicDistributedZkTest-jetty2-1356496921029
[junit4:junit4]   2> 6437 T1417 oasc.CoreContainer$Initializer.initialize looking for solr.xml: /usr/home/hudson/hudson-slave/workspace/Lucene-Solr-Tests-trunk-java7/solr/build/solr-core/test/J1/./org.apache.solr.cloud.BasicDistributedZkTest-jetty2-1356496921029/solr.xml
[junit4:junit4]   2> 6437 T1417 oasc.CoreContainer.<init> New CoreContainer 772881985
[junit4:junit4]   2> 6439 T1417 oasc.CoreContainer.load Loading CoreContainer using Solr Home: '/usr/home/hudson/hudson-slave/workspace/Lucene-Solr-Tests-trunk-java7/solr/build/solr-core/test/J1/./org.apache.solr.cloud.BasicDistributedZkTest-jetty2-1356496921029/'
[junit4:junit4]   2> 6439 T1417 oasc.SolrResourceLoader.<init> new SolrResourceLoader for directory: '/usr/home/hudson/hudson-slave/workspace/Lucene-Solr-Tests-trunk-java7/solr/build/solr-core/test/J1/./org.apache.solr.cloud.BasicDistributedZkTest-jetty2-1356496921029/'
[junit4:junit4]   2> 6470 T1417 oashc.HttpShardHandlerFactory.getParameter Setting socketTimeout to: 30000
[junit4:junit4]   2> 6471 T1417 oashc.HttpShardHandlerFactory.getParameter Setting urlScheme to: http://
[junit4:junit4]   2> 6472 T1417 oashc.HttpShardHandlerFactory.getParameter Setting connTimeout to: 15000
[junit4:junit4]   2> 6472 T1417 oashc.HttpShardHandlerFactory.getParameter Setting maxConnectionsPerHost to: 20
[junit4:junit4]   2> 6473 T1417 oashc.HttpShardHandlerFactory.getParameter Setting corePoolSize to: 0
[junit4:junit4]   2> 6474 T1417 oashc.HttpShardHandlerFactory.getParameter Setting maximumPoolSize to: 2147483647
[junit4:junit4]   2> 6475 T1417 oashc.HttpShardHandlerFactory.getParameter Setting maxThreadIdleTime to: 5
[junit4:junit4]   2> 6476 T1417 oashc.HttpShardHandlerFactory.getParameter Setting sizeOfQueue to: -1
[junit4:junit4]   2> 6476 T1417 oashc.HttpShardHandlerFactory.getParameter Setting fairnessPolicy to: false
[junit4:junit4]   2> 6477 T1417 oascsi.HttpClientUtil.createClient Creating new http client, config:maxConnectionsPerHost=20&maxConnections=10000&socketTimeout=30000&connTimeout=15000&retry=false
[junit4:junit4]   2> 6499 T1417 oasc.CoreContainer.load Registering Log Listener
[junit4:junit4]   2> 6520 T1417 oasc.CoreContainer.initZooKeeper Zookeeper client=127.0.0.1:28188/solr
[junit4:junit4]   2> 6522 T1417 oasc.ZkController.checkChrootPath zkHost includes chroot
[junit4:junit4]   2> 6523 T1417 oaz.ZooKeeper.<init> Initiating client connection, connectString=127.0.0.1:28188 sessionTimeout=60000 watcher=org.apache.solr.common.cloud.ConnectionManager@384a6cae
[junit4:junit4]   2> 6525 T1470 oaz.ClientCnxn$SendThread.logStartConnect Opening socket connection to server localhost/127.0.0.1:28188. Will not attempt to authenticate using SASL (access denied ("javax.security.auth.AuthPermission" "getLoginConfiguration"))
[junit4:junit4]   2> 6524 T1417 oascc.ConnectionManager.waitForConnected Waiting for client to connect to ZooKeeper
[junit4:junit4]   2> 6526 T1470 oaz.ClientCnxn$SendThread.primeConnection Socket connection established to localhost/127.0.0.1:28188, initiating session
[junit4:junit4]   2> 6526 T1419 oazs.NIOServerCnxnFactory.run Accepted socket connection from /140.211.11.196:28199
[junit4:junit4]   2> 6527 T1419 oazs.ZooKeeperServer.processConnectRequest Client attempting to establish new session at /140.211.11.196:28199
[junit4:junit4]   2> 6554 T1421 oazs.ZooKeeperServer.finishSessionInit Established session 0x13bd58449930007 with negotiated timeout 20000 for client /140.211.11.196:28199
[junit4:junit4]   2> 6554 T1470 oaz.ClientCnxn$SendThread.onConnected Session establishment complete on server localhost/127.0.0.1:28188, sessionid = 0x13bd58449930007, negotiated timeout = 20000
[junit4:junit4]   2> 6555 T1471 oascc.ConnectionManager.process Watcher org.apache.solr.common.cloud.ConnectionManager@384a6cae name:ZooKeeperConnection Watcher:127.0.0.1:28188 got event WatchedEvent state:SyncConnected type:None path:null path:null type:None
[junit4:junit4]   2> 6555 T1417 oascc.ConnectionManager.waitForConnected Client is connected to ZooKeeper
[junit4:junit4]   2> 6558 T1422 oazs.PrepRequestProcessor.pRequest2Txn Processed session termination for sessionid: 0x13bd58449930007
[junit4:junit4]   2> 6565 T1471 oaz.ClientCnxn$EventThread.run EventThread shut down
[junit4:junit4]   2> 6565 T1419 oazs.NIOServerCnxn.closeSock Closed socket connection for client /140.211.11.196:28199 which had sessionid 0x13bd58449930007
[junit4:junit4]   2> 6565 T1417 oaz.ZooKeeper.close Session: 0x13bd58449930007 closed
[junit4:junit4]   2> 6566 T1417 oascsi.HttpClientUtil.createClient Creating new http client, config:maxConnections=500&maxConnectionsPerHost=16&socketTimeout=15000&connTimeout=30000
[junit4:junit4]   2> 6586 T1417 oaz.ZooKeeper.<init> Initiating client connection, connectString=127.0.0.1:28188/solr sessionTimeout=30000 watcher=org.apache.solr.common.cloud.ConnectionManager@a5a0dce
[junit4:junit4]   2> 6590 T1472 oaz.ClientCnxn$SendThread.logStartConnect Opening socket connection to server localhost/127.0.0.1:28188. Will not attempt to authenticate using SASL (access denied ("javax.security.auth.AuthPermission" "getLoginConfiguration"))
[junit4:junit4]   2> 6589 T1417 oascc.ConnectionManager.waitForConnected Waiting for client to connect to ZooKeeper
[junit4:junit4]   2> 6591 T1472 oaz.ClientCnxn$SendThread.primeConnection Socket connection established to localhost/127.0.0.1:28188, initiating session
[junit4:junit4]   2> 6592 T1419 oazs.NIOServerCnxnFactory.run Accepted socket connection from /140.211.11.196:28200
[junit4:junit4]   2> 6592 T1419 oazs.ZooKeeperServer.processConnectRequest Client attempting to establish new session at /140.211.11.196:28200
[junit4:junit4]   2> 6594 T1421 oazs.ZooKeeperServer.finishSessionInit Established session 0x13bd58449930008 with negotiated timeout 20000 for client /140.211.11.196:28200
[junit4:junit4]   2> 6594 T1472 oaz.ClientCnxn$SendThread.onConnected Session establishment complete on server localhost/127.0.0.1:28188, sessionid = 0x13bd58449930008, negotiated timeout = 20000
[junit4:junit4]   2> 6594 T1473 oascc.ConnectionManager.process Watcher org.apache.solr.common.cloud.ConnectionManager@a5a0dce name:ZooKeeperConnection Watcher:127.0.0.1:28188/solr got event WatchedEvent state:SyncConnected type:None path:null path:null type:None
[junit4:junit4]   2> 6595 T1417 oascc.ConnectionManager.waitForConnected Client is connected to ZooKeeper
[junit4:junit4]   2> 6598 T1422 oazs.PrepRequestProcessor.pRequest Got user-level KeeperException when processing sessionid:0x13bd58449930008 type:create cxid:0x1 zxid:0x6d txntype:-1 reqpath:n/a Error Path:/solr/overseer Error:KeeperErrorCode = NodeExists for /solr/overseer
[junit4:junit4]   2> 6599 T1422 oazs.PrepRequestProcessor.pRequest Got user-level KeeperException when processing sessionid:0x13bd58449930008 type:create cxid:0x2 zxid:0x6e txntype:-1 reqpath:n/a Error Path:/solr/overseer Error:KeeperErrorCode = NodeExists for /solr/overseer
[junit4:junit4]   2> 6601 T1417 oasc.ZkController.createEphemeralLiveNode Register node as live in ZooKeeper:/live_nodes/127.0.0.1:28198_
[junit4:junit4]   2> 6603 T1422 oazs.PrepRequestProcessor.pRequest Got user-level KeeperException when processing sessionid:0x13bd58449930008 type:delete cxid:0x4 zxid:0x6f txntype:-1 reqpath:n/a Error Path:/solr/live_nodes/127.0.0.1:28198_ Error:KeeperErrorCode = NoNode for /solr/live_nodes/127.0.0.1:28198_
[junit4:junit4]   2> 6610 T1417 oascc.SolrZkClient.makePath makePath: /live_nodes/127.0.0.1:28198_
[junit4:junit4]   2> 6613 T1458 oascc.ZkStateReader$2.process A cluster state change: WatchedEvent state:SyncConnected type:NodeChildrenChanged path:/live_nodes, has occurred - updating... (live nodes size: 2)
[junit4:junit4]   2> 6613 T1445 oascc.ZkStateReader$3.process Updating live nodes... (3)
[junit4:junit4]   2> 6614 T1439 oascc.ZkStateReader$3.process Updating live nodes... (3)
[junit4:junit4]   2> 6614 T1445 oascc.ZkStateReader$2.process A cluster state change: WatchedEvent state:SyncConnected type:NodeChildrenChanged path:/live_nodes, has occurred - updating... (live nodes size: 3)
[junit4:junit4]   2> 6614 T1439 oascc.ZkStateReader$2.process A cluster state change: WatchedEvent state:SyncConnected type:NodeChildrenChanged path:/live_nodes, has occurred - updating... (live nodes size: 3)
[junit4:junit4]   2> 6615 T1458 oascc.ZkStateReader$3.process Updating live nodes... (3)
[junit4:junit4]   2> 6619 T1417 oascc.ZkStateReader.createClusterStateWatchersAndUpdate Updating cluster state from ZooKeeper... 
[junit4:junit4]   2> 6628 T1474 oasc.CoreContainer.create Creating SolrCore 'collection1' using instanceDir: /usr/home/hudson/hudson-slave/workspace/Lucene-Solr-Tests-trunk-java7/solr/build/solr-core/test/J1/./org.apache.solr.cloud.BasicDistributedZkTest-jetty2-1356496921029/collection1
[junit4:junit4]   2> 6629 T1474 oasc.ZkController.createCollectionZkNode Check for collection zkNode:collection1
[junit4:junit4]   2> 6630 T1474 oasc.ZkController.createCollectionZkNode Collection zkNode exists
[junit4:junit4]   2> 6630 T1474 oasc.ZkController.readConfigName Load collection config from:/collections/collection1
[junit4:junit4]   2> 6632 T1474 oasc.SolrResourceLoader.<init> new SolrResourceLoader for directory: '/usr/home/hudson/hudson-slave/workspace/Lucene-Solr-Tests-trunk-java7/solr/build/solr-core/test/J1/./org.apache.solr.cloud.BasicDistributedZkTest-jetty2-1356496921029/collection1/'
[junit4:junit4]   2> 6633 T1474 oasc.SolrResourceLoader.replaceClassLoader Adding 'file:/usr/home/hudson/hudson-slave/workspace/Lucene-Solr-Tests-trunk-java7/solr/build/solr-core/test/J1/org.apache.solr.cloud.BasicDistributedZkTest-jetty2-1356496921029/collection1/lib/classes/' to classloader
[junit4:junit4]   2> 6634 T1474 oasc.SolrResourceLoader.replaceClassLoader Adding 'file:/usr/home/hudson/hudson-slave/workspace/Lucene-Solr-Tests-trunk-java7/solr/build/solr-core/test/J1/org.apache.solr.cloud.BasicDistributedZkTest-jetty2-1356496921029/collection1/lib/README' to classloader
[junit4:junit4]   2> 6649 T1440 oascc.ZkStateReader.updateClusterState Updating cloud state from ZooKeeper... 
[junit4:junit4]   2> 6650 T1440 oasc.Overseer$ClusterStateUpdater.updateState Update state numShards=2 message={
[junit4:junit4]   2> 	  "operation":"state",
[junit4:junit4]   2> 	  "numShards":"2",
[junit4:junit4]   2> 	  "shard":"shard1",
[junit4:junit4]   2> 	  "roles":null,
[junit4:junit4]   2> 	  "state":"active",
[junit4:junit4]   2> 	  "core":"collection1",
[junit4:junit4]   2> 	  "collection":"collection1",
[junit4:junit4]   2> 	  "node_name":"127.0.0.1:28195_",
[junit4:junit4]   2> 	  "base_url":"http://127.0.0.1:28195"}
[junit4:junit4]   2> 6657 T1445 oascc.ZkStateReader$2.process A cluster state change: WatchedEvent state:SyncConnected type:NodeDataChanged path:/clusterstate.json, has occurred - updating... (live nodes size: 3)
[junit4:junit4]   2> 6657 T1458 oascc.ZkStateReader$2.process A cluster state change: WatchedEvent state:SyncConnected type:NodeDataChanged path:/clusterstate.json, has occurred - updating... (live nodes size: 3)
[junit4:junit4]   2> 6657 T1439 oascc.ZkStateReader$2.process A cluster state change: WatchedEvent state:SyncConnected type:NodeDataChanged path:/clusterstate.json, has occurred - updating... (live nodes size: 3)
[junit4:junit4]   2> 6657 T1473 oascc.ZkStateReader$2.process A cluster state change: WatchedEvent state:SyncConnected type:NodeDataChanged path:/clusterstate.json, has occurred - updating... (live nodes size: 3)
[junit4:junit4]   2> 6691 T1474 oasc.SolrConfig.<init> Using Lucene MatchVersion: LUCENE_50
[junit4:junit4]   2> 6765 T1474 oasc.SolrConfig.<init> Loaded SolrConfig: solrconfig.xml
[junit4:junit4]   2> 6867 T1474 oass.IndexSchema.readSchema Reading Solr Schema
[junit4:junit4]   2> 6874 T1474 oass.IndexSchema.readSchema Schema name=test
[junit4:junit4]   2> 7535 T1474 oass.OpenExchangeRatesOrgProvider.init Initialized with rates=open-exchange-rates.json, refreshInterval=1440.
[junit4:junit4]   2> 7544 T1474 oass.IndexSchema.readSchema default search field in schema is text
[junit4:junit4]   2> 7547 T1474 oass.IndexSchema.readSchema unique key field: id
[junit4:junit4]   2> 7559 T1474 oass.FileExchangeRateProvider.reload Reloading exchange rates from file currency.xml
[junit4:junit4]   2> 7563 T1474 oass.FileExchangeRateProvider.reload Reloading exchange rates from file currency.xml
[junit4:junit4]   2> 7567 T1474 oass.OpenExchangeRatesOrgProvider.reload Reloading exchange rates from open-exchange-rates.json
[junit4:junit4]   2> 7568 T1474 oass.OpenExchangeRatesOrgProvider.reload Reloading exchange rates from open-exchange-rates.json
[junit4:junit4]   2> 7569 T1474 oasc.SolrCore.<init> [collection1] Opening new SolrCore at /usr/home/hudson/hudson-slave/workspace/Lucene-Solr-Tests-trunk-java7/solr/build/solr-core/test/J1/./org.apache.solr.cloud.BasicDistributedZkTest-jetty2-1356496921029/collection1/, dataDir=./org.apache.solr.cloud.BasicDistributedZkTest-1356496914830/jetty2/
[junit4:junit4]   2> 7570 T1474 oasc.JmxMonitoredMap.<init> JMX monitoring is enabled. Adding Solr mbeans to JMX Server: com.sun.jmx.mbeanserver.JmxMBeanServer@25c5b6e
[junit4:junit4]   2> 7570 T1474 oasc.SolrCore.initDirectoryFactory solr.NRTCachingDirectoryFactory
[junit4:junit4]   2> 7571 T1474 oasc.CachingDirectoryFactory.get return new directory for /usr/home/hudson/hudson-slave/workspace/Lucene-Solr-Tests-trunk-java7/solr/build/solr-core/test/J1/./org.apache.solr.cloud.BasicDistributedZkTest-1356496914830/jetty2 forceNew:false
[junit4:junit4]   2> 7572 T1474 oasc.CachingDirectoryFactory.close Releasing directory:/usr/home/hudson/hudson-slave/workspace/Lucene-Solr-Tests-trunk-java7/solr/build/solr-core/test/J1/./org.apache.solr.cloud.BasicDistributedZkTest-1356496914830/jetty2
[junit4:junit4]   2> 7572 T1474 oasc.SolrCore.getNewIndexDir New index directory detected: old=null new=./org.apache.solr.cloud.BasicDistributedZkTest-1356496914830/jetty2/index/
[junit4:junit4]   2> 7572 T1474 oasc.SolrCore.initIndex WARNING [collection1] Solr index directory './org.apache.solr.cloud.BasicDistributedZkTest-1356496914830/jetty2/index' doesn't exist. Creating new index...
[junit4:junit4]   2> 7573 T1474 oasc.CachingDirectoryFactory.get return new directory for /usr/home/hudson/hudson-slave/workspace/Lucene-Solr-Tests-trunk-java7/solr/build/solr-core/test/J1/./org.apache.solr.cloud.BasicDistributedZkTest-1356496914830/jetty2/index forceNew:false
[junit4:junit4]   2> 7605 T1474 oasc.SolrDeletionPolicy.onCommit SolrDeletionPolicy.onCommit: commits:num=1
[junit4:junit4]   2> 		commit{dir=RateLimitedDirectoryWrapper(NRTCachingDirectory(org.apache.lucene.store.NIOFSDirectory@/usr/home/hudson/hudson-slave/workspace/Lucene-Solr-Tests-trunk-java7/solr/build/solr-core/test/J1/org.apache.solr.cloud.BasicDistributedZkTest-1356496914830/jetty2/index lockFactory=org.apache.lucene.store.NativeFSLockFactory@5b1bce3f; maxCacheMB=48.0 maxMergeSizeMB=4.0)),segFN=segments_1,generation=1,filenames=[segments_1]
[junit4:junit4]   2> 7606 T1474 oasc.SolrDeletionPolicy.updateCommits newest commit = 1[segments_1]
[junit4:junit4]   2> 7607 T1474 oasc.CachingDirectoryFactory.close Releasing directory:/usr/home/hudson/hudson-slave/workspace/Lucene-Solr-Tests-trunk-java7/solr/build/solr-core/test/J1/./org.apache.solr.cloud.BasicDistributedZkTest-1356496914830/jetty2/index
[junit4:junit4]   2> 7607 T1474 oasc.SolrCore.initWriters created xml: solr.XMLResponseWriter
[junit4:junit4]   2> 7609 T1474 oasup.UpdateRequestProcessorChain.init inserting DistributedUpdateProcessorFactory into updateRequestProcessorChain "dedupe"
[junit4:junit4]   2> 7609 T1474 oasup.UpdateRequestProcessorChain.init inserting DistributedUpdateProcessorFactory into updateRequestProcessorChain "dedupe-allfields"
[junit4:junit4]   2> 7610 T1474 oasup.UpdateRequestProcessorChain.init inserting DistributedUpdateProcessorFactory into updateRequestProcessorChain "stored_sig"
[junit4:junit4]   2> 7610 T1474 oasup.UpdateRequestProcessorChain.init inserting DistributedUpdateProcessorFactory into updateRequestProcessorChain "uniq-fields"
[junit4:junit4]   2> 7611 T1474 oasup.UpdateRequestProcessorChain.init inserting DistributedUpdateProcessorFactory into updateRequestProcessorChain "distrib-dup-test-chain-implicit"
[junit4:junit4]   2> 7611 T1474 oasc.RequestHandlers.initHandlersFromConfig adding lazy requestHandler: solr.ReplicationHandler
[junit4:junit4]   2> 7611 T1474 oasc.RequestHandlers.initHandlersFromConfig created /replication: solr.ReplicationHandler
[junit4:junit4]   2> 7612 T1474 oasc.RequestHandlers.initHandlersFromConfig created standard: solr.StandardRequestHandler
[junit4:junit4]   2> 7613 T1474 oasc.RequestHandlers.initHandlersFromConfig created /get: solr.RealTimeGetHandler
[junit4:junit4]   2> 7614 T1474 oasc.RequestHandlers.initHandlersFromConfig created dismax: solr.SearchHandler
[junit4:junit4]   2> 7614 T1474 oasc.RequestHandlers.initHandlersFromConfig created mock: org.apache.solr.core.MockQuerySenderListenerReqHandler
[junit4:junit4]   2> 7615 T1474 oasc.RequestHandlers.initHandlersFromConfig created /admin/: org.apache.solr.handler.admin.AdminHandlers
[junit4:junit4]   2> 7615 T1474 oasc.RequestHandlers.initHandlersFromConfig created defaults: solr.StandardRequestHandler
[junit4:junit4]   2> 7616 T1474 oasc.RequestHandlers.initHandlersFromConfig adding lazy requestHandler: solr.StandardRequestHandler
[junit4:junit4]   2> 7616 T1474 oasc.RequestHandlers.initHandlersFromConfig created lazy: solr.StandardRequestHandler
[junit4:junit4]   2> 7617 T1474 oasc.RequestHandlers.initHandlersFromConfig created /update: solr.UpdateRequestHandler
[junit4:junit4]   2> 7617 T1474 oasc.RequestHandlers.initHandlersFromConfig created /terms: org.apache.solr.handler.component.SearchHandler
[junit4:junit4]   2> 7618 T1474 oasc.RequestHandlers.initHandlersFromConfig created spellCheckCompRH: org.apache.solr.handler.component.SearchHandler
[junit4:junit4]   2> 7619 T1474 oasc.RequestHandlers.initHandlersFromConfig created spellCheckCompRH_Direct: org.apache.solr.handler.component.SearchHandler
[junit4:junit4]   2> 7619 T1474 oasc.RequestHandlers.initHandlersFromConfig created spellCheckWithWordbreak: org.apache.solr.handler.component.SearchHandler
[junit4:junit4]   2> 7620 T1474 oasc.RequestHandlers.initHandlersFromConfig created spellCheckWithWordbreak_Direct: org.apache.solr.handler.component.SearchHandler
[junit4:junit4]   2> 7621 T1474 oasc.RequestHandlers.initHandlersFromConfig created spellCheckCompRH1: org.apache.solr.handler.component.SearchHandler
[junit4:junit4]   2> 7622 T1474 oasc.RequestHandlers.initHandlersFromConfig created mltrh: org.apache.solr.handler.component.SearchHandler
[junit4:junit4]   2> 7622 T1474 oasc.RequestHandlers.initHandlersFromConfig created tvrh: org.apache.solr.handler.component.SearchHandler
[junit4:junit4]   2> 7623 T1474 oasc.RequestHandlers.initHandlersFromConfig created /mlt: solr.MoreLikeThisHandler
[junit4:junit4]   2> 7624 T1474 oasc.RequestHandlers.initHandlersFromConfig created /debug/dump: solr.DumpRequestHandler
[junit4:junit4]   2> 7633 T1474 oashl.XMLLoader.init xsltCacheLifetimeSeconds=60
[junit4:junit4]   2> 7636 T1474 oasc.SolrCore.initDeprecatedSupport WARNING solrconfig.xml uses deprecated <admin/gettableFiles>, Please update your config to use the ShowFileRequestHandler.
[junit4:junit4]   2> 7638 T1474 oasc.SolrCore.initDeprecatedSupport WARNING adding ShowFileRequestHandler with hidden files: [SCHEMA.XML, OLD_SYNONYMS.TXT, STOPWORDS.TXT, PROTWORDS.TXT, OPEN-EXCHANGE-RATES.JSON, SYNONYMS.TXT, CURRENCY.XML, MAPPING-ISOLATIN1ACCENT.TXT]
[junit4:junit4]   2> 7640 T1474 oasc.CachingDirectoryFactory.close Releasing directory:/usr/home/hudson/hudson-slave/workspace/Lucene-Solr-Tests-trunk-java7/solr/build/solr-core/test/J1/./org.apache.solr.cloud.BasicDistributedZkTest-1356496914830/jetty2
[junit4:junit4]   2> 7641 T1474 oass.SolrIndexSearcher.<init> Opening Searcher@b68ebf8 main
[junit4:junit4]   2> 7642 T1474 oasu.CommitTracker.<init> Hard AutoCommit: disabled
[junit4:junit4]   2> 7642 T1474 oasu.CommitTracker.<init> Soft AutoCommit: disabled
[junit4:junit4]   2> 7643 T1474 oashc.SpellCheckComponent.inform Initializing spell checkers
[junit4:junit4]   2> 7648 T1474 oass.DirectSolrSpellChecker.init init: {name=direct,classname=DirectSolrSpellChecker,field=lowerfilt,minQueryLength=3}
[junit4:junit4]   2> 7698 T1475 oasc.SolrCore.registerSearcher [collection1] Registered new searcher Searcher@b68ebf8 main{StandardDirectoryReader(segments_1:1)}
[junit4:junit4]   2> 7703 T1474 oasc.ZkController.publish publishing core=collection1 state=down
[junit4:junit4]   2> 7703 T1474 oasc.ZkController.publish numShards not found on descriptor - reading it from system property
[junit4:junit4]   2> 8167 T1440 oascc.ZkStateReader.updateClusterState Updating cloud state from ZooKeeper... 
[junit4:junit4]   2> 8168 T1440 oasc.Overseer$ClusterStateUpdater.updateState Update state numShards=2 message={
[junit4:junit4]   2> 	  "operation":"state",
[junit4:junit4]   2> 	  "numShards":"2",
[junit4:junit4]   2> 	  "shard":null,
[junit4:junit4]   2> 	  "roles":null,
[junit4:junit4]   2> 	  "state":"down",
[junit4:junit4]   2> 	  "core":"collection1",
[junit4:junit4]   2> 	  "collection":"collection1",
[junit4:junit4]   2> 	  "node_name":"127.0.0.1:28198_",
[junit4:junit4]   2> 	  "base_url":"http://127.0.0.1:28198"}
[junit4:junit4]   2> 8168 T1440 oasc.Overseer$ClusterStateUpdater.updateState Collection already exists with numShards=2
[junit4:junit4]   2> 8168 T1440 oasc.Overseer$ClusterStateUpdater.updateState Assigning new node to shard shard=shard2
[junit4:junit4]   2> 8183 T1439 oascc.ZkStateReader$2.process A cluster state change: WatchedEvent state:SyncConnected type:NodeDataChanged path:/clusterstate.json, has occurred - updating... (live nodes size: 3)
[junit4:junit4]   2> 8183 T1445 oascc.ZkStateReader$2.process A cluster state change: WatchedEvent state:SyncConnected type:NodeDataChanged path:/clusterstate.json, has occurred - updating... (live nodes size: 3)
[junit4:junit4]   2> 8183 T1458 oascc.ZkStateReader$2.process A cluster state change: WatchedEvent state:SyncConnected type:NodeDataChanged path:/clusterstate.json, has occurred - updating... (live nodes size: 3)
[junit4:junit4]   2> 8183 T1473 oascc.ZkStateReader$2.process A cluster state change: WatchedEvent state:SyncConnected type:NodeDataChanged path:/clusterstate.json, has occurred - updating... (live nodes size: 3)
[junit4:junit4]   2> 8706 T1474 oasc.CoreContainer.registerCore registering core: collection1
[junit4:junit4]   2> 8706 T1474 oasc.ZkController.register Register replica - core:collection1 address:http://127.0.0.1:28198 collection:collection1 shard:shard2
[junit4:junit4]   2> 8707 T1474 oascc.SolrZkClient.makePath makePath: /collections/collection1/leader_elect/shard2/election
[junit4:junit4]   2> 8725 T1422 oazs.PrepRequestProcessor.pRequest Got user-level KeeperException when processing sessionid:0x13bd58449930008 type:delete cxid:0x44 zxid:0x7e txntype:-1 reqpath:n/a Error Path:/solr/collections/collection1/leaders/shard2 Error:KeeperErrorCode = NoNode for /solr/collections/collection1/leaders/shard2
[junit4:junit4]   2> 8726 T1474 oasc.ShardLeaderElectionContext.runLeaderProcess Running the leader process.
[junit4:junit4]   2> 8727 T1422 oazs.PrepRequestProcessor.pRequest Got user-level KeeperException when processing sessionid:0x13bd58449930008 type:create cxid:0x45 zxid:0x7f txntype:-1 reqpath:n/a Error Path:/solr/overseer Error:KeeperErrorCode = NodeExists for /solr/overseer
[junit4:junit4]   2> 8736 T1474 oasc.ShardLeaderElectionContext.waitForReplicasToComeUp Enough replicas found to continue.
[junit4:junit4]   2> 8736 T1474 oasc.ShardLeaderElectionContext.runLeaderProcess I may be the new leader - try and sync
[junit4:junit4]   2> 8736 T1474 oasc.SyncStrategy.sync Sync replicas to http://127.0.0.1:28198/collection1/
[junit4:junit4]   2> 8737 T1474 oasc.SyncStrategy.syncReplicas Sync Success - now sync replicas to me
[junit4:junit4]   2> 8737 T1474 oasc.SyncStrategy.syncToMe http://127.0.0.1:28198/collection1/ has no replicas
[junit4:junit4]   2> 8737 T1474 oasc.ShardLeaderElectionContext.runLeaderProcess I am the new leader: http://127.0.0.1:28198/collection1/
[junit4:junit4]   2> 8738 T1474 oascc.SolrZkClient.makePath makePath: /collections/collection1/leaders/shard2
[junit4:junit4]   2> 8742 T1422 oazs.PrepRequestProcessor.pRequest Got user-level KeeperException when processing sessionid:0x13bd58449930008 type:create cxid:0x4e zxid:0x82 txntype:-1 reqpath:n/a Error Path:/solr/overseer Error:KeeperErrorCode = NodeExists for /solr/overseer
[junit4:junit4]   2> 9190 T1440 oascc.ZkStateReader.updateClusterState Updating cloud state from ZooKeeper... 
[junit4:junit4]   2> 9206 T1439 oascc.ZkStateReader$2.process A cluster state change: WatchedEvent state:SyncConnected type:NodeDataChanged path:/clusterstate.json, has occurred - updating... (live nodes size: 3)
[junit4:junit4]   2> 9206 T1473 oascc.ZkStateReader$2.process A cluster state change: WatchedEvent state:SyncConnected type:NodeDataChanged path:/clusterstate.json, has occurred - updating... (live nodes size: 3)
[junit4:junit4]   2> 9206 T1458 oascc.ZkStateReader$2.process A cluster state change: WatchedEvent state:SyncConnected type:NodeDataChanged path:/clusterstate.json, has occurred - updating... (live nodes size: 3)
[junit4:junit4]   2> 9206 T1445 oascc.ZkStateReader$2.process A cluster state change: WatchedEvent state:SyncConnected type:NodeDataChanged path:/clusterstate.json, has occurred - updating... (live nodes size: 3)
[junit4:junit4]   2> 9254 T1474 oasc.ZkController.register We are http://127.0.0.1:28198/collection1/ and leader is http://127.0.0.1:28198/collection1/
[junit4:junit4]   2> 9255 T1474 oasc.ZkController.register No LogReplay needed for core=collection1 baseURL=http://127.0.0.1:28198
[junit4:junit4]   2> 9255 T1474 oasc.ZkController.checkRecovery I am the leader, no recovery necessary
[junit4:junit4]   2> 9255 T1474 oasc.ZkController.publish publishing core=collection1 state=active
[junit4:junit4]   2> 9256 T1474 oasc.ZkController.publish numShards not found on descriptor - reading it from system property
[junit4:junit4]   2> 9259 T1474 oascc.ZkStateReader.updateClusterState Updating cloud state from ZooKeeper... 
[junit4:junit4]   2> 9260 T1417 oass.SolrDispatchFilter.init user.dir=/usr/home/hudson/hudson-slave/workspace/Lucene-Solr-Tests-trunk-java7/solr/build/solr-core/test/J1
[junit4:junit4]   2> 9261 T1417 oass.SolrDispatchFilter.init SolrDispatchFilter.init() done
[junit4:junit4]   2> 9262 T1417 oascsi.HttpClientUtil.createClient Creating new http client, config:maxConnections=128&maxConnectionsPerHost=32&followRedirects=false
[junit4:junit4]   2> 9444 T1417 oejs.Server.doStart jetty-8.1.8.v20121106
[junit4:junit4]   2> 9448 T1417 oejs.AbstractConnector.doStart Started SocketConnector@127.0.0.1:28201
[junit4:junit4]   2> 9449 T1417 oasc.SolrResourceLoader.locateSolrHome JNDI not configured for solr (NoInitialContextEx)
[junit4:junit4]   2> 9450 T1417 oasc.SolrResourceLoader.locateSolrHome using system property solr.solr.home: /usr/home/hudson/hudson-slave/workspace/Lucene-Solr-Tests-trunk-java7/solr/build/solr-core/test/J1/./org.apache.solr.cloud.BasicDistributedZkTest-jetty3-1356496924100
[junit4:junit4]   2> 9451 T1417 oasc.SolrResourceLoader.<init> new SolrResourceLoader for deduced Solr Home: '/usr/home/hudson/hudson-slave/workspace/Lucene-Solr-Tests-trunk-java7/solr/build/solr-core/test/J1/./org.apache.solr.cloud.BasicDistributedZkTest-jetty3-1356496924100/'
[junit4:junit4]   2> 9495 T1417 oass.SolrDispatchFilter.init SolrDispatchFilter.init()
[junit4:junit4]   2> 9496 T1417 oasc.SolrResourceLoader.locateSolrHome JNDI not configured for solr (NoInitialContextEx)
[junit4:junit4]   2> 9497 T1417 oasc.SolrResourceLoader.locateSolrHome using system property solr.solr.home: /usr/home/hudson/hudson-slave/workspace/Lucene-Solr-Tests-trunk-java7/solr/build/solr-core/test/J1/./org.apache.solr.cloud.BasicDistributedZkTest-jetty3-1356496924100
[junit4:junit4]   2> 9498 T1417 oasc.CoreContainer$Initializer.initialize looking for solr.xml: /usr/home/hudson/hudson-slave/workspace/Lucene-Solr-Tests-trunk-java7/solr/build/solr-core/test/J1/./org.apache.solr.cloud.BasicDistributedZkTest-jetty3-1356496924100/solr.xml
[junit4:junit4]   2> 9499 T1417 oasc.CoreContainer.<init> New CoreContainer 769643199
[junit4:junit4]   2> 9500 T1417 oasc.CoreContainer.load Loading CoreContainer using Solr Home: '/usr/home/hudson/hudson-slave/workspace/Lucene-Solr-Tests-trunk-java7/solr/build/solr-core/test/J1/./org.apache.solr.cloud.BasicDistributedZkTest-jetty3-1356496924100/'
[junit4:junit4]   2> 9500 T1417 oasc.SolrResourceLoader.<init> new SolrResourceLoader for directory: '/usr/home/hudson/hudson-slave/workspace/Lucene-Solr-Tests-trunk-java7/solr/build/solr-core/test/J1/./org.apache.solr.cloud.BasicDistributedZkTest-jetty3-1356496924100/'
[junit4:junit4]   2> 9530 T1417 oashc.HttpShardHandlerFactory.getParameter Setting socketTimeout to: 30000
[junit4:junit4]   2> 9531 T1417 oashc.HttpShardHandlerFactory.getParameter Setting urlScheme to: http://
[junit4:junit4]   2> 9532 T1417 oashc.HttpShardHandlerFactory.getParameter Setting connTimeout to: 15000
[junit4:junit4]   2> 9532 T1417 oashc.HttpShardHandlerFactory.getParameter Setting maxConnectionsPerHost to: 20
[junit4:junit4]   2> 9533 T1417 oashc.HttpShardHandlerFactory.getParameter Setting corePoolSize to: 0
[junit4:junit4]   2> 9534 T1417 oashc.HttpShardHandlerFactory.getParameter Setting maximumPoolSize to: 2147483647
[junit4:junit4]   2> 9535 T1417 oashc.HttpShardHandlerFactory.getParameter Setting maxThreadIdleTime to: 5
[junit4:junit4]   2> 9536 T1417 oashc.HttpShardHandlerFactory.getParameter Setting sizeOfQueue to: -1
[junit4:junit4]   2> 9537 T1417 oashc.HttpShardHandlerFactory.getParameter Setting fairnessPolicy to: false
[junit4:junit4]   2> 9537 T1417 oascsi.HttpClientUtil.createClient Creating new http client, config:maxConnectionsPerHost=20&maxConnections=10000&socketTimeout=30000&connTimeout=15000&retry=false
[junit4:junit4]   2> 9557 T1417 oasc.CoreContainer.load Registering Log Listener
[junit4:junit4]   2> 9578 T1417 oasc.CoreContainer.initZooKeeper Zookeeper client=127.0.0.1:28188/solr
[junit4:junit4]   2> 9579 T1417 oasc.ZkController.checkChrootPath zkHost includes chroot
[junit4:junit4]   2> 9580 T1417 oaz.ZooKeeper.<init> Initiating client connection, connectString=127.0.0.1:28188 sessionTimeout=60000 watcher=org.apache.solr.common.cloud.ConnectionManager@54bde5a7
[junit4:junit4]   2> 9582 T1485 oaz.ClientCnxn$SendThread.logStartConnect Opening socket connection to server localhost/127.0.0.1:28188. Will not attempt to authenticate using SASL (access denied ("javax.security.auth.AuthPermission" "getLoginConfiguration"))
[junit4:junit4]   2> 9582 T1417 oascc.ConnectionManager.waitForConnected Waiting for client to connect to ZooKeeper
[junit4:junit4]   2> 9583 T1485 oaz.ClientCnxn$SendThread.primeConnection Socket connection established to localhost/127.0.0.1:28188, initiating session
[junit4:junit4]   2> 9583 T1419 oazs.NIOServerCnxnFactory.run Accepted socket connection from /140.211.11.196:28202
[junit4:junit4]   2> 9584 T1419 oazs.ZooKeeperServer.processConnectRequest Client attempting to establish new session at /140.211.11.196:28202
[junit4:junit4]   2> 9585 T1421 oazs.ZooKeeperServer.finishSessionInit Established session 0x13bd58449930009 with negotiated timeout 20000 for client /140.211.11.196:28202
[junit4:junit4]   2> 9586 T1485 oaz.ClientCnxn$SendThread.onConnected Session establishment complete on server localhost/127.0.0.1:28188, sessionid = 0x13bd58449930009, negotiated timeout = 20000
[junit4:junit4]   2> 9586 T1486 oascc.ConnectionManager.process Watcher org.apache.solr.common.cloud.ConnectionManager@54bde5a7 name:ZooKeeperConnection Watcher:127.0.0.1:28188 got event WatchedEvent state:SyncConnected type:None path:null path:null type:None
[junit4:junit4]   2> 9586 T1417 oascc.ConnectionManager.waitForConnected Client is connected to ZooKeeper
[junit4:junit4]   2> 9588 T1422 oazs.PrepRequestProcessor.pRequest2Txn Processed session termination for sessionid: 0x13bd58449930009
[junit4:junit4]   2> 9589 T1486 oaz.ClientCnxn$EventThread.run EventThread shut down
[junit4:junit4]   2> 9589 T1419 oazs.NIOServerCnxn.closeSock Closed socket connection for client /140.211.11.196:28202 which had sessionid 0x13bd58449930009
[junit4:junit4]   2> 9589 T1417 oaz.ZooKeeper.close Session: 0x13bd58449930009 closed
[junit4:junit4]   2> 9591 T1417 oascsi.HttpClientUtil.createClient Creating new http client, config:maxConnections=500&maxConnectionsPerHost=16&socketTimeout=15000&connTimeout=30000
[junit4:junit4]   2> 9601 T1417 oaz.ZooKeeper.<init> Initiating client connection, connectString=127.0.0.1:28188/solr sessionTimeout=30000 watcher=org.apache.solr.common.cloud.ConnectionManager@159fd541
[junit4:junit4]   2> 9603 T1487 oaz.ClientCnxn$SendThread.logStartConnect Opening socket connection to server localhost/127.0.0.1:28188. Will not attempt to authenticate using SASL (access denied ("javax.security.auth.AuthPermission" "getLoginConfiguration"))
[junit4:junit4]   2> 9603 T1417 oascc.ConnectionManager.waitForConnected Waiting for client to connect to ZooKeeper
[junit4:junit4]   2> 9604 T1487 oaz.ClientCnxn$SendThread.primeConnection Socket connection established to localhost/127.0.0.1:28188, initiating session
[junit4:junit4]   2> 9604 T1419 oazs.NIOServerCnxnFactory.run Accepted socket connection from /140.211.11.196:28203
[junit4:junit4]   2> 9604 T1419 oazs.ZooKeeperServer.processConnectRequest Client attempting to establish new session at /140.211.11.196:28203
[junit4:junit4]   2> 9606 T1421 oazs.ZooKeeperServer.finishSessionInit Established session 0x13bd5844993000a with negotiated timeout 20000 for client /140.211.11.196:28203
[junit4:junit4]   2> 9606 T1487 oaz.ClientCnxn$SendThread.onConnected Session establishment complete on server localhost/127.0.0.1:28188, sessionid = 0x13bd5844993000a, negotiated timeout = 20000
[junit4:junit4]   2> 9606 T1488 oascc.ConnectionManager.process Watcher org.apache.solr.common.cloud.ConnectionManager@159fd541 name:ZooKeeperConnection Watcher:127.0.0.1:28188/solr got event WatchedEvent state:SyncConnected type:None path:null path:null type:None
[junit4:junit4]   2> 9607 T1417 oascc.ConnectionManager.waitForConnected Client is connected to ZooKeeper
[junit4:junit4]   2> 9609 T1422 oazs.PrepRequestProcessor.pRequest Got user-level KeeperException when processing sessionid:0x13bd5844993000a type:create cxid:0x1 zxid:0x8f txntype:-1 reqpath:n/a Error Path:/solr/overseer Error:KeeperErrorCode = NodeExists for /solr/overseer
[junit4:junit4]   2> 9610 T1422 oazs.PrepRequestProcessor.pRequest Got user-level KeeperException when processing sessionid:0x13bd5844993000a type:create cxid:0x2 zxid:0x90 txntype:-1 reqpath:n/a Error Path:/solr/overseer Error:KeeperErrorCode = NodeExists for /solr/overseer
[junit4:junit4]   2> 9612 T1417 oasc.ZkController.createEphemeralLiveNode Register node as live in ZooKeeper:/live_nodes/127.0.0.1:28201_
[junit4:junit4]   2> 9613 T1422 oazs.PrepRequestProcessor.pRequest Got user-level KeeperException when processing sessionid:0x13bd5844993000a type:delete cxid:0x4 zxid:0x91 txntype:-1 reqpath:n/a Error Path:/solr/live_nodes/127.0.0.1:28201_ Error:KeeperErrorCode = NoNode for /solr/live_nodes/127.0.0.1:28201_
[junit4:junit4]   2> 9619 T1417 oascc.SolrZkClient.makePath makePath: /live_nodes/127.0.0.1:28201_
[junit4:junit4]   2> 9623 T1458 oascc.ZkStateReader$2.process A cluster state change: WatchedEvent state:SyncConnected type:NodeChildrenChanged path:/live_nodes, has occurred - updating... (live nodes size: 3)
[junit4:junit4]   2> 9624 T1445 oascc.ZkStateReader$3.process Updating live nodes... (4)
[junit4:junit4]   2> 9624 T1439 oascc.ZkStateReader$3.process Updating live nodes... (4)
[junit4:junit4]   2> 9624 T1473 oascc.ZkStateReader$3.process Updating live nodes... (4)
[junit4:junit4]   2> 9624 T1445 oascc.ZkStateReader$2.process A cluster state change: WatchedEvent state:SyncConnected type:NodeChildrenChanged path:/live_nodes, has occurred - updating... (live nodes size: 4)
[junit4:junit4]   2> 9625 T1439 oascc.ZkStateReader$2.process A cluster state change: WatchedEvent state:SyncConnected type:NodeChildrenChanged path:/live_nodes, has occurred - updating... (live nodes size: 4)
[junit4:junit4]   2> 9625 T1473 oascc.ZkStateReader$2.process A cluster state change: WatchedEvent state:SyncConnected type:NodeChildrenChanged path:/live_nodes, has occurred - updating... (live nodes size: 4)
[junit4:junit4]   2> 9626 T1458 oascc.ZkStateReader$3.process Updating live nodes... (4)
[junit4:junit4]   2> 9629 T1417 oascc.ZkStateReader.createClusterStateWatchersAndUpdate Updating cluster state from ZooKeeper... 
[junit4:junit4]   2> 9638 T1489 oasc.CoreContainer.create Creating SolrCore 'collection1' using instanceDir: /usr/home/hudson/hudson-slave/workspace/Lucene-Solr-Tests-trunk-java7/solr/build/solr-core/test/J1/./org.apache.solr.cloud.BasicDistributedZkTest-jetty3-1356496924100/collection1
[junit4:junit4]   2> 9639 T1489 oasc.ZkController.createCollectionZkNode Check for collection zkNode:collection1
[junit4:junit4]   2> 9640 T1489 oasc.ZkController.createCollectionZkNode Collection zkNode exists
[junit4:junit4]   2> 9640 T1489 oasc.ZkController.readConfigName Load collection config from:/collections/collection1
[junit4:junit4]   2> 9642 T1489 oasc.SolrResourceLoader.<init> new SolrResourceLoader for directory: '/usr/home/hudson/hudson-slave/workspace/Lucene-Solr-Tests-trunk-java7/solr/build/solr-core/test/J1/./org.apache.solr.cloud.BasicDistributedZkTest-jetty3-1356496924100/collection1/'
[junit4:junit4]   2> 9644 T1489 oasc.SolrResourceLoader.replaceClassLoader Adding 'file:/usr/home/hudson/hudson-slave/workspace/Lucene-Solr-Tests-trunk-java7/solr/build/solr-core/test/J1/org.apache.solr.cloud.BasicDistributedZkTest-jetty3-1356496924100/collection1/lib/README' to classloader
[junit4:junit4]   2> 9644 T1489 oasc.SolrResourceLoader.replaceClassLoader Adding 'file:/usr/home/hudson/hudson-slave/workspace/Lucene-Solr-Tests-trunk-java7/solr/build/solr-core/test/J1/org.apache.solr.cloud.BasicDistributedZkTest-jetty3-1356496924100/collection1/lib/classes/' to classloader
[junit4:junit4]   2> 9698 T1489 oasc.SolrConfig.<init> Using Lucene MatchVersion: LUCENE_50
[junit4:junit4]   2> 9713 T1440 oascc.ZkStateReader.updateClusterState Updating cloud state from ZooKeeper... 
[junit4:junit4]   2> 9714 T1440 oasc.Overseer$ClusterStateUpdater.updateState Update state numShards=2 message={
[junit4:junit4]   2> 	  "operation":"state",
[junit4:junit4]   2> 	  "numShards":"2",
[junit4:junit4]   2> 	  "shard":"shard2",
[junit4:junit4]   2> 	  "roles":null,
[junit4:junit4]   2> 	  "state":"active",
[junit4:junit4]   2> 	  "core":"collection1",
[junit4:junit4]   2> 	  "collection":"collection1",
[junit4:junit4]   2> 	  "node_name":"127.0.0.1:28198_",
[junit4:junit4]   2> 	  "base_url":"http://127.0.0.1:28198"}
[junit4:junit4]   2> 9727 T1458 oascc.ZkStateReader$2.process A cluster state change: WatchedEvent state:SyncConnected type:NodeDataChanged path:/clusterstate.json, has occurred - updating... (live nodes size: 4)
[junit4:junit4]   2> 9727 T1439 oascc.ZkStateReader$2.process A cluster state change: WatchedEvent state:SyncConnected type:NodeDataChanged path:/clusterstate.json, has occurred - updating... (live nodes size: 4)
[junit4:junit4]   2> 9727 T1445 oascc.ZkStateReader$2.process A cluster state change: WatchedEvent state:SyncConnected type:NodeDataChanged path:/clusterstate.json, has occurred - updating... (live nodes size: 4)
[junit4:junit4]   2> 9727 T1488 oascc.ZkStateReader$2.process A cluster state change: WatchedEvent state:SyncConnected type:NodeDataChanged path:/clusterstate.json, has occurred - updating... (live nodes size: 4)
[junit4:junit4]   2> 9727 T1473 oascc.ZkStateReader$2.process A cluster state change: WatchedEvent state:SyncConnected type:NodeDataChanged path:/clusterstate.json, has occurred - updating... (live nodes size: 4)
[junit4:junit4]   2> 9770 T1489 oasc.SolrConfig.<init> Loaded SolrConfig: solrconfig.xml
[junit4:junit4]   2> 9871 T1489 oass.IndexSchema.readSchema Reading Solr Schema
[junit4:junit4]   2> 9878 T1489 oass.IndexSchema.readSchema Schema name=test
[junit4:junit4]   2> 10678 T1489 oass.OpenExchangeRatesOrgProvider.init Initialized with rates=open-exchange-rates.json, refreshInterval=1440.
[junit4:junit4]   2> 10698 T1489 oass.IndexSchema.readSchema default search field in schema is text
[junit4:junit4]   2> 10703 T1489 oass.IndexSchema.readSchema unique key field: id
[junit4:junit4]   2> 10718 T1489 oass.FileExchangeRateProvider.reload Reloading exchange rates from file currency.xml
[junit4:junit4]   2> 10724 T1489 oass.FileExchangeRateProvider.reload Reloading exchange rates from file currency.xml
[junit4:junit4]   2> 10729 T1489 oass.OpenExchangeRatesOrgProvider.reload Reloading exchange rates from open-exchange-rates.json
[junit4:junit4]   2> 10731 T1489 oass.OpenExchangeRatesOrgProvider.reload Reloading exchange rates from open-exchange-rates.json
[junit4:junit4]   2> 10733 T1489 oasc.SolrCore.<init> [collection1] Opening new SolrCore at /usr/home/hudson/hudson-slave/workspace/Lucene-Solr-Tests-trunk-java7/solr/build/solr-core/test/J1/./org.apache.solr.cloud.BasicDistributedZkTest-jetty3-1356496924100/collection1/, dataDir=./org.apache.solr.cloud.BasicDistributedZkTest-1356496914830/jetty3/
[junit4:junit4]   2> 10733 T1489 oasc.JmxMonitoredMap.<init> JMX monitoring is enabled. Adding Solr mbeans to JMX Server: com.sun.jmx.mbeanserver.JmxMBeanServer@25c5b6e
[junit4:junit4]   2> 10734 T1489 oasc.SolrCore.initDirectoryFactory solr.NRTCachingDirectoryFactory
[junit4:junit4]   2> 10735 T1489 oasc.CachingDirectoryFactory.get return new directory for /usr/home/hudson/hudson-slave/workspace/Lucene-Solr-Tests-trunk-java7/solr/build/solr-core/test/J1/./org.apache.solr.cloud.BasicDistributedZkTest-1356496914830/jetty3 forceNew:false
[junit4:junit4]   2> 10736 T1489 oasc.CachingDirectoryFactory.close Releasing directory:/usr/home/hudson/hudson-slave/workspace/Lucene-Solr-Tests-trunk-java7/solr/build/solr-core/test/J1/./org.apache.solr.cloud.BasicDistributedZkTest-1356496914830/jetty3
[junit4:junit4]   2> 10737 T1489 oasc.SolrCore.getNewIndexDir New index directory detected: old=null new=./org.apache.solr.cloud.BasicDistributedZkTest-1356496914830/jetty3/index/
[junit4:junit4]   2> 10738 T1489 oasc.SolrCore.initIndex WARNING [collection1] Solr index directory './org.apache.solr.cloud.BasicDistributedZkTest-1356496914830/jetty3/index' doesn't exist. Creating new index...
[junit4:junit4]   2> 10740 T1489 oasc.CachingDirectoryFactory.get return new directory for /usr/home/hudson/hudson-slave/workspace/Lucene-Solr-Tests-trunk-java7/solr/build/solr-core/test/J1/./org.apache.solr.cloud.BasicDistributedZkTest-1356496914830/jetty3/index forceNew:false
[junit4:junit4]   2> 10753 T1489 oasc.SolrDeletionPolicy.onCommit SolrDeletionPolicy.onCommit: commits:num=1
[junit4:junit4]   2> 		commit{dir=RateLimitedDirectoryWrapper(NRTCachingDirectory(org.apache.lucene.store.NIOFSDirectory@/usr/home/hudson/hudson-slave/workspace/Lucene-Solr-Tests-trunk-java7/solr/build/solr-core/test/J1/org.apache.solr.cloud.BasicDistributedZkTest-1356496914830/jetty3/index lockFactory=org.apache.lucene.store.NativeFSLockFactory@38c9964f; maxCacheMB=48.0 maxMergeSizeMB=4.0)),segFN=segments_1,generation=1,filenames=[segments_1]
[junit4:junit4]   2> 10754 T1489 oasc.SolrDeletionPolicy.updateCommits newest commit = 1[segments_1]
[junit4:junit4]   2> 10755 T1489 oasc.CachingDirectoryFactory.close Releasing directory:/usr/home/hudson/hudson-slave/workspace/Lucene-Solr-Tests-trunk-java7/solr/build/solr-core/test/J1/./org.apache.solr.cloud.BasicDistributedZkTest-1356496914830/jetty3/index
[junit4:junit4]   2> 10755 T1489 oasc.SolrCore.initWriters created xml: solr.XMLResponseWriter
[junit4:junit4]   2> 10758 T1489 oasup.UpdateRequestProcessorChain.init inserting DistributedUpdateProcessorFactory into updateRequestProcessorChain "dedupe"
[junit4:junit4]   2> 10758 T1489 oasup.UpdateRequestProcessorChain.init inserting DistributedUpdateProcessorFactory into updateRequestProcessorChain "dedupe-allfields"
[junit4:junit4]   2> 10759 T1489 oasup.UpdateRequestProcessorChain.init inserting DistributedUpdateProcessorFactory into updateRequestProcessorChain "stored_sig"
[junit4:junit4]   2> 10759 T1489 oasup.UpdateRequestProcessorChain.init inserting DistributedUpdateProcessorFactory into updateRequestProcessorChain "uniq-fields"
[junit4:junit4]   2> 10760 T1489 oasup.UpdateRequestProcessorChain.init inserting DistributedUpdateProcessorFactory into updateRequestProcessorChain "distrib-dup-test-chain-implicit"
[junit4:junit4]   2> 10760 T1489 oasc.RequestHandlers.initHandlersFromConfig adding lazy requestHandler: solr.ReplicationHandler
[junit4:junit4]   2> 10761 T1489 oasc.RequestHandlers.initHandlersFromConfig created /replication: solr.ReplicationHandler
[junit4:junit4]   2> 10762 T1489 oasc.RequestHandlers.initHandlersFromConfig created standard: solr.StandardRequestHandler
[junit4:junit4]   2> 10793 T1489 oasc.RequestHandlers.initHandlersFromConfig created /get: solr.RealTimeGetHandler
[junit4:junit4]   2> 10795 T1489 oasc.RequestHandlers.initHandlersFromConfig created dismax: solr.SearchHandler
[junit4:junit4]   2> 10797 T1489 oasc.RequestHandlers.initHandlersFromConfig created mock: org.apache.solr.core.MockQuerySenderListenerReqHandler
[junit4:junit4]   2> 10797 T1489 oasc.RequestHandlers.initHandlersFromConfig created /admin/: org.apache.solr.handler.admin.AdminHandlers
[junit4:junit4]   2> 10798 T1489 oasc.RequestHandlers.initHandlersFromConfig created defaults: solr.StandardRequestHandler
[junit4:junit4]   2> 10798 T1489 oasc.RequestHandlers.initHandlersFromConfig adding lazy requestHandler: solr.StandardRequestHandler
[junit4:junit4]   2> 10799 T1489 oasc.RequestHandlers.initHandlersFromConfig created lazy: solr.StandardRequestHandler
[junit4:junit4]   2> 10800 T1489 oasc.RequestHandlers.initHandlersFromConfig created /update: solr.UpdateRequestHandler
[junit4:junit4]   2> 10801 T1489 oasc.RequestHandlers.initHandlersFromConfig created /terms: org.apache.solr.handler.component.SearchHandler
[junit4:junit4]   2> 10802 T1489 oasc.RequestHandlers.initHandlersFromConfig created spellCheckCompRH: org.apache.solr.handler.component.SearchHandler
[junit4:junit4]   2> 10804 T1489 oasc.RequestHandlers.initHandlersFromConfig created spellCheckCompRH_Direct: org.apache.solr.handler.component.SearchHandler
[junit4:junit4]   2> 10805 T1489 oasc.RequestHandlers.initHandlersFromConfig created spellCheckWithWordbreak: org.apache.solr.handler.component.SearchHandler
[junit4:junit4]   2> 10806 T1489 oasc.RequestHandlers.initHandlersFromConfig created spellCheckWithWordbreak_Direct: org.apache.solr.handler.component.SearchHandler
[junit4:junit4]   2> 10807 T1489 oasc.RequestHandlers.initHandlersFromConfig created spellCheckCompRH1: org.apache.solr.handler.component.SearchHandler
[junit4:junit4]   2> 10808 T1489 oasc.RequestHandlers.initHandlersFromConfig created mltrh: org.apache.solr.handler.component.SearchHandler
[junit4:junit4]   2> 10809 T1489 oasc.RequestHandlers.initHandlersFromConfig created tvrh: org.apache.solr.handler.component.SearchHandler
[junit4:junit4]   2> 10810 T1489 oasc.RequestHandlers.initHandlersFromConfig created /mlt: solr.MoreLikeThisHandler
[junit4:junit4]   2> 10811 T1489 oasc.RequestHandlers.initHandlersFromConfig created /debug/dump: solr.DumpRequestHandler
[junit4:junit4]   2> 10826 T1489 oashl.XMLLoader.init xsltCacheLifetimeSeconds=60
[junit4:junit4]   2> 10832 T1489 oasc.SolrCore.initDeprecatedSupport WARNING solrconfig.xml uses deprecated <admin/gettableFiles>, Please update your config to use the ShowFileRequestHandler.
[junit4:junit4]   2> 10833 T1489 oasc.SolrCore.initDeprecatedSupport WARNING adding ShowFileRequestHandler with hidden files: [SCHEMA.XML, OLD_SYNONYMS.TXT, STOPWORDS.TXT, PROTWORDS.TXT, OPEN-EXCHANGE-RATES.JSON, SYNONYMS.TXT, CURRENCY.XML, MAPPING-ISOLATIN1ACCENT.TXT]
[junit4:junit4]   2> 10836 T1489 oasc.CachingDirectoryFactory.close Releasing directory:/usr/home/hudson/hudson-slave/workspace/Lucene-Solr-Tests-trunk-java7/solr/build/solr-core/test/J1/./org.apache.solr.cloud.BasicDistributedZkTest-1356496914830/jetty3
[junit4:junit4]   2> 10838 T1489 oass.SolrIndexSearcher.<init> Opening Searcher@de19aaf main
[junit4:junit4]   2> 10840 T1489 oasu.CommitTracker.<init> Hard AutoCommit: disabled
[junit4:junit4]   2> 10840 T1489 oasu.CommitTracker.<init> Soft AutoCommit: disabled
[junit4:junit4]   2> 10841 T1489 oashc.SpellCheckComponent.inform Initializing spell checkers
[junit4:junit4]   2> 10849 T1489 oass.DirectSolrSpellChecker.init init: {name=direct,classname=DirectSolrSpellChecker,field=lowerfilt,minQueryLength=3}
[junit4:junit4]   2> 10912 T1490 oasc.SolrCore.registerSearcher [collection1] Registered new searcher Searcher@de19aaf main{StandardDirectoryReader(segments_1:1)}
[junit4:junit4]   2> 10918 T1489 oasc.ZkController.publish publishing core=collection1 state=down
[junit4:junit4]   2> 10918 T1489 oasc.ZkController.publish numShards not found on descriptor - reading it from system property
[junit4:junit4]   2> 11238 T1440 oascc.ZkStateReader.updateClusterState Updating cloud state from ZooKeeper... 
[junit4:junit4]   2> 11239 T1440 oasc.Overseer$ClusterStateUpdater.updateState Update state numShards=2 message={
[junit4:junit4]   2> 	  "operation":"state",
[junit4:junit4]   2> 	  "numShards":"2",
[junit4:junit4]   2> 	  "shard":null,
[junit4:junit4]   2> 	  "roles":null,
[junit4:junit4]   2> 	  "state":"down",
[junit4:junit4]   2> 	  "core":"collection1",
[junit4:junit4]   2> 	  "collection":"collection1",
[junit4:junit4]   2> 	  "node_name":"127.0.0.1:28201_",
[junit4:junit4]   2> 	  "base_url":"http://127.0.0.1:28201"}
[junit4:junit4]   2> 11239 T1440 oasc.Overseer$ClusterStateUpdater.updateState Collection already exists with numShards=2
[junit4:junit4]   2> 11239 T1440 oasc.Overseer$ClusterStateUpdater.updateState Assigning new node to shard shard=shard1
[junit4:junit4]   2> 11253 T1439 oascc.ZkStateReader$2.process A cluster state change: WatchedEvent state:SyncConnected type:NodeDataChanged path:/clusterstate.json, has occurred - updating... (live nodes size: 4)
[junit4:junit4]   2> 11253 T1445 oascc.ZkStateReader$2.process A cluster state change: WatchedEvent state:SyncConnected type:NodeDataChanged path:/clusterstate.json, has occurred - updating... (live nodes size: 4)
[junit4:junit4]   2> 11254 T1473 oascc.ZkStateReader$2.process A cluster state change: WatchedEvent state:SyncConnected type:NodeDataChanged path:/clusterstate.json, has occurred - updating... (live nodes size: 4)
[junit4:junit4]   2> 11254 T1458 oascc.ZkStateReader$2.process A cluster state change: WatchedEvent state:SyncConnected type:NodeDataChanged path:/clusterstate.json, has occurred - updating... (live nodes size: 4)
[junit4:junit4]   2> 11254 T1488 oascc.ZkStateReader$2.process A cluster state change: WatchedEvent state:SyncConnected type:NodeDataChanged path:/clusterstate.json, has occurred - updating... (live nodes size: 4)
[junit4:junit4]   2> 11921 T1489 oasc.CoreContainer.registerCore registering core: collection1
[junit4:junit4]   2> 11921 T1489 oasc.ZkController.register Register replica - core:collection1 address:http://127.0.0.1:28201 collection:collection1 shard:shard1
[junit4:junit4]   2> 11950 T1489 oasc.ZkController.register We are http://127.0.0.1:28201/collection1/ and leader is http://127.0.0.1:28195/collection1/
[junit4:junit4]   2> 11951 T1489 oasc.ZkController.register No LogReplay needed for core=collection1 baseURL=http://127.0.0.1:28201
[junit4:junit4]   2> 11951 T1489 oasc.ZkController.checkRecovery Core needs to recover:collection1
[junit4:junit4]   2> 11951 T1489 oasu.DefaultSolrCoreState.doRecovery Running recovery - first canceling any ongoing recovery
[junit4:junit4]   2> ASYNC  NEW_CORE C125 name=collection1 org.apache.solr.core.SolrCore@4bb45c11 url=http://127.0.0.1:28201/collection1 node=127.0.0.1:28201_ C125_STATE=coll:collection1 core:collection1 props:{shard=null, roles=null, state=down, core=collection1, collection=collection1, node_name=127.0.0.1:28201_, base_url=http://127.0.0.1:28201}
[junit4:junit4]   2> 11952 T1491 C125 P28201 oasc.RecoveryStrategy.run Starting recovery process.  core=collection1 recoveringAfterStartup=true
[junit4:junit4]   2> 11953 T1491 C125 P28201 oasc.RecoveryStrategy.doRecovery ###### startupVersions=[]
[junit4:junit4]   2> 11952 T1489 oascc.ZkStateReader.updateClusterState Updating cloud state from ZooKeeper... 
[junit4:junit4]   2> 11953 T1491 C125 P28201 oasc.ZkController.publish publishing core=collection1 state=recovering
[junit4:junit4]   2> 11953 T1491 C125 P28201 oasc.ZkController.publish numShards not found on descriptor - reading it from system property
[junit4:junit4]   2> 11955 T1491 C125 P28201 oascsi.HttpClientUtil.createClient Creating new http client, config:maxConnections=128&maxConnectionsPerHost=32&followRedirects=false
[junit4:junit4]   2> 11954 T1417 oass.SolrDispatchFilter.init user.dir=/usr/home/hudson/hudson-slave/workspace/Lucene-Solr-Tests-trunk-java7/solr/build/solr-core/test/J1
[junit4:junit4]   2> 11955 T1417 oass.SolrDispatchFilter.init SolrDispatchFilter.init() done
[junit4:junit4]   2> 11956 T1417 oascsi.HttpClientUtil.createClient Creating new http client, config:maxConnections=128&maxConnectionsPerHost=32&followRedirects=false
[junit4:junit4]   2> 12152 T1417 oejs.Server.doStart jetty-8.1.8.v20121106
[junit4:junit4]   2> 12156 T1417 oejs.AbstractConnector.doStart Started SocketConnector@127.0.0.1:28205
[junit4:junit4]   2> 12157 T1417 oasc.SolrResourceLoader.locateSolrHome JNDI not configured for solr (NoInitialContextEx)
[junit4:junit4]   2> 12158 T1417 oasc.SolrResourceLoader.locateSolrHome using system property solr.solr.home: /usr/home/hudson/hudson-slave/workspace/Lucene-Solr-Tests-trunk-java7/solr/build/solr-core/test/J1/./org.apache.solr.cloud.BasicDistributedZkTest-jetty4-1356496926795
[junit4:junit4]   2> 12159 T1417 oasc.SolrResourceLoader.<init> new SolrResourceLoader for deduced Solr Home: '/usr/home/hudson/hudson-slave/workspace/Lucene-Solr-Tests-trunk-java7/solr/build/solr-core/test/J1/./org.apache.solr.cloud.BasicDistributedZkTest-jetty4-1356496926795/'
[junit4:junit4]   2> 12205 T1417 oass.SolrDispatchFilter.init SolrDispatchFilter.init()
[junit4:junit4]   2> 12206 T1417 oasc.SolrResourceLoader.locateSolrHome JNDI not configured for solr (NoInitialContextEx)
[junit4:junit4]   2> 12207 T1417 oasc.SolrResourceLoader.locateSolrHome using system property solr.solr.home: /usr/home/hudson/hudson-slave/workspace/Lucene-Solr-Tests-trunk-java7/solr/build/solr-core/test/J1/./org.apache.solr.cloud.BasicDistributedZkTest-jetty4-1356496926795
[junit4:junit4]   2> 12207 T1417 oasc.CoreContainer$Initializer.initialize looking for solr.xml: /usr/home/hudson/hudson-slave/workspace/Lucene-Solr-Tests-trunk-java7/solr/build/solr-core/test/J1/./org.apache.solr.cloud.BasicDistributedZkTest-jetty4-1356496926795/solr.xml
[junit4:junit4]   2> 12208 T1417 oasc.CoreContainer.<init> New CoreContainer 759479334
[junit4:junit4]   2> 12209 T1417 oasc.CoreContainer.load Loading CoreContainer using Solr Home: '/usr/home/hudson/hudson-slave/workspace/Lucene-Solr-Tests-trunk-java7/solr/build/solr-core/test/J1/./org.apache.solr.cloud.BasicDistributedZkTest-jetty4-1356496926795/'
[junit4:junit4]   2> 12210 T1417 oasc.SolrResourceLoader.<init> new SolrResourceLoader for directory: '/usr/home/hudson/hudson-slave/workspace/Lucene-Solr-Tests-trunk-java7/solr/build/solr-core/test/J1/./org.apache.solr.cloud.BasicDistributedZkTest-jetty4-1356496926795/'
[junit4:junit4]   2> 12241 T1417 oashc.HttpShardHandlerFactory.getParameter Setting socketTimeout to: 30000
[junit4:junit4]   2> 12242 T1417 oashc.HttpShardHandlerFactory.getParameter Setting urlScheme to: http://
[junit4:junit4]   2> 12243 T1417 oashc.HttpShardHandlerFactory.getParameter Setting connTimeout to: 15000
[junit4:junit4]   2> 12244 T1417 oashc.HttpShardHandlerFactory.getParameter Setting maxConnectionsPerHost to: 20
[junit4:junit4]   2> 12245 T1417 oashc.HttpShardHandlerFactory.getParameter Setting corePoolSize to: 0
[junit4:junit4]   2> 12246 T1417 oashc.HttpShardHandlerFactory.getParameter Setting maximumPoolSize to: 2147483647
[junit4:junit4]   2> 12246 T1417 oashc.HttpShardHandlerFactory.getParameter Setting maxThreadIdleTime to: 5
[junit4:junit4]   2> 12247 T1417 oashc.HttpShardHandlerFactory.getParameter Setting sizeOfQueue to: -1
[junit4:junit4]   2> 12248 T1417 oashc.HttpShardHandlerFactory.getParameter Setting fairnessPolicy to: false
[junit4:junit4]   2> 12249 T1417 oascsi.HttpClientUtil.createClient Creating new http client, config:maxConnectionsPerHost=20&maxConnections=10000&socketTimeout=30000&connTimeout=15000&retry=false
[junit4:junit4]   2> 12261 T1440 oascc.ZkStateReader.updateClusterState Updating cloud state from ZooKeeper... 
[junit4:junit4]   2> 12262 T1440 oasc.Overseer$ClusterStateUpdater.updateState Update state numShards=2 message={
[junit4:junit4]   2> 	  "operation":"state",
[junit4:junit4]   2> 	  "numShards":"2",
[junit4:junit4]   2> 	  "shard":"shard1",
[junit4:junit4]   2> 	  "roles":null,
[junit4:junit4]   2> 	  "state":"recovering",
[junit4:junit4]   2> 	  "core":"collection1",
[junit4:junit4]   2> 	  "collection":"collection1",
[junit4:junit4]   2> 	  "node_name":"127.0.0.1:28201_",
[junit4:junit4]   2> 	  "base_url":"http://127.0.0.1:28201"}
[junit4:junit4]   2> 12270 T1417 oasc.CoreContainer.load Registering Log Listener
[junit4:junit4]   2> 12280 T1439 oascc.ZkStateReader$2.process A cluster state change: WatchedEvent state:SyncConnected type:NodeDataChanged path:/clusterstate.json, has occurred - updating... (live nodes size: 4)
[junit4:junit4]   2> 12280 T1488 oascc.ZkStateReader$2.process A cluster state change: WatchedEvent state:SyncConnected type:NodeDataChanged path:/clusterstate.json, has occurred - updating... (live nodes size: 4)
[junit4:junit4]   2> 12280 T1458 oascc.ZkStateReader$2.process A cluster state change: WatchedEvent state:SyncConnected type:NodeDataChanged path:/clusterstate.json, has occurred - updating... (live nodes size: 4)
[junit4:junit4]   2> 12280 T1473 oascc.ZkStateReader$2.process A cluster state change: WatchedEvent state:SyncConnected type:NodeDataChanged path:/clusterstate.json, has occurred - updating... (live nodes size: 4)
[junit4:junit4]   2> 12280 T1445 oascc.ZkStateReader$2.process A cluster state change: WatchedEvent state:SyncConnected type:NodeDataChanged path:/clusterstate.json, has occurred - updating... (live nodes size: 4)
[junit4:junit4]   2> 12292 T1417 oasc.CoreContainer.initZooKeeper Zookeeper client=127.0.0.1:28188/solr
[junit4:junit4]   2> 12294 T1417 oasc.ZkController.checkChrootPath zkHost includes chroot
[junit4:junit4]   2> 12295 T1417 oaz.ZooKeeper.<init> Initiating client connection, connectString=127.0.0.1:28188 sessionTimeout=60000 watcher=org.apache.solr.common.cloud.ConnectionManager@a4df5f7
[junit4:junit4]   2> 12297 T1501 oaz.ClientCnxn$SendThread.logStartConnect Opening socket connection to server localhost/127.0.0.1:28188. Will not attempt to authenticate using SASL (access denied ("javax.security.auth.AuthPermission" "getLoginConfiguration"))
[junit4:junit4]   2> 12296 T1417 oascc.ConnectionManager.waitForConnected Waiting for client to connect to ZooKeeper
[junit4:junit4]   2> 12297 T1501 oaz.ClientCnxn$SendThread.primeConnection Socket connection established to localhost/127.0.0.1:28188, initiating session
[junit4:junit4]   2> 12297 T1419 oazs.NIOServerCnxnFactory.run Accepted socket connection from /140.211.11.196:28206
[junit4:junit4]   2> 12298 T1419 oazs.ZooKeeperServer.processConnectRequest Client attempting to establish new session at /140.211.11.196:28206
[junit4:junit4]   2> 12299 T1421 oazs.ZooKeeperServer.finishSessionInit Established session 0x13bd5844993000b with negotiated timeout 20000 for client /140.211.11.196:28206
[junit4:junit4]   2> 12299 T1501 oaz.ClientCnxn$SendThread.onConnected Session establishment complete on server localhost/127.0.0.1:28188, sessionid = 0x13bd5844993000b, negotiated timeout = 20000
[junit4:junit4]   2> 12299 T1502 oascc.ConnectionManager.process Watcher org.apache.solr.common.cloud.ConnectionManager@a4df5f7 name:ZooKeeperConnection Watcher:127.0.0.1:28188 got event WatchedEvent state:SyncConnected type:None path:null path:null type:None
[junit4:junit4]   2> 12300 T1417 oascc.ConnectionManager.waitForConnected Client is connected to ZooKeeper
[junit4:junit4]   2> 12301 T1422 oazs.PrepRequestProcessor.pRequest2Txn Processed session termination for sessionid: 0x13bd5844993000b
[junit4:junit4]   2> 12302 T1502 oaz.ClientCnxn$EventThread.run EventThread shut down
[junit4:junit4]   2> 12302 T1419 oazs.NIOServerCnxn.closeSock Closed socket connection for client /140.211.11.196:28206 which had sessionid 0x13bd5844993000b
[junit4:junit4]   2> 12302 T1417 oaz.ZooKeeper.close Session: 0x13bd5844993000b closed
[junit4:junit4]   2> 12303 T1417 oascsi.HttpClientUtil.createClient Creating new http client, config:maxConnections=500&maxConnectionsPerHost=16&socketTimeout=15000&connTimeout=30000
[junit4:junit4]   2> 12314 T1417 oaz.ZooKeeper.<init> Initiating client connection, connectString=127.0.0.1:28188/solr sessionTimeout=30000 watcher=org.apache.solr.common.cloud.ConnectionManager@21318f4f
[junit4:junit4]   2> 12315 T1503 oaz.ClientCnxn$SendThread.logStartConnect Opening socket connection to server localhost/127.0.0.1:28188. Will not attempt to authenticate using SASL (access denied ("javax.security.auth.AuthPermission" "getLoginConfiguration"))
[junit4:junit4]   2> 12315 T1417 oascc.ConnectionManager.waitForConnected Waiting for client to connect to ZooKeeper
[junit4:junit4]   2> 12316 T1503 oaz.ClientCnxn$SendThread.primeConnection Socket connection established to localhost/127.0.0.1:28188, initiating session
[junit4:junit4]   2> 12316 T1419 oazs.NIOServerCnxnFactory.run Accepted socket connection from /140.211.11.196:28207
[junit4:junit4]   2> 12317 T1419 oazs.ZooKeeperServer.processConnectRequest Client attempting to establish new session at /140.211.11.196:28207
[junit4:junit4]   2> 12318 T1421 oazs.ZooKeeperServer.finishSessionInit Established session 0x13bd5844993000c with negotiated timeout 20000 for client /140.211.11.196:28207
[junit4:junit4]   2> 12318 T1503 oaz.ClientCnxn$SendThread.onConnected Session establishment complete on server localhost/127.0.0.1:28188, sessionid = 0x13bd5844993000c, negotiated timeout = 20000
[junit4:junit4]   2> 12318 T1504 oascc.ConnectionManager.process Watcher org.apache.solr.common.cloud.ConnectionManager@21318f4f name:ZooKeeperConnection Watcher:127.0.0.1:28188/solr got event WatchedEvent state:SyncConnected type:None path:null path:null type:None
[junit4:junit4]   2> 12318 T1417 oascc.ConnectionManager.waitForConnected Client is connected to ZooKeeper
[junit4:junit4]   2> 12320 T1422 oazs.PrepRequestProcessor.pRequest Got user-level KeeperException when processing sessionid:0x13bd5844993000c type:create cxid:0x1 zxid:0xa6 txntype:-1 reqpath:n/a Error Path:/solr/overseer Error:KeeperErrorCode = NodeExists for /solr/overseer
[junit4:junit4]   2> 12321 T1422 oazs.PrepRequestProcessor.pRequest Got user-level KeeperException when processing sessionid:0x13bd5844993000c type:create cxid:0x2 zxid:0xa7 txntype:-1 reqpath:n/a Error Path:/solr/overseer Error:KeeperErrorCode = NodeExists for /solr/overseer
[junit4:junit4]   2> 12322 T1417 oasc.ZkController.createEphemeralLiveNode Register node as live in ZooKeeper:/live_nodes/127.0.0.1:28205_
[junit4:junit4]   2> 12324 T1422 oazs.PrepRequestProcessor.pRequest Got user-level KeeperException when processing sessionid:0x13bd5844993000c type:delete cxid:0x4 zxid:0xa8 txntype:-1 reqpath:n/a Error Path:/solr/live_nodes/127.0.0.1:28205_ Error:KeeperErrorCode = NoNode for /solr/live_nodes/127.0.0.1:28205_
[junit4:junit4]   2> 12324 T1417 oascc.SolrZkClient.makePath makePath: /live_nodes/127.0.0.1:28205_
[junit4:junit4]   2> 12333 T1488 oascc.ZkStateReader$2.process A cluster state change: WatchedEvent state:SyncConnected type:NodeChildrenChanged path:/live_nodes, has occurred - updating... (live nodes size: 4)
[junit4:junit4]   2> 12333 T1458 oascc.ZkStateReader$2.process A cluster state change: WatchedEvent state:SyncConnected type:NodeChildrenChanged path:/live_nodes, has occurred - updating... (live nodes size: 4)
[junit4:junit4]   2> 12333 T1473 oascc.ZkStateReader$3.process Updating live nodes... (5)
[junit4:junit4]   2> 12333 T1445 oascc.ZkStateReader$3.process Updating live nodes... (5)
[junit4:junit4]   2> 12333 T1439 oascc.ZkStateReader$3.process Updating live nodes... (5)
[junit4:junit4]   2> 12334 T1473 oascc.ZkStateReader$2.process A cluster state change: WatchedEvent state:SyncConnected type:NodeChildrenChanged path:/live_nodes, has occurred - updating... (live nodes size: 5)
[junit4:junit4]   2> 12334 T1445 oascc.ZkStateReader$2.process A cluster state change: WatchedEvent state:SyncConnected type:NodeChildrenChanged path:/live_nodes, has occurred - updating... (live nodes size: 5)
[junit4:junit4]   2> 12334 T1439 oascc.ZkStateReader$2.process A cluster state change: WatchedEvent state:SyncConnected type:NodeChildrenChanged path:/live_nodes, has occurred - updating... (live nodes size: 5)
[junit4:junit4]   2> 12335 T1458 oascc.ZkStateReader$3.process Updating live nodes... (5)
[junit4:junit4]   2> 12335 T1488 oascc.ZkStateReader$3.process Updating live nodes... (5)
[junit4:junit4]   2> 12338 T1417 oascc.ZkStateReader.createClusterStateWatchersAndUpdate Updating cluster state from ZooKeeper... 
[junit4:junit4]   2> 12347 T1505 oasc.CoreContainer.create Creating SolrCore 'collection1' using instanceDir: /usr/home/hudson/hudson-slave/workspace/Lucene-Solr-Tests-trunk-java7/solr/build/solr-core/test/J1/./org.apache.solr.cloud.BasicDistributedZkTest-jetty4-1356496926795/collection1
[junit4:junit4]   2> 12348 T1505 oasc.ZkController.createCollectionZkNode Check for collection zkNode:collection1
[junit4:junit4]   2> 12349 T1505 oasc.ZkController.createCollectionZkNode Collection zkNode exists
[junit4:junit4]   2> 12349 T1505 oasc.ZkController.readConfigName Load collection config from:/collections/collection1
[junit4:junit4]   2> 12351 T1505 oasc.SolrResourceLoader.<init> new SolrResourceLoader for directory: '/usr/home/hudson/hudson-slave/workspace/Lucene-Solr-Tests-trunk-java7/solr/build/solr-core/test/J1/./org.apache.solr.cloud.BasicDistributedZkTest-jetty4-1356496926795/collection1/'
[junit4:junit4]   2> 12352 T1505 oasc.SolrResourceLoader.replaceClassLoader Adding 'file:/usr/home/hudson/hudson-slave/workspace/Lucene-Solr-Tests-trunk-java7/solr/build/solr-core/test/J1/org.apache.solr.cloud.BasicDistributedZkTest-jetty4-1356496926795/collection1/lib/README' to classloader
[junit4:junit4]   2> 12352 T1505 oasc.SolrResourceLoader.replaceClassLoader Adding 'file:/usr/home/hudson/hudson-slave/workspace/Lucene-Solr-Tests-trunk-java7/solr/build/solr-core/test/J1/org.apache.solr.cloud.BasicDistributedZkTest-jetty4-1356496926795/collection1/lib/classes/' to classloader
[junit4:junit4]   2> 12390 T1505 oasc.SolrConfig.<init> Using Lucene MatchVersion: LUCENE_50
[junit4:junit4]   2> 12439 T1505 oasc.SolrConfig.<init> Loaded SolrConfig: solrconfig.xml
[junit4:junit4]   2> 12540 T1505 oass.IndexSchema.readSchema Reading Solr Schema
[junit4:junit4]   2> 12547 T1505 oass.IndexSchema.readSchema Schema name=test
[junit4:junit4]   2> 13064 T1505 oass.OpenExchangeRatesOrgProvider.init Initialized with rates=open-exchange-rates.json, refreshInterval=1440.
[junit4:junit4]   2> 13073 T1505 oass.IndexSchema.readSchema default search field in schema is text
[junit4:junit4]   2> 13076 T1505 oass.IndexSchema.readSchema unique key field: id
[junit4:junit4]   2> 13092 T1505 oass.FileExchangeRateProvider.reload Reloading exchange rates from file currency.xml
[junit4:junit4]   2> 13096 T1505 oass.FileExchangeRateProvider.reload Reloading exchange rates from file currency.xml
[junit4:junit4]   2> 13100 T1505 oass.OpenExchangeRatesOrgProvider.reload Reloading exchange rates from open-exchange-rates.json
[junit4:junit4]   2> 13102 T1505 oass.OpenExchangeRatesOrgProvider.reload Reloading exchange rates from open-exchange-rates.json
[junit4:junit4]   2> 13103 T1505 oasc.SolrCore.<init> [collection1] Opening new SolrCore at /usr/home/hudson/hudson-slave/workspace/Lucene-Solr-Tests-trunk-java7/solr/build/solr-core/test/J1/./org.apache.solr.cloud.BasicDistributedZkTest-jetty4-1356496926795/collection1/, dataDir=./org.apache.solr.cloud.BasicDistributedZkTest-1356496914830/jetty4/
[junit4:junit4]   2> 13104 T1505 oasc.JmxMonitoredMap.<init> JMX monitoring is enabled. Adding Solr mbeans to JMX Server: com.sun.jmx.mbeanserver.JmxMBeanServer@25c5b6e
[junit4:junit4]   2> 13104 T1505 oasc.SolrCore.initDirectoryFactory solr.NRTCachingDirectoryFactory
[junit4:junit4]   2> 13105 T1505 oasc.CachingDirectoryFactory.get return new directory for /usr/home/hudson/hudson-slave/workspace/Lucene-Solr-Tests-trunk-java7/solr/build/solr-core/test/J1/./org.apache.solr.cloud.BasicDistributedZkTest-1356496914830/jetty4 forceNew:false
[junit4:junit4]   2> 13106 T1505 oasc.CachingDirectoryFactory.close Releasing directory:/usr/home/hudson/hudson-slave/workspace/Lucene-Solr-Tests-trunk-java7/solr/build/solr-core/test/J1/./org.apache.solr.cloud.BasicDistributedZkTest-1356496914830/jetty4
[junit4:junit4]   2> 13106 T1505 oasc.SolrCore.getNewIndexDir New index directory detected: old=null new=./org.apache.solr.cloud.BasicDistributedZkTest-1356496914830/jetty4/index/
[junit4:junit4]   2> 13107 T1505 oasc.SolrCore.initIndex WARNING [collection1] Solr index directory './org.apache.solr.cloud.BasicDistributedZkTest-1356496914830/jetty4/index' doesn't exist. Creating new index...
[junit4:junit4]   2> 13108 T1505 oasc.CachingDirectoryFactory.get return new directory for /usr/home/hudson/hudson-slave/workspace/Lucene-Solr-Tests-trunk-java7/solr/build/solr-core/test/J1/./org.apache.solr.cloud.BasicDistributedZkTest-1356496914830/jetty4/index forceNew:false
[junit4:junit4]   2> 13139 T1505 oasc.SolrDeletionPolicy.onCommit SolrDeletionPolicy.onCommit: commits:num=1
[junit4:junit4]   2> 		commit{dir=RateLimitedDirectoryWrapper(NRTCachingDirectory(org.apache.lucene.store.NIOFSDirectory@/usr/home/hudson/hudson-slave/workspace/Lucene-Solr-Tests-trunk-java7/solr/build/solr-core/test/J1/org.apache.solr.cloud.BasicDistributedZkTest-1356496914830/jetty4/index lockFactory=org.apache.lucene.store.NativeFSLockFactory@20604245; maxCacheMB=48.0 maxMergeSizeMB=4.0)),segFN=segments_1,generation=1,filenames=[segments_1]
[junit4:junit4]   2> 13139 T1505 oasc.SolrDeletionPolicy.updateCommits newest commit = 1[segments_1]
[junit4:junit4]   2> 13140 T1505 oasc.CachingDirectoryFactory.close Releasing directory:/usr/home/hudson/hudson-slave/workspace/Lucene-Solr-Tests-trunk-java7/solr/build/solr-core/test/J1/./org.apache.solr.cloud.BasicDistributedZkTest-1356496914830/jetty4/index
[junit4:junit4]   2> 13140 T1505 oasc.SolrCore.initWriters created xml: solr.XMLResponseWriter
[junit4:junit4]   2> 13142 T1505 oasup.UpdateRequestProcessorChain.init inserting DistributedUpdateProcessorFactory into updateRequestProcessorChain "dedupe"
[junit4:junit4]   2> 13142 T1505 oasup.UpdateRequestProcessorChain.init inserting DistributedUpdateProcessorFactory into updateRequestProcessorChain "dedupe-allfields"
[junit4:junit4]   2> 13143 T1505 oasup.UpdateRequestProcessorChain.init inserting DistributedUpdateProcessorFactory into updateRequestProcessorChain "stored_sig"
[junit4:junit4]   2> 13143 T1505 oasup.UpdateRequestProcessorChain.init inserting DistributedUpdateProcessorFactory into updateRequestProcessorChain "uniq-fields"
[junit4:junit4]   2> 13143 T1505 oasup.UpdateRequestProcessorChain.init inserting DistributedUpdateProcessorFactory into updateRequestProcessorChain "distrib-dup-test-chain-implicit"
[junit4:junit4]   2> 13144 T1505 oasc.RequestHandlers.initHandlersFromConfig adding lazy requestHandler: solr.ReplicationHandler
[junit4:junit4]   2> 13144 T1505 oasc.RequestHandlers.initHandlersFromConfig created /replication: solr.ReplicationHandler
[junit4:junit4]   2> 13145 T1505 oasc.RequestHandlers.initHandlersFromConfig created standard: solr.StandardRequestHandler
[junit4:junit4]   2> 13146 T1505 oasc.RequestHandlers.initHandlersFromConfig created /get: solr.RealTimeGetHandler
[junit4:junit4]   2> 13146 T1505 oasc.RequestHandlers.initHandlersFromConfig created dismax: solr.SearchHandler
[junit4:junit4]   2> 13147 T1505 oasc.RequestHandlers.initHandlersFromConfig created mock: org.apache.solr.core.MockQuerySenderListenerReqHandler
[junit4:junit4]   2> 13147 T1505 oasc.RequestHandlers.initHandlersFromConfig created /admin/: org.apache.solr.handler.admin.AdminHandlers
[junit4:junit4]   2> 13148 T1505 oasc.RequestHandlers.initHandlersFromConfig created defaults: solr.StandardRequestHandler
[junit4:junit4]   2> 13148 T1505 oasc.RequestHandlers.initHandlersFromConfig adding lazy requestHandler: solr.StandardRequestHandler
[junit4:junit4]   2> 13149 T1505 oasc.RequestHandlers.initHandlersFromConfig created lazy: solr.StandardRequestHandler
[junit4:junit4]   2> 13149 T1505 oasc.RequestHandlers.initHandlersFromConfig created /update: solr.UpdateRequestHandler
[junit4:junit4]   2> 13150 T1505 oasc.RequestHandlers.initHandlersFromConfig created /terms: org.apache.solr.handler.component.SearchHandler
[junit4:junit4]   2> 13151 T1505 oasc.RequestHandlers.initHandlersFromConfig created spellCheckCompRH: org.apache.solr.handler.component.SearchHandler
[junit4:junit4]   2> 13151 T1505 oasc.RequestHandlers.initHandlersFromConfig created spellCheckCompRH_Direct: org.apache.solr.handler.component.SearchHandler
[junit4:junit4]   2> 13152 T1505 oasc.RequestHandlers.initHandlersFromConfig created spellCheckWithWordbreak: org.apache.solr.handler.component.SearchHandler
[junit4:junit4]   2> 13153 T1505 oasc.RequestHandlers.initHandlersFromConfig created spellCheckWithWordbreak_Direct: org.apache.solr.handler.component.SearchHandler
[junit4:junit4]   2> 13154 T1505 oasc.RequestHandlers.initHandlersFromConfig created spellCheckCompRH1: org.apache.solr.handler.component.SearchHandler
[junit4:junit4]   2> 13154 T1505 oasc.RequestHandlers.initHandlersFromConfig created mltrh: org.apache.solr.handler.component.SearchHandler
[junit4:junit4]   2> 13155 T1505 oasc.RequestHandlers.initHandlersFromConfig created tvrh: org.apache.solr.handler.component.SearchHandler
[junit4:junit4]   2> 13156 T1505 oasc.RequestHandlers.initHandlersFromConfig created /mlt: solr.MoreLikeThisHandler
[junit4:junit4]   2> 13156 T1505 oasc.RequestHandlers.initHandlersFromConfig created /debug/dump: solr.DumpRequestHandler
[junit4:junit4]   2> 13166 T1505 oashl.XMLLoader.init xsltCacheLifetimeSeconds=60
[junit4:junit4]   2> 13170 T1505 oasc.SolrCore.initDeprecatedSupport WARNING solrconfig.xml uses deprecated <admin/gettableFiles>, Please update your config to use the ShowFileRequestHandler.
[junit4:junit4]   2> 13172 T1505 oasc.SolrCore.initDeprecatedSupport WARNING adding ShowFileRequestHandler with hidden files: [SCHEMA.XML, OLD_SYNONYMS.TXT, STOPWORDS.TXT, PROTWORDS.TXT, OPEN-EXCHANGE-RATES.JSON, SYNONYMS.TXT, CURRENCY.XML, MAPPING-ISOLATIN1ACCENT.TXT]
[junit4:junit4]   2> 13173 T1505 oasc.CachingDirectoryFactory.close Releasing directory:/usr/home/hudson/hudson-slave/workspace/Lucene-Solr-Tests-trunk-java7/solr/build/solr-core/test/J1/./org.apache.solr.cloud.BasicDistributedZkTest-1356496914830/jetty4
[junit4:junit4]   2> 13175 T1505 oass.SolrIndexSearcher.<init> Opening Searcher@2b3b26b main
[junit4:junit4]   2> 13176 T1505 oasu.CommitTracker.<init> Hard AutoCommit: disabled
[junit4:junit4]   2> 13176 T1505 oasu.CommitTracker.<init> Soft AutoCommit: disabled
[junit4:junit4]   2> 13177 T1505 oashc.SpellCheckComponent.inform Initializing spell checkers
[junit4:junit4]   2> 13182 T1505 oass.DirectSolrSpellChecker.init init: {name=direct,classname=DirectSolrSpellChecker,field=lowerfilt,minQueryLength=3}
[junit4:junit4]   2> 13231 T1506 oasc.SolrCore.registerSearcher [collection1] Registered new searcher Searcher@2b3b26b main{StandardDirectoryReader(segments_1:1)}
[junit4:junit4]   2> 13234 T1505 oasc.ZkController.publish publishing core=collection1 state=down
[junit4:junit4]   2> 13235 T1505 oasc.ZkController.publish numShards not found on descriptor - reading it from system property
[junit4:junit4]   2> 13288 T1440 oascc.ZkStateReader.updateClusterState Updating cloud state from ZooKeeper... 
[junit4:junit4]   2> 13289 T1440 oasc.Overseer$ClusterStateUpdater.updateState Update state numShards=2 message={
[junit4:junit4]   2> 	  "operation":"state",
[junit4:junit4]   2> 	  "numShards":"2",
[junit4:junit4]   2> 	  "shard":null,
[junit4:junit4]   2> 	  "roles":null,
[junit4:junit4]   2> 	  "state":"down",
[junit4:junit4]   2> 	  "core":"collection1",
[junit4:junit4]   2> 	  "collection":"collection1",
[junit4:junit4]   2> 	  "node_name":"127.0.0.1:28205_",
[junit4:junit4]   2> 	  "base_url":"http://127.0.0.1:28205"}
[junit4:junit4]   2> 13289 T1440 oasc.Overseer$ClusterStateUpdater.updateState Collection already exists with numShards=2
[junit4:junit4]   2> 13289 T1440 oasc.Overseer$ClusterStateUpdater.updateState Assigning new node to shard shard=shard2
[junit4:junit4]   2> 13294 T1439 oascc.ZkStateReader$2.process A cluster state change: WatchedEvent state:SyncConnected type:NodeDataChanged path:/clusterstate.json, has occurred - updating... (live nodes size: 5)
[junit4:junit4]   2> 13294 T1445 oascc.ZkStateReader$2.process A cluster state change: WatchedEvent state:SyncConnected type:NodeDataChanged path:/clusterstate.json, has occurred - updating... (live nodes size: 5)
[junit4:junit4]   2> 13294 T1488 oascc.ZkStateReader$2.process A cluster state change: WatchedEvent state:SyncConnected type:NodeDataChanged path:/clusterstate.json, has occurred - updating... (live nodes size: 5)
[junit4:junit4]   2> 13294 T1504 oascc.ZkStateReader$2.process A cluster state change: WatchedEvent state:SyncConnected type:NodeDataChanged path:/clusterstate.json, has occurred - updating... (live nodes size: 5)
[junit4:junit4]   2> 13294 T1473 oascc.ZkStateReader$2.process A cluster state change: WatchedEvent state:SyncConnected type:NodeDataChanged path:/clusterstate.json, has occurred - updating... (live nodes size: 5)
[junit4:junit4]   2> 13294 T1458 oascc.ZkStateReader$2.process A cluster state change: WatchedEvent state:SyncConnected type:NodeDataChanged path:/clusterstate.json, has occurred - updating... (live nodes size: 5)
[junit4:junit4]   2> 14237 T1505 oasc.CoreContainer.registerCore registering core: collection1
[junit4:junit4]   2> 14237 T1505 oasc.ZkController.register Register replica - core:collection1 address:http://127.0.0.1:28205 collection:collection1 shard:shard2
[junit4:junit4]   2> 14271 T1505 oasc.ZkController.register We are http://127.0.0.1:28205/collection1/ and leader is http://127.0.0.1:28198/collection1/
[junit4:junit4]   2> 14271 T1505 oasc.ZkController.register No LogReplay needed for core=collection1 baseURL=http://127.0.0.1:28205
[junit4:junit4]   2> 14271 T1505 oasc.ZkController.checkRecovery Core needs to recover:collection1
[junit4:junit4]   2> 14272 T1505 oasu.DefaultSolrCoreState.doRecovery Running recovery - first canceling any ongoing recovery
[junit4:junit4]   2> ASYNC  NEW_CORE C126 name=collection1 org.apache.solr.core.SolrCore@3635e52f url=http://127.0.0.1:28205/collection1 node=127.0.0.1:28205_ C126_STATE=coll:collection1 core:collection1 props:{shard=null, roles=null, state=down, core=collection1, collection=collection1, node_name=127.0.0.1:28205_, base_url=http://127.0.0.1:28205}
[junit4:junit4]   2> 14272 T1507 C126 P28205 oasc.RecoveryStrategy.run Starting recovery process.  core=collection1 recoveringAfterStartup=true
[junit4:junit4]   2> 14273 T1507 C126 P28205 oasc.RecoveryStrategy.doRecovery ###### startupVersions=[]
[junit4:junit4]   2> 14273 T1505 oascc.ZkStateReader.updateClusterState Updating cloud state from ZooKeeper... 
[junit4:junit4]   2> 14274 T1507 C126 P28205 oasc.ZkController.publish publishing core=collection1 state=recovering
[junit4:junit4]   2> 14274 T1507 C126 P28205 oasc.ZkController.publish numShards not found on descriptor - reading it from system property
[junit4:junit4]   2> 14276 T1507 C126 P28205 oascsi.HttpClientUtil.createClient Creating new http client, config:maxConnections=128&maxConnectionsPerHost=32&followRedirects=false
[junit4:junit4]   2> 14275 T1417 oass.SolrDispatchFilter.init user.dir=/usr/home/hudson/hudson-slave/workspace/Lucene-Solr-Tests-trunk-java7/solr/build/solr-core/test/J1
[junit4:junit4]   2> 14276 T1417 oass.SolrDispatchFilter.init SolrDispatchFilter.init() done
[junit4:junit4]   2> 14277 T1417 oascsi.HttpClientUtil.createClient Creating new http client, config:maxConnections=128&maxConnectionsPerHost=32&followRedirects=false
[junit4:junit4]   2> 14296 T1417 oascc.ZkStateReader.updateClusterState Updating cloud state from ZooKeeper... 
[junit4:junit4]   2> 14298 T1417 oasc.AbstractDistribZkTestBase.waitForRecoveriesToFinish Wait for recoveries to finish - collection: collection1 failOnTimeout:true timeout (sec):230
[junit4:junit4]   2> 14300 T1417 oascc.ZkStateReader.updateClusterState Updating cloud state from ZooKeeper... 
[junit4:junit4]   2> 14308 T1440 oascc.ZkStateReader.updateClusterState Updating cloud state from ZooKeeper... 
[junit4:junit4]   2> 14309 T1440 oasc.Overseer$ClusterStateUpdater.updateState Update state numShards=2 message={
[junit4:junit4]   2> 	  "operation":"state",
[junit4:junit4]   2> 	  "numShards":"2",
[junit4:junit4]   2> 	  "shard":"shard2",
[junit4:junit4]   2> 	  "roles":null,
[junit4:junit4]   2> 	  "state":"recovering",
[junit4:junit4]   2> 	  "core":"collection1",
[junit4:junit4]   2> 	  "collection":"collection1",
[junit4:junit4]   2> 	  "node_name":"127.0.0.1:28205_",
[junit4:junit4]   2> 	  "base_url":"http://127.0.0.1:28205"}
[junit4:junit4]   2> 14321 T1458 oascc.ZkStateReader$2.process A cluster state change: WatchedEvent state:SyncConnected type:NodeDataChanged path:/clusterstate.json, has occurred - updating... (live nodes size: 5)
[junit4:junit4]   2> 14321 T1445 oascc.ZkStateReader$2.process A cluster state change: WatchedEvent state:SyncConnected type:NodeDataChanged path:/clusterstate.json, has occurred - updating... (live nodes size: 5)
[junit4:junit4]   2> 14322 T1488 oascc.ZkStateReader$2.process A cluster state change: WatchedEvent state:SyncConnected type:NodeDataChanged path:/clusterstate.json, has occurred - updating... (live nodes size: 5)
[junit4:junit4]   2> 14322 T1473 oascc.ZkStateReader$2.process A cluster state change: WatchedEvent state:SyncConnected type:NodeDataChanged path:/clusterstate.json, has occurred - updating... (live nodes size: 5)
[junit4:junit4]   2> 14321 T1504 oascc.ZkStateReader$2.process A cluster state change: WatchedEvent state:SyncConnected type:NodeDataChanged path:/clusterstate.json, has occurred - updating... (live nodes size: 5)
[junit4:junit4]   2> 14321 T1439 oascc.ZkStateReader$2.process A cluster state change: WatchedEvent state:SyncConnected type:NodeDataChanged path:/clusterstate.json, has occurred - updating... (live nodes size: 5)
[junit4:junit4]   2>  C125_STATE=coll:collection1 core:collection1 props:{shard=shard1, roles=null, state=recovering, core=collection1, collection=collection1, node_name=127.0.0.1:28201_, base_url=http://127.0.0.1:28201}
[junit4:junit4]   2> 14977 T1491 C125 P28201 oasc.RecoveryStrategy.doRecovery Attempting to PeerSync from http://127.0.0.1:28195/collection1/ core=collection1 - recoveringAfterStartup=true
[junit4:junit4]   2> 14977 T1491 C125 P28201 oasu.PeerSync.sync PeerSync: core=collection1 url=http://127.0.0.1:28201 START replicas=[http://127.0.0.1:28195/collection1/] nUpdates=100
[junit4:junit4]   2> 14978 T1491 C125 P28201 oasu.PeerSync.sync WARNING no frame of reference to tell of we've missed updates
[junit4:junit4]   2> 14979 T1491 C125 P28201 oasc.RecoveryStrategy.doRecovery PeerSync Recovery was not successful - trying replication. core=collection1
[junit4:junit4]   2> 14979 T1491 C125 P28201 oasc.RecoveryStrategy.doRecovery Starting Replication Recovery. core=collection1
[junit4:junit4]   2> 14979 T1491 C125 P28201 oasc.RecoveryStrategy.doRecovery Begin buffering updates. core=collection1
[junit4:junit4]   2> 14980 T1491 C125 P28201 oasu.UpdateLog.bufferUpdates Starting to buffer updates. FSUpdateLog{state=ACTIVE, tlog=null}
[junit4:junit4]   2> 14980 T1491 C125 P28201 oasc.RecoveryStrategy.replicate Attempting to replicate from http://127.0.0.1:28195/collection1/. core=collection1
[junit4:junit4]   2> 14980 T1491 C125 P28201 oascsi.HttpClientUtil.createClient Creating new http client, config:maxConnections=128&maxConnectionsPerHost=32&followRedirects=false
[junit4:junit4]   2> ASYNC  NEW_CORE C127 name=collection1 org.apache.solr.core.SolrCore@c1ce752 url=http://127.0.0.1:28195/collection1 node=127.0.0.1:28195_ C127_STATE=coll:collection1 core:collection1 props:{shard=shard1, roles=null, state=active, core=collection1, collection=collection1, node_name=127.0.0.1:28195_, base_url=http://127.0.0.1:28195, leader=true}
[junit4:junit4]   2> 14986 T1449 C127 P28195 REQ /get {distrib=false&qt=/get&wt=javabin&version=2&getVersions=100} status=0 QTime=0 
[junit4:junit4]   2> 14991 T1450 C127 P28195 oasu.DirectUpdateHandler2.commit start commit{flags=0,_version_=0,optimize=false,openSearcher=false,waitSearcher=true,expungeDeletes=false,softCommit=false}
[junit4:junit4]   2> 14993 T1450 C127 P28195 oasc.CachingDirectoryFactory.close Releasing directory:/usr/home/hudson/hudson-slave/workspace/Lucene-Solr-Tests-trunk-java7/solr/build/solr-core/test/J1/./org.apache.solr.cloud.BasicDistributedZkTest-1356496914830/jetty1
[junit4:junit4]   2> 14998 T1450 C127 P28195 oasc.SolrDeletionPolicy.onInit SolrDeletionPolicy.onInit: commits:num=1
[junit4:junit4]   2> 		commit{dir=RateLimitedDirectoryWrapper(NRTCachingDirectory(org.apache.lucene.store.NIOFSDirectory@/usr/home/hudson/hudson-slave/workspace/Lucene-Solr-Tests-trunk-java7/solr/build/solr-core/test/J1/org.apache.solr.cloud.BasicDistributedZkTest-1356496914830/jetty1/index lockFactory=org.apache.lucene.store.NativeFSLockFactory@9627d6f; maxCacheMB=48.0 maxMergeSizeMB=4.0)),segFN=segments_1,generation=1,filenames=[segments_1]
[junit4:junit4]   2> 14999 T1450 C127 P28195 oasc.SolrDeletionPolicy.updateCommits newest commit = 1[segments_1]
[junit4:junit4]   2> 15010 T1450 C127 P28195 oasc.SolrDeletionPolicy.onCommit SolrDeletionPolicy.onCommit: commits:num=2
[junit4:junit4]   2> 		commit{dir=RateLimitedDirectoryWrapper(NRTCachingDirectory(org.apache.lucene.store.NIOFSDirectory@/usr/home/hudson/hudson-slave/workspace/Lucene-Solr-Tests-trunk-java7/solr/build/solr-core/test/J1/org.apache.solr.cloud.BasicDistributedZkTest-1356496914830/jetty1/index lockFactory=org.apache.lucene.store.NativeFSLockFactory@9627d6f; maxCacheMB=48.0 maxMergeSizeMB=4.0)),segFN=segments_1,generation=1,filenames=[segments_1]
[junit4:junit4]   2> 		commit{dir=RateLimitedDirectoryWrapper(NRTCachingDirectory(org.apache.lucene.store.NIOFSDirectory@/usr/home/hudson/hudson-slave/workspace/Lucene-Solr-Tests-trunk-java7/solr/build/solr-core/test/J1/org.apache.solr.cloud.BasicDistributedZkTest-1356496914830/jetty1/index lockFactory=org.apache.lucene.store.NativeFSLockFactory@9627d6f; maxCacheMB=48.0 maxMergeSizeMB=4.0)),segFN=segments_2,generation=2,filenames=[segments_2]
[junit4:junit4]   2> 15011 T1450 C127 P28195 oasc.SolrDeletionPolicy.updateCommits newest commit = 2[segments_2]
[junit4:junit4]   2> 15012 T1450 C127 P28195 oasc.CachingDirectoryFactory.close Releasing directory:/usr/home/hudson/hudson-slave/workspace/Lucene-Solr-Tests-trunk-java7/solr/build/solr-core/test/J1/./org.apache.solr.cloud.BasicDistributedZkTest-1356496914830/jetty1
[junit4:junit4]   2> 15013 T1450 C127 P28195 oass.SolrIndexSearcher.<init> Opening Searcher@7fbfdadf realtime
[junit4:junit4]   2> 15013 T1450 C127 P28195 oasu.DirectUpdateHandler2.commit end_commit_flush
[junit4:junit4]   2> 15014 T1450 C127 P28195 /update {waitSearcher=true&openSearcher=false&commit=true&commit_end_point=true&wt=javabin&softCommit=false&version=2} {commit=} 0 23
[junit4:junit4]   2> 15015 T1491 C125 P28201 oash.ReplicationHandler.inform Commits will be reserved for  10000
[junit4:junit4]   2> 15016 T1491 C125 P28201 oash.SnapPuller.<init>  No value set for 'pollInterval'. Timer Task not started.
[junit4:junit4]   2> 15019 T1451 C127 P28195 oash.ReplicationHandler.inform Commits will be reserved for  10000
[junit4:junit4]   2> 15019 T1451 C127 P28195 REQ /replication {command=indexversion&wt=javabin&qt=/replication&version=2} status=0 QTime=2 
[junit4:junit4]   2> 15020 T1491 C125 P28201 oash.SnapPuller.fetchLatestIndex Master's generation: 2
[junit4:junit4]   2> 15020 T1491 C125 P28201 oash.SnapPuller.fetchLatestIndex Slave's generation: 1
[junit4:junit4]   2> 15020 T1491 C125 P28201 oash.SnapPuller.fetchLatestIndex Starting replication process
[junit4:junit4]   2> 15023 T1451 C127 P28195 oasc.CachingDirectoryFactory.close Releasing directory:/usr/home/hudson/hudson-slave/workspace/Lucene-Solr-Tests-trunk-java7/solr/build/solr-core/test/J1/./org.apache.solr.cloud.BasicDistributedZkTest-1356496914830/jetty1
[junit4:junit4]   2> 15024 T1451 C127 P28195 oasc.CachingDirectoryFactory.close Releasing directory:/usr/home/hudson/hudson-slave/workspace/Lucene-Solr-Tests-trunk-java7/solr/build/solr-core/test/J1/./org.apache.solr.cloud.BasicDistributedZkTest-1356496914830/jetty1/index
[junit4:junit4]   2> 15024 T1451 C127 P28195 REQ /replication {command=filelist&generation=2&wt=javabin&qt=/replication&version=2} status=0 QTime=1 
[junit4:junit4]   2> 15025 T1491 C125 P28201 oash.SnapPuller.fetchLatestIndex Number of files in latest index in master: 1
[junit4:junit4]   2> 15026 T1491 C125 P28201 oasc.CachingDirectoryFactory.get return new directory for /usr/home/hudson/hudson-slave/workspace/Lucene-Solr-Tests-trunk-java7/solr/build/solr-core/test/J1/./org.apache.solr.cloud.BasicDistributedZkTest-1356496914830/jetty3/index.20121225214209848 forceNew:false
[junit4:junit4]   2> 15027 T1491 C125 P28201 oasc.CachingDirectoryFactory.close Releasing directory:/usr/home/hudson/hudson-slave/workspace/Lucene-Solr-Tests-trunk-java7/solr/build/solr-core/test/J1/./org.apache.solr.cloud.BasicDistributedZkTest-1356496914830/jetty3
[junit4:junit4]   2> 15028 T1491 C125 P28201 oash.SnapPuller.fetchLatestIndex Starting download to RateLimitedDirectoryWrapper(NRTCachingDirectory(org.apache.lucene.store.NIOFSDirectory@/usr/home/hudson/hudson-slave/workspace/Lucene-Solr-Tests-trunk-java7/solr/build/solr-core/test/J1/org.apache.solr.cloud.BasicDistributedZkTest-1356496914830/jetty3/index.20121225214209848 lockFactory=org.apache.lucene.store.NativeFSLockFactory@265edaf9; maxCacheMB=48.0 maxMergeSizeMB=4.0)) fullCopy=true
[junit4:junit4]   2> 15031 T1451 C127 P28195 REQ /replication {file=segments_2&command=filecontent&checksum=true&generation=2&qt=/replication&wt=filestream} status=0 QTime=0 
[junit4:junit4]   2> 15033 T1491 C125 P28201 oasc.CachingDirectoryFactory.close Releasing directory:/usr/home/hudson/hudson-slave/workspace/Lucene-Solr-Tests-trunk-java7/solr/build/solr-core/test/J1/./org.apache.solr.cloud.BasicDistributedZkTest-1356496914830/jetty3/index
[junit4:junit4]   2> 15033 T1491 C125 P28201 oash.SnapPuller.fetchLatestIndex Total time taken for download : 0 secs
[junit4:junit4]   2> 15034 T1491 C125 P28201 oash.SnapPuller.modifyIndexProps New index installed. Updating index properties... index=index.20121225214209848
[junit4:junit4]   2> 15035 T1491 C125 P28201 oasc.CachingDirectoryFactory.close Releasing directory:/usr/home/hudson/hudson-slave/workspace/Lucene-Solr-Tests-trunk-java7/solr/build/solr-core/test/J1/./org.apache.solr.cloud.BasicDistributedZkTest-1356496914830/jetty3
[junit4:junit4]   2> 15035 T1491 C125 P28201 oasc.CachingDirectoryFactory.close Releasing directory:/usr/home/hudson/hudson-slave/workspace/Lucene-Solr-Tests-trunk-java7/solr/build/solr-core/test/J1/./org.apache.solr.cloud.BasicDistributedZkTest-1356496914830/jetty3
[junit4:junit4]   2> 15035 T1491 C125 P28201 oasc.SolrCore.getNewIndexDir New index directory detected: old=./org.apache.solr.cloud.BasicDistributedZkTest-1356496914830/jetty3/index/ new=./org.apache.solr.cloud.BasicDistributedZkTest-1356496914830/jetty3/index.20121225214209848
[junit4:junit4]   2> 15038 T1491 C125 P28201 oasc.SolrDeletionPolicy.onInit SolrDeletionPolicy.onInit: commits:num=1
[junit4:junit4]   2> 		commit{dir=RateLimitedDirectoryWrapper(NRTCachingDirectory(org.apache.lucene.store.NIOFSDirectory@/usr/home/hudson/hudson-slave/workspace/Lucene-Solr-Tests-trunk-java7/solr/build/solr-core/test/J1/org.apache.solr.cloud.BasicDistributedZkTest-1356496914830/jetty3/index.20121225214209848 lockFactory=org.apache.lucene.store.NativeFSLockFactory@265edaf9; maxCacheMB=48.0 maxMergeSizeMB=4.0)),segFN=segments_2,generation=2,filenames=[segments_2]
[junit4:junit4]   2> 15039 T1491 C125 P28201 oasc.SolrDeletionPolicy.updateCommits newest commit = 2[segments_2]
[junit4:junit4]   2> 15040 T1491 C125 P28201 oasc.CachingDirectoryFactory.close Releasing directory:/usr/home/hudson/hudson-slave/workspace/Lucene-Solr-Tests-trunk-java7/solr/build/solr-core/test/J1/./org.apache.solr.cloud.BasicDistributedZkTest-1356496914830/jetty3
[junit4:junit4]   2> 15040 T1491 C125 P28201 oasu.DefaultSolrCoreState.newIndexWriter Creating new IndexWriter...
[junit4:junit4]   2> 15040 T1491 C125 P28201 oasu.DefaultSolrCoreState.newIndexWriter Waiting until IndexWriter is unused... core=collection1
[junit4:junit4]   2> 15040 T1491 C125 P28201 oasu.DefaultSolrCoreState.newIndexWriter Rollback old IndexWriter... core=collection1
[junit4:junit4]   2> 15041 T1491 C125 P28201 oasc.CachingDirectoryFactory.close Releasing directory:/usr/home/hudson/hudson-slave/workspace/Lucene-Solr-Tests-trunk-java7/solr/build/solr-core/test/J1/./org.apache.solr.cloud.BasicDistributedZkTest-1356496914830/jetty3/index.20121225214209848
[junit4:junit4]   2> 15041 T1491 C125 P28201 oasc.CachingDirectoryFactory.close Releasing directory:/usr/home/hudson/hudson-slave/workspace/Lucene-Solr-Tests-trunk-java7/solr/build/solr-core/test/J1/./org.apache.solr.cloud.BasicDistributedZkTest-1356496914830/jetty3
[junit4:junit4]   2> 15044 T1491 C125 P28201 oasc.SolrDeletionPolicy.onInit SolrDeletionPolicy.onInit: commits:num=1
[junit4:junit4]   2> 		commit{dir=RateLimitedDirectoryWrapper(NRTCachingDirectory(org.apache.lucene.store.NIOFSDirectory@/usr/home/hudson/hudson-slave/workspace/Lucene-Solr-Tests-trunk-java7/solr/build/solr-core/test/J1/org.apache.solr.cloud.BasicDistributedZkTest-1356496914830/jetty3/index.20121225214209848 lockFactory=org.apache.lucene.store.NativeFSLockFactory@265edaf9; maxCacheMB=48.0 maxMergeSizeMB=4.0)),segFN=segments_2,generation=2,filenames=[segments_2]
[junit4:junit4]   2> 15045 T1491 C125 P28201 oasc.SolrDeletionPolicy.updateCommits newest commit = 2[segments_2]
[junit4:junit4]   2> 15045 T1491 C125 P28201 oasu.DefaultSolrCoreState.newIndexWriter New IndexWriter is ready to be used.
[junit4:junit4]   2> 15046 T1491 C125 P28201 oasc.CachingDirectoryFactory.close Releasing directory:/usr/home/hudson/hudson-slave/workspace/Lucene-Solr-Tests-trunk-java7/solr/build/solr-core/test/J1/./org.apache.solr.cloud.BasicDistributedZkTest-1356496914830/jetty3
[junit4:junit4]   2> 15046 T1491 C125 P28201 oass.SolrIndexSearcher.<init> Opening Searcher@6ccd7d18 main
[junit4:junit4]   2> 15049 T1490 oasc.SolrCore.registerSearcher [collection1] Registered new searcher Searcher@6ccd7d18 main{StandardDirectoryReader(segments_2:1:nrt)}
[junit4:junit4]   2> 15050 T1490 oasc.CachingDirectoryFactory.close Releasing directory:/usr/home/hudson/hudson-slave/workspace/Lucene-Solr-Tests-trunk-java7/solr/build/solr-core/test/J1/./org.apache.solr.cloud.BasicDistributedZkTest-1356496914830/jetty3/index
[junit4:junit4]   2> 15051 T1491 C125 P28201 oasu.DirectUpdateHandler2.commit start commit{flags=0,_version_=0,optimize=false,openSearcher=false,waitSearcher=false,expungeDeletes=false,softCommit=false}
[junit4:junit4]   2> 15055 T1491 C125 P28201 oasc.SolrDeletionPolicy.onCommit SolrDeletionPolicy.onCommit: commits:num=2
[junit4:junit4]   2> 		commit{dir=RateLimitedDirectoryWrapper(NRTCachingDirectory(org.apache.lucene.store.NIOFSDirectory@/usr/home/hudson/hudson-slave/workspace/Lucene-Solr-Tests-trunk-java7/solr/build/solr-core/test/J1/org.apache.solr.cloud.BasicDistributedZkTest-1356496914830/jetty3/index.20121225214209848 lockFactory=org.apache.lucene.store.NativeFSLockFactory@265edaf9; maxCacheMB=48.0 maxMergeSizeMB=4.0)),segFN=segments_2,generation=2,filenames=[segments_2]
[junit4:junit4]   2> 		commit{dir=RateLimitedDirectoryWrapper(NRTCachingDirectory(org.apache.lucene.store.NIOFSDirectory@/usr/home/hudson/hudson-slave/workspace/Lucene-Solr-Tests-trunk-java7/solr/build/solr-core/test/J1/org.apache.solr.cloud.BasicDistributedZkTest-1356496914830/jetty3/index.20121225214209848 lockFactory=org.apache.lucene.store.NativeFSLockFactory@265edaf9; maxCacheMB=48.0 maxMergeSizeMB=4.0)),segFN=segments_3,generation=3,filenames=[segments_3]
[junit4:junit4]   2> 15056 T1491 C125 P28201 oasc.SolrDeletionPolicy.updateCommits newest commit = 3[segments_3]
[junit4:junit4]   2> 15057 T1491 C125 P28201 oasc.CachingDirectoryFactory.close Releasing directory:/usr/home/hudson/hudson-slave/workspace/Lucene-Solr-Tests-trunk-java7/solr/build/solr-core/test/J1/./org.apache.solr.cloud.BasicDistributedZkTest-1356496914830/jetty3
[junit4:junit4]   2> 15058 T1491 C125 P28201 oasu.DirectUpdateHandler2.commit end_commit_flush
[junit4:junit4]   2> 15058 T1491 C125 P28201 oasc.CachingDirectoryFactory.close Releasing directory:/usr/home/hudson/hudson-slave/workspace/Lucene-Solr-Tests-trunk-java7/solr/build/solr-core/test/J1/./org.apache.solr.cloud.BasicDistributedZkTest-1356496914830/jetty3/index.20121225214209848
[junit4:junit4]   2> 15058 T1491 C125 P28201 oasc.CachingDirectoryFactory.close Releasing directory:/usr/home/hudson/hudson-slave/workspace/Lucene-Solr-Tests-trunk-java7/solr/build/solr-core/test/J1/./org.apache.solr.cloud.BasicDistributedZkTest-1356496914830/jetty3/index
[junit4:junit4]   2> 15058 T1491 C125 P28201 oasc.RecoveryStrategy.replay No replay needed. core=collection1
[junit4:junit4]   2> 15059 T1491 C125 P28201 oasc.RecoveryStrategy.doRecovery Replication Recovery was successful - registering as Active. core=collection1
[junit4:junit4]   2> 15059 T1491 C125 P28201 oasc.ZkController.publish publishing core=collection1 state=active
[junit4:junit4]   2> 15059 T1491 C125 P28201 oasc.ZkController.publish numShards not found on descriptor - reading it from system property
[junit4:junit4]   2> 15061 T1491 C125 P28201 oasc.RecoveryStrategy.doRecovery Finished recovery process. core=collection1
[junit4:junit4]   2> 15302 T1417 oascc.ZkStateReader.updateClusterState Updating cloud state from ZooKeeper... 
[junit4:junit4]   2> 15329 T1440 oascc.ZkStateReader.updateClusterState Updating cloud state from ZooKeeper... 
[junit4:junit4]   2> 15330 T1440 oasc.Overseer$ClusterStateUpdater.updateState Update state numShards=2 message={
[junit4:junit4]   2> 	  "operation":"state",
[junit4:junit4]   2> 	  "numShards":"2",
[junit4:junit4]   2> 	  "shard":"shard1",
[junit4:junit4]   2> 	  "roles":null,
[junit4:junit4]   2> 	  "state":"active",
[junit4:junit4]   2> 	  "core":"collection1",
[junit4:junit4]   2> 	  "collection":"collection1",
[junit4:junit4]   2> 	  "node_name":"127.0.0.1:28201_",
[junit4:junit4]   2> 	  "base_url":"http://127.0.0.1:28201"}
[junit4:junit4]   2> 15420 T1504 oascc.ZkStateReader$2.process A cluster state change: WatchedEvent state:SyncConnected type:NodeDataChanged path:/clusterstate.json, has occurred - updating... (live nodes size: 5)
[junit4:junit4]   2> 15420 T1445 oascc.ZkStateReader$2.process A cluster state change: WatchedEvent state:SyncConnected type:NodeDataChanged path:/clusterstate.json, has occurred - updating... (live nodes size: 5)
[junit4:junit4]   2> 15420 T1458 oascc.ZkStateReader$2.process A cluster state change: WatchedEvent state:SyncConnected type:NodeDataChanged path:/clusterstate.json, has occurred - updating... (live nodes size: 5)
[junit4:junit4]   2> 15420 T1439 oascc.ZkStateReader$2.process A cluster state change: WatchedEvent state:SyncConnected type:NodeDataChanged path:/clusterstate.json, has occurred - updating... (live nodes size: 5)
[junit4:junit4]   2> 15420 T1473 oascc.ZkStateReader$2.process A cluster state change: WatchedEvent state:SyncConnected type:NodeDataChanged path:/clusterstate.json, has occurred - updating... (live nodes size: 5)
[junit4:junit4]   2> 15420 T1488 oascc.ZkStateReader$2.process A cluster state change: WatchedEvent state:SyncConnected type:NodeDataChanged path:/clusterstate.json, has occurred - updating... (live nodes size: 5)
[junit4:junit4]   2> 16305 T1417 oascc.ZkStateReader.updateClusterState Updating cloud state from ZooKeeper... 
[junit4:junit4]   2>  C126_STATE=coll:collection1 core:collection1 props:{shard=shard2, roles=null, state=recovering, core=collection1, collection=collection1, node_name=127.0.0.1:28205_, base_url=http://127.0.0.1:28205}
[junit4:junit4]   2> 17299 T1507 C126 P28205 oasc.RecoveryStrategy.doRecovery Attempting to PeerSync from http://127.0.0.1:28198/collection1/ core=collection1 - recoveringAfterStartup=true
[junit4:junit4]   2> 17299 T1507 C126 P28205 oasu.PeerSync.sync PeerSync: core=collection1 url=http://127.0.0.1:28205 START replicas=[http://127.0.0.1:28198/collection1/] nUpdates=100
[junit4:junit4]   2> 17300 T1507 C126 P28205 oasu.PeerSync.sync WARNING no frame of reference to tell of we've missed updates
[junit4:junit4]   2> 17300 T1507 C126 P28205 oasc.RecoveryStrategy.doRecovery PeerSync Recovery was not successful - trying replication. core=collection1
[junit4:junit4]   2> 17300 T1507 C126 P28205 oasc.RecoveryStrategy.doRecovery Starting Replication Recovery. core=collection1
[junit4:junit4]   2> 17300 T1507 C126 P28205 oasc.RecoveryStrategy.doRecovery Begin buffering updates. core=collection1
[junit4:junit4]   2> 17301 T1507 C126 P28205 oasu.UpdateLog.bufferUpdates Starting to buffer updates. FSUpdateLog{state=ACTIVE, tlog=null}
[junit4:junit4]   2> 17301 T1507 C126 P28205 oasc.RecoveryStrategy.replicate Attempting to replicate from http://127.0.0.1:28198/collection1/. core=collection1
[junit4:junit4]   2> 17302 T1507 C126 P28205 oascsi.HttpClientUtil.createClient Creating new http client, config:maxConnections=128&maxConnectionsPerHost=32&followRedirects=false
[junit4:junit4]   2> ASYNC  NEW_CORE C128 name=collection1 org.apache.solr.core.SolrCore@158f6f79 url=http://127.0.0.1:28198/collection1 node=127.0.0.1:28198_ C128_STATE=coll:collection1 core:collection1 props:{shard=shard2, roles=null, state=active, core=collection1, collection=collection1, node_name=127.0.0.1:28198_, base_url=http://127.0.0.1:28198, leader=true}
[junit4:junit4]   2> 17307 T1464 C128 P28198 REQ /get {distrib=false&qt=/get&wt=javabin&version=2&getVersions=100} status=0 QTime=0 
[junit4:junit4]   2> 17308 T1417 oascc.ZkStateReader.updateClusterState Updating cloud state from ZooKeeper... 
[junit4:junit4]   2> 17317 T1465 C128 P28198 oasu.DirectUpdateHandler2.commit start commit{flags=0,_version_=0,optimize=false,openSearcher=false,waitSearcher=true,expungeDeletes=false,softCommit=false}
[junit4:junit4]   2> 17319 T1465 C128 P28198 oasc.CachingDirectoryFactory.close Releasing directory:/usr/home/hudson/hudson-slave/workspace/Lucene-Solr-Tests-trunk-java7/solr/build/solr-core/test/J1/./org.apache.solr.cloud.BasicDistributedZkTest-1356496914830/jetty2
[junit4:junit4]   2> 17324 T1465 C128 P28198 oasc.SolrDeletionPolicy.onInit SolrDeletionPolicy.onInit: commits:num=1
[junit4:junit4]   2> 		commit{dir=RateLimitedDirectoryWrapper(NRTCachingDirectory(org.apache.lucene.store.NIOFSDirectory@/usr/home/hudson/hudson-slave/workspace/Lucene-Solr-Tests-trunk-java7/solr/build/solr-core/test/J1/org.apache.solr.cloud.BasicDistributedZkTest-1356496914830/jetty2/index lockFactory=org.apache.lucene.store.NativeFSLockFactory@5b1bce3f; maxCacheMB=48.0 maxMergeSizeMB=4.0)),segFN=segments_1,generation=1,filenames=[segments_1]
[junit4:junit4]   2> 17325 T1465 C128 P28198 oasc.SolrDeletionPolicy.updateCommits newest commit = 1[segments_1]
[junit4:junit4]   2> 17329 T1465 C128 P28198 oasc.SolrDeletionPolicy.onCommit SolrDeletionPolicy.onCommit: commits:num=2
[junit4:junit4]   2> 		commit{dir=RateLimitedDirectoryWrapper(NRTCachingDirectory(org.apache.lucene.store.NIOFSDirectory@/usr/home/hudson/hudson-slave/workspace/Lucene-Solr-Tests-trunk-java7/solr/build/solr-core/test/J1/org.apache.solr.cloud.BasicDistributedZkTest-1356496914830/jetty2/index lockFactory=org.apache.lucene.store.NativeFSLockFactory@5b1bce3f; maxCacheMB=48.0 maxMergeSizeMB=4.0)),segFN=segments_1,generation=1,filenames=[segments_1]
[junit4:junit4]   2> 		commit{dir=RateLimitedDirectoryWrapper(NRTCachingDirectory(org.apache.lucene.store.NIOFSDirectory@/usr/home/hudson/hudson-slave/workspace/Lucene-Solr-Tests-trunk-java7/solr/build/solr-core/test/J1/org.apache.solr.cloud.BasicDistributedZkTest-1356496914830/jetty2/index lockFactory=org.apache.lucene.store.NativeFSLockFactory@5b1bce3f; maxCacheMB=48.0 maxMergeSizeMB=4.0)),segFN=segments_2,generation=2,filenames=[segments_2]
[junit4:junit4]   2> 17330 T1465 C128 P28198 oasc.SolrDeletionPolicy.updateCommits newest commit = 2[segments_2]
[junit4:junit4]   2> 17331 T1465 C128 P28198 oasc.CachingDirectoryFactory.close Releasing directory:/usr/home/hudson/hudson-slave/workspace/Lucene-Solr-Tests-trunk-java7/solr/build/solr-core/test/J1/./org.apache.solr.cloud.BasicDistributedZkTest-1356496914830/jetty2
[junit4:junit4]   2> 17332 T1465 C128 P28198 oass.SolrIndexSearcher.<init> Opening Searcher@2acb04e6 realtime
[junit4:junit4]   2> 17332 T1465 C128 P28198 oasu.DirectUpdateHandler2.commit end_commit_flush
[junit4:junit4]   2> 17333 T1465 C128 P28198 /update {waitSearcher=true&openSearcher=false&commit=true&commit_end_point=true&wt=javabin&softCommit=false&version=2} {commit=} 0 16
[junit4:junit4]   2> 17334 T1507 C126 P28205 oash.ReplicationHandler.inform Commits will be reserved for  10000
[junit4:junit4]   2> 17335 T1507 C126 P28205 oash.SnapPuller.<init>  No value set for 'pollInterval'. Timer Task not started.
[junit4:junit4]   2> 17337 T1466 C128 P28198 oash.ReplicationHandler.inform Commits will be reserved for  10000
[junit4:junit4]   2> 17337 T1466 C128 P28198 REQ /replication {command=indexversion&wt=javabin&qt=/replication&version=2} status=0 QTime=1 
[junit4:junit4]   2> 17338 T1507 C126 P28205 oash.SnapPuller.fetchLatestIndex Master's generation: 2
[junit4:junit4]   2> 17338 T1507 C126 P28205 oash.SnapPuller.fetchLatestIndex Slave's generation: 1
[junit4:junit4]   2> 17339 T1507 C126 P28205 oash.SnapPuller.fetchLatestIndex Starting replication process
[junit4:junit4]   2> 17341 T1466 C128 P28198 oasc.CachingDirectoryFactory.close Releasing directory:/usr/home/hudson/hudson-slave/workspace/Lucene-Solr-Tests-trunk-java7/solr/build/solr-core/test/J1/./org.apache.solr.cloud.BasicDistributedZkTest-1356496914830/jetty2
[junit4:junit4]   2> 17342 T1466 C128 P28198 oasc.CachingDirectoryFactory.close Releasing directory:/usr/home/hudson/hudson-slave/workspace/Lucene-Solr-Tests-trunk-java7/solr/build/solr-core/test/J1/./org.apache.solr.cloud.BasicDistributedZkTest-1356496914830/jetty2/index
[junit4:junit4]   2> 17342 T1466 C128 P28198 REQ /replication {command=filelist&generation=2&wt=javabin&qt=/replication&version=2} status=0 QTime=1 
[junit4:junit4]   2> 17343 T1507 C126 P28205 oash.SnapPuller.fetchLatestIndex Number of files in latest index in master: 1
[junit4:junit4]   2> 17344 T1507 C126 P28205 oasc.CachingDirectoryFactory.get return new directory for /usr/home/hudson/hudson-slave/workspace/Lucene-Solr-Tests-trunk-java7/solr/build/solr-core/test/J1/./org.apache.solr.cloud.BasicDistributedZkTest-1356496914830/jetty4/index.20121225214212167 forceNew:false
[junit4:junit4]   2> 17345 T1507 C126 P28205 oasc.CachingDirectoryFactory.close Releasing directory:/usr/home/hudson/hudson-slave/workspace/Lucene-Solr-Tests-trunk-java7/solr/build/solr-core/test/J1/./org.apache.solr.cloud.BasicDistributedZkTest-1356496914830/jetty4
[junit4:junit4]   2> 17346 T1507 C126 P28205 oash.SnapPuller.fetchLatestIndex Starting download to RateLimitedDirectoryWrapper(NRTCachingDirectory(org.apache.lucene.store.NIOFSDirectory@/usr/home/hudson/hudson-slave/workspace/Lucene-Solr-Tests-trunk-java7/solr/build/solr-core/test/J1/org.apache.solr.cloud.BasicDistributedZkTest-1356496914830/jetty4/index.20121225214212167 lockFactory=org.apache.lucene.store.NativeFSLockFactory@407ba54a; maxCacheMB=48.0 maxMergeSizeMB=4.0)) fullCopy=true
[junit4:junit4]   2> 17350 T1466 C128 P28198 REQ /replication {file=segments_2&command=filecontent&checksum=true&generation=2&qt=/replication&wt=filestream} status=0 QTime=0 
[junit4:junit4]   2> 17352 T1507 C126 P28205 oasc.CachingDirectoryFactory.close Releasing directory:/usr/home/hudson/hudson-slave/workspace/Lucene-Solr-Tests-trunk-java7/solr/build/solr-core/test/J1/./org.apache.solr.cloud.BasicDistributedZkTest-1356496914830/jetty4/index
[junit4:junit4]   2> 17352 T1507 C126 P28205 oash.SnapPuller.fetchLatestIndex Total time taken for download : 0 secs
[junit4:junit4]   2> 17353 T1507 C126 P28205 oash.SnapPuller.modifyIndexProps New index installed. Updating index properties... index=index.20121225214212167
[junit4:junit4]   2> 17354 T1507 C126 P28205 oasc.CachingDirectoryFactory.close Releasing directory:/usr/home/hudson/hudson-slave/workspace/Lucene-Solr-Tests-trunk-java7/solr/build/solr-core/test/J1/./org.apache.solr.cloud.BasicDistributedZkTest-1356496914830/jetty4
[junit4:junit4]   2> 17354 T1507 C126 P28205 oasc.CachingDirectoryFactory.close Releasing directory:/usr/home/hudson/hudson-slave/workspace/Lucene-Solr-Tests-trunk-java7/solr/build/solr-core/test/J1/./org.apache.solr.cloud.BasicDistributedZkTest-1356496914830/jetty4
[junit4:junit4]   2> 17354 T1507 C126 P28205 oasc.SolrCore.getNewIndexDir New index directory detected: old=./org.apache.solr.cloud.BasicDistributedZkTest-1356496914830/jetty4/index/ new=./org.apache.solr.cloud.BasicDistributedZkTest-1356496914830/jetty4/index.20121225214212167
[junit4:junit4]   2> 17357 T1507 C126 P28205 oasc.SolrDeletionPolicy.onInit SolrDeletionPolicy.onInit: commits:num=1
[junit4:junit4]   2> 		commit{dir=RateLimitedDirectoryWrapper(NRTCachingDirectory(org.apache.lucene.store.NIOFSDirectory@/usr/home/hudson/hudson-slave/workspace/Lucene-Solr-Tests-trunk-java7/solr/build/solr-core/test/J1/org.apache.solr.cloud.BasicDistributedZkTest-1356496914830/jetty4/index.20121225214212167 lockFactory=org.apache.lucene.store.NativeFSLockFactory@407ba54a; maxCacheMB=48.0 maxMergeSizeMB=4.0)),segFN=segments_2,generation=2,filenames=[segments_2]
[junit4:junit4]   2> 17358 T1507 C126 P28205 oasc.SolrDeletionPolicy.updateCommits newest commit = 2[segments_2]
[junit4:junit4]   2> 17359 T1507 C126 P28205 oasc.CachingDirectoryFactory.close Releasing directory:/usr/home/hudson/hudson-slave/workspace/Lucene-Solr-Tests-trunk-java7/solr/build/solr-core/test/J1/./org.apache.solr.cloud.BasicDistributedZkTest-1356496914830/jetty4
[junit4:junit4]   2> 17359 T1507 C126 P28205 oasu.DefaultSolrCoreState.newIndexWriter Creating new IndexWriter...
[junit4:junit4]   2> 17360 T1507 C126 P28205 oasu.DefaultSolrCoreState.newIndexWriter Waiting until IndexWriter is unused... core=collection1
[junit4:junit4]   2> 17360 T1507 C126 P28205 oasu.DefaultSolrCoreState.newIndexWriter Rollback old IndexWriter... core=collection1
[junit4:junit4]   2> 17360 T1507 C126 P28205 oasc.CachingDirectoryFactory.close Releasing directory:/usr/home/hudson/hudson-slave/workspace/Lucene-Solr-Tests-trunk-java7/solr/build/solr-core/test/J1/./org.apache.solr.cloud.BasicDistributedZkTest-1356496914830/jetty4/index.20121225214212167
[junit4:junit4]   2> 17361 T1507 C126 P28205 oasc.CachingDirectoryFactory.close Releasing directory:/usr/home/hudson/hudson-slave/workspace/Lucene-Solr-Tests-trunk-java7/solr/build/solr-core/test/J1/./org.apache.solr.cloud.BasicDistributedZkTest-1356496914830/jetty4
[junit4:junit4]   2> 17364 T1507 C126 P28205 oasc.SolrDeletionPolicy.onInit SolrDeletionPolicy.onInit: commits:num=1
[junit4:junit4]   2> 		commit{dir=RateLimitedDirectoryWrapper(NRTCachingDirectory(org.apache.lucene.store.NIOFSDirectory@/usr/home/hudson/hudson-slave/workspace/Lucene-Solr-Tests-trunk-java7/solr/build/solr-core/test/J1/org.apache.solr.cloud.BasicDistributedZkTest-1356496914830/jetty4/index.20121225214212167 lockFactory=org.apache.lucene.store.NativeFSLockFactory@407ba54a; maxCacheMB=48.0 maxMergeSizeMB=4.0)),segFN=segments_2,generation=2,filenames=[segments_2]
[junit4:junit4]   2> 17364 T1507 C126 P28205 oasc.SolrDeletionPolicy.updateCommits newest commit = 2[segments_2]
[junit4:junit4]   2> 17364 T1507 C126 P28205 oasu.DefaultSolrCoreState.newIndexWriter New IndexWriter is ready to be used.
[junit4:junit4]   2> 17365 T1507 C126 P28205 oasc.CachingDirectoryFactory.close Releasing directory:/usr/home/hudson/hudson-slave/workspace/Lucene-Solr-Tests-trunk-java7/solr/build/solr-core/test/J1/./org.apache.solr.cloud.BasicDistributedZkTest-1356496914830/jetty4
[junit4:junit4]   2> 17365 T1507 C126 P28205 oass.SolrIndexSearcher.<init> Opening Searcher@f76912b main
[junit4:junit4]   2> 17367 T1506 oasc.SolrCore.registerSearcher [collection1] Registered new searcher Searcher@f76912b main{StandardDirectoryReader(segments_2:1:nrt)}
[junit4:junit4]   2> 17368 T1506 oasc.CachingDirectoryFactory.close Releasing directory:/usr/home/hudson/hudson-slave/workspace/Lucene-Solr-Tests-trunk-java7/solr/build/solr-core/test/J1/./org.apache.solr.cloud.BasicDistributedZkTest-1356496914830/jetty4/index
[junit4:junit4]   2> 17368 T1507 C126 P28205 oasu.DirectUpdateHandler2.commit start commit{flags=0,_version_=0,optimize=false,openSearcher=false,waitSearcher=false,expungeDeletes=false,softCommit=false}
[junit4:junit4]   2> 17371 T1507 C126 P28205 oasc.SolrDeletionPolicy.onCommit SolrDeletionPolicy.onCommit: commits:num=2
[junit4:junit4]   2> 		commit{dir=RateLimitedDirectoryWrapper(NRTCachingDirectory(org.apache.lucene.store.NIOFSDirectory@/usr/home/hudson/hudson-slave/workspace/Lucene-Solr-Tests-trunk-java7/solr/build/solr-core/test/J1/org.apache.solr.cloud.BasicDistributedZkTest-1356496914830/jetty4/index.20121225214212167 lockFactory=org.apache.lucene.store.NativeFSLockFactory@407ba54a; maxCacheMB=48.0 maxMergeSizeMB=4.0)),segFN=segments_2,generation=2,filenames=[segments_2]
[junit4:junit4]   2> 		commit{dir=RateLimitedDirectoryWrapper(NRTCachingDirectory(org.apache.lucene.store.NIOFSDirectory@/usr/home/hudson/hudson-slave/workspace/Lucene-Solr-Tests-trunk-java7/solr/build/solr-core/test/J1/org.apache.solr.cloud.BasicDistributedZkTest-1356496914830/jetty4/index.20121225214212167 lockFactory=org.apache.lucene.store.NativeFSLockFactory@407ba54a; maxCacheMB=48.0 maxMergeSizeMB=4.0)),segFN=segments_3,generation=3,filenames=[segments_3]
[junit4:junit4]   2> 17371 T1507 C126 P28205 oasc.SolrDeletionPolicy.updateCommits newest commit = 3[segments_3]
[junit4:junit4]   2> 17372 T1507 C126 P28205 oasc.CachingDirectoryFactory.close Releasing directory:/usr/home/hudson/hudson-slave/workspace/Lucene-Solr-Tests-trunk-java7/solr/build/solr-core/test/J1/./org.apache.solr.cloud.BasicDistributedZkTest-1356496914830/jetty4
[junit4:junit4]   2> 17372 T1507 C126 P28205 oasu.DirectUpdateHandler2.commit end_commit_flush
[junit4:junit4]   2> 17372 T1507 C126 P28205 oasc.CachingDirectoryFactory.close Releasing directory:/usr/home/hudson/hudson-slave/workspace/Lucene-Solr-Tests-trunk-java7/solr/build/solr-core/test/J1/./org.apache.solr.cloud.BasicDistributedZkTest-1356496914830/jetty4/index.20121225214212167
[junit4:junit4]   2> 17373 T1507 C126 P28205 oasc.CachingDirectoryFactory.close Releasing directory:/usr/home/hudson/hudson-slave/workspace/Lucene-Solr-Tests-trunk-java7/solr/build/solr-core/test/J1/./org.apache.solr.cloud.BasicDistributedZkTest-1356496914830/jetty4/index
[junit4:junit4]   2> 17373 T1507 C126 P28205 oasc.RecoveryStrategy.replay No replay needed. core=collection1
[junit4:junit4]   2> 17373 T1507 C126 P28205 oasc.RecoveryStrategy.doRecovery Replication Recovery was successful - registering as Active. core=collection1
[junit4:junit4]   2> 17373 T1507 C126 P28205 oasc.ZkController.publish publishing core=collection1 state=active
[junit4:junit4]   2> 17373 T1507 C126 P28205 oasc.ZkController.publish numShards not found on descriptor - reading it from system property
[junit4:junit4]   2> 17386 T1507 C126 P28205 oasc.RecoveryStrategy.doRecovery Finished recovery process. core=collection1
[junit4:junit4]   2> 17432 T1440 oascc.ZkStateReader.updateClusterState Updating cloud state from ZooKeeper... 
[junit4:junit4]   2> 17433 T1440 oasc.Overseer$ClusterStateUpdater.updateState Update state numShards=2 message={
[junit4:junit4]   2> 	  "operation":"state",
[junit4:junit4]   2> 	  "numShards":"2",
[junit4:junit4]   2> 	  "shard":"shard2",
[junit4:junit4]   2> 	  "roles":null,
[junit4:junit4]   2> 	  "state":"active",
[junit4:junit4]   2> 	  "core":"collection1",
[junit4:junit4]   2> 	  "collection":"collection1",
[junit4:junit4]   2> 	  "node_name":"127.0.0.1:28205_",
[junit4:junit4]   2> 	  "base_url":"http://127.0.0.1:28205"}
[junit4:junit4]   2> 17445 T1458 oascc.ZkStateReader$2.process A cluster state change: WatchedEvent state:SyncConnected type:NodeDataChanged path:/clusterstate.json, has occurred - updating... (live nodes size: 5)
[junit4:junit4]   2> 17445 T1504 oascc.ZkStateReader$2.process A cluster state change: WatchedEvent state:SyncConnected type:NodeDataChanged path:/clusterstate.json, has occurred - updating... (live nodes size: 5)
[junit4:junit4]   2> 17445 T1473 oascc.ZkStateReader$2.process A cluster state change: WatchedEvent state:SyncConnected type:NodeDataChanged path:/clusterstate.json, has occurred - updating... (live nodes size: 5)
[junit4:junit4]   2> 17445 T1439 oascc.ZkStateReader$2.process A cluster state change: WatchedEvent state:SyncConnected type:NodeDataChanged path:/clusterstate.json, has occurred - updating... (live nodes size: 5)
[junit4:junit4]   2> 17445 T1445 oascc.ZkStateReader$2.process A cluster state change: WatchedEvent state:SyncConnected type:NodeDataChanged path:/clusterstate.json, has occurred - updating... (live nodes size: 5)
[junit4:junit4]   2> 17445 T1488 oascc.ZkStateReader$2.process A cluster state change: WatchedEvent state:SyncConnected type:NodeDataChanged path:/clusterstate.json, has occurred - updating... (live nodes size: 5)
[junit4:junit4]   2> 18312 T1417 oascc.ZkStateReader.updateClusterState Updating cloud state from ZooKeeper... 
[junit4:junit4]   2> 18314 T1417 oasc.AbstractDistribZkTestBase.waitForRecoveriesToFinish Recoveries finished - collection: collection1
[junit4:junit4]   2> ASYNC  NEW_CORE C129 name=collection1 org.apache.solr.core.SolrCore@517b578b url=http://127.0.0.1:28191/collection1 node=127.0.0.1:28191_ C129_STATE=coll:control_collection core:collection1 props:{shard=shard1, roles=null, state=active, core=collection1, collection=control_collection, node_name=127.0.0.1:28191_, base_url=http://127.0.0.1:28191, leader=true}
[junit4:junit4]   2> 18324 T1429 C129 P28191 oasc.CachingDirectoryFactory.close Releasing directory:/usr/home/hudson/hudson-slave/workspace/Lucene-Solr-Tests-trunk-java7/solr/build/solr-core/test/J1/./org.apache.solr.cloud.BasicDistributedZkTest-1356496914830/control/data
[junit4:junit4]   2> 18328 T1429 C129 P28191 oasc.SolrDeletionPolicy.onInit SolrDeletionPolicy.onInit: commits:num=1
[junit4:junit4]   2> 		commit{dir=RateLimitedDirectoryWrapper(NRTCachingDirectory(org.apache.lucene.store.NIOFSDirectory@/usr/home/hudson/hudson-slave/workspace/Lucene-Solr-Tests-trunk-java7/solr/build/solr-core/test/J1/org.apache.solr.cloud.BasicDistributedZkTest-1356496914830/control/data/index lockFactory=org.apache.lucene.store.NativeFSLockFactory@69d57ede; maxCacheMB=48.0 maxMergeSizeMB=4.0)),segFN=segments_1,generation=1,filenames=[segments_1]
[junit4:junit4]   2> 18328 T1429 C129 P28191 oasc.SolrDeletionPolicy.updateCommits newest commit = 1[segments_1]
[junit4:junit4]   2> 18329 T1429 C129 P28191 oasc.CachingDirectoryFactory.close Releasing directory:/usr/home/hudson/hudson-slave/workspace/Lucene-Solr-Tests-trunk-java7/solr/build/solr-core/test/J1/./org.apache.solr.cloud.BasicDistributedZkTest-1356496914830/control/data
[junit4:junit4]   2> 18330 T1429 C129 P28191 oass.SolrIndexSearcher.<init> Opening Searcher@bee6154 realtime
[junit4:junit4]   2> 18331 T1429 C129 P28191 /update {wt=javabin&version=2} {deleteByQuery=*:* (-1422390128169451520)} 0 9
[junit4:junit4]   2> 18334 T1452 C127 P28195 oasc.CachingDirectoryFactory.close Releasing directory:/usr/home/hudson/hudson-slave/workspace/Lucene-Solr-Tests-trunk-java7/solr/build/solr-core/test/J1/./org.apache.solr.cloud.BasicDistributedZkTest-1356496914830/jetty1
[junit4:junit4]   2> 18337 T1467 C128 P28198 oasc.CachingDirectoryFactory.close Releasing directory:/usr/home/hudson/hudson-slave/workspace/Lucene-Solr-Tests-trunk-java7/solr/build/solr-core/test/J1/./org.apache.solr.cloud.BasicDistributedZkTest-1356496914830/jetty2
[junit4:junit4]   2>  C125_STATE=coll:collection1 core:collection1 props:{shard=shard1, roles=null, state=active, core=collection1, collection=collection1, node_name=127.0.0.1:28201_, base_url=http://127.0.0.1:28201}
[junit4:junit4]   2> 18342 T1478 C125 P28201 oasc.CachingDirectoryFactory.close Releasing directory:/usr/home/hudson/hudso

[...truncated too long message...]

urrent.ThreadPoolExecutor.runWorker(ThreadPoolExecutor.java:1103)
[junit4:junit4]   2> 	        at java.util.concurrent.ThreadPoolExecutor$Worker.run(ThreadPoolExecutor.java:603)
[junit4:junit4]   2> 	        at java.lang.Thread.run(Thread.java:722)
[junit4:junit4]   2> 	  37) Thread[id=1635, name=qtp642712099-1635, state=RUNNABLE, group=TGRP-BasicDistributedZkTest]
[junit4:junit4]   2> 	        at java.net.SocketInputStream.socketRead0(Native Method)
[junit4:junit4]   2> 	        at java.net.SocketInputStream.read(SocketInputStream.java:150)
[junit4:junit4]   2> 	        at java.net.SocketInputStream.read(SocketInputStream.java:121)
[junit4:junit4]   2> 	        at org.eclipse.jetty.io.ByteArrayBuffer.readFrom(ByteArrayBuffer.java:375)
[junit4:junit4]   2> 	        at org.eclipse.jetty.io.bio.StreamEndPoint.fill(StreamEndPoint.java:141)
[junit4:junit4]   2> 	        at org.eclipse.jetty.server.bio.SocketConnector$ConnectorEndPoint.fill(SocketConnector.java:227)
[junit4:junit4]   2> 	        at org.eclipse.jetty.http.HttpParser.fill(HttpParser.java:1035)
[junit4:junit4]   2> 	        at org.eclipse.jetty.http.HttpParser.parseNext(HttpParser.java:280)
[junit4:junit4]   2> 	        at org.eclipse.jetty.http.HttpParser.parseAvailable(HttpParser.java:235)
[junit4:junit4]   2> 	        at org.eclipse.jetty.server.BlockingHttpConnection.handle(BlockingHttpConnection.java:72)
[junit4:junit4]   2> 	        at org.eclipse.jetty.server.bio.SocketConnector$ConnectorEndPoint.run(SocketConnector.java:264)
[junit4:junit4]   2> 	        at org.eclipse.jetty.util.thread.QueuedThreadPool.runJob(QueuedThreadPool.java:608)
[junit4:junit4]   2> 	        at org.eclipse.jetty.util.thread.QueuedThreadPool$3.run(QueuedThreadPool.java:543)
[junit4:junit4]   2> 	        at java.lang.Thread.run(Thread.java:722)
[junit4:junit4]   2> 	  38) Thread[id=1639, name=searcherExecutor-995-thread-1, state=WAITING, group=TGRP-BasicDistributedZkTest]
[junit4:junit4]   2> 	        at sun.misc.Unsafe.park(Native Method)
[junit4:junit4]   2> 	        at java.util.concurrent.locks.LockSupport.park(LockSupport.java:186)
[junit4:junit4]   2> 	        at java.util.concurrent.locks.AbstractQueuedSynchronizer$ConditionObject.await(AbstractQueuedSynchronizer.java:2043)
[junit4:junit4]   2> 	        at java.util.concurrent.LinkedBlockingQueue.take(LinkedBlockingQueue.java:442)
[junit4:junit4]   2> 	        at java.util.concurrent.ThreadPoolExecutor.getTask(ThreadPoolExecutor.java:1043)
[junit4:junit4]   2> 	        at java.util.concurrent.ThreadPoolExecutor.runWorker(ThreadPoolExecutor.java:1103)
[junit4:junit4]   2> 	        at java.util.concurrent.ThreadPoolExecutor$Worker.run(ThreadPoolExecutor.java:603)
[junit4:junit4]   2> 	        at java.lang.Thread.run(Thread.java:722)
[junit4:junit4]   2> 	  39) Thread[id=1640, name=searcherExecutor-996-thread-1, state=WAITING, group=TGRP-BasicDistributedZkTest]
[junit4:junit4]   2> 	        at sun.misc.Unsafe.park(Native Method)
[junit4:junit4]   2> 	        at java.util.concurrent.locks.LockSupport.park(LockSupport.java:186)
[junit4:junit4]   2> 	        at java.util.concurrent.locks.AbstractQueuedSynchronizer$ConditionObject.await(AbstractQueuedSynchronizer.java:2043)
[junit4:junit4]   2> 	        at java.util.concurrent.LinkedBlockingQueue.take(LinkedBlockingQueue.java:442)
[junit4:junit4]   2> 	        at java.util.concurrent.ThreadPoolExecutor.getTask(ThreadPoolExecutor.java:1043)
[junit4:junit4]   2> 	        at java.util.concurrent.ThreadPoolExecutor.runWorker(ThreadPoolExecutor.java:1103)
[junit4:junit4]   2> 	        at java.util.concurrent.ThreadPoolExecutor$Worker.run(ThreadPoolExecutor.java:603)
[junit4:junit4]   2> 	        at java.lang.Thread.run(Thread.java:722)
[junit4:junit4]   2> 	  40) Thread[id=1476, name=HashSessionScavenger-48, state=TIMED_WAITING, group=TGRP-BasicDistributedZkTest]
[junit4:junit4]   2> 	        at java.lang.Object.wait(Native Method)
[junit4:junit4]   2> 	        at java.util.TimerThread.mainLoop(Timer.java:552)
[junit4:junit4]   2> 	        at java.util.TimerThread.run(Timer.java:505)
[junit4:junit4]   2> 	  41) Thread[id=1427, name=HashSessionScavenger-45, state=TIMED_WAITING, group=TGRP-BasicDistributedZkTest]
[junit4:junit4]   2> 	        at java.lang.Object.wait(Native Method)
[junit4:junit4]   2> 	        at java.util.TimerThread.mainLoop(Timer.java:552)
[junit4:junit4]   2> 	        at java.util.TimerThread.run(Timer.java:505)
[junit4:junit4]   2> 	  42) Thread[id=1548, name=searcherExecutor-909-thread-1, state=WAITING, group=TGRP-BasicDistributedZkTest]
[junit4:junit4]   2> 	        at sun.misc.Unsafe.park(Native Method)
[junit4:junit4]   2> 	        at java.util.concurrent.locks.LockSupport.park(LockSupport.java:186)
[junit4:junit4]   2> 	        at java.util.concurrent.locks.AbstractQueuedSynchronizer$ConditionObject.await(AbstractQueuedSynchronizer.java:2043)
[junit4:junit4]   2> 	        at java.util.concurrent.LinkedBlockingQueue.take(LinkedBlockingQueue.java:442)
[junit4:junit4]   2> 	        at java.util.concurrent.ThreadPoolExecutor.getTask(ThreadPoolExecutor.java:1043)
[junit4:junit4]   2> 	        at java.util.concurrent.ThreadPoolExecutor.runWorker(ThreadPoolExecutor.java:1103)
[junit4:junit4]   2> 	        at java.util.concurrent.ThreadPoolExecutor$Worker.run(ThreadPoolExecutor.java:603)
[junit4:junit4]   2> 	        at java.lang.Thread.run(Thread.java:722)
[junit4:junit4]   2> NOTE: test params are: codec=Lucene41: {n_f1=MockFixedIntBlock(blockSize=1586), foo_b=Lucene41(blocksize=128), foo_d=PostingsFormat(name=Lucene41WithOrds), foo_f=Lucene41(blocksize=128), n_tl1=MockFixedIntBlock(blockSize=1586), n_d1=PostingsFormat(name=Memory doPackFST= true), rnd_b=PostingsFormat(name=Lucene41WithOrds), intDefault=PostingsFormat(name=Memory doPackFST= true), n_td1=MockFixedIntBlock(blockSize=1586), timestamp=PostingsFormat(name=Memory doPackFST= true), id=PostingsFormat(name=Lucene41WithOrds), range_facet_sl=Lucene41(blocksize=128), range_facet_si=MockFixedIntBlock(blockSize=1586), oddField_s=Lucene41(blocksize=128), multiDefault=MockFixedIntBlock(blockSize=1586), n_tf1=PostingsFormat(name=Memory doPackFST= true), n_dt1=MockFixedIntBlock(blockSize=1586), n_ti1=PostingsFormat(name=Lucene41WithOrds), range_facet_l=PostingsFormat(name=Memory doPackFST= true), text=Lucene41(blocksize=128), _version_=PostingsFormat(name=Memory doPackFST= true), SubjectTerms_mfacet=PostingsFormat(name=Memory doPackFST= true), a_t=PostingsFormat(name=Memory doPackFST= true), n_tdt1=PostingsFormat(name=Memory doPackFST= true), other_tl1=PostingsFormat(name=Memory doPackFST= true), n_l1=PostingsFormat(name=Memory doPackFST= true), a_si=MockFixedIntBlock(blockSize=1586)}, sim=RandomSimilarityProvider(queryNorm=false,coord=no): {}, locale=tr, timezone=America/Chihuahua
[junit4:junit4]   2> NOTE: FreeBSD 9.0-RELEASE amd64/Oracle Corporation 1.7.0_09 (64-bit)/cpus=16,threads=45,free=183065904,total=536870912
[junit4:junit4]   2> NOTE: All tests run in this JVM: [TestReload, FullSolrCloudDistribCmdsTest, TestPhraseSuggestions, TestMultiCoreConfBootstrap, TestDistributedGrouping, ConvertedLegacyTest, TestUtils, IndexSchemaRuntimeFieldTest, LukeRequestHandlerTest, SchemaVersionSpecificBehaviorTest, PrimUtilsTest, TestStressVersions, EchoParamsTest, UpdateParamsTest, TestWriterPerf, TestJmxIntegration, FieldMutatingUpdateProcessorTest, TestHashPartitioner, TestLazyCores, DocumentBuilderTest, DirectUpdateHandlerTest, UUIDFieldTest, TestSolrDeletionPolicy2, SignatureUpdateProcessorFactoryTest, TestSolrXMLSerializer, TestStressReorder, DisMaxRequestHandlerTest, TestCSVLoader, OutputWriterTest, DistributedQueryElevationComponentTest, ZkCLITest, BasicZkTest, StatsComponentTest, TestReplicationHandler, PeerSyncTest, TestCodecSupport, MultiTermTest, CoreContainerCoreInitFailuresTest, PolyFieldTest, FileUtilsTest, TestSort, DebugComponentTest, TestAtomicUpdateErrorCases, TestOmitPositions, TestBM25SimilarityFactory, TestArbitraryIndexDir, PingRequestHandlerTest, TestBinaryField, ExternalFileFieldSortTest, SuggesterTest, ReturnFieldsTest, QueryParsingTest, TestSurroundQueryParser, TestValueSourceCache, RecoveryZkTest, TestRealTimeGet, TestPropInject, TestMergePolicyConfig, BasicDistributedZkTest]
[junit4:junit4]   2> NOTE: reproduce with: ant test  -Dtestcase=BasicDistributedZkTest -Dtests.seed=C714D129BCBD2EDE -Dtests.multiplier=3 -Dtests.slow=true -Dtests.locale=tr -Dtests.timezone=America/Chihuahua -Dtests.file.encoding=US-ASCII
[junit4:junit4] ERROR   0.00s J1 | BasicDistributedZkTest (suite) <<<
[junit4:junit4]    > Throwable #1: java.lang.Exception: Suite timeout exceeded (>= 7200000 msec).
[junit4:junit4]    > 	at __randomizedtesting.SeedInfo.seed([C714D129BCBD2EDE]:0)
[junit4:junit4] Completed on J1 in 7224.79s, 1 test, 2 errors <<< FAILURES!

[...truncated 11 lines...]
BUILD FAILED
/usr/home/hudson/hudson-slave/workspace/Lucene-Solr-Tests-trunk-java7/build.xml:353: The following error occurred while executing this line:
/usr/home/hudson/hudson-slave/workspace/Lucene-Solr-Tests-trunk-java7/build.xml:39: The following error occurred while executing this line:
/usr/home/hudson/hudson-slave/workspace/Lucene-Solr-Tests-trunk-java7/solr/build.xml:178: The following error occurred while executing this line:
/usr/home/hudson/hudson-slave/workspace/Lucene-Solr-Tests-trunk-java7/solr/common-build.xml:438: The following error occurred while executing this line:
/usr/home/hudson/hudson-slave/workspace/Lucene-Solr-Tests-trunk-java7/lucene/common-build.xml:1176: The following error occurred while executing this line:
/usr/home/hudson/hudson-slave/workspace/Lucene-Solr-Tests-trunk-java7/lucene/common-build.xml:841: There were test failures: 243 suites, 1009 tests, 1 suite-level error, 1 error, 21 ignored (3 assumptions)

Total time: 147 minutes 34 seconds
Build step 'Invoke Ant' marked build as failure
Archiving artifacts
Recording test results
Email was triggered for: Failure
Sending email for trigger: Failure



Mime
View raw message