lucene-dev mailing list archives

Site index · List index
Message view « Date » · « Thread »
Top « Date » · « Thread »
From Policeman Jenkins Server <jenk...@sd-datasolutions.de>
Subject [JENKINS] Lucene-Solr-4.x-Linux (32bit/jrockit-jdk1.6.0_33-R28.2.4-4.1.0) - Build # 3183 - Still Failing!
Date Wed, 12 Dec 2012 13:43:36 GMT
Build: http://jenkins.sd-datasolutions.de/job/Lucene-Solr-4.x-Linux/3183/
Java: 32bit/jrockit-jdk1.6.0_33-R28.2.4-4.1.0 -XnoOpt

2 tests failed.
FAILED:  org.apache.solr.cloud.BasicDistributedZk2Test.testDistribSearch

Error Message:
There are still nodes recoverying - waited for 540 seconds

Stack Trace:
java.lang.AssertionError: There are still nodes recoverying - waited for 540 seconds
	at __randomizedtesting.SeedInfo.seed([7A742FE34F0A21F3:FB92A1FB385541CF]:0)
	at org.junit.Assert.fail(Assert.java:93)
	at org.apache.solr.cloud.AbstractDistribZkTestBase.waitForRecoveriesToFinish(AbstractDistribZkTestBase.java:165)
	at org.apache.solr.cloud.AbstractDistribZkTestBase.waitForRecoveriesToFinish(AbstractDistribZkTestBase.java:115)
	at org.apache.solr.cloud.AbstractDistribZkTestBase.waitForRecoveriesToFinish(AbstractDistribZkTestBase.java:110)
	at org.apache.solr.cloud.AbstractFullDistribZkTestBase.waitForRecoveriesToFinish(AbstractFullDistribZkTestBase.java:563)
	at org.apache.solr.cloud.BasicDistributedZk2Test.brindDownShardIndexSomeDocsAndRecover(BasicDistributedZk2Test.java:321)
	at org.apache.solr.cloud.BasicDistributedZk2Test.doTest(BasicDistributedZk2Test.java:83)
	at org.apache.solr.BaseDistributedSearchTestCase.testDistribSearch(BaseDistributedSearchTestCase.java:697)
	at sun.reflect.NativeMethodAccessorImpl.invoke0(Native Method)
	at sun.reflect.NativeMethodAccessorImpl.invoke(NativeMethodAccessorImpl.java:39)
	at sun.reflect.DelegatingMethodAccessorImpl.invoke(DelegatingMethodAccessorImpl.java:25)
	at java.lang.reflect.Method.invoke(Method.java:597)
	at com.carrotsearch.randomizedtesting.RandomizedRunner.invoke(RandomizedRunner.java:1559)
	at com.carrotsearch.randomizedtesting.RandomizedRunner.access$600(RandomizedRunner.java:79)
	at com.carrotsearch.randomizedtesting.RandomizedRunner$6.evaluate(RandomizedRunner.java:738)
	at com.carrotsearch.randomizedtesting.RandomizedRunner$7.evaluate(RandomizedRunner.java:774)
	at com.carrotsearch.randomizedtesting.RandomizedRunner$8.evaluate(RandomizedRunner.java:787)
	at com.carrotsearch.randomizedtesting.rules.SystemPropertiesRestoreRule$1.evaluate(SystemPropertiesRestoreRule.java:53)
	at org.apache.lucene.util.TestRuleSetupTeardownChained$1.evaluate(TestRuleSetupTeardownChained.java:50)
	at org.apache.lucene.util.TestRuleFieldCacheSanity$1.evaluate(TestRuleFieldCacheSanity.java:51)
	at org.apache.lucene.util.AbstractBeforeAfterRule$1.evaluate(AbstractBeforeAfterRule.java:46)
	at com.carrotsearch.randomizedtesting.rules.SystemPropertiesInvariantRule$1.evaluate(SystemPropertiesInvariantRule.java:55)
	at org.apache.lucene.util.TestRuleThreadAndTestName$1.evaluate(TestRuleThreadAndTestName.java:49)
	at org.apache.lucene.util.TestRuleIgnoreAfterMaxFailures$1.evaluate(TestRuleIgnoreAfterMaxFailures.java:70)
	at org.apache.lucene.util.TestRuleMarkFailure$1.evaluate(TestRuleMarkFailure.java:48)
	at com.carrotsearch.randomizedtesting.rules.StatementAdapter.evaluate(StatementAdapter.java:36)
	at com.carrotsearch.randomizedtesting.ThreadLeakControl$StatementRunner.run(ThreadLeakControl.java:358)
	at com.carrotsearch.randomizedtesting.ThreadLeakControl.forkTimeoutingTask(ThreadLeakControl.java:782)
	at com.carrotsearch.randomizedtesting.ThreadLeakControl$3.evaluate(ThreadLeakControl.java:442)
	at com.carrotsearch.randomizedtesting.RandomizedRunner.runSingleTest(RandomizedRunner.java:746)
	at com.carrotsearch.randomizedtesting.RandomizedRunner$3.evaluate(RandomizedRunner.java:648)
	at com.carrotsearch.randomizedtesting.RandomizedRunner$4.evaluate(RandomizedRunner.java:683)
	at com.carrotsearch.randomizedtesting.RandomizedRunner$5.evaluate(RandomizedRunner.java:693)
	at com.carrotsearch.randomizedtesting.rules.StatementAdapter.evaluate(StatementAdapter.java:36)
	at com.carrotsearch.randomizedtesting.rules.SystemPropertiesRestoreRule$1.evaluate(SystemPropertiesRestoreRule.java:53)
	at org.apache.lucene.util.AbstractBeforeAfterRule$1.evaluate(AbstractBeforeAfterRule.java:46)
	at org.apache.lucene.util.TestRuleStoreClassName$1.evaluate(TestRuleStoreClassName.java:42)
	at com.carrotsearch.randomizedtesting.rules.SystemPropertiesInvariantRule$1.evaluate(SystemPropertiesInvariantRule.java:55)
	at com.carrotsearch.randomizedtesting.rules.NoShadowingOrOverridesOnMethodsRule$1.evaluate(NoShadowingOrOverridesOnMethodsRule.java:40)
	at com.carrotsearch.randomizedtesting.rules.NoShadowingOrOverridesOnMethodsRule$1.evaluate(NoShadowingOrOverridesOnMethodsRule.java:40)
	at com.carrotsearch.randomizedtesting.rules.StatementAdapter.evaluate(StatementAdapter.java:36)
	at org.apache.lucene.util.TestRuleAssertionsRequired$1.evaluate(TestRuleAssertionsRequired.java:44)
	at org.apache.lucene.util.TestRuleMarkFailure$1.evaluate(TestRuleMarkFailure.java:48)
	at org.apache.lucene.util.TestRuleIgnoreAfterMaxFailures$1.evaluate(TestRuleIgnoreAfterMaxFailures.java:70)
	at org.apache.lucene.util.TestRuleIgnoreTestSuites$1.evaluate(TestRuleIgnoreTestSuites.java:56)
	at com.carrotsearch.randomizedtesting.rules.StatementAdapter.evaluate(StatementAdapter.java:36)
	at com.carrotsearch.randomizedtesting.ThreadLeakControl$StatementRunner.run(ThreadLeakControl.java:358)
	at java.lang.Thread.run(Thread.java:662)


FAILED:  org.apache.solr.cloud.BasicDistributedZkTest.testDistribSearch

Error Message:
Server at http://127.0.0.1:53762/solr returned non ok status:500, message:Server Error

Stack Trace:
org.apache.solr.common.SolrException: Server at http://127.0.0.1:53762/solr returned non ok status:500, message:Server Error
	at __randomizedtesting.SeedInfo.seed([7A742FE34F0A21F3:FB92A1FB385541CF]:0)
	at org.apache.solr.client.solrj.impl.HttpSolrServer.request(HttpSolrServer.java:372)
	at org.apache.solr.client.solrj.impl.HttpSolrServer.request(HttpSolrServer.java:181)
	at org.apache.solr.client.solrj.request.CoreAdminRequest.process(CoreAdminRequest.java:429)
	at org.apache.solr.client.solrj.request.CoreAdminRequest.getStatus(CoreAdminRequest.java:472)
	at org.apache.solr.cloud.BasicDistributedZkTest.collectStartTimes(BasicDistributedZkTest.java:959)
	at org.apache.solr.cloud.BasicDistributedZkTest.testCollectionsAPI(BasicDistributedZkTest.java:795)
	at org.apache.solr.cloud.BasicDistributedZkTest.doTest(BasicDistributedZkTest.java:344)
	at org.apache.solr.BaseDistributedSearchTestCase.testDistribSearch(BaseDistributedSearchTestCase.java:697)
	at sun.reflect.NativeMethodAccessorImpl.invoke0(Native Method)
	at sun.reflect.NativeMethodAccessorImpl.invoke(NativeMethodAccessorImpl.java:39)
	at sun.reflect.DelegatingMethodAccessorImpl.invoke(DelegatingMethodAccessorImpl.java:25)
	at java.lang.reflect.Method.invoke(Method.java:597)
	at com.carrotsearch.randomizedtesting.RandomizedRunner.invoke(RandomizedRunner.java:1559)
	at com.carrotsearch.randomizedtesting.RandomizedRunner.access$600(RandomizedRunner.java:79)
	at com.carrotsearch.randomizedtesting.RandomizedRunner$6.evaluate(RandomizedRunner.java:738)
	at com.carrotsearch.randomizedtesting.RandomizedRunner$7.evaluate(RandomizedRunner.java:774)
	at com.carrotsearch.randomizedtesting.RandomizedRunner$8.evaluate(RandomizedRunner.java:787)
	at com.carrotsearch.randomizedtesting.rules.SystemPropertiesRestoreRule$1.evaluate(SystemPropertiesRestoreRule.java:53)
	at org.apache.lucene.util.TestRuleSetupTeardownChained$1.evaluate(TestRuleSetupTeardownChained.java:50)
	at org.apache.lucene.util.TestRuleFieldCacheSanity$1.evaluate(TestRuleFieldCacheSanity.java:51)
	at org.apache.lucene.util.AbstractBeforeAfterRule$1.evaluate(AbstractBeforeAfterRule.java:46)
	at com.carrotsearch.randomizedtesting.rules.SystemPropertiesInvariantRule$1.evaluate(SystemPropertiesInvariantRule.java:55)
	at org.apache.lucene.util.TestRuleThreadAndTestName$1.evaluate(TestRuleThreadAndTestName.java:49)
	at org.apache.lucene.util.TestRuleIgnoreAfterMaxFailures$1.evaluate(TestRuleIgnoreAfterMaxFailures.java:70)
	at org.apache.lucene.util.TestRuleMarkFailure$1.evaluate(TestRuleMarkFailure.java:48)
	at com.carrotsearch.randomizedtesting.rules.StatementAdapter.evaluate(StatementAdapter.java:36)
	at com.carrotsearch.randomizedtesting.ThreadLeakControl$StatementRunner.run(ThreadLeakControl.java:358)
	at com.carrotsearch.randomizedtesting.ThreadLeakControl.forkTimeoutingTask(ThreadLeakControl.java:782)
	at com.carrotsearch.randomizedtesting.ThreadLeakControl$3.evaluate(ThreadLeakControl.java:442)
	at com.carrotsearch.randomizedtesting.RandomizedRunner.runSingleTest(RandomizedRunner.java:746)
	at com.carrotsearch.randomizedtesting.RandomizedRunner$3.evaluate(RandomizedRunner.java:648)
	at com.carrotsearch.randomizedtesting.RandomizedRunner$4.evaluate(RandomizedRunner.java:683)
	at com.carrotsearch.randomizedtesting.RandomizedRunner$5.evaluate(RandomizedRunner.java:693)
	at com.carrotsearch.randomizedtesting.rules.StatementAdapter.evaluate(StatementAdapter.java:36)
	at com.carrotsearch.randomizedtesting.rules.SystemPropertiesRestoreRule$1.evaluate(SystemPropertiesRestoreRule.java:53)
	at org.apache.lucene.util.AbstractBeforeAfterRule$1.evaluate(AbstractBeforeAfterRule.java:46)
	at org.apache.lucene.util.TestRuleStoreClassName$1.evaluate(TestRuleStoreClassName.java:42)
	at com.carrotsearch.randomizedtesting.rules.SystemPropertiesInvariantRule$1.evaluate(SystemPropertiesInvariantRule.java:55)
	at com.carrotsearch.randomizedtesting.rules.NoShadowingOrOverridesOnMethodsRule$1.evaluate(NoShadowingOrOverridesOnMethodsRule.java:40)
	at com.carrotsearch.randomizedtesting.rules.NoShadowingOrOverridesOnMethodsRule$1.evaluate(NoShadowingOrOverridesOnMethodsRule.java:40)
	at com.carrotsearch.randomizedtesting.rules.StatementAdapter.evaluate(StatementAdapter.java:36)
	at org.apache.lucene.util.TestRuleAssertionsRequired$1.evaluate(TestRuleAssertionsRequired.java:44)
	at org.apache.lucene.util.TestRuleMarkFailure$1.evaluate(TestRuleMarkFailure.java:48)
	at org.apache.lucene.util.TestRuleIgnoreAfterMaxFailures$1.evaluate(TestRuleIgnoreAfterMaxFailures.java:70)
	at org.apache.lucene.util.TestRuleIgnoreTestSuites$1.evaluate(TestRuleIgnoreTestSuites.java:56)
	at com.carrotsearch.randomizedtesting.rules.StatementAdapter.evaluate(StatementAdapter.java:36)
	at com.carrotsearch.randomizedtesting.ThreadLeakControl$StatementRunner.run(ThreadLeakControl.java:358)
	at java.lang.Thread.run(Thread.java:662)




Build Log:
[...truncated 8017 lines...]
[junit4:junit4] Suite: org.apache.solr.cloud.BasicDistributedZk2Test
[junit4:junit4]   2> 18 T339 oas.SolrTestCaseJ4.setUp ###Starting testDistribSearch
[junit4:junit4]   2> Creating dataDir: /mnt/ssd/jenkins/workspace/Lucene-Solr-4.x-Linux/solr/build/solr-core/test/J1/./solrtest-BasicDistributedZk2Test-1355318805943
[junit4:junit4]   2> 19 T339 oasc.ZkTestServer.run STARTING ZK TEST SERVER
[junit4:junit4]   2> 19 T340 oasc.ZkTestServer$ZKServerMain.runFromConfig Starting server
[junit4:junit4]   2> 20 T340 oazs.ZooKeeperServer.setTickTime tickTime set to 1000
[junit4:junit4]   2> 20 T340 oazs.ZooKeeperServer.setMinSessionTimeout minSessionTimeout set to -1
[junit4:junit4]   2> 20 T340 oazs.ZooKeeperServer.setMaxSessionTimeout maxSessionTimeout set to -1
[junit4:junit4]   2> 21 T340 oazs.NIOServerCnxnFactory.configure binding to port 0.0.0.0/0.0.0.0:0
[junit4:junit4]   2> 21 T340 oazsp.FileTxnSnapLog.save Snapshotting: 0x0 to /mnt/ssd/jenkins/workspace/Lucene-Solr-4.x-Linux/solr/build/solr-core/test/J1/./org.apache.solr.cloud.BasicDistributedZk2Test-1355318805943/zookeeper/server1/data/version-2/snapshot.0
[junit4:junit4]   2> 121 T339 oasc.ZkTestServer.run start zk server on port:38624
[junit4:junit4]   2> 122 T339 oaz.ZooKeeper.<init> Initiating client connection, connectString=127.0.0.1:38624 sessionTimeout=10000 watcher=org.apache.solr.common.cloud.ConnectionManager@1b0feb09
[junit4:junit4]   2> 127 T345 oaz.ClientCnxn$SendThread.logStartConnect Opening socket connection to server localhost.localdomain/127.0.0.1:38624. Will not attempt to authenticate using SASL (access denied (javax.security.auth.AuthPermission getLoginConfiguration))
[junit4:junit4]   2> 127 T339 oascc.ConnectionManager.waitForConnected Waiting for client to connect to ZooKeeper
[junit4:junit4]   2> 127 T345 oaz.ClientCnxn$SendThread.primeConnection Socket connection established to localhost.localdomain/127.0.0.1:38624, initiating session
[junit4:junit4]   2> 128 T341 oazs.NIOServerCnxnFactory.run Accepted socket connection from /127.0.0.1:56863
[junit4:junit4]   2> 128 T341 oazs.ZooKeeperServer.processConnectRequest Client attempting to establish new session at /127.0.0.1:56863
[junit4:junit4]   2> 128 T343 oazsp.FileTxnLog.append Creating new log file: log.1
[junit4:junit4]   2> 253 T343 oazs.ZooKeeperServer.finishSessionInit Established session 0x13b8f4bc5bb0000 with negotiated timeout 10000 for client /127.0.0.1:56863
[junit4:junit4]   2> 253 T345 oaz.ClientCnxn$SendThread.onConnected Session establishment complete on server localhost.localdomain/127.0.0.1:38624, sessionid = 0x13b8f4bc5bb0000, negotiated timeout = 10000
[junit4:junit4]   2> 253 T346 oascc.ConnectionManager.process Watcher org.apache.solr.common.cloud.ConnectionManager@1b0feb09 name:ZooKeeperConnection Watcher:127.0.0.1:38624 got event WatchedEvent state:SyncConnected type:None path:null path:null type:None
[junit4:junit4]   2> 254 T339 oascc.ConnectionManager.waitForConnected Client is connected to ZooKeeper
[junit4:junit4]   2> 254 T339 oascc.SolrZkClient.makePath makePath: /solr
[junit4:junit4]   2> 256 T344 oazs.PrepRequestProcessor.pRequest2Txn Processed session termination for sessionid: 0x13b8f4bc5bb0000
[junit4:junit4]   2> 257 T346 oaz.ClientCnxn$EventThread.run EventThread shut down
[junit4:junit4]   2> 257 T341 oazs.NIOServerCnxn.closeSock Closed socket connection for client /127.0.0.1:56863 which had sessionid 0x13b8f4bc5bb0000
[junit4:junit4]   2> 257 T339 oaz.ZooKeeper.close Session: 0x13b8f4bc5bb0000 closed
[junit4:junit4]   2> 257 T339 oaz.ZooKeeper.<init> Initiating client connection, connectString=127.0.0.1:38624/solr sessionTimeout=10000 watcher=org.apache.solr.common.cloud.ConnectionManager@1b10815d
[junit4:junit4]   2> 258 T339 oascc.ConnectionManager.waitForConnected Waiting for client to connect to ZooKeeper
[junit4:junit4]   2> 258 T347 oaz.ClientCnxn$SendThread.logStartConnect Opening socket connection to server localhost.localdomain/127.0.0.1:38624. Will not attempt to authenticate using SASL (access denied (javax.security.auth.AuthPermission getLoginConfiguration))
[junit4:junit4]   2> 258 T347 oaz.ClientCnxn$SendThread.primeConnection Socket connection established to localhost.localdomain/127.0.0.1:38624, initiating session
[junit4:junit4]   2> 259 T341 oazs.NIOServerCnxnFactory.run Accepted socket connection from /127.0.0.1:56864
[junit4:junit4]   2> 259 T341 oazs.ZooKeeperServer.processConnectRequest Client attempting to establish new session at /127.0.0.1:56864
[junit4:junit4]   2> 259 T343 oazs.ZooKeeperServer.finishSessionInit Established session 0x13b8f4bc5bb0001 with negotiated timeout 10000 for client /127.0.0.1:56864
[junit4:junit4]   2> 259 T347 oaz.ClientCnxn$SendThread.onConnected Session establishment complete on server localhost.localdomain/127.0.0.1:38624, sessionid = 0x13b8f4bc5bb0001, negotiated timeout = 10000
[junit4:junit4]   2> 260 T348 oascc.ConnectionManager.process Watcher org.apache.solr.common.cloud.ConnectionManager@1b10815d name:ZooKeeperConnection Watcher:127.0.0.1:38624/solr got event WatchedEvent state:SyncConnected type:None path:null path:null type:None
[junit4:junit4]   2> 260 T339 oascc.ConnectionManager.waitForConnected Client is connected to ZooKeeper
[junit4:junit4]   2> 260 T339 oascc.SolrZkClient.makePath makePath: /collections/collection1
[junit4:junit4]   2> 263 T339 oascc.SolrZkClient.makePath makePath: /collections/collection1/shards
[junit4:junit4]   2> 266 T339 oascc.SolrZkClient.makePath makePath: /collections/control_collection
[junit4:junit4]   2> 267 T339 oascc.SolrZkClient.makePath makePath: /collections/control_collection/shards
[junit4:junit4]   2> 268 T339 oasc.AbstractZkTestCase.putConfig put /mnt/ssd/jenkins/workspace/Lucene-Solr-4.x-Linux/solr/build/solr-core/test-files/solr/collection1/conf/solrconfig.xml to /configs/conf1/solrconfig.xml
[junit4:junit4]   2> 269 T339 oascc.SolrZkClient.makePath makePath: /configs/conf1/solrconfig.xml
[junit4:junit4]   2> 272 T339 oasc.AbstractZkTestCase.putConfig put /mnt/ssd/jenkins/workspace/Lucene-Solr-4.x-Linux/solr/build/solr-core/test-files/solr/collection1/conf/schema.xml to /configs/conf1/schema.xml
[junit4:junit4]   2> 273 T339 oascc.SolrZkClient.makePath makePath: /configs/conf1/schema.xml
[junit4:junit4]   2> 275 T339 oasc.AbstractZkTestCase.putConfig put /mnt/ssd/jenkins/workspace/Lucene-Solr-4.x-Linux/solr/build/solr-core/test-files/solr/collection1/conf/solrconfig.xml to /configs/conf1/solrconfig.xml
[junit4:junit4]   2> 276 T339 oascc.SolrZkClient.makePath makePath: /configs/conf1/solrconfig.xml
[junit4:junit4]   2> 278 T339 oasc.AbstractZkTestCase.putConfig put /mnt/ssd/jenkins/workspace/Lucene-Solr-4.x-Linux/solr/build/solr-core/test-files/solr/collection1/conf/stopwords.txt to /configs/conf1/stopwords.txt
[junit4:junit4]   2> 278 T339 oascc.SolrZkClient.makePath makePath: /configs/conf1/stopwords.txt
[junit4:junit4]   2> 280 T339 oasc.AbstractZkTestCase.putConfig put /mnt/ssd/jenkins/workspace/Lucene-Solr-4.x-Linux/solr/build/solr-core/test-files/solr/collection1/conf/protwords.txt to /configs/conf1/protwords.txt
[junit4:junit4]   2> 281 T339 oascc.SolrZkClient.makePath makePath: /configs/conf1/protwords.txt
[junit4:junit4]   2> 282 T339 oasc.AbstractZkTestCase.putConfig put /mnt/ssd/jenkins/workspace/Lucene-Solr-4.x-Linux/solr/build/solr-core/test-files/solr/collection1/conf/currency.xml to /configs/conf1/currency.xml
[junit4:junit4]   2> 283 T339 oascc.SolrZkClient.makePath makePath: /configs/conf1/currency.xml
[junit4:junit4]   2> 284 T339 oasc.AbstractZkTestCase.putConfig put /mnt/ssd/jenkins/workspace/Lucene-Solr-4.x-Linux/solr/build/solr-core/test-files/solr/collection1/conf/open-exchange-rates.json to /configs/conf1/open-exchange-rates.json
[junit4:junit4]   2> 285 T339 oascc.SolrZkClient.makePath makePath: /configs/conf1/open-exchange-rates.json
[junit4:junit4]   2> 286 T339 oasc.AbstractZkTestCase.putConfig put /mnt/ssd/jenkins/workspace/Lucene-Solr-4.x-Linux/solr/build/solr-core/test-files/solr/collection1/conf/mapping-ISOLatin1Accent.txt to /configs/conf1/mapping-ISOLatin1Accent.txt
[junit4:junit4]   2> 287 T339 oascc.SolrZkClient.makePath makePath: /configs/conf1/mapping-ISOLatin1Accent.txt
[junit4:junit4]   2> 289 T339 oasc.AbstractZkTestCase.putConfig put /mnt/ssd/jenkins/workspace/Lucene-Solr-4.x-Linux/solr/build/solr-core/test-files/solr/collection1/conf/old_synonyms.txt to /configs/conf1/old_synonyms.txt
[junit4:junit4]   2> 289 T339 oascc.SolrZkClient.makePath makePath: /configs/conf1/old_synonyms.txt
[junit4:junit4]   2> 291 T339 oasc.AbstractZkTestCase.putConfig put /mnt/ssd/jenkins/workspace/Lucene-Solr-4.x-Linux/solr/build/solr-core/test-files/solr/collection1/conf/synonyms.txt to /configs/conf1/synonyms.txt
[junit4:junit4]   2> 291 T339 oascc.SolrZkClient.makePath makePath: /configs/conf1/synonyms.txt
[junit4:junit4]   2> 293 T344 oazs.PrepRequestProcessor.pRequest2Txn Processed session termination for sessionid: 0x13b8f4bc5bb0001
[junit4:junit4]   2> 293 T348 oaz.ClientCnxn$EventThread.run EventThread shut down
[junit4:junit4]   2> 293 T341 oazs.NIOServerCnxn.closeSock Closed socket connection for client /127.0.0.1:56864 which had sessionid 0x13b8f4bc5bb0001
[junit4:junit4]   2> 293 T339 oaz.ZooKeeper.close Session: 0x13b8f4bc5bb0001 closed
[junit4:junit4]   2> 349 T339 oejs.Server.doStart jetty-8.1.8.v20121106
[junit4:junit4]   2> 352 T339 oejs.AbstractConnector.doStart Started SelectChannelConnector@0.0.0.0:35281
[junit4:junit4]   2> 352 T339 oasc.SolrResourceLoader.locateSolrHome JNDI not configured for solr (NoInitialContextEx)
[junit4:junit4]   2> 353 T339 oasc.SolrResourceLoader.locateSolrHome using system property solr.solr.home: /mnt/ssd/jenkins/workspace/Lucene-Solr-4.x-Linux/solr/build/solr-core/test/J1/./org.apache.solr.cloud.BasicDistributedZk2Test-controljetty-1355318806219
[junit4:junit4]   2> 353 T339 oasc.SolrResourceLoader.<init> new SolrResourceLoader for deduced Solr Home: '/mnt/ssd/jenkins/workspace/Lucene-Solr-4.x-Linux/solr/build/solr-core/test/J1/./org.apache.solr.cloud.BasicDistributedZk2Test-controljetty-1355318806219/'
[junit4:junit4]   2> 367 T339 oass.SolrDispatchFilter.init SolrDispatchFilter.init()
[junit4:junit4]   2> 367 T339 oasc.SolrResourceLoader.locateSolrHome JNDI not configured for solr (NoInitialContextEx)
[junit4:junit4]   2> 368 T339 oasc.SolrResourceLoader.locateSolrHome using system property solr.solr.home: /mnt/ssd/jenkins/workspace/Lucene-Solr-4.x-Linux/solr/build/solr-core/test/J1/./org.apache.solr.cloud.BasicDistributedZk2Test-controljetty-1355318806219
[junit4:junit4]   2> 368 T339 oasc.CoreContainer$Initializer.initialize looking for solr.xml: /mnt/ssd/jenkins/workspace/Lucene-Solr-4.x-Linux/solr/build/solr-core/test/J1/./org.apache.solr.cloud.BasicDistributedZk2Test-controljetty-1355318806219/solr.xml
[junit4:junit4]   2> 368 T339 oasc.CoreContainer.<init> New CoreContainer 458263267
[junit4:junit4]   2> 369 T339 oasc.CoreContainer.load Loading CoreContainer using Solr Home: '/mnt/ssd/jenkins/workspace/Lucene-Solr-4.x-Linux/solr/build/solr-core/test/J1/./org.apache.solr.cloud.BasicDistributedZk2Test-controljetty-1355318806219/'
[junit4:junit4]   2> 369 T339 oasc.SolrResourceLoader.<init> new SolrResourceLoader for directory: '/mnt/ssd/jenkins/workspace/Lucene-Solr-4.x-Linux/solr/build/solr-core/test/J1/./org.apache.solr.cloud.BasicDistributedZk2Test-controljetty-1355318806219/'
[junit4:junit4]   2> 384 T339 oasc.CoreContainer.load Registering Log Listener
[junit4:junit4]   2> 398 T339 oasc.CoreContainer.initZooKeeper Zookeeper client=127.0.0.1:38624/solr
[junit4:junit4]   2> 398 T339 oasc.ZkController.checkChrootPath zkHost includes chroot
[junit4:junit4]   2> 399 T339 oaz.ZooKeeper.<init> Initiating client connection, connectString=127.0.0.1:38624 sessionTimeout=60000 watcher=org.apache.solr.common.cloud.ConnectionManager@1b63b76c
[junit4:junit4]   2> 399 T339 oascc.ConnectionManager.waitForConnected Waiting for client to connect to ZooKeeper
[junit4:junit4]   2> 400 T358 oaz.ClientCnxn$SendThread.logStartConnect Opening socket connection to server localhost.localdomain/127.0.0.1:38624. Will not attempt to authenticate using SASL (access denied (javax.security.auth.AuthPermission getLoginConfiguration))
[junit4:junit4]   2> 400 T358 oaz.ClientCnxn$SendThread.primeConnection Socket connection established to localhost.localdomain/127.0.0.1:38624, initiating session
[junit4:junit4]   2> 400 T341 oazs.NIOServerCnxnFactory.run Accepted socket connection from /127.0.0.1:56865
[junit4:junit4]   2> 401 T341 oazs.ZooKeeperServer.processConnectRequest Client attempting to establish new session at /127.0.0.1:56865
[junit4:junit4]   2> 402 T343 oazs.ZooKeeperServer.finishSessionInit Established session 0x13b8f4bc5bb0002 with negotiated timeout 20000 for client /127.0.0.1:56865
[junit4:junit4]   2> 402 T358 oaz.ClientCnxn$SendThread.onConnected Session establishment complete on server localhost.localdomain/127.0.0.1:38624, sessionid = 0x13b8f4bc5bb0002, negotiated timeout = 20000
[junit4:junit4]   2> 402 T359 oascc.ConnectionManager.process Watcher org.apache.solr.common.cloud.ConnectionManager@1b63b76c name:ZooKeeperConnection Watcher:127.0.0.1:38624 got event WatchedEvent state:SyncConnected type:None path:null path:null type:None
[junit4:junit4]   2> 403 T339 oascc.ConnectionManager.waitForConnected Client is connected to ZooKeeper
[junit4:junit4]   2> 404 T344 oazs.PrepRequestProcessor.pRequest2Txn Processed session termination for sessionid: 0x13b8f4bc5bb0002
[junit4:junit4]   2> 404 T341 oazs.NIOServerCnxn.closeSock Closed socket connection for client /127.0.0.1:56865 which had sessionid 0x13b8f4bc5bb0002
[junit4:junit4]   2> 404 T339 oaz.ZooKeeper.close Session: 0x13b8f4bc5bb0002 closed
[junit4:junit4]   2> 404 T359 oaz.ClientCnxn$EventThread.run EventThread shut down
[junit4:junit4]   2> 404 T339 oaz.ZooKeeper.<init> Initiating client connection, connectString=127.0.0.1:38624/solr sessionTimeout=8000 watcher=org.apache.solr.common.cloud.ConnectionManager@1b5ffcb4
[junit4:junit4]   2> 405 T360 oaz.ClientCnxn$SendThread.logStartConnect Opening socket connection to server localhost.localdomain/127.0.0.1:38624. Will not attempt to authenticate using SASL (access denied (javax.security.auth.AuthPermission getLoginConfiguration))
[junit4:junit4]   2> 405 T339 oascc.ConnectionManager.waitForConnected Waiting for client to connect to ZooKeeper
[junit4:junit4]   2> 406 T341 oazs.NIOServerCnxnFactory.run Accepted socket connection from /127.0.0.1:56866
[junit4:junit4]   2> 406 T360 oaz.ClientCnxn$SendThread.primeConnection Socket connection established to localhost.localdomain/127.0.0.1:38624, initiating session
[junit4:junit4]   2> 406 T341 oazs.ZooKeeperServer.processConnectRequest Client attempting to establish new session at /127.0.0.1:56866
[junit4:junit4]   2> 407 T343 oazs.ZooKeeperServer.finishSessionInit Established session 0x13b8f4bc5bb0003 with negotiated timeout 8000 for client /127.0.0.1:56866
[junit4:junit4]   2> 407 T360 oaz.ClientCnxn$SendThread.onConnected Session establishment complete on server localhost.localdomain/127.0.0.1:38624, sessionid = 0x13b8f4bc5bb0003, negotiated timeout = 8000
[junit4:junit4]   2> 407 T361 oascc.ConnectionManager.process Watcher org.apache.solr.common.cloud.ConnectionManager@1b5ffcb4 name:ZooKeeperConnection Watcher:127.0.0.1:38624/solr got event WatchedEvent state:SyncConnected type:None path:null path:null type:None
[junit4:junit4]   2> 407 T339 oascc.ConnectionManager.waitForConnected Client is connected to ZooKeeper
[junit4:junit4]   2> 408 T344 oazs.PrepRequestProcessor.pRequest Got user-level KeeperException when processing sessionid:0x13b8f4bc5bb0003 type:create cxid:0x2 zxid:0x1b txntype:-1 reqpath:n/a Error Path:/solr/overseer Error:KeeperErrorCode = NodeExists for /solr/overseer
[junit4:junit4]   2> 409 T339 oascc.SolrZkClient.makePath makePath: /live_nodes
[junit4:junit4]   2> 410 T339 oasc.ZkController.createEphemeralLiveNode Register node as live in ZooKeeper:/live_nodes/127.0.0.1:35281_solr
[junit4:junit4]   2> 411 T344 oazs.PrepRequestProcessor.pRequest Got user-level KeeperException when processing sessionid:0x13b8f4bc5bb0003 type:delete cxid:0x7 zxid:0x1d txntype:-1 reqpath:n/a Error Path:/solr/live_nodes/127.0.0.1:35281_solr Error:KeeperErrorCode = NoNode for /solr/live_nodes/127.0.0.1:35281_solr
[junit4:junit4]   2> 412 T339 oascc.SolrZkClient.makePath makePath: /live_nodes/127.0.0.1:35281_solr
[junit4:junit4]   2> 414 T339 oashc.HttpShardHandlerFactory.getParameter Setting socketTimeout to: 0
[junit4:junit4]   2> 414 T339 oashc.HttpShardHandlerFactory.getParameter Setting urlScheme to: http://
[junit4:junit4]   2> 415 T339 oashc.HttpShardHandlerFactory.getParameter Setting connTimeout to: 0
[junit4:junit4]   2> 415 T339 oashc.HttpShardHandlerFactory.getParameter Setting maxConnectionsPerHost to: 20
[junit4:junit4]   2> 416 T339 oashc.HttpShardHandlerFactory.getParameter Setting corePoolSize to: 0
[junit4:junit4]   2> 416 T339 oashc.HttpShardHandlerFactory.getParameter Setting maximumPoolSize to: 2147483647
[junit4:junit4]   2> 417 T339 oashc.HttpShardHandlerFactory.getParameter Setting maxThreadIdleTime to: 5
[junit4:junit4]   2> 417 T339 oashc.HttpShardHandlerFactory.getParameter Setting sizeOfQueue to: -1
[junit4:junit4]   2> 417 T339 oashc.HttpShardHandlerFactory.getParameter Setting fairnessPolicy to: false
[junit4:junit4]   2> 418 T339 oascsi.HttpClientUtil.createClient Creating new http client, config:maxConnectionsPerHost=20&maxConnections=10000&socketTimeout=0&connTimeout=0&retry=false
[junit4:junit4]   2> 422 T339 oascc.SolrZkClient.makePath makePath: /overseer_elect/election
[junit4:junit4]   2> 425 T344 oazs.PrepRequestProcessor.pRequest Got user-level KeeperException when processing sessionid:0x13b8f4bc5bb0003 type:delete cxid:0x15 zxid:0x22 txntype:-1 reqpath:n/a Error Path:/solr/overseer_elect/leader Error:KeeperErrorCode = NoNode for /solr/overseer_elect/leader
[junit4:junit4]   2> 426 T339 oascc.SolrZkClient.makePath makePath: /overseer_elect/leader
[junit4:junit4]   2> 427 T339 oasc.Overseer.start Overseer (id=88822173266542595-127.0.0.1:35281_solr-n_0000000000) starting
[junit4:junit4]   2> 428 T344 oazs.PrepRequestProcessor.pRequest Got user-level KeeperException when processing sessionid:0x13b8f4bc5bb0003 type:create cxid:0x1a zxid:0x24 txntype:-1 reqpath:n/a Error Path:/solr/overseer Error:KeeperErrorCode = NodeExists for /solr/overseer
[junit4:junit4]   2> 428 T344 oazs.PrepRequestProcessor.pRequest Got user-level KeeperException when processing sessionid:0x13b8f4bc5bb0003 type:create cxid:0x1b zxid:0x25 txntype:-1 reqpath:n/a Error Path:/solr/overseer Error:KeeperErrorCode = NodeExists for /solr/overseer
[junit4:junit4]   2> 429 T344 oazs.PrepRequestProcessor.pRequest Got user-level KeeperException when processing sessionid:0x13b8f4bc5bb0003 type:create cxid:0x1c zxid:0x26 txntype:-1 reqpath:n/a Error Path:/solr/overseer Error:KeeperErrorCode = NodeExists for /solr/overseer
[junit4:junit4]   2> 430 T344 oazs.PrepRequestProcessor.pRequest Got user-level KeeperException when processing sessionid:0x13b8f4bc5bb0003 type:create cxid:0x1d zxid:0x27 txntype:-1 reqpath:n/a Error Path:/solr/overseer Error:KeeperErrorCode = NodeExists for /solr/overseer
[junit4:junit4]   2> 430 T363 oasc.OverseerCollectionProcessor.run Process current queue of collection messages
[junit4:junit4]   2> 431 T339 oascc.SolrZkClient.makePath makePath: /clusterstate.json
[junit4:junit4]   2> 433 T339 oascc.ZkStateReader.createClusterStateWatchersAndUpdate Updating cluster state from ZooKeeper... 
[junit4:junit4]   2> 438 T362 oasc.Overseer$ClusterStateUpdater.run Starting to work on the main queue
[junit4:junit4]   2> 439 T364 oasc.CoreContainer.create Creating SolrCore 'collection1' using instanceDir: /mnt/ssd/jenkins/workspace/Lucene-Solr-4.x-Linux/solr/build/solr-core/test/J1/./org.apache.solr.cloud.BasicDistributedZk2Test-controljetty-1355318806219/collection1
[junit4:junit4]   2> 439 T364 oasc.ZkController.createCollectionZkNode Check for collection zkNode:control_collection
[junit4:junit4]   2> 440 T364 oasc.ZkController.createCollectionZkNode Collection zkNode exists
[junit4:junit4]   2> 440 T364 oasc.ZkController.readConfigName Load collection config from:/collections/control_collection
[junit4:junit4]   2> 441 T364 oasc.SolrResourceLoader.<init> new SolrResourceLoader for directory: '/mnt/ssd/jenkins/workspace/Lucene-Solr-4.x-Linux/solr/build/solr-core/test/J1/./org.apache.solr.cloud.BasicDistributedZk2Test-controljetty-1355318806219/collection1/'
[junit4:junit4]   2> 441 T364 oasc.SolrResourceLoader.replaceClassLoader Adding 'file:/mnt/ssd/jenkins/workspace/Lucene-Solr-4.x-Linux/solr/build/solr-core/test/J1/org.apache.solr.cloud.BasicDistributedZk2Test-controljetty-1355318806219/collection1/lib/README' to classloader
[junit4:junit4]   2> 442 T364 oasc.SolrResourceLoader.replaceClassLoader Adding 'file:/mnt/ssd/jenkins/workspace/Lucene-Solr-4.x-Linux/solr/build/solr-core/test/J1/org.apache.solr.cloud.BasicDistributedZk2Test-controljetty-1355318806219/collection1/lib/classes/' to classloader
[junit4:junit4]   2> 491 T364 oasc.SolrConfig.<init> Using Lucene MatchVersion: LUCENE_41
[junit4:junit4]   2> 550 T364 oasc.SolrConfig.<init> Loaded SolrConfig: solrconfig.xml
[junit4:junit4]   2> 551 T364 oass.IndexSchema.readSchema Reading Solr Schema
[junit4:junit4]   2> 556 T364 oass.IndexSchema.readSchema Schema name=test
[junit4:junit4]   2> 1084 T364 oass.OpenExchangeRatesOrgProvider.init Initialized with rates=open-exchange-rates.json, refreshInterval=1440.
[junit4:junit4]   2> 1095 T364 oass.IndexSchema.readSchema default search field in schema is text
[junit4:junit4]   2> 1099 T364 oass.IndexSchema.readSchema unique key field: id
[junit4:junit4]   2> 1108 T364 oass.FileExchangeRateProvider.reload Reloading exchange rates from file currency.xml
[junit4:junit4]   2> 1111 T364 oass.FileExchangeRateProvider.reload Reloading exchange rates from file currency.xml
[junit4:junit4]   2> 1115 T364 oass.OpenExchangeRatesOrgProvider.reload Reloading exchange rates from open-exchange-rates.json
[junit4:junit4]   2> 1116 T364 oass.OpenExchangeRatesOrgProvider.reload Reloading exchange rates from open-exchange-rates.json
[junit4:junit4]   2> 1117 T364 oasc.SolrCore.<init> [collection1] Opening new SolrCore at /mnt/ssd/jenkins/workspace/Lucene-Solr-4.x-Linux/solr/build/solr-core/test/J1/./org.apache.solr.cloud.BasicDistributedZk2Test-controljetty-1355318806219/collection1/, dataDir=./org.apache.solr.cloud.BasicDistributedZk2Test-1355318805943/control/data/
[junit4:junit4]   2> 1117 T364 oasc.JmxMonitoredMap.<init> JMX monitoring is enabled. Adding Solr mbeans to JMX Server: com.sun.jmx.mbeanserver.JmxMBeanServer@1ad38771
[junit4:junit4]   2> 1117 T364 oasc.SolrCore.getNewIndexDir New index directory detected: old=null new=./org.apache.solr.cloud.BasicDistributedZk2Test-1355318805943/control/data/index/
[junit4:junit4]   2> 1118 T364 oasc.SolrCore.initIndex WARNING [collection1] Solr index directory './org.apache.solr.cloud.BasicDistributedZk2Test-1355318805943/control/data/index' doesn't exist. Creating new index...
[junit4:junit4]   2> 1118 T364 oasc.CachingDirectoryFactory.get return new directory for /mnt/ssd/jenkins/workspace/Lucene-Solr-4.x-Linux/solr/build/solr-core/test/J1/./org.apache.solr.cloud.BasicDistributedZk2Test-1355318805943/control/data/index forceNew:false
[junit4:junit4]   2> 1121 T364 oasc.SolrDeletionPolicy.onCommit SolrDeletionPolicy.onCommit: commits:num=1
[junit4:junit4]   2> 		commit{dir=RateLimitedDirectoryWrapper(NRTCachingDirectory(org.apache.lucene.store.NIOFSDirectory@/mnt/ssd/jenkins/workspace/Lucene-Solr-4.x-Linux/solr/build/solr-core/test/J1/org.apache.solr.cloud.BasicDistributedZk2Test-1355318805943/control/data/index lockFactory=org.apache.lucene.store.NativeFSLockFactory@1af08c29; maxCacheMB=48.0 maxMergeSizeMB=4.0)),segFN=segments_1,generation=1,filenames=[segments_1]
[junit4:junit4]   2> 1122 T364 oasc.SolrDeletionPolicy.updateCommits newest commit = 1
[junit4:junit4]   2> 1122 T364 oasc.SolrCore.initWriters created xml: solr.XMLResponseWriter
[junit4:junit4]   2> 1123 T364 oasup.UpdateRequestProcessorChain.init inserting DistributedUpdateProcessorFactory into updateRequestProcessorChain "dedupe"
[junit4:junit4]   2> 1124 T364 oasup.UpdateRequestProcessorChain.init inserting DistributedUpdateProcessorFactory into updateRequestProcessorChain "dedupe-allfields"
[junit4:junit4]   2> 1124 T364 oasup.UpdateRequestProcessorChain.init inserting DistributedUpdateProcessorFactory into updateRequestProcessorChain "stored_sig"
[junit4:junit4]   2> 1124 T364 oasup.UpdateRequestProcessorChain.init inserting DistributedUpdateProcessorFactory into updateRequestProcessorChain "uniq-fields"
[junit4:junit4]   2> 1125 T364 oasup.UpdateRequestProcessorChain.init inserting DistributedUpdateProcessorFactory into updateRequestProcessorChain "distrib-dup-test-chain-implicit"
[junit4:junit4]   2> 1125 T364 oasc.RequestHandlers.initHandlersFromConfig adding lazy requestHandler: solr.ReplicationHandler
[junit4:junit4]   2> 1125 T364 oasc.RequestHandlers.initHandlersFromConfig created /replication: solr.ReplicationHandler
[junit4:junit4]   2> 1126 T364 oasc.RequestHandlers.initHandlersFromConfig created standard: solr.StandardRequestHandler
[junit4:junit4]   2> 1126 T364 oasc.RequestHandlers.initHandlersFromConfig created /get: solr.RealTimeGetHandler
[junit4:junit4]   2> 1127 T364 oasc.RequestHandlers.initHandlersFromConfig created dismax: solr.SearchHandler
[junit4:junit4]   2> 1128 T364 oasc.RequestHandlers.initHandlersFromConfig created mock: org.apache.solr.core.MockQuerySenderListenerReqHandler
[junit4:junit4]   2> 1128 T364 oasc.RequestHandlers.initHandlersFromConfig created /admin/: org.apache.solr.handler.admin.AdminHandlers
[junit4:junit4]   2> 1129 T364 oasc.RequestHandlers.initHandlersFromConfig created defaults: solr.StandardRequestHandler
[junit4:junit4]   2> 1129 T364 oasc.RequestHandlers.initHandlersFromConfig adding lazy requestHandler: solr.StandardRequestHandler
[junit4:junit4]   2> 1129 T364 oasc.RequestHandlers.initHandlersFromConfig created lazy: solr.StandardRequestHandler
[junit4:junit4]   2> 1130 T364 oasc.RequestHandlers.initHandlersFromConfig created /update: solr.UpdateRequestHandler
[junit4:junit4]   2> 1131 T364 oasc.RequestHandlers.initHandlersFromConfig created /terms: org.apache.solr.handler.component.SearchHandler
[junit4:junit4]   2> 1131 T364 oasc.RequestHandlers.initHandlersFromConfig created spellCheckCompRH: org.apache.solr.handler.component.SearchHandler
[junit4:junit4]   2> 1132 T364 oasc.RequestHandlers.initHandlersFromConfig created spellCheckCompRH_Direct: org.apache.solr.handler.component.SearchHandler
[junit4:junit4]   2> 1132 T364 oasc.RequestHandlers.initHandlersFromConfig created spellCheckWithWordbreak: org.apache.solr.handler.component.SearchHandler
[junit4:junit4]   2> 1133 T364 oasc.RequestHandlers.initHandlersFromConfig created spellCheckWithWordbreak_Direct: org.apache.solr.handler.component.SearchHandler
[junit4:junit4]   2> 1134 T364 oasc.RequestHandlers.initHandlersFromConfig created spellCheckCompRH1: org.apache.solr.handler.component.SearchHandler
[junit4:junit4]   2> 1134 T364 oasc.RequestHandlers.initHandlersFromConfig created tvrh: org.apache.solr.handler.component.SearchHandler
[junit4:junit4]   2> 1135 T364 oasc.RequestHandlers.initHandlersFromConfig created /mlt: solr.MoreLikeThisHandler
[junit4:junit4]   2> 1136 T364 oasc.RequestHandlers.initHandlersFromConfig created /debug/dump: solr.DumpRequestHandler
[junit4:junit4]   2> 1138 T364 oashl.XMLLoader.init xsltCacheLifetimeSeconds=60
[junit4:junit4]   2> 1140 T364 oasc.SolrCore.initDeprecatedSupport WARNING solrconfig.xml uses deprecated <admin/gettableFiles>, Please update your config to use the ShowFileRequestHandler.
[junit4:junit4]   2> 1141 T364 oasc.SolrCore.initDeprecatedSupport WARNING adding ShowFileRequestHandler with hidden files: [SCHEMA.XML, OLD_SYNONYMS.TXT, STOPWORDS.TXT, PROTWORDS.TXT, OPEN-EXCHANGE-RATES.JSON, SYNONYMS.TXT, CURRENCY.XML, MAPPING-ISOLATIN1ACCENT.TXT]
[junit4:junit4]   2> 1144 T364 oass.SolrIndexSearcher.<init> Opening Searcher@1b037ca1 main
[junit4:junit4]   2> 1144 T364 oass.SolrIndexSearcher.getIndexDir WARNING WARNING: Directory impl does not support setting indexDir: org.apache.lucene.store.RateLimitedDirectoryWrapper
[junit4:junit4]   2> 1144 T364 oasu.CommitTracker.<init> Hard AutoCommit: disabled
[junit4:junit4]   2> 1144 T364 oasu.CommitTracker.<init> Soft AutoCommit: disabled
[junit4:junit4]   2> 1145 T364 oashc.SpellCheckComponent.inform Initializing spell checkers
[junit4:junit4]   2> 1149 T364 oass.DirectSolrSpellChecker.init init: {name=direct,classname=DirectSolrSpellChecker,field=lowerfilt,minQueryLength=3}
[junit4:junit4]   2> 1177 T365 oasc.SolrCore.registerSearcher [collection1] Registered new searcher Searcher@1b037ca1 main{StandardDirectoryReader(segments_1:1)}
[junit4:junit4]   2> 1183 T364 oasc.ZkController.publish publishing core=collection1 state=down
[junit4:junit4]   2> 1183 T364 oasc.ZkController.publish numShards not found on descriptor - reading it from system property
[junit4:junit4]   2> 1184 T344 oazs.PrepRequestProcessor.pRequest Got user-level KeeperException when processing sessionid:0x13b8f4bc5bb0003 type:create cxid:0x53 zxid:0x2a txntype:-1 reqpath:n/a Error Path:/solr/overseer/queue Error:KeeperErrorCode = NoNode for /solr/overseer/queue
[junit4:junit4]   2> 1185 T364 oasc.CoreContainer.register registering core: collection1
[junit4:junit4]   2> 1185 T364 oasc.ZkController.register Register shard - core:collection1 address:http://127.0.0.1:35281/solr shardId:control_shard
[junit4:junit4]   2> 1186 T364 oascc.SolrZkClient.makePath makePath: /collections/control_collection/leader_elect/control_shard/election
[junit4:junit4]   2> 1191 T344 oazs.PrepRequestProcessor.pRequest Got user-level KeeperException when processing sessionid:0x13b8f4bc5bb0003 type:delete cxid:0x62 zxid:0x31 txntype:-1 reqpath:n/a Error Path:/solr/collections/control_collection/leaders Error:KeeperErrorCode = NoNode for /solr/collections/control_collection/leaders
[junit4:junit4]   2> 1192 T364 oasc.ShardLeaderElectionContext.runLeaderProcess Running the leader process.
[junit4:junit4]   2> 1192 T344 oazs.PrepRequestProcessor.pRequest Got user-level KeeperException when processing sessionid:0x13b8f4bc5bb0003 type:create cxid:0x63 zxid:0x32 txntype:-1 reqpath:n/a Error Path:/solr/overseer Error:KeeperErrorCode = NodeExists for /solr/overseer
[junit4:junit4]   2> 1441 T362 oascc.ZkStateReader.updateClusterState Updating cloud state from ZooKeeper... 
[junit4:junit4]   2> 1442 T362 oasc.Overseer$ClusterStateUpdater.updateState Update state numShards=null message={
[junit4:junit4]   2> 	  "operation":"state",
[junit4:junit4]   2> 	  "numShards":null,
[junit4:junit4]   2> 	  "shard":"control_shard",
[junit4:junit4]   2> 	  "roles":null,
[junit4:junit4]   2> 	  "state":"down",
[junit4:junit4]   2> 	  "core":"collection1",
[junit4:junit4]   2> 	  "collection":"control_collection",
[junit4:junit4]   2> 	  "node_name":"127.0.0.1:35281_solr",
[junit4:junit4]   2> 	  "base_url":"http://127.0.0.1:35281/solr"}
[junit4:junit4]   2> 1442 T344 oazs.PrepRequestProcessor.pRequest Got user-level KeeperException when processing sessionid:0x13b8f4bc5bb0003 type:create cxid:0x6a zxid:0x34 txntype:-1 reqpath:n/a Error Path:/solr/overseer/queue-work Error:KeeperErrorCode = NoNode for /solr/overseer/queue-work
[junit4:junit4]   2> 1447 T361 oascc.ZkStateReader$2.process A cluster state change has occurred - updating... (1)
[junit4:junit4]   2> 1694 T364 oasc.ShardLeaderElectionContext.waitForReplicasToComeUp Enough replicas found to continue.
[junit4:junit4]   2> 1694 T364 oasc.ShardLeaderElectionContext.runLeaderProcess I may be the new leader - try and sync
[junit4:junit4]   2> 1694 T364 oasc.SyncStrategy.sync Sync replicas to http://127.0.0.1:35281/solr/collection1/
[junit4:junit4]   2> 1694 T364 oasc.SyncStrategy.syncReplicas Sync Success - now sync replicas to me
[junit4:junit4]   2> 1695 T364 oasc.SyncStrategy.syncToMe http://127.0.0.1:35281/solr/collection1/ has no replicas
[junit4:junit4]   2> 1695 T364 oasc.ShardLeaderElectionContext.runLeaderProcess I am the new leader: http://127.0.0.1:35281/solr/collection1/
[junit4:junit4]   2> 1695 T364 oascc.SolrZkClient.makePath makePath: /collections/control_collection/leaders/control_shard
[junit4:junit4]   2> 1698 T344 oazs.PrepRequestProcessor.pRequest Got user-level KeeperException when processing sessionid:0x13b8f4bc5bb0003 type:create cxid:0x89 zxid:0x3f txntype:-1 reqpath:n/a Error Path:/solr/overseer Error:KeeperErrorCode = NodeExists for /solr/overseer
[junit4:junit4]   2> 1951 T362 oascc.ZkStateReader.updateClusterState Updating cloud state from ZooKeeper... 
[junit4:junit4]   2> 1953 T361 oascc.ZkStateReader$2.process A cluster state change has occurred - updating... (1)
[junit4:junit4]   2> 2000 T364 oasc.ZkController.register We are http://127.0.0.1:35281/solr/collection1/ and leader is http://127.0.0.1:35281/solr/collection1/
[junit4:junit4]   2> 2001 T364 oasc.ZkController.register No LogReplay needed for core=collection1 baseURL=http://127.0.0.1:35281/solr
[junit4:junit4]   2> 2001 T364 oasc.ZkController.checkRecovery I am the leader, no recovery necessary
[junit4:junit4]   2> 2001 T364 oasc.ZkController.publish publishing core=collection1 state=active
[junit4:junit4]   2> 2002 T364 oasc.ZkController.publish numShards not found on descriptor - reading it from system property
[junit4:junit4]   2> 2003 T364 oascc.ZkStateReader.updateClusterState Updating cloud state from ZooKeeper... 
[junit4:junit4]   2> 2003 T339 oass.SolrDispatchFilter.init user.dir=/mnt/ssd/jenkins/workspace/Lucene-Solr-4.x-Linux/solr/build/solr-core/test/J1
[junit4:junit4]   2> 2004 T339 oass.SolrDispatchFilter.init SolrDispatchFilter.init() done
[junit4:junit4]   2> 2004 T339 oascsi.HttpClientUtil.createClient Creating new http client, config:maxConnections=128&maxConnectionsPerHost=32&followRedirects=false
[junit4:junit4]   2> 2061 T339 oejs.Server.doStart jetty-8.1.8.v20121106
[junit4:junit4]   2> 2063 T339 oejs.AbstractConnector.doStart Started SelectChannelConnector@0.0.0.0:43182
[junit4:junit4]   2> 2063 T339 oasc.SolrResourceLoader.locateSolrHome JNDI not configured for solr (NoInitialContextEx)
[junit4:junit4]   2> 2064 T339 oasc.SolrResourceLoader.locateSolrHome using system property solr.solr.home: /mnt/ssd/jenkins/workspace/Lucene-Solr-4.x-Linux/solr/build/solr-core/test/J1/./solrtest-jetty1-1355318807932
[junit4:junit4]   2> 2064 T339 oasc.SolrResourceLoader.<init> new SolrResourceLoader for deduced Solr Home: '/mnt/ssd/jenkins/workspace/Lucene-Solr-4.x-Linux/solr/build/solr-core/test/J1/./solrtest-jetty1-1355318807932/'
[junit4:junit4]   2> 2079 T339 oass.SolrDispatchFilter.init SolrDispatchFilter.init()
[junit4:junit4]   2> 2080 T339 oasc.SolrResourceLoader.locateSolrHome JNDI not configured for solr (NoInitialContextEx)
[junit4:junit4]   2> 2080 T339 oasc.SolrResourceLoader.locateSolrHome using system property solr.solr.home: /mnt/ssd/jenkins/workspace/Lucene-Solr-4.x-Linux/solr/build/solr-core/test/J1/./solrtest-jetty1-1355318807932
[junit4:junit4]   2> 2080 T339 oasc.CoreContainer$Initializer.initialize looking for solr.xml: /mnt/ssd/jenkins/workspace/Lucene-Solr-4.x-Linux/solr/build/solr-core/test/J1/./solrtest-jetty1-1355318807932/solr.xml
[junit4:junit4]   2> 2081 T339 oasc.CoreContainer.<init> New CoreContainer 455520935
[junit4:junit4]   2> 2081 T339 oasc.CoreContainer.load Loading CoreContainer using Solr Home: '/mnt/ssd/jenkins/workspace/Lucene-Solr-4.x-Linux/solr/build/solr-core/test/J1/./solrtest-jetty1-1355318807932/'
[junit4:junit4]   2> 2081 T339 oasc.SolrResourceLoader.<init> new SolrResourceLoader for directory: '/mnt/ssd/jenkins/workspace/Lucene-Solr-4.x-Linux/solr/build/solr-core/test/J1/./solrtest-jetty1-1355318807932/'
[junit4:junit4]   2> 2097 T339 oasc.CoreContainer.load Registering Log Listener
[junit4:junit4]   2> 2111 T339 oasc.CoreContainer.initZooKeeper Zookeeper client=127.0.0.1:38624/solr
[junit4:junit4]   2> 2111 T339 oasc.ZkController.checkChrootPath zkHost includes chroot
[junit4:junit4]   2> 2112 T339 oaz.ZooKeeper.<init> Initiating client connection, connectString=127.0.0.1:38624 sessionTimeout=60000 watcher=org.apache.solr.common.cloud.ConnectionManager@1b9bc10c
[junit4:junit4]   2> 2112 T339 oascc.ConnectionManager.waitForConnected Waiting for client to connect to ZooKeeper
[junit4:junit4]   2> 2113 T375 oaz.ClientCnxn$SendThread.logStartConnect Opening socket connection to server localhost.localdomain/127.0.0.1:38624. Will not attempt to authenticate using SASL (access denied (javax.security.auth.AuthPermission getLoginConfiguration))
[junit4:junit4]   2> 2113 T375 oaz.ClientCnxn$SendThread.primeConnection Socket connection established to localhost.localdomain/127.0.0.1:38624, initiating session
[junit4:junit4]   2> 2113 T341 oazs.NIOServerCnxnFactory.run Accepted socket connection from /127.0.0.1:56867
[junit4:junit4]   2> 2114 T341 oazs.ZooKeeperServer.processConnectRequest Client attempting to establish new session at /127.0.0.1:56867
[junit4:junit4]   2> 2114 T343 oazs.ZooKeeperServer.finishSessionInit Established session 0x13b8f4bc5bb0004 with negotiated timeout 20000 for client /127.0.0.1:56867
[junit4:junit4]   2> 2114 T375 oaz.ClientCnxn$SendThread.onConnected Session establishment complete on server localhost.localdomain/127.0.0.1:38624, sessionid = 0x13b8f4bc5bb0004, negotiated timeout = 20000
[junit4:junit4]   2> 2114 T376 oascc.ConnectionManager.process Watcher org.apache.solr.common.cloud.ConnectionManager@1b9bc10c name:ZooKeeperConnection Watcher:127.0.0.1:38624 got event WatchedEvent state:SyncConnected type:None path:null path:null type:None
[junit4:junit4]   2> 2115 T339 oascc.ConnectionManager.waitForConnected Client is connected to ZooKeeper
[junit4:junit4]   2> 2115 T344 oazs.PrepRequestProcessor.pRequest2Txn Processed session termination for sessionid: 0x13b8f4bc5bb0004
[junit4:junit4]   2> 2116 T341 oazs.NIOServerCnxn.closeSock Closed socket connection for client /127.0.0.1:56867 which had sessionid 0x13b8f4bc5bb0004
[junit4:junit4]   2> 2116 T376 oaz.ClientCnxn$EventThread.run EventThread shut down
[junit4:junit4]   2> 2116 T339 oaz.ZooKeeper.close Session: 0x13b8f4bc5bb0004 closed
[junit4:junit4]   2> 2116 T339 oaz.ZooKeeper.<init> Initiating client connection, connectString=127.0.0.1:38624/solr sessionTimeout=8000 watcher=org.apache.solr.common.cloud.ConnectionManager@1b9c57a0
[junit4:junit4]   2> 2117 T377 oaz.ClientCnxn$SendThread.logStartConnect Opening socket connection to server localhost.localdomain/127.0.0.1:38624. Will not attempt to authenticate using SASL (access denied (javax.security.auth.AuthPermission getLoginConfiguration))
[junit4:junit4]   2> 2117 T339 oascc.ConnectionManager.waitForConnected Waiting for client to connect to ZooKeeper
[junit4:junit4]   2> 2118 T377 oaz.ClientCnxn$SendThread.primeConnection Socket connection established to localhost.localdomain/127.0.0.1:38624, initiating session
[junit4:junit4]   2> 2119 T341 oazs.NIOServerCnxnFactory.run Accepted socket connection from /127.0.0.1:56868
[junit4:junit4]   2> 2119 T341 oazs.ZooKeeperServer.processConnectRequest Client attempting to establish new session at /127.0.0.1:56868
[junit4:junit4]   2> 2120 T343 oazs.ZooKeeperServer.finishSessionInit Established session 0x13b8f4bc5bb0005 with negotiated timeout 8000 for client /127.0.0.1:56868
[junit4:junit4]   2> 2120 T377 oaz.ClientCnxn$SendThread.onConnected Session establishment complete on server localhost.localdomain/127.0.0.1:38624, sessionid = 0x13b8f4bc5bb0005, negotiated timeout = 8000
[junit4:junit4]   2> 2120 T378 oascc.ConnectionManager.process Watcher org.apache.solr.common.cloud.ConnectionManager@1b9c57a0 name:ZooKeeperConnection Watcher:127.0.0.1:38624/solr got event WatchedEvent state:SyncConnected type:None path:null path:null type:None
[junit4:junit4]   2> 2120 T339 oascc.ConnectionManager.waitForConnected Client is connected to ZooKeeper
[junit4:junit4]   2> 2121 T344 oazs.PrepRequestProcessor.pRequest Got user-level KeeperException when processing sessionid:0x13b8f4bc5bb0005 type:create cxid:0x1 zxid:0x49 txntype:-1 reqpath:n/a Error Path:/solr/overseer Error:KeeperErrorCode = NodeExists for /solr/overseer
[junit4:junit4]   2> 2122 T344 oazs.PrepRequestProcessor.pRequest Got user-level KeeperException when processing sessionid:0x13b8f4bc5bb0005 type:create cxid:0x2 zxid:0x4a txntype:-1 reqpath:n/a Error Path:/solr/overseer Error:KeeperErrorCode = NodeExists for /solr/overseer
[junit4:junit4]   2> 2124 T339 oasc.ZkController.createEphemeralLiveNode Register node as live in ZooKeeper:/live_nodes/127.0.0.1:43182_solr
[junit4:junit4]   2> 2125 T344 oazs.PrepRequestProcessor.pRequest Got user-level KeeperException when processing sessionid:0x13b8f4bc5bb0005 type:delete cxid:0x4 zxid:0x4b txntype:-1 reqpath:n/a Error Path:/solr/live_nodes/127.0.0.1:43182_solr Error:KeeperErrorCode = NoNode for /solr/live_nodes/127.0.0.1:43182_solr
[junit4:junit4]   2> 2126 T339 oascc.SolrZkClient.makePath makePath: /live_nodes/127.0.0.1:43182_solr
[junit4:junit4]   2> 2127 T361 oascc.ZkStateReader$2.process A cluster state change has occurred - updating... (1)
[junit4:junit4]   2> 2128 T339 oashc.HttpShardHandlerFactory.getParameter Setting socketTimeout to: 0
[junit4:junit4]   2> 2129 T361 oascc.ZkStateReader$3.process Updating live nodes... (2)
[junit4:junit4]   2> 2129 T339 oashc.HttpShardHandlerFactory.getParameter Setting urlScheme to: http://
[junit4:junit4]   2> 2129 T339 oashc.HttpShardHandlerFactory.getParameter Setting connTimeout to: 0
[junit4:junit4]   2> 2130 T339 oashc.HttpShardHandlerFactory.getParameter Setting maxConnectionsPerHost to: 20
[junit4:junit4]   2> 2130 T339 oashc.HttpShardHandlerFactory.getParameter Setting corePoolSize to: 0
[junit4:junit4]   2> 2130 T339 oashc.HttpShardHandlerFactory.getParameter Setting maximumPoolSize to: 2147483647
[junit4:junit4]   2> 2131 T339 oashc.HttpShardHandlerFactory.getParameter Setting maxThreadIdleTime to: 5
[junit4:junit4]   2> 2132 T339 oashc.HttpShardHandlerFactory.getParameter Setting sizeOfQueue to: -1
[junit4:junit4]   2> 2132 T339 oashc.HttpShardHandlerFactory.getParameter Setting fairnessPolicy to: false
[junit4:junit4]   2> 2132 T339 oascsi.HttpClientUtil.createClient Creating new http client, config:maxConnectionsPerHost=20&maxConnections=10000&socketTimeout=0&connTimeout=0&retry=false
[junit4:junit4]   2> 2139 T339 oascc.ZkStateReader.createClusterStateWatchersAndUpdate Updating cluster state from ZooKeeper... 
[junit4:junit4]   2> 2145 T379 oasc.CoreContainer.create Creating SolrCore 'collection1' using instanceDir: /mnt/ssd/jenkins/workspace/Lucene-Solr-4.x-Linux/solr/build/solr-core/test/J1/./solrtest-jetty1-1355318807932/collection1
[junit4:junit4]   2> 2146 T379 oasc.ZkController.createCollectionZkNode Check for collection zkNode:collection1
[junit4:junit4]   2> 2146 T379 oasc.ZkController.createCollectionZkNode Collection zkNode exists
[junit4:junit4]   2> 2146 T379 oasc.ZkController.readConfigName Load collection config from:/collections/collection1
[junit4:junit4]   2> 2147 T379 oasc.SolrResourceLoader.<init> new SolrResourceLoader for directory: '/mnt/ssd/jenkins/workspace/Lucene-Solr-4.x-Linux/solr/build/solr-core/test/J1/./solrtest-jetty1-1355318807932/collection1/'
[junit4:junit4]   2> 2148 T379 oasc.SolrResourceLoader.replaceClassLoader Adding 'file:/mnt/ssd/jenkins/workspace/Lucene-Solr-4.x-Linux/solr/build/solr-core/test/J1/solrtest-jetty1-1355318807932/collection1/lib/README' to classloader
[junit4:junit4]   2> 2148 T379 oasc.SolrResourceLoader.replaceClassLoader Adding 'file:/mnt/ssd/jenkins/workspace/Lucene-Solr-4.x-Linux/solr/build/solr-core/test/J1/solrtest-jetty1-1355318807932/collection1/lib/classes/' to classloader
[junit4:junit4]   2> 2189 T379 oasc.SolrConfig.<init> Using Lucene MatchVersion: LUCENE_41
[junit4:junit4]   2> 2251 T379 oasc.SolrConfig.<init> Loaded SolrConfig: solrconfig.xml
[junit4:junit4]   2> 2252 T379 oass.IndexSchema.readSchema Reading Solr Schema
[junit4:junit4]   2> 2258 T379 oass.IndexSchema.readSchema Schema name=test
[junit4:junit4]   2> 2456 T362 oascc.ZkStateReader.updateClusterState Updating cloud state from ZooKeeper... 
[junit4:junit4]   2> 2456 T362 oasc.Overseer$ClusterStateUpdater.updateState Update state numShards=null message={
[junit4:junit4]   2> 	  "operation":"state",
[junit4:junit4]   2> 	  "numShards":null,
[junit4:junit4]   2> 	  "shard":"control_shard",
[junit4:junit4]   2> 	  "roles":null,
[junit4:junit4]   2> 	  "state":"active",
[junit4:junit4]   2> 	  "core":"collection1",
[junit4:junit4]   2> 	  "collection":"control_collection",
[junit4:junit4]   2> 	  "node_name":"127.0.0.1:35281_solr",
[junit4:junit4]   2> 	  "base_url":"http://127.0.0.1:35281/solr"}
[junit4:junit4]   2> 2458 T378 oascc.ZkStateReader$2.process A cluster state change has occurred - updating... (2)
[junit4:junit4]   2> 2459 T361 oascc.ZkStateReader$2.process A cluster state change has occurred - updating... (2)
[junit4:junit4]   2> 2776 T379 oass.OpenExchangeRatesOrgProvider.init Initialized with rates=open-exchange-rates.json, refreshInterval=1440.
[junit4:junit4]   2> 2789 T379 oass.IndexSchema.readSchema default search field in schema is text
[junit4:junit4]   2> 2792 T379 oass.IndexSchema.readSchema unique key field: id
[junit4:junit4]   2> 2800 T379 oass.FileExchangeRateProvider.reload Reloading exchange rates from file currency.xml
[junit4:junit4]   2> 2804 T379 oass.FileExchangeRateProvider.reload Reloading exchange rates from file currency.xml
[junit4:junit4]   2> 2807 T379 oass.OpenExchangeRatesOrgProvider.reload Reloading exchange rates from open-exchange-rates.json
[junit4:junit4]   2> 2808 T379 oass.OpenExchangeRatesOrgProvider.reload Reloading exchange rates from open-exchange-rates.json
[junit4:junit4]   2> 2809 T379 oasc.SolrCore.<init> [collection1] Opening new SolrCore at /mnt/ssd/jenkins/workspace/Lucene-Solr-4.x-Linux/solr/build/solr-core/test/J1/./solrtest-jetty1-1355318807932/collection1/, dataDir=./org.apache.solr.cloud.BasicDistributedZk2Test-1355318805943/jetty1/
[junit4:junit4]   2> 2809 T379 oasc.JmxMonitoredMap.<init> JMX monitoring is enabled. Adding Solr mbeans to JMX Server: com.sun.jmx.mbeanserver.JmxMBeanServer@1ad38771
[junit4:junit4]   2> 2809 T379 oasc.SolrCore.getNewIndexDir New index directory detected: old=null new=./org.apache.solr.cloud.BasicDistributedZk2Test-1355318805943/jetty1/index/
[junit4:junit4]   2> 2810 T379 oasc.SolrCore.initIndex WARNING [collection1] Solr index directory './org.apache.solr.cloud.BasicDistributedZk2Test-1355318805943/jetty1/index' doesn't exist. Creating new index...
[junit4:junit4]   2> 2810 T379 oasc.CachingDirectoryFactory.get return new directory for /mnt/ssd/jenkins/workspace/Lucene-Solr-4.x-Linux/solr/build/solr-core/test/J1/./org.apache.solr.cloud.BasicDistributedZk2Test-1355318805943/jetty1/index forceNew:false
[junit4:junit4]   2> 2813 T379 oasc.SolrDeletionPolicy.onCommit SolrDeletionPolicy.onCommit: commits:num=1
[junit4:junit4]   2> 		commit{dir=RateLimitedDirectoryWrapper(NRTCachingDirectory(org.apache.lucene.store.NIOFSDirectory@/mnt/ssd/jenkins/workspace/Lucene-Solr-4.x-Linux/solr/build/solr-core/test/J1/org.apache.solr.cloud.BasicDistributedZk2Test-1355318805943/jetty1/index lockFactory=org.apache.lucene.store.NativeFSLockFactory@1b0867dc; maxCacheMB=48.0 maxMergeSizeMB=4.0)),segFN=segments_1,generation=1,filenames=[segments_1]
[junit4:junit4]   2> 2814 T379 oasc.SolrDeletionPolicy.updateCommits newest commit = 1
[junit4:junit4]   2> 2815 T379 oasc.SolrCore.initWriters created xml: solr.XMLResponseWriter
[junit4:junit4]   2> 2816 T379 oasup.UpdateRequestProcessorChain.init inserting DistributedUpdateProcessorFactory into updateRequestProcessorChain "dedupe"
[junit4:junit4]   2> 2816 T379 oasup.UpdateRequestProcessorChain.init inserting DistributedUpdateProcessorFactory into updateRequestProcessorChain "dedupe-allfields"
[junit4:junit4]   2> 2816 T379 oasup.UpdateRequestProcessorChain.init inserting DistributedUpdateProcessorFactory into updateRequestProcessorChain "stored_sig"
[junit4:junit4]   2> 2817 T379 oasup.UpdateRequestProcessorChain.init inserting DistributedUpdateProcessorFactory into updateRequestProcessorChain "uniq-fields"
[junit4:junit4]   2> 2818 T379 oasup.UpdateRequestProcessorChain.init inserting DistributedUpdateProcessorFactory into updateRequestProcessorChain "distrib-dup-test-chain-implicit"
[junit4:junit4]   2> 2818 T379 oasc.RequestHandlers.initHandlersFromConfig adding lazy requestHandler: solr.ReplicationHandler
[junit4:junit4]   2> 2818 T379 oasc.RequestHandlers.initHandlersFromConfig created /replication: solr.ReplicationHandler
[junit4:junit4]   2> 2819 T379 oasc.RequestHandlers.initHandlersFromConfig created standard: solr.StandardRequestHandler
[junit4:junit4]   2> 2820 T379 oasc.RequestHandlers.initHandlersFromConfig created /get: solr.RealTimeGetHandler
[junit4:junit4]   2> 2821 T379 oasc.RequestHandlers.initHandlersFromConfig created dismax: solr.SearchHandler
[junit4:junit4]   2> 2822 T379 oasc.RequestHandlers.initHandlersFromConfig created mock: org.apache.solr.core.MockQuerySenderListenerReqHandler
[junit4:junit4]   2> 2822 T379 oasc.RequestHandlers.initHandlersFromConfig created /admin/: org.apache.solr.handler.admin.AdminHandlers
[junit4:junit4]   2> 2823 T379 oasc.RequestHandlers.initHandlersFromConfig created defaults: solr.StandardRequestHandler
[junit4:junit4]   2> 2823 T379 oasc.RequestHandlers.initHandlersFromConfig adding lazy requestHandler: solr.StandardRequestHandler
[junit4:junit4]   2> 2824 T379 oasc.RequestHandlers.initHandlersFromConfig created lazy: solr.StandardRequestHandler
[junit4:junit4]   2> 2825 T379 oasc.RequestHandlers.initHandlersFromConfig created /update: solr.UpdateRequestHandler
[junit4:junit4]   2> 2825 T379 oasc.RequestHandlers.initHandlersFromConfig created /terms: org.apache.solr.handler.component.SearchHandler
[junit4:junit4]   2> 2826 T379 oasc.RequestHandlers.initHandlersFromConfig created spellCheckCompRH: org.apache.solr.handler.component.SearchHandler
[junit4:junit4]   2> 2827 T379 oasc.RequestHandlers.initHandlersFromConfig created spellCheckCompRH_Direct: org.apache.solr.handler.component.SearchHandler
[junit4:junit4]   2> 2828 T379 oasc.RequestHandlers.initHandlersFromConfig created spellCheckWithWordbreak: org.apache.solr.handler.component.SearchHandler
[junit4:junit4]   2> 2829 T379 oasc.RequestHandlers.initHandlersFromConfig created spellCheckWithWordbreak_Direct: org.apache.solr.handler.component.SearchHandler
[junit4:junit4]   2> 2830 T379 oasc.RequestHandlers.initHandlersFromConfig created spellCheckCompRH1: org.apache.solr.handler.component.SearchHandler
[junit4:junit4]   2> 2830 T379 oasc.RequestHandlers.initHandlersFromConfig created tvrh: org.apache.solr.handler.component.SearchHandler
[junit4:junit4]   2> 2831 T379 oasc.RequestHandlers.initHandlersFromConfig created /mlt: solr.MoreLikeThisHandler
[junit4:junit4]   2> 2832 T379 oasc.RequestHandlers.initHandlersFromConfig created /debug/dump: solr.DumpRequestHandler
[junit4:junit4]   2> 2834 T379 oashl.XMLLoader.init xsltCacheLifetimeSeconds=60
[junit4:junit4]   2> 2836 T379 oasc.SolrCore.initDeprecatedSupport WARNING solrconfig.xml uses deprecated <admin/gettableFiles>, Please update your config to use the ShowFileRequestHandler.
[junit4:junit4]   2> 2838 T379 oasc.SolrCore.initDeprecatedSupport WARNING adding ShowFileRequestHandler with hidden files: [SCHEMA.XML, OLD_SYNONYMS.TXT, STOPWORDS.TXT, PROTWORDS.TXT, OPEN-EXCHANGE-RATES.JSON, SYNONYMS.TXT, CURRENCY.XML, MAPPING-ISOLATIN1ACCENT.TXT]
[junit4:junit4]   2> 2840 T379 oass.SolrIndexSearcher.<init> Opening Searcher@1b029cf2 main
[junit4:junit4]   2> 2840 T379 oass.SolrIndexSearcher.getIndexDir WARNING WARNING: Directory impl does not support setting indexDir: org.apache.lucene.store.RateLimitedDirectoryWrapper
[junit4:junit4]   2> 2840 T379 oasu.CommitTracker.<init> Hard AutoCommit: disabled
[junit4:junit4]   2> 2841 T379 oasu.CommitTracker.<init> Soft AutoCommit: disabled
[junit4:junit4]   2> 2841 T379 oashc.SpellCheckComponent.inform Initializing spell checkers
[junit4:junit4]   2> 2845 T379 oass.DirectSolrSpellChecker.init init: {name=direct,classname=DirectSolrSpellChecker,field=lowerfilt,minQueryLength=3}
[junit4:junit4]   2> 2876 T380 oasc.SolrCore.registerSearcher [collection1] Registered new searcher Searcher@1b029cf2 main{StandardDirectoryReader(segments_1:1)}
[junit4:junit4]   2> 2882 T379 oasc.ZkController.publish publishing core=collection1 state=down
[junit4:junit4]   2> 2883 T379 oasc.ZkController.publish numShards not found on descriptor - reading it from system property
[junit4:junit4]   2> 2961 T362 oascc.ZkStateReader.updateClusterState Updating cloud state from ZooKeeper... 
[junit4:junit4]   2> 2962 T362 oasc.Overseer$ClusterStateUpdater.updateState Update state numShards=2 message={
[junit4:junit4]   2> 	  "operation":"state",
[junit4:junit4]   2> 	  "numShards":"2",
[junit4:junit4]   2> 	  "shard":null,
[junit4:junit4]   2> 	  "roles":null,
[junit4:junit4]   2> 	  "state":"down",
[junit4:junit4]   2> 	  "core":"collection1",
[junit4:junit4]   2> 	  "collection":"collection1",
[junit4:junit4]   2> 	  "node_name":"127.0.0.1:43182_solr",
[junit4:junit4]   2> 	  "base_url":"http://127.0.0.1:43182/solr"}
[junit4:junit4]   2> 2962 T362 oasc.Overseer$ClusterStateUpdater.createCollection Create collection collection1 with numShards 2
[junit4:junit4]   2> 2963 T362 oasc.Overseer$ClusterStateUpdater.updateState Assigning new node to shard shard=shard1
[junit4:junit4]   2> 2965 T361 oascc.ZkStateReader$2.process A cluster state change has occurred - updating... (2)
[junit4:junit4]   2> 2965 T378 oascc.ZkStateReader$2.process A cluster state change has occurred - updating... (2)
[junit4:junit4]   2> 3384 T379 oasc.CoreContainer.register registering core: collection1
[junit4:junit4]   2> 3384 T379 oasc.ZkController.register Register shard - core:collection1 address:http://127.0.0.1:43182/solr shardId:shard1
[junit4:junit4]   2> 3385 T379 oascc.SolrZkClient.makePath makePath: /collections/collection1/leader_elect/shard1/election
[junit4:junit4]   2> 3389 T344 oazs.PrepRequestProcessor.pRequest Got user-level KeeperException when processing sessionid:0x13b8f4bc5bb0005 type:delete cxid:0x45 zxid:0x5b txntype:-1 reqpath:n/a Error Path:/solr/collections/collection1/leaders Error:KeeperErrorCode = NoNode for /solr/collections/collection1/leaders
[junit4:junit4]   2> 3389 T379 oasc.ShardLeaderElectionContext.runLeaderProcess Running the leader process.
[junit4:junit4]   2> 3390 T344 oazs.PrepRequestProcessor.pRequest Got user-level KeeperException when processing sessionid:0x13b8f4bc5bb0005 type:create cxid:0x46 zxid:0x5c txntype:-1 reqpath:n/a Error Path:/solr/overseer Error:KeeperErrorCode = NodeExists for /solr/overseer
[junit4:junit4]   2> 3391 T379 oasc.ShardLeaderElectionContext.waitForReplicasToComeUp Enough replicas found to continue.
[junit4:junit4]   2> 3391 T379 oasc.ShardLeaderElectionContext.runLeaderProcess I may be the new leader - try and sync
[junit4:junit4]   2> 3391 T379 oasc.SyncStrategy.sync Sync replicas to http://127.0.0.1:43182/solr/collection1/
[junit4:junit4]   2> 3391 T379 oasc.SyncStrategy.syncReplicas Sync Success - now sync replicas to me
[junit4:junit4]   2> 3391 T379 oasc.SyncStrategy.syncToMe http://127.0.0.1:43182/solr/collection1/ has no replicas
[junit4:junit4]   2> 3392 T379 oasc.ShardLeaderElectionContext.runLeaderProcess I am the new leader: http://127.0.0.1:43182/solr/collection1/
[junit4:junit4]   2> 3392 T379 oascc.SolrZkClient.makePath makePath: /collections/collection1/leaders/shard1
[junit4:junit4]   2> 3395 T344 oazs.PrepRequestProcessor.pRequest Got user-level KeeperException when processing sessionid:0x13b8f4bc5bb0005 type:create cxid:0x50 zxid:0x60 txntype:-1 reqpath:n/a Error Path:/solr/overseer Error:KeeperErrorCode = NodeExists for /solr/overseer
[junit4:junit4]   2> 3468 T362 oascc.ZkStateReader.updateClusterState Updating cloud state from ZooKeeper... 
[junit4:junit4]   2> 3472 T361 oascc.ZkStateReader$2.process A cluster state change has occurred - updating... (2)
[junit4:junit4]   2> 3472 T378 oascc.ZkStateReader$2.process A cluster state change has occurred - updating... (2)
[junit4:junit4]   2> 3496 T379 oasc.ZkController.register We are http://127.0.0.1:43182/solr/collection1/ and leader is http://127.0.0.1:43182/solr/collection1/
[junit4:junit4]   2> 3497 T379 oasc.ZkController.register No LogReplay needed for core=collection1 baseURL=http://127.0.0.1:43182/solr
[junit4:junit4]   2> 3497 T379 oasc.ZkController.checkRecovery I am the leader, no recovery necessary
[junit4:junit4]   2> 3497 T379 oasc.ZkController.publish publishing core=collection1 state=active
[junit4:junit4]   2> 3497 T379 oasc.ZkController.publish numShards not found on descriptor - reading it from system property
[junit4:junit4]   2> 3498 T379 oascc.ZkStateReader.updateClusterState Updating cloud state from ZooKeeper... 
[junit4:junit4]   2> 3499 T339 oass.SolrDispatchFilter.init user.dir=/mnt/ssd/jenkins/workspace/Lucene-Solr-4.x-Linux/solr/build/solr-core/test/J1
[junit4:junit4]   2> 3500 T339 oass.SolrDispatchFilter.init SolrDispatchFilter.init() done
[junit4:junit4]   2> 3500 T339 oascsi.HttpClientUtil.createClient Creating new http client, config:maxConnections=128&maxConnectionsPerHost=32&followRedirects=false
[junit4:junit4]   2> 3562 T339 oejs.Server.doStart jetty-8.1.8.v20121106
[junit4:junit4]   2> 3564 T339 oejs.AbstractConnector.doStart Started SelectChannelConnector@0.0.0.0:50246
[junit4:junit4]   2> 3565 T339 oasc.SolrResourceLoader.locateSolrHome JNDI not configured for solr (NoInitialContextEx)
[junit4:junit4]   2> 3565 T339 oasc.SolrResourceLoader.locateSolrHome using system property solr.solr.home: /mnt/ssd/jenkins/workspace/Lucene-Solr-4.x-Linux/solr/build/solr-core/test/J1/./solrtest-jetty2-1355318809428
[junit4:junit4]   2> 3565 T339 oasc.SolrResourceLoader.<init> new SolrResourceLoader for deduced Solr Home: '/mnt/ssd/jenkins/workspace/Lucene-Solr-4.x-Linux/solr/build/solr-core/test/J1/./solrtest-jetty2-1355318809428/'
[junit4:junit4]   2> 3581 T339 oass.SolrDispatchFilter.init SolrDispatchFilter.init()
[junit4:junit4]   2> 3581 T339 oasc.SolrResourceLoader.locateSolrHome JNDI not configured for solr (NoInitialContextEx)
[junit4:junit4]   2> 3582 T339 oasc.SolrResourceLoader.locateSolrHome using system property solr.solr.home: /mnt/ssd/jenkins/workspace/Lucene-Solr-4.x-Linux/solr/build/solr-core/test/J1/./solrtest-jetty2-1355318809428
[junit4:junit4]   2> 3582 T339 oasc.CoreContainer$Initializer.initialize looking for solr.xml: /mnt/ssd/jenkins/workspace/Lucene-Solr-4.x-Linux/solr/build/solr-core/test/J1/./solrtest-jetty2-1355318809428/solr.xml
[junit4:junit4]   2> 3582 T339 oasc.CoreContainer.<init> New CoreContainer 455968067
[junit4:junit4]   2> 3583 T339 oasc.CoreContainer.load Loading CoreContainer using Solr Home: '/mnt/ssd/jenkins/workspace/Lucene-Solr-4.x-Linux/solr/build/solr-core/test/J1/./solrtest-jetty2-1355318809428/'
[junit4:junit4]   2> 3583 T339 oasc.SolrResourceLoader.<init> new SolrResourceLoader for directory: '/mnt/ssd/jenkins/workspace/Lucene-Solr-4.x-Linux/solr/build/solr-core/test/J1/./solrtest-jetty2-1355318809428/'
[junit4:junit4]   2> 3599 T339 oasc.CoreContainer.load Registering Log Listener
[junit4:junit4]   2> 3613 T339 oasc.CoreContainer.initZooKeeper Zookeeper client=127.0.0.1:38624/solr
[junit4:junit4]   2> 3613 T339 oasc.ZkController.checkChrootPath zkHost includes chroot
[junit4:junit4]   2> 3614 T339 oaz.ZooKeeper.<init> Initiating client connection, connectString=127.0.0.1:38624 sessionTimeout=60000 watcher=org.apache.solr.common.cloud.ConnectionManager@1ba0fc95
[junit4:junit4]   2> 3615 T390 oaz.ClientCnxn$SendThread.logStartConnect Opening socket connection to server localhost.localdomain/127.0.0.1:38624. Will not attempt to authenticate using SASL (access denied (javax.security.auth.AuthPermission getLoginConfiguration))
[junit4:junit4]   2> 3615 T339 oascc.ConnectionManager.waitForConnected Waiting for client to connect to ZooKeeper
[junit4:junit4]   2> 3615 T341 oazs.NIOServerCnxnFactory.run Accepted socket connection from /127.0.0.1:56869
[junit4:junit4]   2> 3615 T390 oaz.ClientCnxn$SendThread.primeConnection Socket connection established to localhost.localdomain/127.0.0.1:38624, initiating session
[junit4:junit4]   2> 3616 T341 oazs.ZooKeeperServer.processConnectRequest Client attempting to establish new session at /127.0.0.1:56869
[junit4:junit4]   2> 3616 T343 oazs.ZooKeeperServer.finishSessionInit Established session 0x13b8f4bc5bb0006 with negotiated timeout 20000 for client /127.0.0.1:56869
[junit4:junit4]   2> 3616 T390 oaz.ClientCnxn$SendThread.onConnected Session establishment complete on server localhost.localdomain/127.0.0.1:38624, sessionid = 0x13b8f4bc5bb0006, negotiated timeout = 20000
[junit4:junit4]   2> 3617 T391 oascc.ConnectionManager.process Watcher org.apache.solr.common.cloud.ConnectionManager@1ba0fc95 name:ZooKeeperConnection Watcher:127.0.0.1:38624 got event WatchedEvent state:SyncConnected type:None path:null path:null type:None
[junit4:junit4]   2> 3617 T339 oascc.ConnectionManager.waitForConnected Client is connected to ZooKeeper
[junit4:junit4]   2> 3618 T344 oazs.PrepRequestProcessor.pRequest2Txn Processed session termination for sessionid: 0x13b8f4bc5bb0006
[junit4:junit4]   2> 3618 T391 oaz.ClientCnxn$EventThread.run EventThread shut down
[junit4:junit4]   2> 3618 T341 oazs.NIOServerCnxn.closeSock Closed socket connection for client /127.0.0.1:56869 which had sessionid 0x13b8f4bc5bb0006
[junit4:junit4]   2> 3618 T339 oaz.ZooKeeper.close Session: 0x13b8f4bc5bb0006 closed
[junit4:junit4]   2> 3619 T339 oaz.ZooKeeper.<init> Initiating client connection, connectString=127.0.0.1:38624/solr sessionTimeout=8000 watcher=org.apache.solr.common.cloud.ConnectionManager@1ba1533d
[junit4:junit4]   2> 3620 T392 oaz.ClientCnxn$SendThread.logStartConnect Opening socket connection to server localhost.localdomain/127.0.0.1:38624. Will not attempt to authenticate using SASL (access denied (javax.security.auth.AuthPermission getLoginConfiguration))
[junit4:junit4]   2> 3619 T339 oascc.ConnectionManager.waitForConnected Waiting for client to connect to ZooKeeper
[junit4:junit4]   2> 3620 T392 oaz.ClientCnxn$SendThread.primeConnection Socket connection established to localhost.localdomain/127.0.0.1:38624, initiating session
[junit4:junit4]   2> 3620 T341 oazs.NIOServerCnxnFactory.run Accepted socket connection from /127.0.0.1:56870
[junit4:junit4]   2> 3620 T341 oazs.ZooKeeperServer.processConnectRequest Client attempting to establish new session at /127.0.0.1:56870
[junit4:junit4]   2> 3621 T343 oazs.ZooKeeperServer.finishSessionInit Established session 0x13b8f4bc5bb0007 with negotiated timeout 8000 for client /127.0.0.1:56870
[junit4:junit4]   2> 3621 T392 oaz.ClientCnxn$SendThread.onConnected Session establishment complete on server localhost.localdomain/127.0.0.1:38624, sessionid = 0x13b8f4bc5bb0007, negotiated timeout = 8000
[junit4:junit4]   2> 3621 T393 oascc.ConnectionManager.process Watcher org.apache.solr.common.cloud.ConnectionManager@1ba1533d name:ZooKeeperConnection Watcher:127.0.0.1:38624/solr got event WatchedEvent state:SyncConnected type:None path:null path:null type:None
[junit4:junit4]   2> 3621 T339 oascc.ConnectionManager.waitForConnected Client is connected to ZooKeeper
[junit4:junit4]   2> 3622 T344 oazs.PrepRequestProcessor.pRequest Got user-level KeeperException when processing sessionid:0x13b8f4bc5bb0007 type:create cxid:0x1 zxid:0x6d txntype:-1 reqpath:n/a Error Path:/solr/overseer Error:KeeperErrorCode = NodeExists for /solr/overseer
[junit4:junit4]   2> 3622 T344 oazs.PrepRequestProcessor.pRequest Got user-level KeeperException when processing sessionid:0x13b8f4bc5bb0007 type:create cxid:0x2 zxid:0x6e txntype:-1 reqpath:n/a Error Path:/solr/overseer Error:KeeperErrorCode = NodeExists for /solr/overseer
[junit4:junit4]   2> 3623 T339 oasc.ZkController.createEphemeralLiveNode Register node as live in ZooKeeper:/live_nodes/127.0.0.1:50246_solr
[junit4:junit4]   2> 3623 T344 oazs.PrepRequestProcessor.pRequest Got user-level KeeperException when processing sessionid:0x13b8f4bc5bb0007 type:delete cxid:0x4 zxid:0x6f txntype:-1 reqpath:n/a Error Path:/solr/live_nodes/127.0.0.1:50246_solr Error:KeeperErrorCode = NoNode for /solr/live_nodes/127.0.0.1:50246_solr
[junit4:junit4]   2> 3624 T339 oascc.SolrZkClient.makePath makePath: /live_nodes/127.0.0.1:50246_solr
[junit4:junit4]   2> 3625 T361 oascc.ZkStateReader$2.process A cluster state change has occurred - updating... (2)
[junit4:junit4]   2> 3625 T378 oascc.ZkStateReader$3.process Updating live nodes... (3)
[junit4:junit4]   2> 3625 T378 oascc.ZkStateReader$2.process A cluster state change has occurred - updating... (3)
[junit4:junit4]   2> 3625 T339 oashc.HttpShardHandlerFactory.getParameter Setting socketTimeout to: 0
[junit4:junit4]   2> 3626 T339 oashc.HttpShardHandlerFactory.getParameter Setting urlScheme to: http://
[junit4:junit4]   2> 3626 T361 oascc.ZkStateReader$3.process Updating live nodes... (3)
[junit4:junit4]   2> 3626 T339 oashc.HttpShardHandlerFactory.getParameter Setting connTimeout to: 0
[junit4:junit4]   2> 3627 T339 oashc.HttpShardHandlerFactory.getParameter Setting maxConnectionsPerHost to: 20
[junit4:junit4]   2> 3627 T339 oashc.HttpShardHandlerFactory.getParameter Setting corePoolSize to: 0
[junit4:junit4]   2> 3627 T339 oashc.HttpShardHandlerFactory.getParameter Setting maximumPoolSize to: 2147483647
[junit4:junit4]   2> 3628 T339 oashc.HttpShardHandlerFactory.getParameter Setting maxThreadIdleTime to: 5
[junit4:junit4]   2> 3628 T339 oashc.HttpShardHandlerFactory.getParameter Setting sizeOfQueue to: -1
[junit4:junit4]   2> 3628 T339 oashc.HttpShardHandlerFactory.getParameter Setting fairnessPolicy to: false
[junit4:junit4]   2> 3629 T339 oascsi.HttpClientUtil.createClient Creating new http client, config:maxConnectionsPerHost=20&maxConnections=10000&socketTimeout=0&connTimeout=0&retry=false
[junit4:junit4]   2> 3633 T339 oascc.ZkStateReader.createClusterStateWatchersAndUpdate Updating cluster state from ZooKeeper... 
[junit4:junit4]   2> 3639 T394 oasc.CoreContainer.create Creating SolrCore 'collection1' using instanceDir: /mnt/ssd/jenkins/workspace/Lucene-Solr-4.x-Linux/solr/build/solr-core/test/J1/./solrtest-jetty2-1355318809428/collection1
[junit4:junit4]   2> 3639 T394 oasc.ZkController.createCollectionZkNode Check for collection zkNode:collection1
[junit4:junit4]   2> 3640 T394 oasc.ZkController.createCollectionZkNode Collection zkNode exists
[junit4:junit4]   2> 3640 T394 oasc.ZkController.readConfigName Load collection config from:/collections/collection1
[junit4:junit4]   2> 3641 T394 oasc.SolrResourceLoader.<init> new SolrResourceLoader for directory: '/mnt/ssd/jenkins/workspace/Lucene-Solr-4.x-Linux/solr/build/solr-core/test/J1/./solrtest-jetty2-1355318809428/collection1/'
[junit4:junit4]   2> 3641 T394 oasc.SolrResourceLoader.replaceClassLoader Adding 'file:/mnt/ssd/jenkins/workspace/Lucene-Solr-4.x-Linux/solr/build/solr-core/test/J1/solrtest-jetty2-1355318809428/collection1/lib/README' to classloader
[junit4:junit4]   2> 3641 T394 oasc.SolrResourceLoader.replaceClassLoader Adding 'file:/mnt/ssd/jenkins/workspace/Lucene-Solr-4.x-Linux/solr/build/solr-core/test/J1/solrtest-jetty2-1355318809428/collection1/lib/classes/' to classloader
[junit4:junit4]   2> 3680 T394 oasc.SolrConfig.<init> Using Lucene MatchVersion: LUCENE_41
[junit4:junit4]   2> 3748 T394 oasc.SolrConfig.<init> Loaded SolrConfig: solrconfig.xml
[junit4:junit4]   2> 3749 T394 oass.IndexSchema.readSchema Reading Solr Schema
[junit4:junit4]   2> 3755 T394 oass.IndexSchema.readSchema Schema name=test
[junit4:junit4]   2> 3975 T362 oascc.ZkStateReader.updateClusterState Updating cloud state from ZooKeeper... 
[junit4:junit4]   2> 3975 T362 oasc.Overseer$ClusterStateUpdater.updateState Update state numShards=2 message={
[junit4:junit4]   2> 	  "operation":"state",
[junit4:junit4]   2> 	  "numShards":"2",
[junit4:junit4]   2> 	  "shard":"shard1",
[junit4:junit4]   2> 	  "roles":null,
[junit4:junit4]   2> 	  "state":"active",
[junit4:junit4]   2> 	  "core":"collection1",
[junit4:junit4]   2> 	  "collection":"collection1",
[junit4:junit4]   2> 	  "node_name":"127.0.0.1:43182_solr",
[junit4:junit4]   2> 	  "base_url":"http://127.0.0.1:43182/solr"}
[junit4:junit4]   2> 3978 T361 oascc.ZkStateReader$2.process A cluster state change has occurred - updating... (3)
[junit4:junit4]   2> 3978 T378 oascc.ZkStateReader$2.process A cluster state change has occurred - updating... (3)
[junit4:junit4]   2> 3978 T393 oascc.ZkStateReader$2.process A cluster state change has occurred - updating... (3)
[junit4:junit4]   2> 4279 T394 oass.OpenExchangeRatesOrgProvider.init Initialized with rates=open-exchange-rates.json, refreshInterval=1440.
[junit4:junit4]   2> 4287 T394 oass.IndexSchema.readSchema default search field in schema is text
[junit4:junit4]   2> 4291 T394 oass.IndexSchema.readSchema unique key field: id
[junit4:junit4]   2> 4299 T394 oass.FileExchangeRateProvider.reload Reloading exchange rates from file currency.xml
[junit4:junit4]   2> 4303 T394 oass.FileExchangeRateProvider.reload Reloading exchange rates from file currency.xml
[junit4:junit4]   2> 4306 T394 oass.OpenExchangeRatesOrgProvider.reload Reloading exchange rates from open-exchange-rates.json
[junit4:junit4]   2> 4307 T394 oass.OpenExchangeRatesOrgProvider.reload Reloading exchange rates from open-exchange-rates.json
[junit4:junit4]   2> 4308 T394 oasc.SolrCore.<init> [collection1] Opening new SolrCore at /mnt/ssd/jenkins/workspace/Lucene-Solr-4.x-Linux/solr/build/solr-core/test/J1/./solrtest-jetty2-1355318809428/collection1/, dataDir=./org.apache.solr.cloud.BasicDistributedZk2Test-1355318805943/jetty2/
[junit4:junit4]   2> 4308 T394 oasc.JmxMonitoredMap.<init> JMX monitoring is enabled. Adding Solr mbeans to JMX Server: com.sun.jmx.mbeanserver.JmxMBeanServer@1ad38771
[junit4:junit4]   2> 4309 T394 oasc.SolrCore.getNewIndexDir New index directory detected: old=null new=./org.apache.solr.cloud.BasicDistributedZk2Test-1355318805943/jetty2/index/
[junit4:junit4]   2> 4309 T394 oasc.SolrCore.initIndex WARNING [collection1] Solr index directory './org.apache.solr.cloud.BasicDistributedZk2Test-1355318805943/jetty2/index' doesn't exist. Creating new index...
[junit4:junit4]   2> 4310 T394 oasc.CachingDirectoryFactory.get return new directory for /mnt/ssd/jenkins/workspace/Lucene-Solr-4.x-Linux/solr/build/solr-core/test/J1/./org.apache.solr.cloud.BasicDistributedZk2Test-1355318805943/jetty2/index forceNew:false
[junit4:junit4]   2> 4313 T394 oasc.SolrDeletionPolicy.onCommit SolrDeletionPolicy.onCommit: commits:num=1
[junit4:junit4]   2> 		commit{dir=RateLimitedDirectoryWrapper(NRTCachingDirectory(org.apache.lucene.store.NIOFSDirectory@/mnt/ssd/jenkins/workspace/Lucene-Solr-4.x-Linux/solr/build/solr-core/test/J1/org.apache.solr.cloud.BasicDistributedZk2Test-1355318805943/jetty2/index lockFactory=org.apache.lucene.store.NativeFSLockFactory@1af80167; maxCacheMB=48.0 maxMergeSizeMB=4.0)),segFN=segments_1,generation=1,filenames=[segments_1]
[junit4:junit4]   2> 4313 T394 oasc.SolrDeletionPolicy.updateCommits newest commit = 1
[junit4:junit4]   2> 4314 T394 oasc.SolrCore.initWriters created xml: solr.XMLResponseWriter
[junit4:junit4]   2> 4315 T394 oasup.UpdateRequestProcessorChain.init inserting DistributedUpdateProcessorFactory into updateRequestProcessorChain "dedupe"
[junit4:junit4]   2> 4315 T394 oasup.UpdateRequestProcessorChain.init inserting DistributedUpdateProcessorFactory into updateRequestProcessorChain "dedupe-allfields"
[junit4:junit4]   2> 4316 T394 oasup.UpdateRequestProcessorChain.init inserting DistributedUpdateProcessorFactory into updateRequestProcessorChain "stored_sig"
[junit4:junit4]   2> 4316 T394 oasup.UpdateRequestProcessorChain.init inserting DistributedUpdateProcessorFactory into updateRequestProcessorChain "uniq-fields"
[junit4:junit4]   2> 4316 T394 oasup.UpdateRequestProcessorChain.init inserting DistributedUpdateProcessorFactory into updateRequestProcessorChain "distrib-dup-test-chain-implicit"
[junit4:junit4]   2> 4316 T394 oasc.RequestHandlers.initHandlersFromConfig adding lazy requestHandler: solr.ReplicationHandler
[junit4:junit4]   2> 4317 T394 oasc.RequestHandlers.initHandlersFromConfig created /replication: solr.ReplicationHandler
[junit4:junit4]   2> 4318 T394 oasc.RequestHandlers.initHandlersFromConfig created standard: solr.StandardRequestHandler
[junit4:junit4]   2> 4318 T394 oasc.RequestHandlers.initHandlersFromConfig created /get: solr.RealTimeGetHandler
[junit4:junit4]   2> 4319 T394 oasc.RequestHandlers.initHandlersFromConfig created dismax: solr.SearchHandler
[junit4:junit4]   2> 4320 T394 oasc.RequestHandlers.initHandlersFromConfig created mock: org.apache.solr.core.MockQuerySenderListenerReqHandler
[junit4:junit4]   2> 4321 T394 oasc.RequestHandlers.initHandlersFromConfig created /admin/: org.apache.solr.handler.admin.AdminHandlers
[junit4:junit4]   2> 4321 T394 oasc.RequestHandlers.initHandlersFromConfig created defaults: solr.StandardRequestHandler
[junit4:junit4]   2> 4322 T394 oasc.RequestHandlers.initHandlersFromConfig adding lazy requestHandler: solr.StandardRequestHandler
[junit4:junit4]   2> 4322 T394 oasc.RequestHandlers.initHandlersFromConfig created lazy: solr.StandardRequestHandler
[junit4:junit4]   2> 4323 T394 oasc.RequestHandlers.initHandlersFromConfig created /update: solr.UpdateRequestHandler
[junit4:junit4]   2> 4324 T394 oasc.RequestHandlers.initHandlersFromConfig created /terms: org.apache.solr.handler.component.SearchHandler
[junit4:junit4]   2> 4324 T394 oasc.RequestHandlers.initHandlersFromConfig created spellCheckCompRH: org.apache.solr.handler.component.SearchHandler
[junit4:junit4]   2> 4325 T394 oasc.RequestHandlers.initHandlersFromConfig created spellCheckCompRH_Direct: org.apache.solr.handler.component.SearchHandler
[junit4:junit4]   2> 4326 T394 oasc.RequestHandlers.initHandlersFromConfig created spellCheckWithWordbreak: org.apache.solr.handler.component.SearchHandler
[junit4:junit4]   2> 4327 T394 oasc.RequestHandlers.initHandlersFromConfig created spellCheckWithWordbreak_Direct: org.apache.solr.handler.component.SearchHandler
[junit4:junit4]   2> 4328 T394 oasc.RequestHandlers.initHandlersFromConfig created spellCheckCompRH1: org.apache.solr.handler.component.SearchHandler
[junit4:junit4]   2> 4329 T394 oasc.RequestHandlers.initHandlersFromConfig created tvrh: org.apache.solr.handler.component.SearchHandler
[junit4:junit4]   2> 4330 T394 oasc.RequestHandlers.initHandlersFromConfig created /mlt: solr.MoreLikeThisHandler
[junit4:junit4]   2> 4330 T394 oasc.RequestHandlers.initHandlersFromConfig created /debug/dump: solr.DumpRequestHandler
[junit4:junit4]   2> 4333 T394 oashl.XMLLoader.init xsltCacheLifetimeSeconds=60
[junit4:junit4]   2> 4335 T394 oasc.SolrCore.initDeprecatedSupport WARNING solrconfig.xml uses deprecated <admin/gettableFiles>, Please update your config to use the ShowFileRequestHandler.
[junit4:junit4]   2> 4336 T394 oasc.SolrCore.initDeprecatedSupport WARNING adding ShowFileRequestHandler with hidden files: [SCHEMA.XML, OLD_SYNONYMS.TXT, STOPWORDS.TXT, PROTWORDS.TXT, OPEN-EXCHANGE-RATES.JSON, SYNONYMS.TXT, CURRENCY.XML, MAPPING-ISOLATIN1ACCENT.TXT]
[junit4:junit4]   2> 4338 T394 oass.SolrIndexSearcher.<init> Opening Searcher@1b14091e main
[junit4:junit4]   2> 4338 T394 oass.SolrIndexSearcher.getIndexDir WARNING WARNING: Directory impl does not support setting indexDir: org.apache.lucene.store.RateLimitedDirectoryWrapper
[junit4:junit4]   2> 4339 T394 oasu.CommitTracker.<init> Hard AutoCommit: disabled
[junit4:junit4]   2> 4339 T394 oasu.CommitTracker.<init> Soft AutoCommit: disabled
[junit4:junit4]   2> 4340 T394 oashc.SpellCheckComponent.inform Initializing spell checkers
[junit4:junit4]   2> 4343 T394 oass.DirectSolrSpellChecker.init init: {name=direct,classname=DirectSolrSpellChecker,field=lowerfilt,minQueryLength=3}
[junit4:junit4]   2> 4372 T395 oasc.SolrCore.registerSearcher [collection1] Registered new searcher Searcher@1b14091e main{StandardDirectoryReader(segments_1:1)}
[junit4:junit4]   2> 4379 T394 oasc.ZkController.publish publishing core=collection1 state=down
[junit4:junit4]   2> 4379 T394 oasc.ZkController.publish numShards not found on descriptor - reading it from system property
[junit4:junit4]   2> 4481 T362 oascc.ZkStateReader.updateClusterState Updating cloud state from ZooKeeper... 
[junit4:junit4]   2> 4482 T362 oasc.Overseer$ClusterStateUpdater.updateState Update state numShards=2 message={
[junit4:junit4]   2> 	  "operation":"state",
[junit4:junit4]   2> 	  "numShards":"2",
[junit4:junit4]   2> 	  "shard":null,
[junit4:junit4]   2> 	  "roles":null,
[junit4:junit4]   2> 	  "state":"down",
[junit4:junit4]   2> 	  "core":"collection1",
[junit4:junit4]   2> 	  "collection":"collection1",
[junit4:junit4]   2> 	  "node_name":"127.0.0.1:50246_solr",
[junit4:junit4]   2> 	  "base_url":"http://127.0.0.1:50246/solr"}
[junit4:junit4]   2> 4482 T362 oasc.Overseer$ClusterStateUpdater.updateState Collection already exists with numShards=2
[junit4:junit4]   2> 4482 T362 oasc.Overseer$ClusterStateUpdater.updateState Assigning new node to shard shard=shard2
[junit4:junit4]   2> 4485 T393 oascc.ZkStateReader$2.process A cluster state change has occurred - updating... (3)
[junit4:junit4]   2> 4485 T378 oascc.ZkStateReader$2.process A cluster state change has occurred - updating... (3)
[junit4:junit4]   2> 4485 T361 oascc.ZkStateReader$2.process A cluster state change has occurred - updating... (3)
[junit4:junit4]   2> 4881 T394 oasc.CoreContainer.register registering core: collection1
[junit4:junit4]   2> 4881 T394 oasc.ZkController.register Register shard - core:collection1 address:http://127.0.0.1:50246/solr shardId:shard2
[junit4:junit4]   2> 4882 T394 oascc.SolrZkClient.makePath makePath: /collections/collection1/leader_elect/shard2/election
[junit4:junit4]   2> 4885 T344 oazs.PrepRequestProcessor.pRequest Got user-level KeeperException when processing sessionid:0x13b8f4bc5bb0007 type:delete cxid:0x44 zxid:0x7e txntype:-1 reqpath:n/a Error Path:/solr/collections/collection1/leaders/shard2 Error:KeeperErrorCode = NoNode for /solr/collections/collection1/leaders/shard2
[junit4:junit4]   2> 4886 T394 oasc.ShardLeaderElectionContext.runLeaderProcess Running the leader process.
[junit4:junit4]   2> 4886 T344 oazs.PrepRequestProcessor.pRequest Got user-level KeeperException when processing sessionid:0x13b8f4bc5bb0007 type:create cxid:0x45 zxid:0x7f txntype:-1 reqpath:n/a Error Path:/solr/overseer Error:KeeperErrorCode = NodeExists for /solr/overseer
[junit4:junit4]   2> 4887 T394 oasc.ShardLeaderElectionContext.waitForReplicasToComeUp Enough replicas found to continue.
[junit4:junit4]   2> 4887 T394 oasc.ShardLeaderElectionContext.runLeaderProcess I may be the new leader - try and sync
[junit4:junit4]   2> 4887 T394 oasc.SyncStrategy.sync Sync replicas to http://127.0.0.1:50246/solr/collection1/
[junit4:junit4]   2> 4888 T394 oasc.SyncStrategy.syncReplicas Sync Success - now sync replicas to me
[junit4:junit4]   2> 4888 T394 oasc.SyncStrategy.syncToMe http://127.0.0.1:50246/solr/collection1/ has no replicas
[junit4:junit4]   2> 4888 T394 oasc.ShardLeaderElectionContext.runLeaderProcess I am the new leader: http://127.0.0.1:50246/solr/collection1/
[junit4:junit4]   2> 4888 T394 oascc.SolrZkClient.makePath makePath: /collections/collection1/leaders/shard2
[junit4:junit4]   2> 4890 T344 oazs.PrepRequestProcessor.pRequest Got user-level KeeperException when processing sessionid:0x13b8f4bc5bb0007 type:create cxid:0x4e zxid:0x82 txntype:-1 reqpath:n/a Error Path:/solr/overseer Error:KeeperErrorCode = NodeExists for /solr/overseer
[junit4:junit4]   2> 4987 T362 oascc.ZkStateReader.updateClusterState Updating cloud state from ZooKeeper... 
[junit4:junit4]   2> 4994 T361 oascc.ZkStateReader$2.process A cluster state change has occurred - updating... (3)
[junit4:junit4]   2> 4994 T378 oascc.ZkStateReader$2.process A cluster state change has occurred - updating... (3)
[junit4:junit4]   2> 4994 T393 oascc.ZkStateReader$2.process A cluster state change has occurred - updating... (3)
[junit4:junit4]   2> 5042 T394 oasc.ZkController.register We are http://127.0.0.1:50246/solr/collection1/ and leader is http://127.0.0.1:50246/solr/collection1/
[junit4:junit4]   2> 5042 T394 oasc.ZkController.register No LogReplay needed for core=collection1 baseURL=http://127.0.0.1:50246/solr
[junit4:junit4]   2> 5042 T394 oasc.ZkController.checkRecovery I am the leader, no recovery necessary
[junit4:junit4]   2> 5042 T394 oasc.ZkController.publish publishing core=collection1 state=active
[junit4:junit4]   2> 5042 T394 oasc.ZkController.publish numShards not found on descriptor - reading it from system property
[junit4:junit4]   2> 5043 T394 oascc.ZkStateReader.updateClusterState Updating cloud state from ZooKeeper... 
[junit4:junit4]   2> 5044 T339 oass.SolrDispatchFilter.init user.dir=/mnt/ssd/jenkins/workspace/Lucene-Solr-4.x-Linux/solr/build/solr-core/test/J1
[junit4:junit4]   2> 5044 T339 oass.SolrDispatchFilter.init SolrDispatchFilter.init() done
[junit4:junit4]   2> 5045 T339 oascsi.HttpClientUtil.createClient Creating new http client, config:maxConnections=128&maxConnectionsPerHost=32&followRedirects=false
[junit4:junit4]   2> 5103 T339 oejs.Server.doStart jetty-8.1.8.v20121106
[junit4:junit4]   2> 5105 T339 oejs.AbstractConnector.doStart Started SelectChannelConnector@0.0.0.0:38044
[junit4:junit4]   2> 5105 T339 oasc.SolrResourceLoader.locateSolrHome JNDI not configured for solr (NoInitialContextEx)
[junit4:junit4]   2> 5106 T339 oasc.SolrResourceLoader.locateSolrHome using system property solr.solr.home: /mnt/ssd/jenkins/workspace/Lucene-Solr-4.x-Linux/solr/build/solr-core/test/J1/./solrtest-jetty3-1355318810973
[junit4:junit4]   2> 5106 T339 oasc.SolrResourceLoader.<init> new SolrResourceLoader for deduced Solr Home: '/mnt/ssd/jenkins/workspace/Lucene-Solr-4.x-Linux/solr/build/solr-core/test/J1/./solrtest-jetty3-1355318810973/'
[junit4:junit4]   2> 5120 T339 oass.SolrDispatchFilter.init SolrDispatchFilter.init()
[junit4:junit4]   2> 5121 T339 oasc.SolrResourceLoader.locateSolrHome JNDI not configured for solr (NoInitialContextEx)
[junit4:junit4]   2> 5121 T339 oasc.SolrResourceLoader.locateSolrHome using system property solr.solr.home: /mnt/ssd/jenkins/workspace/Lucene-Solr-4.x-Linux/solr/build/solr-core/test/J1/./solrtest-jetty3-1355318810973
[junit4:junit4]   2> 5121 T339 oasc.CoreContainer$Initializer.initialize looking for solr.xml: /mnt/ssd/jenkins/workspace/Lucene-Solr-4.x-Linux/solr/build/solr-core/test/J1/./solrtest-jetty3-1355318810973/solr.xml
[junit4:junit4]   2> 5122 T339 oasc.CoreContainer.<init> New CoreContainer 456602038
[junit4:junit4]   2> 5122 T339 oasc.CoreContainer.load Loading CoreContainer using Solr Home: '/mnt/ssd/jenkins/workspace/Lucene-Solr-4.x-Linux/solr/build/solr-core/test/J1/./solrtest-jetty3-1355318810973/'
[junit4:junit4]   2> 5123 T339 oasc.SolrResourceLoader.<init> new SolrResourceLoader for directory: '/mnt/ssd/jenkins/workspace/Lucene-Solr-4.x-Linux/solr/build/solr-core/test/J1/./solrtest-jetty3-1355318810973/'
[junit4:junit4]   2> 5137 T339 oasc.CoreContainer.load Registering Log Listener
[junit4:junit4]   2> 5151 T339 oasc.CoreContainer.initZooKeeper Zookeeper client=127.0.0.1:38624/solr
[junit4:junit4]   2> 5152 T339 oasc.ZkController.checkChrootPath zkHost includes chroot
[junit4:junit4]   2> 5152 T339 oaz.ZooKeeper.<init> Initiating client connection, connectString=127.0.0.1:38624 sessionTimeout=60000 watcher=org.apache.solr.common.cloud.ConnectionManager@1baa748d
[junit4:junit4]   2> 5153 T405 oaz.ClientCnxn$SendThread.logStartConnect Opening socket connection to server localhost.localdomain/127.0.0.1:38624. Will not attempt to authenticate using SASL (access denied (javax.security.auth.AuthPermission getLoginConfiguration))
[junit4:junit4]   2> 5153 T339 oascc.ConnectionManager.waitForConnected Waiting for client to connect to ZooKeeper
[junit4:junit4]   2> 5153 T341 oazs.NIOServerCnxnFactory.run Accepted socket connection from /127.0.0.1:56871
[junit4:junit4]   2> 5153 T405 oaz.ClientCnxn$SendThread.primeConnection Socket connection established to localhost.localdomain/127.0.0.1:38624, initiating session
[junit4:junit4]   2> 5154 T341 oazs.ZooKeeperServer.processConnectRequest Client attempting to establish new session at /127.0.0.1:56871
[junit4:junit4]   2> 5154 T343 oazs.ZooKeeperServer.finishSessionInit Established session 0x13b8f4bc5bb0008 with negotiated timeout 20000 for client /127.0.0.1:56871
[junit4:junit4]   2> 5154 T405 oaz.ClientCnxn$SendThread.onConnected Session establishment complete on server localhost.localdomain/127.0.0.1:38624, sessionid = 0x13b8f4bc5bb0008, negotiated timeout = 20000
[junit4:junit4]   2> 5155 T406 oascc.ConnectionManager.process Watcher org.apache.solr.common.cloud.ConnectionManager@1baa748d name:ZooKeeperConnection Watcher:127.0.0.1:38624 got event WatchedEvent state:SyncConnected type:None path:null path:null type:None
[junit4:junit4]   2> 5155 T339 oascc.ConnectionManager.waitForConnected Client is connected to ZooKeeper
[junit4:junit4]   2> 5156 T344 oazs.PrepRequestProcessor.pRequest2Txn Processed session termination for sessionid: 0x13b8f4bc5bb0008
[junit4:junit4]   2> 5156 T406 oaz.ClientCnxn$EventThread.run EventThread shut down
[junit4:junit4]   2> 5156 T339 oaz.ZooKeeper.close Session: 0x13b8f4bc5bb0008 closed
[junit4:junit4]   2> 5156 T341 oazs.NIOServerCnxn.closeSock Closed socket connection for client /127.0.0.1:56871 which had sessionid 0x13b8f4bc5bb0008
[junit4:junit4]   2> 5157 T339 oaz.ZooKeeper.<init> Initiating client connection, connectString=127.0.0.1:38624/solr sessionTimeout=8000 watcher=org.apache.solr.common.cloud.ConnectionManager@1baacb35
[junit4:junit4]   2> 5158 T407 oaz.ClientCnxn$SendThread.logStartConnect Opening socket connection to server localhost.localdomain/127.0.0.1:38624. Will not attempt to authenticate using SASL (access denied (javax.security.auth.AuthPermission getLoginConfiguration))
[junit4:junit4]   2> 5158 T339 oascc.ConnectionManager.waitForConnected Waiting for client to connect to ZooKeeper
[junit4:junit4]   2> 5158 T407 oaz.ClientCnxn$SendThread.primeConnection Socket connection established to localhost.localdomain/127.0.0.1:38624, initiating session
[junit4:junit4]   2> 5158 T341 oazs.NIOServerCnxnFactory.run Accepted socket connection from /127.0.0.1:56872
[junit4:junit4]   2> 5158 T341 oazs.ZooKeeperServer.processConnectRequest Client attempting to establish new session at /127.0.0.1:56872
[junit4:junit4]   2> 5159 T343 oazs.ZooKeeperServer.finishSessionInit Established session 0x13b8f4bc5bb0009 with negotiated timeout 8000 for client /127.0.0.1:56872
[junit4:junit4]   2> 5159 T407 oaz.ClientCnxn$SendThread.onConnected Session establishment complete on server localhost.localdomain/127.0.0.1:38624, sessionid = 0x13b8f4bc5bb0009, negotiated timeout = 8000
[junit4:junit4]   2> 5159 T408 oascc.ConnectionManager.process Watcher org.apache.solr.common.cloud.ConnectionManager@1baacb35 name:ZooKeeperConnection Watcher:127.0.0.1:38624/solr got event WatchedEvent state:SyncConnected type:None path:null path:null type:None
[junit4:junit4]   2> 5159 T339 oascc.ConnectionManager.waitForConnected Client is connected to ZooKeeper
[junit4:junit4]   2> 5160 T344 oazs.PrepRequestProcessor.pRequest Got user-level KeeperException when processing sessionid:0x13b8f4bc5bb0009 type:create cxid:0x1 zxid:0x8f txntype:-1 reqpath:n/a Error Path:/solr/overseer Error:KeeperErrorCode = NodeExists for /solr/overseer
[junit4:junit4]   2> 5160 T344 oazs.PrepRequestProcessor.pRequest Got user-level KeeperException when processing sessionid:0x13b8f4bc5bb0009 type:create cxid:0x2 zxid:0x90 txntype:-1 reqpath:n/a Error Path:/solr/overseer Error:KeeperErrorCode = NodeExists for /solr/overseer
[junit4:junit4]   2> 5161 T339 oasc.ZkController.createEphemeralLiveNode Register node as live in ZooKeeper:/live_nodes/127.0.0.1:38044_solr
[junit4:junit4]   2> 5161 T344 oazs.PrepRequestProcessor.pRequest Got user-level KeeperException when processing sessionid:0x13b8f4bc5bb0009 type:delete cxid:0x4 zxid:0x91 txntype:-1 reqpath:n/a Error Path:/solr/live_nodes/127.0.0.1:38044_solr Error:KeeperErrorCode = NoNode for /solr/live_nodes/127.0.0.1:38044_solr
[junit4:junit4]   2> 5162 T339 oascc.SolrZkClient.makePath makePath: /live_nodes/127.0.0.1:38044_solr
[junit4:junit4]   2> 5163 T393 oascc.ZkStateReader$2.process A cluster state change has occurred - updating... (3)
[junit4:junit4]   2> 5163 T361 oascc.ZkStateReader$2.process A cluster state change has occurred - updating... (3)
[junit4:junit4]   2> 5163 T378 oascc.ZkStateReader$3.process Updating live nodes... (4)
[junit4:junit4]   2> 5164 T378 oascc.ZkStateReader$2.process A cluster state change has occurred - updating... (4)
[junit4:junit4]   2> 5164 T393 oascc.ZkStateReader$3.process Updating live nodes... (4)
[junit4:junit4]   2> 5164 T339 oashc.HttpShardHandlerFactory.getParameter Setting socketTimeout to: 0
[junit4:junit4]   2> 5164 T361 oascc.ZkStateReader$3.process Updating live nodes... (4)
[junit4:junit4]   2> 5164 T339 oashc.HttpShardHandlerFactory.getParameter Setting urlScheme to: http://
[junit4:junit4]   2> 5165 T339 oashc.HttpShardHandlerFactory.getParameter Setting connTimeout to: 0
[junit4:junit4]   2> 5165 T339 oashc.HttpShardHandlerFactory.getParameter Setting maxConnectionsPerHost to: 20
[junit4:junit4]   2> 5166 T339 oashc.HttpShardHandlerFactory.getParameter Setting corePoolSize to: 0
[junit4:junit4]   2> 5166 T339 oashc.HttpShardHandlerFactory.getParameter Setting maximumPoolSize to: 2147483647
[junit4:junit4]   2> 5166 T339 oashc.HttpShardHandlerFactory.getParameter Setting maxThreadIdleTime to: 5
[junit4:junit4]   2> 5166 T339 oashc.HttpShardHandlerFactory.getParameter Setting sizeOfQueue to: -1
[junit4:junit4]   2> 5167 T339 oashc.HttpShardHandlerFactory.getParameter Setting fairnessPolicy to: false
[junit4:junit4]   2> 5167 T339 oascsi.HttpClientUtil.createClient Creating new http client, config:maxConnectionsPerHost=20&maxConnections=10000&socketTimeout=0&connTimeout=0&retry=false
[junit4:junit4]   2> 5172 T339 oascc.ZkStateReader.createClusterStateWatchersAndUpdate Updating cluster state from ZooKeeper... 
[junit4:junit4]   2> 5178 T409 oasc.CoreContainer.create Creating SolrCore 'collection1' using instanceDir: /mnt/ssd/jenkins/workspace/Lucene-Solr-4.x-Linux/solr/build/solr-core/test/J1/./solrtest-jetty3-1355318810973/collection1
[junit4:junit4]   2> 5178 T409 oasc.ZkController.createCollectionZkNode Check for collection zkNode:collection1
[junit4:junit4]   2> 5178 T409 oasc.ZkController.createCollectionZkNode Collection zkNode exists
[junit4:junit4]   2> 5178 T409 oasc.ZkController.readConfigName Load collection config from:/collections/collection1
[junit4:junit4]   2> 5179 T409 oasc.SolrResourceLoader.<init> new SolrResourceLoader for directory: '/mnt/ssd/jenkins/workspace/Lucene-Solr-4.x-Linux/solr/build/solr-core/test/J1/./solrtest-jetty3-1355318810973/collection1/'
[junit4:junit4]   2> 5180 T409 oasc.SolrResourceLoader.replaceClassLoader Adding 'file:/mnt/ssd/jenkins/workspace/Lucene-Solr-4.x-Linux/solr/build/solr-core/test/J1/solrtest-jetty3-1355318810973/collection1/lib/README' to classloader
[junit4:junit4]   2> 5180 T409 oasc.SolrResourceLoader.replaceClassLoader Adding 'file:/mnt/ssd/jenkins/workspace/Lucene-Solr-4.x-Linux/solr/build/solr-core/test/J1/solrtest-jetty3-1355318810973/collection1/lib/classes/' to classloader
[junit4:junit4]   2> 5219 T409 oasc.SolrConfig.<init> Using Lucene MatchVersion: LUCENE_41
[junit4:junit4]   2> 5280 T409 oasc.SolrConfig.<init> Loaded SolrConfig: solrconfig.xml
[junit4:junit4]   2> 5281 T409 oass.IndexSchema.readSchema Reading Solr Schema
[junit4:junit4]   2> 5287 T409 oass.IndexSchema.readSchema Schema name=test
[junit4:junit4]   2> 5497 T362 oascc.ZkStateReader.updateClusterState Updating cloud state from ZooKeeper... 
[junit4:junit4]   2> 5497 T362 oasc.Overseer$ClusterStateUpdater.updateState Update state numShards=2 message={
[junit4:junit4]   2> 	  "operation":"state",
[junit4:junit4]   2> 	  "numShards":"2",
[junit4:junit4]   2> 	  "shard":"shard2",
[junit4:junit4]   2> 	  "roles":null,
[junit4:junit4]   2> 	  "state":"active",
[junit4:junit4]   2> 	  "core":"collection1",
[junit4:junit4]   2> 	  "collection":"collection1",
[junit4:junit4]   2> 	  "node_name":"127.0.0.1:50246_solr",
[junit4:junit4]   2> 	  "base_url":"http://127.0.0.1:50246/solr"}
[junit4:junit4]   2> 5500 T393 oascc.ZkStateReader$2.process A cluster state change has occurred - updating... (4)
[junit4:junit4]   2> 5500 T378 oascc.ZkStateReader$2.process A cluster state change has occurred - updating... (4)
[junit4:junit4]   2> 5500 T408 oascc.ZkStateReader$2.process A cluster state change has occurred - updating... (4)
[junit4:junit4]   2> 5500 T361 oascc.ZkStateReader$2.process A cluster state change has occurred - updating... (4)
[junit4:junit4]   2> 5823 T409 oass.OpenExchangeRatesOrgProvider.init Initialized with rates=open-exchange-rates.json, refreshInterval=1440.
[junit4:junit4]   2> 5831 T409 oass.IndexSchema.readSchema default search field in schema is text
[junit4:junit4]   2> 5835 T409 oass.IndexSchema.readSchema unique key field: id
[junit4:junit4]   2> 5845 T409 oass.FileExchangeRateProvider.reload Reloading exchange rates from file currency.xml
[junit4:junit4]   2> 5848 T409 oass.FileExchangeRateProvider.reload Reloading exchange rates from file currency.xml
[junit4:junit4]   2> 5851 T409 oass.OpenExchangeRatesOrgProvider.reload Reloading exchange rates from open-exchange-rates.json
[junit4:junit4]   2> 5852 T409 oass.OpenExchangeRatesOrgProvider.reload Reloading exchange rates from open-exchange-rates.json
[junit4:junit4]   2> 5853 T409 oasc.SolrCore.<init> [collection1] Opening new SolrCore at /mnt/ssd/jenkins/workspace/Lucene-Solr-4.x-Linux/solr/build/solr-core/test/J1/./solrtest-jetty3-1355318810973/collection1/, dataDir=./org.apache.solr.cloud.BasicDistributedZk2Test-1355318805943/jetty3/
[junit4:junit4]   2> 5853 T409 oasc.JmxMonitoredMap.<init> JMX monitoring is enabled. Adding Solr mbeans to JMX Server: com.sun.jmx.mbeanserver.JmxMBeanServer@1ad38771
[junit4:junit4]   2> 5854 T409 oasc.SolrCore.getNewIndexDir New index directory detected: old=null new=./org.apache.solr.cloud.BasicDistributedZk2Test-1355318805943/jetty3/index/
[junit4:junit4]   2> 5854 T409 oasc.SolrCore.initIndex WARNING [collection1] Solr index directory './org.apache.solr.cloud.BasicDistributedZk2Test-1355318805943/jetty3/index' doesn't exist. Creating new index...
[junit4:junit4]   2> 5855 T409 oasc.CachingDirectoryFactory.get return new directory for /mnt/ssd/jenkins/workspace/Lucene-Solr-4.x-Linux/solr/build/solr-core/test/J1/./org.apache.solr.cloud.BasicDistributedZk2Test-1355318805943/jetty3/index forceNew:false
[junit4:junit4]   2> 5858 T409 oasc.SolrDeletionPolicy.onCommit SolrDeletionPolicy.onCommit: commits:num=1
[junit4:junit4]   2> 		commit{dir=RateLimitedDirectoryWrapper(NRTCachingDirectory(org.apache.lucene.store.NIOFSDirectory@/mnt/ssd/jenkins/workspace/Lucene-Solr-4.x-Linux/solr/build/solr-core/test/J1/org.apache.solr.cloud.BasicDistributedZk2Test-1355318805943/jetty3/index lockFactory=org.apache.lucene.store.NativeFSLockFactory@1c2be90f; maxCacheMB=48.0 maxMergeSizeMB=4.0)),segFN=segments_1,generation=1,filenames=[segments_1]
[junit4:junit4]   2> 5858 T409 oasc.SolrDeletionPolicy.updateCommits newest commit = 1
[junit4:junit4]   2> 5859 T409 oasc.SolrCore.initWriters created xml: solr.XMLResponseWriter
[junit4:junit4]   2> 5860 T409 oasup.UpdateRequestProcessorChain.init inserting DistributedUpdateProcessorFactory into updateRequestProcessorChain "dedupe"
[junit4:junit4]   2> 5860 T409 oasup.UpdateRequestProcessorChain.init inserting DistributedUpdateProcessorFactory into updateRequestProcessorChain "dedupe-allfields"
[junit4:junit4]   2> 5860 T409 oasup.UpdateRequestProcessorChain.init inserting DistributedUpdateProcessorFactory into updateRequestProcessorChain "stored_sig"
[junit4:junit4]   2> 5861 T409 oasup.UpdateRequestProcessorChain.init inserting DistributedUpdateProcessorFactory into updateRequestProcessorChain "uniq-fields"
[junit4:junit4]   2> 5861 T409 oasup.UpdateRequestProcessorChain.init inserting DistributedUpdateProcessorFactory into updateRequestProcessorChain "distrib-dup-test-chain-implicit"
[junit4:junit4]   2> 5861 T409 oasc.RequestHandlers.initHandlersFromConfig adding lazy requestHandler: solr.ReplicationHandler
[junit4:junit4]   2> 5862 T409 oasc.RequestHandlers.initHandlersFromConfig created /replication: solr.ReplicationHandler
[junit4:junit4]   2> 5863 T409 oasc.RequestHandlers.initHandlersFromConfig created standard: solr.StandardRequestHandler
[junit4:junit4]   2> 5864 T409 oasc.RequestHandlers.initHandlersFromConfig created /get: solr.RealTimeGetHandler
[junit4:junit4]   2> 5864 T409 oasc.RequestHandlers.initHandlersFromConfig created dismax: solr.SearchHandler
[junit4:junit4]   2> 5865 T409 oasc.RequestHandlers.initHandlersFromConfig created mock: org.apache.solr.core.MockQuerySenderListenerReqHandler
[junit4:junit4]   2> 5866 T409 oasc.RequestHandlers.initHandlersFromConfig created /admin/: org.apache.solr.handler.admin.AdminHandlers
[junit4:junit4]   2> 5867 T409 oasc.RequestHandlers.initHandlersFromConfig created defaults: solr.StandardRequestHandler
[junit4:junit4]   2> 5867 T409 oasc.RequestHandlers.initHandlersFromConfig adding lazy requestHandler: solr.StandardRequestHandler
[junit4:junit4]   2> 5867 T409 oasc.RequestHandlers.initHandlersFromConfig created lazy: solr.StandardRequestHandler
[junit4:junit4]   2> 5868 T409 oasc.RequestHandlers.initHandlersFromConfig created /update: solr.UpdateRequestHandler
[junit4:junit4]   2> 5869 T409 oasc.RequestHandlers.initHandlersFromConfig created /terms: org.apache.solr.handler.component.SearchHandler
[junit4:junit4]   2> 5870 T409 oasc.RequestHandlers.initHandlersFromConfig created spellCheckCompRH: org.apache.solr.handler.component.SearchHandler
[junit4:junit4]   2> 5871 T409 oasc.RequestHandlers.initHandlersFromConfig created spellCheckCompRH_Direct: org.apache.solr.handler.component.SearchHandler
[junit4:junit4]   2> 5871 T409 oasc.RequestHandlers.initHandlersFromConfig created spellCheckWithWordbreak: org.apache.solr.handler.component.SearchHandler
[junit4:junit4]   2> 5872 T409 oasc.RequestHandlers.initHandlersFromConfig created spellCheckWithWordbreak_Direct: org.apache.solr.handler.component.SearchHandler
[junit4:junit4]   2> 5873 T409 oasc.RequestHandlers.initHandlersFromConfig created spellCheckCompRH1: org.apache.solr.handler.component.SearchHandler
[junit4:junit4]   2> 5874 T409 oasc.RequestHandlers.initHandlersFromConfig created tvrh: org.apache.solr.handler.component.SearchHandler
[junit4:junit4]   2> 5875 T409 oasc.RequestHandlers.initHandlersFromConfig created /mlt: solr.MoreLikeThisHandler
[junit4:junit4]   2> 5876 T409 oasc.RequestHandlers.initHandlersFromConfig created /debug/dump: solr.DumpRequestHandler
[junit4:junit4]   2> 5878 T409 oashl.XMLLoader.init xsltCacheLifetimeSeconds=60
[junit4:junit4]   2> 5880 T409 oasc.SolrCore.initDeprecatedSupport WARNING solrconfig.xml uses deprecated <admin/gettableFiles>, Please update your config to use the ShowFileRequestHandler.
[junit4:junit4]   2> 5881 T409 oasc.SolrCore.initDeprecatedSupport WARNING adding ShowFileRequestHandler with hidden files: [SCHEMA.XML, OLD_SYNONYMS.TXT, STOPWORDS.TXT, PROTWORDS.TXT, OPEN-EXCHANGE-RATES.JSON, SYNONYMS.TXT, CURRENCY.XML, MAPPING-ISOLATIN1ACCENT.TXT]
[junit4:junit4]   2> 5884 T409 oass.SolrIndexSearcher.<init> Opening Searcher@1c2e2265 main
[junit4:junit4]   2> 5884 T409 oass.SolrIndexSearcher.getIndexDir WARNING WARNING: Directory impl does not support setting indexDir: org.apache.lucene.store.RateLimitedDirectoryWrapper
[junit4:junit4]   2> 5885 T409 oasu.CommitTracker.<init> Hard AutoCommit: disabled
[junit4:junit4]   2> 5885 T409 oasu.CommitTracker.<init> Soft AutoCommit: disabled
[junit4:junit4]   2> 5885 T409 oashc.SpellCheckComponent.inform Initializing spell checkers
[junit4:junit4]   2> 5889 T409 oass.DirectSolrSpellChecker.init init: {name=direct,classname=DirectSolrSpellChecker,field=lowerfilt,minQueryLength=3}
[junit4:junit4]   2> 5919 T410 oasc.SolrCore.registerSearcher [collection1] Registered new searcher Searcher@1c2e2265 main{StandardDirectoryReader(segments_1:1)}
[junit4:junit4]   2> 5926 T409 oasc.ZkController.publish publishing core=collection1 state=down
[junit4:junit4]   2> 5926 T409 oasc.ZkController.publish numShards not found on descriptor - reading it from system property
[junit4:junit4]   2> 6003 T362 oascc.ZkStateReader.updateClusterState Updating cloud state from ZooKeeper... 
[junit4:junit4]   2> 6004 T362 oasc.Overseer$ClusterStateUpdater.updateState Update state numShards=2 message={
[junit4:junit4]   2> 	  "operation":"state",
[junit4:junit4]   2> 	  "numShards":"2",
[junit4:junit4]   2> 	  "shard":null,
[junit4:junit4]   2> 	  "roles":null,
[junit4:junit4]   2> 	  "state":"down",
[junit4:junit4]   2> 	  "core":"collection1",
[junit4:junit4]   2> 	  "collection":"collection1",
[junit4:junit4]   2> 	  "node_name":"127.0.0.1:38044_solr",
[junit4:junit4]   2> 	  "base_url":"http://127.0.0.1:38044/solr"}
[junit4:junit4]   2> 6004 T362 oasc.Overseer$ClusterStateUpdater.updateState Collection already exists with numShards=2
[junit4:junit4]   2> 6004 T362 oasc.Overseer$ClusterStateUpdater.updateState Assigning new node to shard shard=shard1
[junit4:junit4]   2> 6007 T393 oascc.ZkStateReader$2.process A cluster state change has occurred - updating... (4)
[junit4:junit4]   2> 6007 T361 oascc.ZkStateReader$2.process A cluster state change has occurred - updating... (4)
[junit4:junit4]   2> 6008 T408 oascc.ZkStateReader$2.process A cluster state change has occurred - updating... (4)
[junit4:junit4]   2> 6008 T378 oascc.ZkStateReader$2.process A cluster state change has occurred - updating... (4)
[junit4:junit4]   2> 6427 T409 oasc.CoreContainer.register registering core: collection1
[junit4:junit4]   2> 6427 T409 oasc.ZkController.register Register shard - core:collection1 address:http://127.0.0.1:38044/solr shardId:shard1
[junit4:junit4]   2> 6429 T409 oasc.ZkController.register We are http://127.0.0.1:38044/solr/collection1/ and leader is http://127.0.0.1:43182/solr/collection1/
[junit4:junit4]   2> 6429 T409 oasc.ZkController.register No LogReplay needed for core=collection1 baseURL=http://127.0.0.1:38044/solr
[junit4:junit4]   2> 6429 T409 oasc.ZkController.checkRecovery Core needs to recover:collection1
[junit4:junit4]   2> 6430 T409 oasu.DefaultSolrCoreState.doRecovery Running recovery - first canceling any ongoing recovery
[junit4:junit4]   2> ASYNC  NEW_CORE C14 name=collection1 org.apache.solr.core.SolrCore@1c2b9496 url=http://127.0.0.1:38044/solr/collection1 node=127.0.0.1:38044_solr
[junit4:junit4]   2> 6430 T411 C14 P38044 oasc.RecoveryStrategy.run Starting recovery process.  core=collection1 recoveringAfterStartup=true
[junit4:junit4]   2> 6430 T409 oascc.ZkStateReader.updateClusterState Updating cloud state from ZooKeeper... 
[junit4:junit4]   2> 6430 T411 C14 P38044 oasc.RecoveryStrategy.doRecovery ###### startupVersions=[]
[junit4:junit4]   2> 6431 T411 C14 P38044 oasc.ZkController.publish publishing core=collection1 state=recovering
[junit4:junit4]   2> 6431 T411 C14 P38044 oasc.ZkController.publish numShards not found on descriptor - reading it from system property
[junit4:junit4]   2> 6431 T339 oass.SolrDispatchFilter.init user.dir=/mnt/ssd/jenkins/workspace/Lucene-Solr-4.x-Linux/solr/build/solr-core/test/J1
[junit4:junit4]   2> 6431 T339 oass.SolrDispatchFilter.init SolrDispatchFilter.init() done
[junit4:junit4]   2> 6432 T411 C14 P38044 oasc.RecoveryStrategy.doRecovery Attempting to PeerSync from http://127.0.0.1:43182/solr/collection1/ core=collection1 - recoveringAfterStartup=true
[junit4:junit4]   2> 6432 T411 C14 P38044 oasu.PeerSync.sync PeerSync: core=collection1 url=http://127.0.0.1:38044/solr START replicas=[http://127.0.0.1:43182/solr/collection1/] nUpdates=100
[junit4:junit4]   2> 6432 T339 oascsi.HttpClientUtil.createClient Creating new http client, config:maxConnections=128&maxConnectionsPerHost=32&followRedirects=false
[junit4:junit4]   2> 6432 T411 C14 P38044 oasu.PeerSync.sync WARNING no frame of reference to tell of we've missed updates
[junit4:junit4]   2> 6433 T411 C14 P38044 oasc.RecoveryStrategy.doRecovery PeerSync Recovery was not successful - trying replication. core=collection1
[junit4:junit4]   2> 6433 T411 C14 P38044 oasc.RecoveryStrategy.doRecovery Starting Replication Recovery. core=collection1
[junit4:junit4]   2> 6433 T411 C14 P38044 oascsi.HttpClientUtil.createClient Creating new http client, config:maxConnections=128&maxConnectionsPerHost=32&followRedirects=false
[junit4:junit4]   2> ASYNC  NEW_CORE C15 name=collection1 org.apache.solr.core.SolrCore@1b08134d url=http://127.0.0.1:43182/solr/collection1 node=127.0.0.1:43182_solr
[junit4:junit4]   2> 6440 T373 C15 P43182 REQ /get {distrib=false&qt=/get&wt=javabin&version=2&getVersions=100} status=0 QTime=0 
[junit4:junit4]   2> 6495 T339 oejs.Server.doStart jetty-8.1.8.v20121106
[junit4:junit4]   2> 6497 T339 oejs.AbstractConnector.doStart Started SelectChannelConnector@0.0.0.0:50707
[junit4:junit4]   2> 6497 T339 oasc.SolrResourceLoader.locateSolrHome JNDI not configured for solr (NoInitialContextEx)
[junit4:junit4]   2> 6497 T339 oasc.SolrResourceLoader.locateSolrHome using system property solr.solr.home: /mnt/ssd/jenkins/workspace/Lucene-Solr-4.x-Linux/solr/build/solr-core/test/J1/./solrtest-jetty4-1355318812360
[junit4:junit4]   2> 6498 T339 oasc.SolrResourceLoader.<init> new SolrResourceLoader for deduced Solr Home: '/mnt/ssd/jenkins/workspace/Lucene-Solr-4.x-Linux/solr/build/solr-core/test/J1/./solrtest-jetty4-1355318812360/'
[junit4:junit4]   2> 6510 T362 oascc.ZkStateReader.updateClusterState Updating cloud state from ZooKeeper... 
[junit4:junit4]   2> 6511 T362 oasc.Overseer$ClusterStateUpdater.updateState Update state numShards=2 message={
[junit4:junit4]   2> 	  "operation":"state",
[junit4:junit4]   2> 	  "numShards":"2",
[junit4:junit4]   2> 	  "shard":"shard1",
[junit4:junit4]   2> 	  "roles":null,
[junit4:junit4]   2> 	  "state":"recovering",
[junit4:junit4]   2> 	  "core":"collection1",
[junit4:junit4]   2> 	  "collection":"collection1",
[junit4:junit4]   2> 	  "node_name":"127.0.0.1:38044_solr",
[junit4:junit4]   2> 	  "base_url":"http://127.0.0.1:38044/solr"}
[junit4:junit4]   2> 6513 T393 oascc.ZkStateReader$2.process A cluster state change has occurred - updating... (4)
[junit4:junit4]   2> 6513 T361 oascc.ZkStateReader$2.process A cluster state change has occurred - updating... (4)
[junit4:junit4]   2> 6513 T378 oascc.ZkStateReader$2.process A cluster state change has occurred - updating... (4)
[junit4:junit4]   2> 6513 T339 oass.SolrDispatchFilter.init SolrDispatchFilter.init()
[junit4:junit4]   2> 6513 T408 oascc.ZkStateReader$2.process A cluster state change has occurred - updating... (4)
[junit4:junit4]   2> 6514 T339 oasc.SolrResourceLoader.locateSolrHome JNDI not configured for solr (NoInitialContextEx)
[junit4:junit4]   2> 6514 T339 oasc.SolrResourceLoader.locateSolrHome using system property solr.solr.home: /mnt/ssd/jenkins/workspace/Lucene-Solr-4.x-Linux/solr/build/solr-core/test/J1/./solrtest-jetty4-1355318812360
[junit4:junit4]   2> 6515 T339 oasc.CoreContainer$Initializer.initialize looking for solr.xml: /mnt/ssd/jenkins/workspace/Lucene-Solr-4.x-Linux/solr/build/solr-core/test/J1/./solrtest-jetty4-1355318812360/solr.xml
[junit4:junit4]   2> 6515 T339 oasc.CoreContainer.<init> New CoreContainer 474889255
[junit4:junit4]   2> 6516 T339 oasc.CoreContainer.load Loading CoreContainer using Solr Home: '/mnt/ssd/jenkins/workspace/Lucene-Solr-4.x-Linux/solr/build/solr-core/test/J1/./solrtest-jetty4-1355318812360/'
[junit4:junit4]   2> 6516 T339 oasc.SolrResourceLoader.<init> new SolrResourceLoader for directory: '/mnt/ssd/jenkins/workspace/Lucene-Solr-4.x-Linux/solr/build/solr-core/test/J1/./solrtest-jetty4-1355318812360/'
[junit4:junit4]   2> 6531 T339 oasc.CoreContainer.load Registering Log Listener
[junit4:junit4]   2> 6545 T339 oasc.CoreContainer.initZooKeeper Zookeeper client=127.0.0.1:38624/solr
[junit4:junit4]   2> 6545 T339 oasc.ZkController.checkChrootPath zkHost includes chroot
[junit4:junit4]   2> 6545 T339 oaz.ZooKeeper.<init> Initiating client connection, connectString=127.0.0.1:38624 sessionTimeout=60000 watcher=org.apache.solr.common.cloud.ConnectionManager@1c458e10
[junit4:junit4]   2> 6546 T422 oaz.ClientCnxn$SendThread.logStartConnect Opening socket connection to server localhost.localdomain/127.0.0.1:38624. Will not attempt to authenticate using SASL (access denied (javax.security.auth.AuthPermission getLoginConfiguration))
[junit4:junit4]   2> 6546 T339 oascc.ConnectionManager.waitForConnected Waiting for client to connect to ZooKeeper
[junit4:junit4]   2> 6547 T422 oaz.ClientCnxn$SendThread.primeConnection Socket connection established to localhost.localdomain/127.0.0.1:38624, initiating session
[junit4:junit4]   2> 6547 T341 oazs.NIOServerCnxnFactory.run Accepted socket connection from /127.0.0.1:56875
[junit4:junit4]   2> 6547 T341 oazs.ZooKeeperServer.processConnectRequest Client attempting to establish new session at /127.0.0.1:56875
[junit4:junit4]   2> 6548 T343 oazs.ZooKeeperServer.finishSessionInit Established session 0x13b8f4bc5bb000a with negotiated timeout 20000 for client /127.0.0.1:56875
[junit4:junit4]   2> 6548 T422 oaz.ClientCnxn$SendThread.onConnected Session establishment complete on server localhost.localdomain/127.0.0.1:38624, sessionid = 0x13b8f4bc5bb000a, negotiated timeout = 20000
[junit4:junit4]   2> 6548 T423 oascc.ConnectionManager.process Watcher org.apache.solr.common.cloud.ConnectionManager@1c458e10 name:ZooKeeperConnection Watcher:127.0.0.1:38624 got event WatchedEvent state:SyncConnected type:None path:null path:null type:None
[junit4:junit4]   2> 6548 T339 oascc.ConnectionManager.waitForConnected Client is connected to ZooKeeper
[junit4:junit4]   2> 6549 T344 oazs.PrepRequestProcessor.pRequest2Txn Processed session termination for sessionid: 0x13b8f4bc5bb000a
[junit4:junit4]   2> 6549 T423 oaz.ClientCnxn$EventThread.run EventThread shut down
[junit4:junit4]   2> 6550 T341 oazs.NIOServerCnxn.closeSock Closed socket connection for client /127.0.0.1:56875 which had sessionid 0x13b8f4bc5bb000a
[junit4:junit4]   2> 6549 T339 oaz.ZooKeeper.close Session: 0x13b8f4bc5bb000a closed
[junit4:junit4]   2> 6550 T339 oaz.ZooKeeper.<init> Initiating client connection, connectString=127.0.0.1:38624/solr sessionTimeout=8000 watcher=org.apache.solr.common.cloud.ConnectionManager@1c343fb9
[junit4:junit4]   2> 6551 T424 oaz.ClientCnxn$SendThread.logStartConnect Opening socket connection to server localhost.localdomain/127.0.0.1:38624. Will not attempt to authenticate using SASL (access denied (javax.security.auth.AuthPermission getLoginConfiguration))
[junit4:junit4]   2> 6551 T339 oascc.ConnectionManager.waitForConnected Waiting for client to connect to ZooKeeper
[junit4:junit4]   2> 6551 T341 oazs.NIOServerCnxnFactory.run Accepted socket connection from /127.0.0.1:56876
[junit4:junit4]   2> 6551 T424 oaz.ClientCnxn$SendThread.primeConnection Socket connection established to localhost.localdomain/127.0.0.1:38624, initiating session
[junit4:junit4]   2> 6552 T341 oazs.ZooKeeperServer.processConnectRequest Client attempting to establish new session at /127.0.0.1:56876
[junit4:junit4]   2> 6553 T343 oazs.ZooKeeperServer.finishSessionInit Established session 0x13b8f4bc5bb000b with negotiated timeout 8000 for client /127.0.0.1:56876
[junit4:junit4]   2> 6553 T424 oaz.ClientCnxn$SendThread.onConnected Session establishment complete on server localhost.localdomain/127.0.0.1:38624, sessionid = 0x13b8f4bc5bb000b, negotiated timeout = 8000
[junit4:junit4]   2> 6553 T425 oascc.ConnectionManager.process Watcher org.apache.solr.common.cloud.ConnectionManager@1c343fb9 name:ZooKeeperConnection Watcher:127.0.0.1:38624/solr got event WatchedEvent state:SyncConnected type:None path:null path:null type:None
[junit4:junit4]   2> 6553 T339 oascc.ConnectionManager.waitForConnected Client is connected to ZooKeeper
[junit4:junit4]   2> 6554 T344 oazs.PrepRequestProcessor.pRequest Got user-level KeeperException when processing sessionid:0x13b8f4bc5bb000b type:create cxid:0x1 zxid:0xa6 txntype:-1 reqpath:n/a Error Path:/solr/overseer Error:KeeperErrorCode = NodeExists for /solr/overseer
[junit4:junit4]   2> 6555 T344 oazs.PrepRequestProcessor.pRequest Got user-level KeeperException when processing sessionid:0x13b8f4bc5bb000b type:create cxid:0x2 zxid:0xa7 txntype:-1 reqpath:n/a Error Path:/solr/overseer Error:KeeperErrorCode = NodeExists for /solr/overseer
[junit4:junit4]   2> 6555 T339 oasc.ZkController.createEphemeralLiveNode Register node as live in ZooKeeper:/live_nodes/127.0.0.1:50707_solr
[junit4:junit4]   2> 6556 T344 oazs.PrepRequestProcessor.pRequest Got user-level KeeperException when processing sessionid:0x13b8f4bc5bb000b type:delete cxid:0x4 zxid:0xa8 txntype:-1 reqpath:n/a Error Path:/solr/live_nodes/127.0.0.1:50707_solr Error:KeeperErrorCode = NoNode for /solr/live_nodes/127.0.0.1:50707_solr
[junit4:junit4]   2> 6556 T339 oascc.SolrZkClient.makePath makePath: /live_nodes/127.0.0.1:50707_solr
[junit4:junit4]   2> 6557 T361 oascc.ZkStateReader$2.process A cluster state change has occurred - updating... (4)
[junit4:junit4]   2> 6557 T408 oascc.ZkStateReader$2.process A cluster state change has occurred - updating... (4)
[junit4:junit4]   2> 6557 T393 oascc.ZkStateReader$2.process A cluster state change has occurred - updating... (4)
[junit4:junit4]   2> 6558 T378 oascc.ZkStateReader$3.process Updating live nodes... (5)
[junit4:junit4]   2> 6558 T378 oascc.ZkStateReader$2.process A cluster state change has occurred - updating... (5)
[junit4:junit4]   2> 6558 T339 oashc.HttpShardHandlerFactory.getParameter Setting socketTimeout to: 0
[junit4:junit4]   2> 6559 T339 oashc.HttpShardHandlerFactory.getParameter Setting urlScheme to: http://
[junit4:junit4]   2> 6559 T408 oascc.ZkStateReader$3.process Updating live nodes... (5)
[junit4:junit4]   2> 6559 T361 oascc.ZkStateReader$3.process Updating live nodes... (5)
[junit4:junit4]   2> 6559 T393 oascc.ZkStateReader$3.process Updating live nodes... (5)
[junit4:junit4]   2> 6559 T339 oashc.HttpShardHandlerFactory.getParameter Setting connTimeout to: 0
[junit4:junit4]   2> 6560 T339 oashc.HttpShardHandlerFactory.getParameter Setting maxConnectionsPerHost to: 20
[junit4:junit4]   2> 6560 T339 oashc.HttpShardHandlerFactory.getParameter Setting corePoolSize to: 0
[junit4:junit4]   2> 6561 T339 oashc.HttpShardHandlerFactory.getParameter Setting maximumPoolSize to: 2147483647
[junit4:junit4]   2> 6561 T339 oashc.HttpShardHandlerFactory.getParameter Setting maxThreadIdleTime to: 5
[junit4:junit4]   2> 6561 T339 oashc.HttpShardHandlerFactory.getParameter Setting sizeOfQueue to: -1
[junit4:junit4]   2> 6562 T339 oashc.HttpShardHandlerFactory.getParameter Setting fairnessPolicy to: false
[junit4:junit4]   2> 6562 T339 oascsi.HttpClientUtil.createClient Creating new http client, config:maxConnectionsPerHost=20&maxConnections=10000&socketTimeout=0&connTimeout=0&retry=false
[junit4:junit4]   2> 6567 T339 oascc.ZkStateReader.createClusterStateWatchersAndUpdate Updating cluster state from ZooKeeper... 
[junit4:junit4]   2> 6573 T426 oasc.CoreContainer.create Creating SolrCore 'collection1' using instanceDir: /mnt/ssd/jenkins/workspace/Lucene-Solr-4.x-Linux/solr/build/solr-core/test/J1/./solrtest-jetty4-1355318812360/collection1
[junit4:junit4]   2> 6573 T426 oasc.ZkController.createCollectionZkNode Check for collection zkNode:collection1
[junit4:junit4]   2> 6573 T426 oasc.ZkController.createCollectionZkNode Collection zkNode exists
[junit4:junit4]   2> 6574 T426 oasc.ZkController.readConfigName Load collection config from:/collections/collection1
[junit4:junit4]   2> 6574 T426 oasc.SolrResourceLoader.<init> new SolrResourceLoader for directory: '/mnt/ssd/jenkins/workspace/Lucene-Solr-4.x-Linux/solr/build/solr-core/test/J1/./solrtest-jetty4-1355318812360/collection1/'
[junit4:junit4]   2> 6575 T426 oasc.SolrResourceLoader.replaceClassLoader Adding 'file:/mnt/ssd/jenkins/workspace/Lucene-Solr-4.x-Linux/solr/build/solr-core/test/J1/solrtest-jetty4-1355318812360/collection1/lib/README' to classloader
[junit4:junit4]   2> 6575 T426 oasc.SolrResourceLoader.replaceClassLoader Adding 'file:/mnt/ssd/jenkins/workspace/Lucene-Solr-4.x-Linux/solr/build/solr-core/test/J1/solrtest-jetty4-1355318812360/collection1/lib/classes/' to classloader
[junit4:junit4]   2> 6647 T426 oasc.SolrConfig.<init> Using Lucene MatchVersion: LUCENE_41
[junit4:junit4]   2> 6705 T426 oasc.SolrConfig.<init> Loaded SolrConfig: solrconfig.xml
[junit4:junit4]   2> 6706 T426 oass.IndexSchema.readSchema Reading Solr Schema
[junit4:junit4]   2> 6712 T426 oass.IndexSchema.readSchema Schema name=test
[junit4:junit4]   2> 7219 T426 oass.OpenExchangeRatesOrgProvider.init Initialized with rates=open-exchange-rates.json, refreshInterval=1440.
[junit4:junit4]   2> 7226 T426 oass.IndexSchema.readSchema default search field in schema is text
[junit4:junit4]   2> 7230 T426 oass.IndexSchema.readSchema unique key field: id
[junit4:junit4]   2> 7238 T426 oass.FileExchangeRateProvider.reload Reloading exchange rates from file currency.xml
[junit4:junit4]   2> 7241 T426 oass.FileExchangeRateProvider.reload Reloading exchange rates from file currency.xml
[junit4:junit4]   2> 7244 T426 oass.OpenExchangeRatesOrgProvider.reload Reloading exchange rates from open-exchange-rates.json
[junit4:junit4]   2> 7245 T426 oass.OpenExchangeRatesOrgProvider.reload Reloading exchange rates from open-exchange-rates.json
[junit4:junit4]   2> 7246 T426 oasc.SolrCore.<init> [collection1] Opening new SolrCore at /mnt/ssd/jenkins/workspace/Lucene-Solr-4.x-Linux/solr/build/solr-core/test/J1/./solrtest-jetty4-1355318812360/collection1/, dataDir=./org.apache.solr.cloud.BasicDistributedZk2Test-1355318805943/jetty4/
[junit4:junit4]   2> 7246 T426 oasc.JmxMonitoredMap.<init> JMX monitoring is enabled. Adding Solr mbeans to JMX Server: com.sun.jmx.mbeanserver.JmxMBeanServer@1ad38771
[junit4:junit4]   2> 7247 T426 oasc.SolrCore.getNewIndexDir New index directory detected: old=null new=./org.apache.solr.cloud.BasicDistributedZk2Test-1355318805943/jetty4/index/
[junit4:junit4]   2> 7247 T426 oasc.SolrCore.initIndex WARNING [collection1] Solr index directory './org.apache.solr.cloud.BasicDistributedZk2Test-1355318805943/jetty4/index' doesn't exist. Creating new index...
[junit4:junit4]   2> 7247 T426 oasc.CachingDirectoryFactory.get return new directory for /mnt/ssd/jenkins/workspace/Lucene-Solr-4.x-Linux/solr/build/solr-core/test/J1/./org.apache.solr.cloud.BasicDistributedZk2Test-1355318805943/jetty4/index forceNew:false
[junit4:junit4]   2> 7250 T426 oasc.SolrDeletionPolicy.onCommit SolrDeletionPolicy.onCommit: commits:num=1
[junit4:junit4]   2> 		commit{dir=RateLimitedDirectoryWrapper(NRTCachingDirectory(org.apache.lucene.store.NIOFSDirectory@/mnt/ssd/jenkins/workspace/Lucene-Solr-4.x-Linux/solr/build/solr-core/test/J1/org.apache.solr.cloud.BasicDistributedZk2Test-1355318805943/jetty4/index lockFactory=org.apache.lucene.store.NativeFSLockFactory@1b65e4f0; maxCacheMB=48.0 maxMergeSizeMB=4.0)),segFN=segments_1,generation=1,filenames=[segments_1]
[junit4:junit4]   2> 7251 T426 oasc.SolrDeletionPolicy.updateCommits newest commit = 1
[junit4:junit4]   2> 7251 T426 oasc.SolrCore.initWriters created xml: solr.XMLResponseWriter
[junit4:junit4]   2> 7252 T426 oasup.UpdateRequestProcessorChain.init inserting DistributedUpdateProcessorFactory into updateRequestProcessorChain "dedupe"
[junit4:junit4]   2> 7252 T426 oasup.UpdateRequestProcessorChain.init inserting DistributedUpdateProcessorFactory into updateRequestProcessorChain "dedupe-allfields"
[junit4:junit4]   2> 7253 T426 oasup.UpdateRequestProcessorChain.init inserting DistributedUpdateProcessorFactory into updateRequestProcessorChain "stored_sig"
[junit4:junit4]   2> 7253 T426 oasup.UpdateRequestProcessorChain.init inserting DistributedUpdateProcessorFactory into updateRequestProcessorChain "uniq-fields"
[junit4:junit4]   2> 7253 T426 oasup.UpdateRequestProcessorChain.init inserting DistributedUpdateProcessorFactory into updateRequestProcessorChain "distrib-dup-test-chain-implicit"
[junit4:junit4]   2> 7253 T426 oasc.RequestHandlers.initHandlersFromConfig adding lazy requestHandler: solr.ReplicationHandler
[junit4:junit4]   2> 7254 T426 oasc.RequestHandlers.initHandlersFromConfig created /replication: solr.ReplicationHandler
[junit4:junit4]   2> 7254 T426 oasc.RequestHandlers.initHandlersFromConfig created standard: solr.StandardRequestHandler
[junit4:junit4]   2> 7255 T426 oasc.RequestHandlers.initHandlersFromConfig created /get: solr.RealTimeGetHandler
[junit4:junit4]   2> 7256 T426 oasc.RequestHandlers.initHandlersFromConfig created dismax: solr.SearchHandler
[junit4:junit4]   2> 7257 T426 oasc.RequestHandlers.initHandlersFromConfig created mock: org.apache.solr.core.MockQuerySenderListenerReqHandler
[junit4:junit4]   2> 7257 T426 oasc.RequestHandlers.initHandlersFromConfig created /admin/: org.apache.solr.handler.admin.AdminHandlers
[junit4:junit4]   2> 7258 T426 oasc.RequestHandlers.initHandlersFromConfig created defaults: solr.StandardRequestHandler
[junit4:junit4]   2> 7258 T426 oasc.RequestHandlers.initHandlersFromConfig adding lazy requestHandler: solr.StandardRequestHandler
[junit4:junit4]   2> 7258 T426 oasc.RequestHandlers.initHandlersFromConfig created lazy: solr.StandardRequestHandler
[junit4:junit4]   2> 7259 T426 oasc.RequestHandlers.initHandlersFromConfig created /update: solr.UpdateRequestHandler
[junit4:junit4]   2> 7260 T426 oasc.RequestHandlers.initHandlersFromConfig created /terms: org.apache.solr.handler.component.SearchHandler
[junit4:junit4]   2> 7261 T426 oasc.RequestHandlers.initHandlersFromConfig created spellCheckCompRH: org.apache.solr.handler.component.SearchHandler
[junit4:junit4]   2> 7262 T426 oasc.RequestHandlers.initHandlersFromConfig created spellCheckCompRH_Direct: org.apache.solr.handler.component.SearchHandler
[junit4:junit4]   2> 7262 T426 oasc.RequestHandlers.initHandlersFromConfig created spellCheckWithWordbreak: org.apache.solr.handler.component.SearchHandler
[junit4:junit4]   2> 7263 T426 oasc.RequestHandlers.initHandlersFromConfig created spellCheckWithWordbreak_Direct: org.apache.solr.handler.component.SearchHandler
[junit4:junit4]   2> 7264 T426 oasc.RequestHandlers.initHandlersFromConfig created spellCheckCompRH1: org.apache.solr.handler.component.SearchHandler
[junit4:junit4]   2> 7265 T426 oasc.RequestHandlers.initHandlersFromConfig created tvrh: org.apache.solr.handler.component.SearchHandler
[junit4:junit4]   2> 7266 T426 oasc.RequestHandlers.initHandlersFromConfig created /mlt: solr.MoreLikeThisHandler
[junit4:junit4]   2> 7266 T426 oasc.RequestHandlers.initHandlersFromConfig created /debug/dump: solr.DumpRequestHandler
[junit4:junit4]   2> 7268 T426 oashl.XMLLoader.init xsltCacheLifetimeSeconds=60
[junit4:junit4]   2> 7270 T426 oasc.SolrCore.initDeprecatedSupport WARNING solrconfig.xml uses deprecated <admin/gettableFiles>, Please update your config to use the ShowFileRequestHandler.
[junit4:junit4]   2> 7271 T426 oasc.SolrCore.initDeprecatedSupport WARNING adding ShowFileRequestHandler with hidden files: [SCHEMA.XML, OLD_SYNONYMS.TXT, STOPWORDS.TXT, PROTWORDS.TXT, OPEN-EXCHANGE-RATES.JSON, SYNONYMS.TXT, CURRENCY.XML, MAPPING-ISOLATIN1ACCENT.TXT]
[junit4:junit4]   2> 7274 T426 oass.SolrIndexSearcher.<init> Opening Searcher@1b694e52 main
[junit4:junit4]   2> 7274 T426 oass.SolrIndexSearcher.getIndexDir WARNING WARNING: Directory impl does not support setting indexDir: org.apache.lucene.store.RateLimitedDirectoryWrapper
[junit4:junit4]   2> 7274 T426 oasu.CommitTracker.<init> Hard AutoCommit: disabled
[junit4:junit4]   2> 7275 T426 oasu.CommitTracker.<init> Soft AutoCommit: disabled
[junit4:junit4]   2> 7275 T426 oashc.SpellCheckComponent.inform Initializing spell checkers
[junit4:junit4]   2> 7280 T426 oass.DirectSolrSpellChecker.init init: {name=direct,classname=DirectSolrSpellChecker,field=lowerfilt,minQueryLength=3}
[junit4:junit4]   2> 7306 T427 oasc.SolrCore.registerSearcher [collection1] Registered new searcher Searcher@1b694e52 main{StandardDirectoryReader(segments_1:1)}
[junit4:junit4]   2> 7313 T426 oasc.ZkController.publish publishing core=collection1 state=down
[junit4:junit4]   2> 7314 T426 oasc.ZkController.publish numShards not found on descriptor - reading it from system property
[junit4:junit4]   2> 7517 T362 oascc.ZkStateReader.updateClusterState Updating cloud state from ZooKeeper... 
[junit4:junit4]   2> 7518 T362 oasc.Overseer$ClusterStateUpdater.updateState Update state numShards=2 message={
[junit4:junit4]   2> 	  "operation":"state",
[junit4:junit4]   2> 	  "numShards":"2",
[junit4:junit4]   2> 	  "shard":null,
[junit4:junit4]   2> 	  "roles":null,
[junit4:junit4]   2> 	  "state":"down",
[junit4:junit4]   2> 	  "core":"collection1",
[junit4:junit4]   2> 	  "collection":"collection1",
[junit4:junit4]   2> 	  "node_name":"127.0.0.1:50707_solr",
[junit4:junit4]   2> 	  "base_url":"http://127.0.0.1:50707/solr"}
[junit4:junit4]   2> 7518 T362 oasc.Overseer$ClusterStateUpdater.updateState Collection already exists with numShards=2
[junit4:junit4]   2> 7518 T362 oasc.Overseer$ClusterStateUpdater.updateState Assigning new node to shard shard=shard2
[junit4:junit4]   2> 7521 T425 oascc.ZkStateReader$2.process A cluster state change has occurred - updating... (5)
[junit4:junit4]   2> 7521 T361 oascc.ZkStateReader$2.process A cluster state change has occurred - updating... (5)
[junit4:junit4]   2> 7521 T378 oascc.ZkStateReader$2.process A cluster state change has occurred - updating... (5)
[junit4:junit4]   2> 7521 T393 oascc.ZkStateReader$2.process A cluster state change has occurred - updating... (5)
[junit4:junit4]   2> 7521 T408 oascc.ZkStateReader$2.process A cluster state change has occurred - updating... (5)
[junit4:junit4]   2> 7814 T426 oasc.CoreContainer.register registering core: collection1
[junit4:junit4]   2> 7815 T426 oasc.ZkController.register Register shard - core:collection1 address:http://127.0.0.1:50707/solr shardId:shard2
[junit4:junit4]   2> 7817 T426 oasc.ZkController.register We are http://127.0.0.1:50707/solr/collection1/ and leader is http://127.0.0.1:50246/solr/collection1/
[junit4:junit4]   2> 7817 T426 oasc.ZkController.register No LogReplay needed for core=collection1 baseURL=http://127.0.0.1:50707/solr
[junit4:junit4]   2> 7817 T426 oasc.ZkController.checkRecovery Core needs to recover:collection1
[junit4:junit4]   2> 7817 T426 oasu.DefaultSolrCoreState.doRecovery Running recovery - first canceling any ongoing recovery
[junit4:junit4]   2> ASYNC  NEW_CORE C16 name=collection1 org.apache.solr.core.SolrCore@1b65902f url=http://127.0.0.1:50707/solr/collection1 node=127.0.0.1:50707_solr
[junit4:junit4]   2> 7818 T428 C16 P50707 oasc.RecoveryStrategy.run Starting recovery process.  core=collection1 recoveringAfterStartup=true
[junit4:junit4]   2> 7818 T428 C16 P50707 oasc.RecoveryStrategy.doRecovery ###### startupVersions=[]
[junit4:junit4]   2> 7818 T426 oascc.ZkStateReader.updateClusterState Updating cloud state from ZooKeeper... 
[junit4:junit4]   2> 7818 T428 C16 P50707 oasc.ZkController.publish publishing core=collection1 state=recovering
[junit4:junit4]   2> 7818 T428 C16 P50707 oasc.ZkController.publish numShards not found on descriptor - reading it from system property
[junit4:junit4]   2> 7819 T339 oass.SolrDispatchFilter.init user.dir=/mnt/ssd/jenkins/workspace/Lucene-Solr-4.x-Linux/solr/build/solr-core/test/J1
[junit4:junit4]   2> 7819 T428 C16 P50707 oasc.RecoveryStrategy.doRecovery Attempting to PeerSync from http://127.0.0.1:50246/solr/collection1/ core=collection1 - recoveringAfterStartup=true
[junit4:junit4]   2> 7819 T339 oass.SolrDispatchFilter.init SolrDispatchFilter.init() done
[junit4:junit4]   2> 7819 T428 C16 P50707 oasu.PeerSync.sync PeerSync: core=collection1 url=http://127.0.0.1:50707/solr START replicas=[http://127.0.0.1:50246/solr/collection1/] nUpdates=100
[junit4:junit4]   2> 7820 T428 C16 P50707 oasu.PeerSync.sync WARNING no frame of reference to tell of we've missed updates
[junit4:junit4]   2> 7820 T339 oascsi.HttpClientUtil.createClient Creating new http client, config:maxConnections=128&maxConnectionsPerHost=32&followRedirects=false
[junit4:junit4]   2> 7820 T428 C16 P50707 oasc.RecoveryStrategy.doRecovery PeerSync Recovery was not successful - trying replication. core=collection1
[junit4:junit4]   2> 7820 T428 C16 P50707 oasc.RecoveryStrategy.doRecovery Starting Replication Recovery. core=collection1
[junit4:junit4]   2> 7821 T428 C16 P50707 oascsi.HttpClientUtil.createClient Creating new http client, config:maxConnections=128&maxConnectionsPerHost=32&followRedirects=false
[junit4:junit4]   2> 7824 T339 oaz.ZooKeeper.<init> Initiating client connection, connectString=127.0.0.1:38624/solr sessionTimeout=10000 watcher=org.apache.solr.common.cloud.ConnectionManager@1b5a018e
[junit4:junit4]   2> ASYNC  NEW_CORE C17 name=collection1 org.apache.solr.core.SolrCore@1af7accc url=http://127.0.0.1:50246/solr/collection1 node=127.0.0.1:50246_solr
[junit4:junit4]   2> 7825 T386 C17 P50246 REQ /get {distrib=false&qt=/get&wt=javabin&version=2&getVersions=100} status=0 QTime=0 
[junit4:junit4]   2> 7825 T430 oaz.ClientCnxn$SendThread.logStartConnect Opening socket connection to server localhost.localdomain/127.0.0.1:38624. Will not attempt to authenticate using SASL (access denied (javax.security.auth.AuthPermission getLoginConfiguration))
[junit4:junit4]   2> 7825 T339 oascc.ConnectionManager.waitForConnected Waiting for client to connect to ZooKeeper
[junit4:junit4]   2> 7826 T430 oaz.ClientCnxn$SendThread.primeConnection Socket connection established to localhost.localdomain/127.0.0.1:38624, initiating session
[junit4:junit4]   2> 7826 T341 oazs.NIOServerCnxnFactory.run Accepted socket connection from /127.0.0.1:56879
[junit4:junit4]   2> 7826 T341 oazs.ZooKeeperServer.processConnectRequest Client attempting to establish new session at /127.0.0.1:56879
[junit4:junit4]   2> 7827 T343 oazs.ZooKeeperServer.finishSessionInit Established session 0x13b8f4bc5bb000c with negotiated timeout 10000 for client /127.0.0.1:56879
[junit4:junit4]   2> 7827 T430 oaz.ClientCnxn$SendThread.onConnected Session establishment complete on server localhost.localdomain/127.0.0.1:38624, sessionid = 0x13b8f4bc5bb000c, negotiated timeout = 10000
[junit4:junit4]   2> 7827 T431 oascc.ConnectionManager.process Watcher org.apache.solr.common.cloud.ConnectionManager@1b5a018e name:ZooKeeperConnection Watcher:127.0.0.1:38624/solr got event WatchedEvent state:SyncConnected type:None path:null path:null type:None
[junit4:junit4]   2> 7827 T339 oascc.ConnectionManager.waitForConnected Client is connected to ZooKeeper
[junit4:junit4]   2> 7828 T339 oascc.ZkStateReader.createClusterStateWatchersAndUpdate Updating cluster state from ZooKeeper... 
[junit4:junit4]   2> 7829 T339 oasc.ChaosMonkey.monkeyLog monkey: init - expire sessions:true cause connection loss:true
[junit4:junit4]   2> 7830 T339 oascsi.HttpClientUtil.createClient Creating new http client, config:
[junit4:junit4]   2> 7834 T339 oascc.ZkStateReader.updateClusterState Updating cloud state from ZooKeeper... 
[junit4:junit4]   2> ASYNC  NEW_CORE C18 name=collection1 org.apache.solr.core.SolrCore@1af03818 url=http://127.0.0.1:35281/solr/collection1 node=127.0.0.1:35281_solr
[junit4:junit4]   2> 7849 T356 C18 P35281 oasc.SolrDeletionPolicy.onInit SolrDeletionPolicy.onInit: commits:num=1
[junit4:junit4]   2> 		commit{dir=RateLimitedDirectoryWrapper(NRTCachingDirectory(org.apache.lucene.store.NIOFSDirectory@/mnt/ssd/jenkins/workspace/Lucene-Solr-4.x-Linux/solr/build/solr-core/test/J1/org.apache.solr.cloud.BasicDistributedZk2Test-1355318805943/control/data/index lockFactory=org.apache.lucene.store.NativeFSLockFactory@1af08c29; maxCacheMB=48.0 maxMergeSizeMB=4.0)),segFN=segments_1,generation=1,filenames=[segments_1]
[junit4:junit4]   2> 7850 T356 C18 P35281 oasc.SolrDeletionPolicy.updateCommits newest commit = 1
[junit4:junit4]   2> 7853 T356 C18 P35281 /update {wt=javabin&version=2} {add=[1 (1421154780468740096)]} 0 7
[junit4:junit4]   2> 7854 T339 oaz.ZooKeeper.<init> Initiating client connection, connectString=127.0.0.1:38624/solr sessionTimeout=10000 watcher=org.apache.solr.common.cloud.ConnectionManager@1b5bb4ef
[junit4:junit4]   2> 7855 T432 oaz.ClientCnxn$SendThread.logStartConnect Opening socket connection to server localhost.localdomain/127.0.0.1:38624. Will not attempt to authenticate using SASL (access denied (javax.security.auth.AuthPermission getLoginConfiguration))
[junit4:junit4]   2> 7855 T339 oascc.ConnectionManager.waitForConnected Waiting for client to connect to ZooKeeper
[junit4:junit4]   2> 7856 T341 oazs.NIOServerCnxnFactory.run Accepted socket connection from /127.0.0.1:56881
[junit4:junit4]   2> 7855 T432 oaz.ClientCnxn$SendThread.primeConnection Socket connection established to localhost.localdomain/127.0.0.1:38624, initiating session
[junit4:junit4]   2> 7856 T341 oazs.ZooKeeperServer.processConnectRequest Client attempting to establish new session at /127.0.0.1:56881
[junit4:junit4]   2> 7857 T343 oazs.ZooKeeperServer.finishSessionInit Established session 0x13b8f4bc5bb000d with negotiated timeout 10000 for client /127.0.0.1:56881
[junit4:junit4]   2> 7857 T432 oaz.ClientCnxn$SendThread.onConnected Session establishment complete on server localhost.localdomain/127.0.0.1:38624, sessionid = 0x13b8f4bc5bb000d, negotiated timeout = 10000
[junit4:junit4]   2> 7857 T433 oascc.ConnectionManager.process Watcher org.apache.solr.common.cloud.ConnectionManager@1b5bb4ef name:ZooKeeperConnection Watcher:127.0.0.1:38624/solr got event WatchedEvent state:SyncConnected type:None path:null path:null type:None
[junit4:junit4]   2> 7857 T339 oascc.ConnectionManager.waitForConnected Client is connected to ZooKeeper
[junit4:junit4]   2> 7858 T339 oascc.ZkStateReader.createClusterStateWatchersAndUpdate Updating cluster state from ZooKeeper... 
[junit4:junit4]   2> 7863 T374 C15 P43182 oasc.SolrDeletionPolicy.onInit SolrDeletionPolicy.onInit: commits:num=1
[junit4:junit4]   2> 		commit{dir=RateLimitedDirectoryWrapper(NRTCachingDirectory(org.apache.lucene.store.NIOFSDirectory@/mnt/ssd/jenkins/workspace/Lucene-Solr-4.x-Linux/solr/build/solr-core/test/J1/org.apache.solr.cloud.BasicDistributedZk2Test-1355318805943/jetty1/index lockFactory=org.apache.lucene.store.NativeFSLockFactory@1b0867dc; maxCacheMB=48.0 maxMergeSizeMB=4.0)),segFN=segments_1,generation=1,filenames=[segments_1]
[junit4:junit4]   2> 7863 T374 C15 P43182 oasc.SolrDeletionPolicy.updateCommits newest commit = 1
[junit4:junit4]   2>  C14_STATE=coll:collection1 core:collection1 props:{shard=shard1, roles=null, state=recovering, core=collection1, collection=collection1, node_name=127.0.0.1:38044_solr, base_url=http://127.0.0.1:38044/solr}
[junit4:junit4]   2> 7873 T403 C14 P38044 oasc.SolrDeletionPolicy.onInit SolrDeletionPolicy.onInit: commits:num=1
[junit4:junit4]   2> 		commit{dir=RateLimitedDirectoryWrapper(NRTCachingDirectory(org.apache.lucene.store.NIOFSDirectory@/mnt/ssd/jenkins/workspace/Lucene-Solr-4.x-Linux/solr/build/solr-core/test/J1/org.apache.solr.cloud.BasicDistributedZk2Test-1355318805943/jetty3/index lockFactory=org.apache.lucene.store.NativeFSLockFactory@1c2be90f; maxCacheMB=48.0 maxMergeSizeMB=4.0)),segFN=segments_1,generation=1,filenames=[segments_1]
[junit4:junit4]   2> 7873 T403 C14 P38044 oasc.SolrDeletionPolicy.updateCommits newest commit = 1
[junit4:junit4]   2> 7875 T403 C14 P38044 REQ /update {distrib.from=http://127.0.0.1:43182/solr/collection1/&update.distrib=FROMLEADER&wt=javabin&version=2} status=0 QTime=4 
[junit4:junit4]   2> 7876 T374 C15 P43182 REQ /update {distrib.from=http://127.0.0.1:50246/solr/collection1/&update.distrib=TOLEADER&wt=javabin&version=2} status=0 QTime=15 
[junit4:junit4]   2> 7877 T388 C17 P50246 /update {wt=javabin&version=2} {add=[1]} 0 17
[junit4:junit4]   2> 7878 T357 C18 P35281 oasu.DirectUpdateHandler2.commit start commit{flags=0,_version_=0,optimize=false,openSearcher=true,waitSearcher=true,expungeDeletes=false,softCommit=false}
[junit4:junit4]   2> 7941 T357 C18 P35281 oasc.SolrDeletionPolicy.onCommit SolrDeletionPolicy.onCommit: commits:num=2
[junit4:junit4]   2> 		commit{dir=RateLimitedDirectoryWrapper(NRTCachingDirectory(org.apache.lucene.store.NIOFSDirectory@/mnt/ssd/jenkins/workspace/Lucene-Solr-4.x-Linux/solr/build/solr-core/test/J1/org.apache.solr.cloud.BasicDistributedZk2Test-1355318805943/control/data/index lockFactory=org.apache.lucene.store.NativeFSLockFactory@1af08c29; maxCacheMB=48.0 maxMergeSizeMB=4.0)),segFN=segments_1,generation=1,filenames=[segments_1]
[junit4:junit4]   2> 		commit{dir=RateLimitedDirectoryWrapper(NRTCachingDirectory(org.apache.lucene.store.NIOFSDirectory@/mnt/ssd/jenkins/workspace/Lucene-Solr-4.x-Linux/solr/build/solr-core/test/J1/org.apache.solr.cloud.BasicDistributedZk2Test-1355318805943/control/data/index lockFactory=org.apache.lucene.store.NativeFSLockFactory@1af08c29; maxCacheMB=48.0 maxMergeSizeMB=4.0)),segFN=segments_2,generation=2,filenames=[_0_Asserting_0.tim, _0_Asserting_0.tip, _0_TestBloomFilteredLucene41Postings_0.tim, _0_TestBloomFilteredLucene41Postings_0.tip, _0_MockFixedIntBlock_0.tib, _0_TestBloomFilteredLucene41Postings_0.pos, _0_MockFixedIntBlock_0.skp, _0_MockFixedIntBlock_0.pyl, _0_Pulsing41_0.tim, _0_MockFixedIntBlock_0.tii, _0_Pulsing41_0.tip, _0.si, _0_Asserting_0.doc, _0.fnm, _0_TestBloomFilteredLucene41Postings_0.blm, _0_MockFixedIntBlock_0.pos, _0_nrm.cfs, _0_MockFixedIntBlock_0.frq, _0_Pulsing41_0.pos, _0_Pulsing41_0.doc, _0_MockFixedIntBlock_0.doc, _0_nrm.cfe, segments_2, _0_TestBloomFilteredLucene41Postings_0.doc, _0.fdx, _0_Asserting_0.pos, _0.fdt]
[junit4:junit4]   2> 7945 T357 C18 P35281 oasc.SolrDeletionPolicy.updateCommits newest commit = 2
[junit4:junit4]   2> 7964 T357 C18 P35281 oass.SolrIndexSearcher.<init> Opening Searcher@1b97b31f main
[junit4:junit4]   2> 7964 T357 C18 P35281 oass.SolrIndexSearcher.getIndexDir WARNING WARNING: Directory impl does not support setting indexDir: org.apache.lucene.store.RateLimitedDirectoryWrapper
[junit4:junit4]   2> 7964 T357 C18 P35281 oasu.DirectUpdateHandler2.commit end_commit_flush
[junit4:junit4]   2> 7966 T365 oasc.SolrCore.registerSearcher [collection1] Registered new searcher Searcher@1b97b31f main{StandardDirectoryReader(segments_2:3 _0(4.1):C1)}
[junit4:junit4]   2> 7967 T357 C18 P35281 /update {waitSearcher=true&wt=javabin&commit=true&softCommit=false&version=2} {commit=} 0 89
[junit4:junit4]   2> 7968 T389 C17 P50246 oasu.DirectUpdateHandler2.commit start commit{flags=0,_version_=0,optimize=false,openSearcher=true,waitSearcher=true,expungeDeletes=false,softCommit=false}
[junit4:junit4]   2> 7970 T389 C17 P50246 oasc.SolrDeletionPolicy.onInit SolrDeletionPolicy.onInit: commits:num=1
[junit4:junit4]   2> 		commit{dir=RateLimitedDirectoryWrapper(NRTCachingDirectory(org.apache.lucene.store.NIOFSDirectory@/mnt/ssd/jenkins/workspace/Lucene-Solr-4.x-Linux/solr/build/solr-core/test/J1/org.apache.solr.cloud.BasicDistributedZk2Test-1355318805943/jetty2/index lockFactory=org.apache.lucene.store.NativeFSLockFactory@1af80167; maxCacheMB=48.0 maxMergeSizeMB=4.0)),segFN=segments_1,generation=1,filenames=[segments_1]
[junit4:junit4]   2> 7971 T389 C17 P50246 oasc.SolrDeletionPolicy.updateCommits newest commit = 1
[junit4:junit4]   2> 7993 T389 C17 P50246 oasc.SolrDeletionPolicy.onCommit SolrDeletionPolicy.onCommit: commits:num=2
[junit4:junit4]   2> 		commit{dir=RateLimitedDirectoryWrapper(NRTCachingDirectory(org.apache.lucene.store.NIOFSDirectory@/mnt/ssd/jenkins/workspace/Lucene-Solr-4.x-Linux/solr/build/solr-core/test/J1/org.apache.solr.cloud.BasicDistributedZk2Test-1355318805943/jetty2/index lockFactory=org.apache.lucene.store.NativeFSLockFactory@1af80167; maxCacheMB=48.0 maxMergeSizeMB=4.0)),segFN=segments_1,generation=1,filenames=[segments_1]
[junit4:junit4]   2> 		commit{dir=RateLimitedDirectoryWrapper(NRTCachingDirectory(org.apache.lucene.store.NIOFSDirectory@/mnt/ssd/jenkins/workspace/Lucene-Solr-4.x-Linux/solr/build/solr-core/test/J1/org.apache.solr.cloud.BasicDistributedZk2Test-1355318805943/jetty2/index lockFactory=org.apache.lucene.store.NativeFSLockFactory@1af80167; maxCacheMB=48.0 maxMergeSizeMB=4.0)),segFN=segments_2,generation=2,filenames=[segments_2]
[junit4:junit4]   2> 7993 T389 C17 P50246 oasc.SolrDeletionPolicy.updateCommits newest commit = 2
[junit4:junit4]   2> 7994 T389 C17 P50246 oass.SolrIndexSearcher.<init> Opening Searcher@1af2b2ef main
[junit4:junit4]   2> 7995 T389 C17 P50246 oass.SolrIndexSearcher.getIndexDir WARNING WARNING: Directory impl does not support setting indexDir: org.apache.lucene.store.RateLimitedDirectoryWrapper
[junit4:junit4]   2> 7995 T389 C17 P50246 oasu.DirectUpdateHandler2.commit end_commit_flush
[junit4:junit4]   2> 7997 T395 oasc.SolrCore.registerSearcher [collection1] Registered new searcher Searcher@1af2b2ef main{StandardDirectoryReader(segments_1:1)}
[junit4:junit4]   2> 7997 T389 C17 P50246 oasu.SolrCmdDistributor.distribCommit Distrib commit to:[StdNode: http://127.0.0.1:43182/solr/collection1/, StdNode: http://127.0.0.1:38044/solr/collection1/, StdNode: http://127.0.0.1:50707/solr/collection1/] params:commit_end_point=true&commit=true&softCommit=false&waitSearcher=true&expungeDeletes=false
[junit4:junit4]   2> 7999 T371 C15 P43182 oasu.DirectUpdateHandler2.commit start commit{flags=0,_version_=0,optimize=false,openSearcher=true,waitSearcher=true,expungeDeletes=false,softCommit=false}
[junit4:junit4]   2> 7999 T401 C14 P38044 oasu.DirectUpdateHandler2.commit start commit{flags=0,_version_=0,optimize=false,openSearcher=true,waitSearcher=true,expungeDeletes=false,softCommit=false}
[junit4:junit4]   2> 8008 T418 C16 P50707 oasu.DirectUpdateHandler2.commit start commit{flags=0,_version_=0,optimize=false,openSearcher=true,waitSearcher=true,expungeDeletes=false,softCommit=false}
[junit4:junit4]   2> 8011 T418 C16 P50707 oasc.SolrDeletionPolicy.onInit SolrDeletionPolicy.onInit: commits:num=1
[junit4:junit4]   2> 		commit{dir=RateLimitedDirectoryWrapper(NRTCachingDirectory(org.apache.lucene.store.NIOFSDirectory@/mnt/ssd/jenkins/workspace/Lucene-Solr-4.x-Linux/solr/build/solr-core/test/J1/org.apache.solr.cloud.BasicDistributedZk2Test-1355318805943/jetty4/index lockFactory=org.apache.lucene.store.NativeFSLockFactory@1b65e4f0; maxCacheMB=48.0 maxMergeSizeMB=4.0)),segFN=segments_1,generation=1,filenames=[segments_1]
[junit4:junit4]   2> 8011 T418 C16 P50707 oasc.SolrDeletionPolicy.updateCommits newest commit = 1
[junit4:junit4]   2> 8024 T362 oascc.ZkStateReader.updateClusterState Updating cloud state from ZooKeeper... 
[junit4:junit4]   2> 8025 T362 oasc.Overseer$ClusterStateUpdater.updateState Update state numShards=2 message={
[junit4:junit4]   2> 	  "operation":"state",
[junit4:junit4]   2> 	  "numShards":"2",
[junit4:junit4]   2> 	  "shard":"shard2",
[junit4:junit4]   2> 	  "roles":null,
[junit4:junit4]   2> 	  "state":"recovering",
[junit4:junit4]   2> 	  "core":"collection1",
[junit4:junit4]   2> 	  "collection":"collection1",
[junit4:junit4]   2> 	  "node_name":"127.0.0.1:50707_solr",
[junit4:junit4]   2> 	  "base_url":"http://127.0.0.1:50707/solr"}
[junit4:junit4]   2> 8033 T418 C16 P50707 oasc.SolrDeletionPolicy.onCommit SolrDeletionPolicy.onCommit: commits:num=2
[junit4:junit4]   2> 		commit{dir=RateLimitedDirectoryWrapper(NRTCachingDirectory(org.apache.lucene.store.NIOFSDirectory@/mnt/ssd/jenkins/workspace/Lucene-Solr-4.x-Linux/solr/build/solr-core/test/J1/org.apache.solr.cloud.BasicDistributedZk2Test-1355318805943/jetty4/index lockFactory=org.apache.lucene.store.NativeFSLockFactory@1b65e4f0; maxCacheMB=48.0 maxMergeSizeMB=4.0)),segFN=segments_1,generation=1,filenames=[segments_1]
[junit4:junit4]   2> 		commit{dir=RateLimitedDirectoryWrapper(NRTCachingDirectory(org.apache.lucene.store.NIOFSDirectory@/mnt/ssd/jenkins/workspace/Lucene-Solr-4.x-Linux/solr/build/solr-core/test/J1/org.apache.solr.cloud.BasicDistributedZk2Test-1355318805943/jetty4/index lockFactory=org.apache.lucene.store.NativeFSLockFactory@1b65e4f0; maxCacheMB=48.0 maxMergeSizeMB=4.0)),segFN=segments_2,generation=2,filenames=[segments_2]
[junit4:junit4]   2> 8033 T418 C16 P50707 oasc.SolrDeletionPolicy.updateCommits newest commit = 2
[junit4:junit4]   2> 8034 T418 C16 P50707 oass.SolrIndexSearcher.<init> Opening Searcher@1b26663e main
[junit4:junit4]   2> 8035 T418 C16 P50707 oass.SolrIndexSearcher.getIndexDir WARNING WARNING: Directory impl does not support setting indexDir: org.apache.lucene.store.RateLimitedDirectoryWrapper
[junit4:junit4]   2> 8035 T418 C16 P50707 oasu.DirectUpdateHandler2.commit end_commit_flush
[junit4:junit4]   2> 8037 T427 oasc.SolrCore.registerSearcher [collection1] Registered new searcher Searcher@1b26663e main{StandardDirectoryReader(segments_1:1)}
[junit4:junit4]   2> 8037 T418 C16 P50707 /update {waitSearcher=true&commit=true&commit_end_point=true&expungeDeletes=false&wt=javabin&softCommit=false&version=2} {commit=} 0 30
[junit4:junit4]   2> 8044 T425 oascc.ZkStateReader$2.process A cluster state change has occurred - updating... (5)
[junit4:junit4]   2> 8044 T393 oascc.ZkStateReader$2.process A cluster state change has occurred - updating... (5)
[junit4:junit4]   2> 8044 T433 oascc.ZkStateReader$2.process A cluster state change has occurred - updating... (5)
[junit4:junit4]   2> 8044 T361 oascc.ZkStateReader$2.process A cluster state change has occurred - updating... (5)
[junit4:junit4]   2> 8044 T408 oascc.ZkStateReader$2.process A cluster state change has occurred - updating... (5)
[junit4:junit4]   2> 8044 T378 oascc.ZkStateReader$2.process A cluster state change has occurred - updating... (5)
[junit4:junit4]   2> 8044 T431 oascc.ZkStateReader$2.process A cluster state change has occurred - updating... (5)
[junit4:junit4]   2> 8075 T401 C14 P38044 oasc.SolrDeletionPolicy.onCommit SolrDeletionPolicy.onCommit: commits:num=2
[junit4:junit4]   2> 		commit{dir=RateLimitedDirectoryWrapper(NRTCachingDirectory(org.apache.lucene.store.NIOFSDirectory@/mnt/ssd/jenkins/workspace/Lucene-Solr-4.x-Linux/solr/build/solr-core/test/J1/org.apache.solr.cloud.BasicDistributedZk2Test-1355318805943/jetty3/index lockFactory=org.apache.lucene.store.NativeFSLockFactory@1c2be90f; maxCacheMB=48.0 maxMergeSizeMB=4.0)),segFN=segments_1,generation=1,filenames=[segments_1]
[junit4:junit4]   2> 		commit{dir=RateLimitedDirectoryWrapper(NRTCachingDirectory(org.apache.lucene.store.NIOFSDirectory@/mnt/ssd/jenkins/workspace/Lucene-Solr-4.x-Linux/solr/build/solr-core/test/J1/org.apache.solr.cloud.BasicDistributedZk2Test-1355318805943/jetty3/index lockFactory=org.apache.lucene.store.NativeFSLockFactory@1c2be90f; maxCacheMB=48.0 maxMergeSizeMB=4.0)),segFN=segments_2,generation=2,filenames=[_0_Asserting_0.tim, _0_Asserting_0.tip, _0_TestBloomFilteredLucene41Postings_0.tim, _0_TestBloomFilteredLucene41Postings_0.tip, _0_MockFixedIntBlock_0.tib, _0_TestBloomFilteredLucene41Postings_0.pos, _0_MockFixedIntBlock_0.skp, _0_MockFixedIntBlock_0.pyl, _0_Pulsing41_0.tim, _0_MockFixedIntBlock_0.tii, _0_Pulsing41_0.tip, _0.si, _0_Asserting_0.doc, _0.fnm, _0_TestBloomFilteredLucene41Postings_0.blm, _0_MockFixedIntBlock_0.pos, _0_nrm.cfs, _0_MockFixedIntBlock_0.frq, _0_Pulsing41_0.pos, _0_Pulsing41_0.doc, _0_MockFixedIntBlock_0.doc, _0_nrm.cfe, segments_2, _0_TestBloomFilteredLucene41Postings_0.doc, _0.fdx, _0_Asserting_0.pos, _0.fdt]
[junit4:junit4]   2> 8076 T401 C14 P38044 oasc.SolrDeletionPolicy.updateCommits newest commit = 2
[junit4:junit4]   2> 8076 T371 C15 P43182 oasc.SolrDeletionPolicy.onCommit SolrDeletionPolicy.onCommit: commits:num=2
[junit4:junit4]   2> 		commit{dir=RateLimitedDirectoryWrapper(NRTCachingDirectory(org.apache.lucene.store.NIOFSDirectory@/mnt/ssd/jenkins/workspace/Lucene-Solr-4.x-Linux/solr/build/solr-core/test/J1/org.apache.solr.cloud.BasicDistributedZk2Test-1355318805943/jetty1/index lockFactory=org.apache.lucene.store.NativeFSLockFactory@1b0867dc; maxCacheMB=48.0 maxMergeSizeMB=4.0)),segFN=segments_1,generation=1,filenames=[segments_1]
[junit4:junit4]   2> 		commit{dir=RateLimitedDirectoryWrapper(NRTCachingDirectory(org.apache.lucene.store.NIOFSDirectory@/mnt/ssd/jenkins/workspace/Lucene-Solr-4.x-Linux/solr/build/solr-core/test/J1/org.apache.solr.cloud.BasicDistributedZk2Test-1355318805943/jetty1/index lockFactory=org.apache.lucene.store.NativeFSLockFactory@1b0867dc; maxCacheMB=48.0 maxMergeSizeMB=4.0)),segFN=segments_2,generation=2,filenames=[_0_Asserting_0.tim, _0_Asserting_0.tip, _0_TestBloomFilteredLucene41Postings_0.tim, _0_TestBloomFilteredLucene41Postings_0.tip, _0_MockFixedIntBlock_0.tib, _0_TestBloomFilteredLucene41Postings_0.pos, _0_MockFixedIntBlock_0.skp, _0_MockFixedIntBlock_0.pyl, _0_Pulsing41_0.tim, _0_MockFixedIntBlock_0.tii, _0_Pulsing41_0.tip, _0.si, _0_Asserting_0.doc, _0.fnm, _0_TestBloomFilteredLucene41Postings_0.blm, _0_MockFixedIntBlock_0.pos, _0_nrm.cfs, _0_MockFixedIntBlock_0.frq, _0_Pulsing41_0.pos, _0_Pulsing41_0.doc, _0_MockFixedIntBlock_0.doc, _0_nrm.cfe, segments_2, _0_TestBloomFilteredLucene41Postings_0.doc, _0.fdx, _0_Asserting_0.pos, _0.fdt]
[junit4:junit4]   2> 8077 T371 C15 P43182 oasc.SolrDeletionPolicy.updateCommits newest commit = 2
[junit4:junit4]   2> 8085 T401 C14 P38044 oass.SolrIndexSearcher.<init> Opening Searcher@1b7eba71 main
[junit4:junit4]   2> 8085 T401 C14 P38044 oass.SolrIndexSearcher.getIndexDir WARNING WARNING: Directory impl does not support setting indexDir: org.apache.lucene.store.RateLimitedDirectoryWrapper
[junit4:junit4]   2> 8085 T401 C14 P38044 oasu.DirectUpdateHandler2.commit end_commit_flush
[junit4:junit4]   2> 8086 T371 C15 P43182 oass.SolrIndexSearcher.<init> Opening Searcher@1b93de11 main
[junit4:junit4]   2> 8086 T371 C15 P43182 oass.SolrIndexSearcher.getIndexDir WARNING WARNING: Directory impl does not support setting indexDir: org.apache.lucene.store.RateLimitedDirectoryWrapper
[junit4:junit4]   2> 8086 T371 C15 P43182 oasu.DirectUpdateHandler2.commit end_commit_flush
[junit4:junit4]   2> 8089 T380 oasc.JmxMonitoredMap.put WARNING Failed to register info bean: queryResultCache javax.management.InstanceAlreadyExistsException: solr/collection1:type=queryResultCache,id=org.apache.solr.search.LRUCache
[junit4:junit4]   2> 	at com.sun.jmx.mbeanserver.Repository.addMBean(Repository.java:453)
[junit4:junit4]   2> 	at com.sun.jmx.interceptor.DefaultMBeanServerInterceptor.internal_addObject(DefaultMBeanServerInterceptor.java:1484)
[junit4:junit4]   2> 	at com.sun.jmx.interceptor.DefaultMBeanServerInterceptor.registerDynamicMBean(DefaultMBeanServerInterceptor.java:963)
[junit4:junit4]   2> 	at com.sun.jmx.interceptor.DefaultMBeanServerInterceptor.registerObject(DefaultMBeanServerInterceptor.java:917)
[junit4:junit4]   2> 	at com.sun.jmx.interceptor.DefaultMBeanServerInterceptor.registerMBean(DefaultMBeanServerInterceptor.java:312)
[junit4:junit4]   2> 	at com.sun.jmx.mbeanserver.JmxMBeanServer.registerMBean(JmxMBeanServer.java:482)
[junit4:junit4]   2> 	at org.apache.solr.core.JmxMonitoredMap.put(JmxMonitoredMap.java:140)
[junit4:junit4]   2> 	at org.apache.solr.core.JmxMonitoredMap.put(JmxMonitoredMap.java:51)
[junit4:junit4]   2> 	at org.apache.solr.search.SolrIndexSearcher.register(SolrIndexSearcher.java:246)
[junit4:junit4]   2> 	at org.apache.solr.core.SolrCore.registerSearcher(SolrCore.java:1701)
[junit4:junit4]   2> 	at org.apache.solr.core.SolrCore.access$000(SolrCore.java:124)
[junit4:junit4]   2> 	at org.apache.solr.core.SolrCore$7.call(SolrCore.java:1577)
[junit4:junit4]   2> 	at java.util.concurrent.FutureTask$Sync.innerRun(FutureTask.java:303)
[junit4:junit4]   2> 	at java.util.concurrent.FutureTask.run(FutureTask.java:139)
[junit4:junit4]   2> 	at java.util.concurrent.ThreadPoolExecutor$Worker.runTask(ThreadPoolExecutor.java:886)
[junit4:junit4]   2> 	at java.util.concurrent.ThreadPoolExecutor$Worker.run(ThreadPoolExecutor.java:909)
[junit4:junit4]   2> 	at java.lang.Thread.run(Thread.java:662)
[junit4:junit4]   2> 
[junit4:junit4]   2> 8089 T410 oasc.SolrCore.registerSearcher [collection1] Registered new searcher Searcher@1b7eba71 main{StandardDirectoryReader(segments_2:3 _0(4.1):C1)}
[junit4:junit4]   2> 8089 T380 oasc.SolrCore.registerSearcher [collection1] Registered new searcher Searcher@1b93de11 main{StandardDirectoryReader(segments_2:3 _0(4.1):C1)}
[junit4:junit4]   2> 8090 T401 C14 P38044 /update {waitSearcher=true&commit=true&commit_end_point=true&expungeDeletes=false&wt=javabin&softCommit=false&version=2} {commit=} 0 91
[junit4:junit4]   2> 8090 T371 C15 P43182 /update {waitSearcher=true&commit=true&commit_end_point=true&expungeDeletes=false&wt=javabin&softCommit=false&version=2} {commit=} 0 91
[junit4:junit4]   2> 8091 T389 C17 P50246 /update {waitSearcher=true&wt=javabin&commit=true&softCommit=false&version=2} {commit=} 0 123
[junit4:junit4]   2> 8091 T339 oasc.AbstractDistribZkTestBase.waitForRecoveriesToFinish Wait for recoveries to finish - collection: collection1 failOnTimeout:true timeout (sec):540
[junit4:junit4]   2> 8092 T339 oascc.ZkStateReader.updateClusterState Updating cloud state from ZooKeeper... 
[junit4:junit4]   2> 9093 T339 oascc.ZkStateReader.updateClusterState Updating cloud state from ZooKeeper... 
[junit4:junit4]   2> 9436 T411 C14 P38044 oasc.RecoveryStrategy.doRecovery Begin buffering updates. core=collection1
[junit4:junit4]   2> 9437 T411 C14 P38044 oasu.UpdateLog.bufferUpdates Starting to buffer updates. FSUpdateLog{state=ACTIVE, tlog=null}
[junit4:junit4]   2> 9437 T411 C14 P38044 oasc.RecoveryStrategy.replicate Attempting to replicate from http://127.0.0.1:43182/solr/collection1/. core=collection1
[junit4:junit4]   2> 9437 T411 C14 P38044 oascsi.HttpClientUtil.createClient Creating new http client, config:maxConnections=128&maxConnectionsPerHost=32&followRedirects=false
[junit4:junit4]   2> 9442 T372 C15 P43182 oasu.DirectUpdateHandler2.commit start commit{flags=0,_version_=0,optimize=false,openSearcher=false,waitSearcher=true,expungeDeletes=false,softCommit=false}
[junit4:junit4]   2> 9475 T372 C15 P43182 oasc.SolrDeletionPolicy.onCommit SolrDeletionPolicy.onCommit: commits:num=2
[junit4:junit4]   2> 		commit{dir=RateLimitedDirectoryWrapper(NRTCachingDirectory(org.apache.lucene.store.NIOFSDirectory@/mnt/ssd/jenkins/workspace/Lucene-Solr-4.x-Linux/solr/build/solr-core/test/J1/org.apache.solr.cloud.BasicDistributedZk2Test-1355318805943/jetty1/index lockFactory=org.apache.lucene.store.NativeFSLockFactory@1b0867dc; maxCacheMB=48.0 maxMergeSizeMB=4.0)),segFN=segments_2,generation=2,filenames=[_0_Asserting_0.tim, _0_Asserting_0.tip, _0_TestBloomFilteredLucene41Postings_0.tim, _0_TestBloomFilteredLucene41Postings_0.tip, _0_MockFixedIntBlock_0.tib, _0_TestBloomFilteredLucene41Postings_0.pos, _0_MockFixedIntBlock_0.skp, _0_MockFixedIntBlock_0.pyl, _0_Pulsing41_0.tim, _0_MockFixedIntBlock_0.tii, _0_Pulsing41_0.tip, _0.si, _0_Asserting_0.doc, _0.fnm, _0_TestBloomFilteredLucene41Postings_0.blm, _0_MockFixedIntBlock_0.pos, _0_nrm.cfs, _0_MockFixedIntBlock_0.frq, _0_Pulsing41_0.pos, _0_Pulsing41_0.doc, _0_MockFixedIntBlock_0.doc, _0_nrm.cfe, segments_2, _0_TestBloomFilteredLucene41Postings_0.doc, _0.fdx, _0_Asserting_0.pos, _0.fdt]
[junit4:junit4]   2> 		commit{dir=RateLimitedDirectoryWrapper(NRTCachingDirectory(org.apache.lucene.store.NIOFSDirectory@/mnt/ssd/jenkins/workspace/Lucene-Solr-4.x-Linux/solr/build/solr-core/test/J1/org.apache.solr.cloud.BasicDistributedZk2Test-1355318805943/jetty1/index lockFactory=org.apache.lucene.store.NativeFSLockFactory@1b0867dc; maxCacheMB=48.0 maxMergeSizeMB=4.0)),segFN=segments_3,generation=3,filenames=[_0_Asserting_0.tim, _0_Asserting_0.tip, _0_TestBloomFilteredLucene41Postings_0.tim, _0_TestBloomFilteredLucene41Postings_0.tip, _0_MockFixedIntBlock_0.tib, _0_TestBloomFilteredLucene41Postings_0.pos, _0_MockFixedIntBlock_0.skp, _0_MockFixedIntBlock_0.pyl, _0_Pulsing41_0.tim, _0_MockFixedIntBlock_0.tii, _0_Pulsing41_0.tip, _0.si, _0_Asserting_0.doc, _0.fnm, _0_TestBloomFilteredLucene41Postings_0.blm, _0_MockFixedIntBlock_0.pos, _0_nrm.cfs, _0_MockFixedIntBlock_0.frq, _0_Pulsing41_0.pos, _0_Pulsing41_0.doc, _0_MockFixedIntBlock_0.doc, _0_nrm.cfe, _0_TestBloomFilteredLucene41Postings_0.doc, _0.fdx, _0_Asserting_0.pos, _0.fdt, segments_3]
[junit4:junit4]   2> 9475 T372 C15 P43182 oasc.SolrDeletionPolicy.updateCommits newest commit = 3
[junit4:junit4]   2> 9484 T372 C15 P43182 oass.SolrIndexSearcher.<init> Opening Searcher@1b59e4c7 realtime
[junit4:junit4]   2> 9485 T372 C15 P43182 oass.SolrIndexSearcher.getIndexDir WARNING WARNING: Directory impl does not support setting indexDir: org.apache.lucene.store.RateLimitedDirectoryWrapper
[junit4:junit4]   2> 9485 T372 C15 P43182 oasu.DirectUpdateHandler2.commit end_commit_flush
[junit4:junit4]   2> 9485 T372 C15 P43182 /update {waitSearcher=true&openSearcher=false&commit=true&commit_end_point=true&wt=javabin&softCommit=false&version=2} {commit=} 0 43
[junit4:junit4]   2> 9486 T411 C14 P38044 oash.ReplicationHandler.inform Commits will be reserved for  10000
[junit4:junit4]   2> 9486 T411 C14 P38044 oash.SnapPuller.<init>  No value set for 'pollInterval'. Timer Task not started.
[junit4:junit4]   2> 9488 T371 C15 P43182 oash.ReplicationHandler.inform Commits will be reserved for  10000
[junit4:junit4]   2> 9488 T371 C15 P43182 REQ /replication {command=indexversion&wt=javabin&qt=/replication&version=2} status=0 QTime=1 
[junit4:junit4]   2> 9488 T411 C14 P38044 oash.SnapPuller.fetchLatestIndex Master's generation: 3
[junit4:junit4]   2> 9488 T411 C14 P38044 oash.SnapPuller.fetchLatestIndex Slave's generation: 2
[junit4:junit4]   2> 9489 T411 C14 P38044 oash.SnapPuller.fetchLatestIndex Starting replication process
[junit4:junit4]   2> 9494 T372 C15 P43182 REQ /replication {command=filelist&generation=3&wt=javabin&qt=/replication&version=2} status=0 QTime=4 
[junit4:junit4]   2> 9494 T411 C14 P38044 oash.SnapPuller.fetchLatestIndex Number of files in latest index in master: 27
[junit4:junit4]   2> 9497 T411 C14 P38044 oash.SnapPuller.fetchLatestIndex Starting download to ./org.apache.solr.cloud.BasicDistributedZk2Test-1355318805943/jetty3/index.20121212142655419 fullCopy=true
[junit4:junit4]   2> 9499 T373 C15 P43182 REQ /replication {file=_0_Asserting_0.tim&command=filecontent&checksum=true&generation=3&qt=/replication&wt=filestream} status=0 QTime=0 
[junit4:junit4]   2> 9502 T374 C15 P43182 REQ /replication {file=_0_Asserting_0.tip&command=filecontent&checksum=true&generation=3&qt=/replication&wt=filestream} status=0 QTime=0 
[junit4:junit4]   2> 9504 T371 C15 P43182 REQ /replication {file=_0_TestBloomFilteredLucene41Postings_0.tim&command=filecontent&checksum=true&generation=3&qt=/replication&wt=filestream} status=0 QTime=0 
[junit4:junit4]   2> 9507 T372 C15 P43182 REQ /replication {file=_0_TestBloomFilteredLucene41Postings_0.tip&command=filecontent&checksum=true&generation=3&qt=/replication&wt=filestream} status=0 QTime=0 
[junit4:junit4]   2> 9509 T373 C15 P43182 REQ /replication {file=_0_MockFixedIntBlock_0.tib&command=filecontent&checksum=true&generation=3&qt=/replication&wt=filestream} status=0 QTime=0 
[junit4:junit4]   2> 9512 T374 C15 P43182 REQ /replication {file=_0_TestBloomFilteredLucene41Postings_0.pos&command=filecontent&checksum=true&generation=3&qt=/replication&wt=filestream} status=0 QTime=0 
[junit4:junit4]   2> 9514 T371 C15 P43182 REQ /replication {file=_0_MockFixedIntBlock_0.pyl&command=filecontent&checksum=true&generation=3&qt=/replication&wt=filestream} status=0 QTime=0 
[junit4:junit4]   2> 9515 T411 C14 P38044 oash.SnapPuller$FileFetcher.fetchPackets WARNING No content recieved for file: {name=_0_MockFixedIntBlock_0.pyl, lastmodified=1355318813000, size=0}
[junit4:junit4]   2> 9517 T372 C15 P43182 REQ /replication {file=_0_MockFixedIntBlock_0.skp&command=filecontent&checksum=true&generation=3&qt=/replication&wt=filestream} status=0 QTime=0 
[junit4:junit4]   2> 9518 T411 C14 P38044 oash.SnapPuller$FileFetcher.fetchPackets WARNING No content recieved for file: {name=_0_MockFixedIntBlock_0.skp, lastmodified=1355318813000, size=0}
[junit4:junit4]   2> 9520 T373 C15 P43182 REQ /replication {file=_0_Pulsing41_0.tim&command=filecontent&checksum=true&generation=3&qt=/replication&wt=filestream} status=0 QTime=0 
[junit4:junit4]   2> 9522 T374 C15 P43182 REQ /replication {file=_0_Pulsing41_0.tip&command=filecontent&checksum=true&generation=3&qt=/replication&wt=filestream} status=0 QTime=0 
[junit4:junit4]   2> 9526 T371 C15 P43182 REQ /replication {file=_0_MockFixedIntBlock_0.tii&command=filecontent&checksum=true&generation=3&qt=/replication&wt=filestream} status=0 QTime=0 
[junit4:junit4]   2> 9528 T372 C15 P43182 REQ /replication {file=_0.si&command=filecontent&checksum=true&generation=3&qt=/replication&wt=filestream} status=0 QTime=0 
[junit4:junit4]   2> 9531 T373 C15 P43182 REQ /replication {file=_0_Asserting_0.doc&command=filecontent&checksum=true&generation=3&qt=/replication&wt=filestream} status=0 QTime=0 
[junit4:junit4]   2> 9534 T374 C15 P43182 REQ /replication {file=_0.fnm&command=filecontent&checksum=true&generation=3&qt=/replication&wt=filestream} status=0 QTime=0 
[junit4:junit4]   2> 9537 T371 C15 P43182 REQ /replication {file=_0_TestBloomFilteredLucene41Postings_0.blm&command=filecontent&checksum=true&generation=3&qt=/replication&wt=filestream} status=0 QTime=1 
[junit4:junit4]   2> 9539 T372 C15 P43182 REQ /replication {file=_0_MockFixedIntBlock_0.pos&command=filecontent&checksum=true&generation=3&qt=/replication&wt=filestream} status=0 QTime=0 
[junit4:junit4]   2> 9542 T373 C15 P43182 REQ /replication {file=_0_nrm.cfs&command=filecontent&checksum=true&generation=3&qt=/replication&wt=filestream} status=0 QTime=0 
[junit4:junit4]   2> 9544 T374 C15 P43182 REQ /replication {file=_0_MockFixedIntBlock_0.frq&command=filecontent&checksum=true&generation=3&qt=/replication&wt=filestream} status=0 QTime=0 
[junit4:junit4]   2> 9547 T371 C15 P43182 REQ /replication {file=_0_Pulsing41_0.doc&command=filecontent&checksum=true&generation=3&qt=/replication&wt=filestream} status=0 QTime=0 
[junit4:junit4]   2> 9549 T372 C15 P43182 REQ /replication {file=_0_Pulsing41_0.pos&command=filecontent&checksum=true&generation=3&qt=/replication&wt=filestream} status=0 QTime=0 
[junit4:junit4]   2> 9552 T373 C15 P43182 REQ /replication {file=_0_MockFixedIntBlock_0.doc&command=filecontent&checksum=true&generation=3&qt=/replication&wt=filestream} status=0 QTime=0 
[junit4:junit4]   2> 9555 T374 C15 P43182 REQ /replication {file=_0_nrm.cfe&command=filecontent&checksum=true&generation=3&qt=/replication&wt=filestream} status=0 QTime=1 
[junit4:junit4]   2> 9557 T371 C15 P43182 REQ /replication {file=_0_TestBloomFilteredLucene41Postings_0.doc&command=filecontent&checksum=true&generation=3&qt=/replication&wt=filestream} status=0 QTime=0 
[junit4:junit4]   2> 9560 T372 C15 P43182 REQ /replication {file=_0.fdx&command=filecontent&checksum=true&generation=3&qt=/replication&wt=filestream} status=0 QTime=1 
[junit4:junit4]   2> 9562 T373 C15 P43182 REQ /replication {file=_0_Asserting_0.pos&command=filecontent&checksum=true&generation=3&qt=/replication&wt=filestream} status=0 QTime=0 
[junit4:junit4]   2> 9614 T374 C15 P43182 REQ /replication {file=segments_3&command=filecontent&checksum=true&generation=3&qt=/replication&wt=filestream} status=0 QTime=0 
[junit4:junit4]   2> 9616 T371 C15 P43182 REQ /replication {file=_0.fdt&command=filecontent&checksum=true&generation=3&qt=/replication&wt=filestream} status=0 QTime=0 
[junit4:junit4]   2> 9617 T411 C14 P38044 oash.SnapPuller.fetchLatestIndex Total time taken for download : 0 secs
[junit4:junit4]   2> 9618 T411 C14 P38044 oash.SnapPuller.modifyIndexProps New index installed. Updating index properties... index=index.20121212142655419
[junit4:junit4]   2> 9619 T411 C14 P38044 oasu.DefaultSolrCoreState.newIndexWriter Creating new IndexWriter...
[junit4:junit4]   2> 9619 T411 C14 P38044 oasu.DefaultSolrCoreState.newIndexWriter Waiting until IndexWriter is unused... core=collection1
[junit4:junit4]   2> 9619 T411 C14 P38044 oasu.DefaultSolrCoreState.newIndexWriter Rollback old IndexWriter... core=collection1
[junit4:junit4]   2> 9624 T411 C14 P38044 oasc.SolrCore.getNewIndexDir New index directory detected: old=./org.apache.solr.cloud.BasicDistributedZk2Test-1355318805943/jetty3/index/ new=./org.apache.solr.cloud.BasicDistributedZk2Test-1355318805943/jetty3/index.20121212142655419
[junit4:junit4]   2> 9625 T411 C14 P38044 oasc.CachingDirectoryFactory.get return new directory for /mnt/ssd/jenkins/workspace/Lucene-Solr-4.x-Linux/solr/build/solr-core/test/J1/./org.apache.solr.cloud.BasicDistributedZk2Test-1355318805943/jetty3/index.20121212142655419 forceNew:true
[junit4:junit4]   2> 9630 T411 C14 P38044 oasc.SolrDeletionPolicy.onInit SolrDeletionPolicy.onInit: commits:num=1
[junit4:junit4]   2> 		commit{dir=RateLimitedDirectoryWrapper(NRTCachingDirectory(org.apache.lucene.store.NIOFSDirectory@/mnt/ssd/jenkins/workspace/Lucene-Solr-4.x-Linux/solr/build/solr-core/test/J1/org.apache.solr.cloud.BasicDistributedZk2Test-1355318805943/jetty3/index.20121212142655419 lockFactory=org.apache.lucene.store.NativeFSLockFactory@1af45f31; maxCacheMB=48.0 maxMergeSizeMB=4.0)),segFN=segments_3,generation=3,filenames=[_0_Asserting_0.tim, _0_Asserting_0.tip, _0_TestBloomFilteredLucene41Postings_0.tim, _0_TestBloomFilteredLucene41Postings_0.tip, _0_MockFixedIntBlock_0.tib, _0_TestBloomFilteredLucene41Postings_0.pos, _0_MockFixedIntBlock_0.pyl, _0_MockFixedIntBlock_0.skp, _0_Pulsing41_0.tim, _0_Pulsing41_0.tip, _0_MockFixedIntBlock_0.tii, _0.si, _0_Asserting_0.doc, _0.fnm, _0_TestBloomFilteredLucene41Postings_0.blm, _0_MockFixedIntBlock_0.pos, _0_nrm.cfs, _0_MockFixedIntBlock_0.frq, _0_Pulsing41_0.pos, _0_Pulsing41_0.doc, _0_MockFixedIntBlock_0.doc, _0_nrm.cfe, _0_TestBloomFilteredLucene41Postings_0.doc, _0.fdx, _0_Asserting_0.pos, _0.fdt, segments_3]
[junit4:junit4]   2> 9631 T411 C14 P38044 oasc.SolrDeletionPolicy.updateCommits newest commit = 3
[junit4:junit4]   2> 9632 T411 C14 P38044 oasu.DefaultSolrCoreState.newIndexWriter New IndexWriter is ready to be used.
[junit4:junit4]   2> 9634 T411 C14 P38044 oass.SolrIndexSearcher.<init> Opening Searcher@1af41f55 main
[junit4:junit4]   2> 9634 T411 C14 P38044 oass.SolrIndexSearcher.getIndexDir WARNING WARNING: Directory impl does not support setting indexDir: org.apache.lucene.store.RateLimitedDirectoryWrapper
[junit4:junit4]   2> 9636 T410 oasc.SolrCore.registerSearcher [collection1] Registered new searcher Searcher@1af41f55 main{StandardDirectoryReader(segments_3:3:nrt _0(4.1):C1)}
[junit4:junit4]   2> 9637 T410 oasc.CachingDirectoryFactory.close Closing directory:/mnt/ssd/jenkins/workspace/Lucene-Solr-4.x-Linux/solr/build/solr-core/test/J1/./org.apache.solr.cloud.BasicDistributedZk2Test-1355318805943/jetty3/index
[junit4:junit4]   2> 9637 T410 oash.SnapPuller$2.onClose removing old index directory ./org.apache.solr.cloud.BasicDistributedZk2Test-1355318805943/jetty3/index
[junit4:junit4]   2> 9640 T411 C14 P38044 oasu.DirectUpdateHandler2.commit start commit{flags=0,_version_=0,optimize=false,openSearcher=false,waitSearcher=false,expungeDeletes=false,softCommit=false}
[junit4:junit4]   2> 9825 T411 C14 P38044 oasc.SolrDeletionPolicy.onCommit SolrDeletionPolicy.onCommit: commits:num=2
[junit4:junit4]   2> 		commit{dir=RateLimitedDirectoryWrapper(NRTCachingDirectory(org.apache.lucene.store.NIOFSDirectory@/mnt/ssd/jenkins/workspace/Lucene-Solr-4.x-Linux/solr/build/solr-core/test/J1/org.apache.solr.cloud.BasicDistributedZk2Test-1355318805943/jetty3/index.20121212142655419 lockFactory=org.apache.lucene.store.NativeFSLockFactory@1af45f31; maxCacheMB=48.0 maxMergeSizeMB=4.0)),segFN=segments_3,generation=3,filenames=[_0_Asserting_0.tim, _0_Asserting_0.tip, _0_TestBloomFilteredLucene41Postings_0.tim, _0_TestBloomFilteredLucene41Postings_0.tip, _0_MockFixedIntBlock_0.tib, _0_TestBloomFilteredLucene41Postings_0.pos, _0_MockFixedIntBlock_0.pyl, _0_MockFixedIntBlock_0.skp, _0_Pulsing41_0.tim, _0_Pulsing41_0.tip, _0_MockFixedIntBlock_0.tii, _0.si, _0_Asserting_0.doc, _0.fnm, _0_TestBloomFilteredLucene41Postings_0.blm, _0_MockFixedIntBlock_0.pos, _0_nrm.cfs, _0_MockFixedIntBlock_0.frq, _0_Pulsing41_0.pos, _0_Pulsing41_0.doc, _0_MockFixedIntBlock_0.doc, _0_nrm.cfe, _0_TestBloomFilteredLucene41Postings_0.doc, _0.fdx, _0_Asserting_0.pos, _0.fdt, segments_3]
[junit4:junit4]   2> 		commit{dir=RateLimitedDirectoryWrapper(NRTCachingDirectory(org.apache.lucene.store.NIOFSDirectory@/mnt/ssd/jenkins/workspace/Lucene-Solr-4.x-Linux/solr/build/solr-core/test/J1/org.apache.solr.cloud.BasicDistributedZk2Test-1355318805943/jetty3/index.20121212142655419 lockFactory=org.apache.lucene.store.NativeFSLockFactory@1af45f31; maxCacheMB=48.0 maxMergeSizeMB=4.0)),segFN=segments_4,generation=4,filenames=[_0_Asserting_0.tim, _0_Asserting_0.tip, _0_TestBloomFilteredLucene41Postings_0.tim, _0_TestBloomFilteredLucene41Postings_0.tip, _0_MockFixedIntBlock_0.tib, _0_TestBloomFilteredLucene41Postings_0.pos, _0_MockFixedIntBlock_0.pyl, _0_MockFixedIntBlock_0.skp, _0_Pulsing41_0.tim, _0_Pulsing41_0.tip, _0_MockFixedIntBlock_0.tii, _0.si, _0_Asserting_0.doc, _0.fnm, _0_TestBloomFilteredLucene41Postings_0.blm, _0_MockFixedIntBlock_0.pos, _0_nrm.cfs, _0_MockFixedIntBlock_0.frq, _0_Pulsing41_0.pos, _0_Pulsing41_0.doc, _0_MockFixedIntBlock_0.doc, _0_nrm.cfe, _0_TestBloomFilteredLucene41Postings_0.doc, _0.fdx, _0_Asserting_0.pos, _0.fdt, segments_4]
[junit4:junit4]   2> 9826 T411 C14 P38044 oasc.SolrDeletionPolicy.updateCommits newest commit = 4
[junit4:junit4]   2> 9828 T411 C14 P38044 oasu.DirectUpdateHandler2.commit end_commit_flush
[junit4:junit4]   2> 9828 T411 C14 P38044 oasc.RecoveryStrategy.replay No replay needed. core=collection1
[junit4:junit4]   2> 9828 T411 C14 P38044 oasc.RecoveryStrategy.doRecovery Replication Recovery was successful - registering as Active. core=collection1
[junit4:junit4]   2> 9828 T411 C14 P38044 oasc.ZkController.publish publishing core=collection1 state=active
[junit4:junit4]   2> 9828 T411 C14 P38044 oasc.ZkController.publish numShards not found on descriptor - reading it from system property
[junit4:junit4]   2> 9829 T411 C14 P38044 oasc.RecoveryStrategy.doRecovery Finished recovery process. core=collection1
[junit4:junit4]   2> 10051 T362 oascc.ZkStateReader.updateClusterState Updating cloud state from ZooKeeper... 
[junit4:junit4]   2> 10051 T362 oasc.Overseer$ClusterStateUpdater.updateState Update state numShards=2 message={
[junit4:junit4]   2> 	  "operation":"state",
[junit4:junit4]   2> 	  "numShards":"2",
[junit4:junit4]   2> 	  "shard":"shard1",
[junit4:junit4]   2> 	  "roles":null,
[junit4:junit4]   2> 	  "state":"active",
[junit4:junit4]   2> 	  "core":"collection1",
[junit4:junit4]   2> 	  "collection":"collection1",
[junit4:junit4]   2> 	  "node_name":"127.0.0.1:38044_solr",
[junit4:junit4]   2> 	  "base_url":"http://127.0.0.1:38044/solr"}
[junit4:junit4]   2> 10063 T361 oascc.ZkStateReader$2.process A cluster state change has occurred - updating... (5)
[junit4:junit4]   2> 10063 T425 oascc.ZkStateReader$2.process A cluster state change has occurred - updating... (5)
[junit4:junit4]   2> 10063 T431 oascc.ZkStateReader$2.process A cluster state change has occurred - updating... (5)
[junit4:junit4]   2> 10063 T378 oascc.ZkStateReader$2.process A cluster state change has occurred - updating... (5)
[junit4:junit4]   2> 10063 T433 oascc.ZkStateReader$2.process A cluster state change has occurred - updating... (5)
[junit4:junit4]   2> 10063 T408 oascc.ZkStateReader$2.process A cluster state change has occurred - updating... (5)
[junit4:junit4]   2> 10063 T393 oascc.ZkStateReader$2.process A cluster state change has occurred - updating... (5)
[junit4:junit4]   2> 10094 T339 oascc.ZkStateReader.updateClusterState Updating cloud state from ZooKeeper... 
[junit4:junit4]   2>  C16_STATE=coll:collection1 core:collection1 props:{shard=shard2, roles=null, state=recovering, core=collection1, collection=collection1, node_name=127.0.0.1:50707_solr, base_url=http://127.0.0.1:50707/solr}
[junit4:junit4]   2> 10825 T428 C16 P50707 oasc.RecoveryStrategy.doRecovery Begin buffering updates. core=collection1
[junit4:junit4]   2> 10826 T428 C16 P50707 oasu.UpdateLog.bufferUpdates Starting to buffer updates. FSUpdateLog{state=ACTIVE, tlog=null}
[junit4:junit4]   2> 10826 T428 C16 P50707 oasc.RecoveryStrategy.replicate Attempting to replicate from http://127.0.0.1:50246/solr/collection1/. core=collection1
[junit4:junit4]   2> 10826 T428 C16 P50707 oascsi.HttpClientUtil.createClient Creating new http client, config:maxConnections=128&maxConnectionsPerHost=32&followRedirects=false
[junit4:junit4]   2> 10832 T389 C17 P50246 oasu.DirectUpdateHandler2.commit start commit{flags=0,_version_=0,optimize=false,openSearcher=false,waitSearcher=true,expungeDeletes=false,softCommit=false}
[junit4:junit4]   2> 10843 T389 C17 P50246 oasc.SolrDeletionPolicy.onCommit SolrDeletionPolicy.onCommit: commits:num=2
[junit4:junit4]   2> 		commit{dir=RateLimitedDirectoryWrapper(NRTCachingDirectory(org.apache.lucene.store.NIOFSDirectory@/mnt/ssd/jenkins/workspace/Lucene-Solr-4.x-Linux/solr/build/solr-core/test/J1/org.apache.solr.cloud.BasicDistributedZk2Test-1355318805943/jetty2/index lockFactory=org.apache.lucene.store.NativeFSLockFactory@1af80167; maxCacheMB=48.0 maxMergeSizeMB=4.0)),segFN=segments_2,generation=2,filenames=[segments_2]
[junit4:junit4]   2> 		commit{dir=RateLimitedDirectoryWrapper(NRTCachingDirectory(org.apache.lucene.store.NIOFSDirectory@/mnt/ssd/jenkins/workspace/Lucene-Solr-4.x-Linux/solr/build/solr-core/test/J1/org.apache.solr.cloud.BasicDistributedZk2Test-1355318805943/jetty2/index lockFactory=org.apache.lucene.store.NativeFSLockFactory@1af80167; maxCacheMB=48.0 maxMergeSizeMB=4.0)),segFN=segments_3,generation=3,filenames=[segments_3]
[junit4:junit4]   2> 10843 T389 C17 P50246 oasc.SolrDeletionPolicy.updateCommits newest commit = 3
[junit4:junit4]   2> 10844 T389 C17 P50246 oass.SolrIndexSearcher.<init> Opening Searcher@1aec1ead realtime
[junit4:junit4]   2> 10844 T389 C17 P50246 oass.SolrIndexSearcher.getIndexDir WARNING WARNING: Directory impl does not support setting indexDir: org.apache.lucene.store.RateLimitedDirectoryWrapper
[junit4:junit4]   2> 10845 T389 C17 P50246 oasu.DirectUpdateHandler2.commit end_commit_flush
[junit4:junit4]   2> 10845 T389 C17 P50246 /update {waitSearcher=true&openSearcher=false&commit=true&commit_end_point=true&wt=javabin&softCommit=false&version=2} {commit=} 0 13
[junit4:junit4]   2> 10846 T428 C16 P50707 oash.ReplicationHandler.inform Commits will be reserved for  10000
[junit4:junit4]   2> 10846 T428 C16 P50707 oash.SnapPuller.<init>  No value set for 'pollInterval'. Timer Task not started.
[junit4:junit4]   2> 10848 T388 C17 P50246 oash.ReplicationHandler.inform Commits will be reserved for  10000
[junit4:junit4]   2> 10848 T388 C17 P50246 REQ /replication {command=indexversion&wt=javabin&qt=/replication&version=2} status=0 QTime=1 
[junit4:junit4]   2> 10848 T428 C16 P50707 oash.SnapPuller.fetchLatestIndex Master's generation: 3
[junit4:junit4]   2> 10849 T428 C16 P50707 oash.SnapPuller.fetchLatestIndex Slave's generation: 1
[junit4:junit4]   2> 10849 T428 C16 P50707 oash.SnapPuller.fetchLatestIndex Starting replication process
[junit4:junit4]   2> 10851 T387 C17 P50246 REQ /replication {command=filelist&generation=3&wt=javabin&qt=/replication&version=2} status=0 QTime=1 
[junit4:junit4]   2> 10851 T428 C16 P50707 oash.SnapPuller.fetchLatestIndex Number of files in latest index in master: 1
[junit4:junit4]   2> 10852 T428 C16 P50707 oash.SnapPuller.fetchLatestIndex Starting download to ./org.apache.solr.cloud.BasicDistributedZk2Test-1355318805943/jetty4/index.20121212142656776 fullCopy=true
[junit4:junit4]   2> 10854 T389 C17 P50246 REQ /replication {file=segments_3&command=filecontent&checksum=true&generation=3&qt=/replication&wt=filestream} status=0 QTime=0 
[junit4:junit4]   2> 10855 T428 C16 P50707 oash.SnapPuller.fetchLatestIndex Total time taken for download : 0 secs
[junit4:junit4]   2> 10862 T428 C16 P50707 oash.SnapPuller.modifyIndexProps New index installed. Updating index properties... index=index.20121212142656776
[junit4:junit4]   2> 10863 T428 C16 P50707 oasu.DefaultSolrCoreState.newIndexWriter Creating new IndexWriter...
[junit4:junit4]   2> 10863 T428 C16 P50707 oasu.DefaultSolrCoreState.newIndexWriter Waiting until IndexWriter is unused... core=collection1
[junit4:junit4]   2> 10864 T428 C16 P50707 oasu.DefaultSolrCoreState.newIndexWriter Rollback old IndexWriter... core=collection1
[junit4:junit4]   2> 10865 T428 C16 P50707 oasc.SolrCore.getNewIndexDir New index directory detected: old=./org.apache.solr.cloud.BasicDistributedZk2Test-1355318805943/jetty4/index/ new=./org.apache.solr.cloud.BasicDistributedZk2Test-1355318805943/jetty4/index.20121212142656776
[junit4:junit4]   2> 10866 T428 C16 P50707 oasc.CachingDirectoryFactory.get return new directory for /mnt/ssd/jenkins/workspace/Lucene-Solr-4.x-Linux/solr/build/solr-core/test/J1/./org.apache.solr.cloud.BasicDistributedZk2Test-1355318805943/jetty4/index.20121212142656776 forceNew:true
[junit4:junit4]   2> 10868 T428 C16 P50707 oasc.SolrDeletionPolicy.onInit SolrDeletionPolicy.onInit: commits:num=1
[junit4:junit4]   2> 		commit{dir=RateLimitedDirectoryWrapper(NRTCachingDirectory(org.apache.lucene.store.NIOFSDirectory@/mnt/ssd/jenkins/workspace/Lucene-Solr-4.x-Linux/solr/build/solr-core/test/J1/org.apache.solr.cloud.BasicDistributedZk2Test-1355318805943/jetty4/index.20121212142656776 lockFactory=org.apache.lucene.store.NativeFSLockFactory@1b15a84c; maxCacheMB=48.0 maxMergeSizeMB=4.0)),segFN=segments_3,generation=3,filenames=[segments_3]
[junit4:junit4]   2> 10868 T428 C16 P50707 oasc.SolrDeletionPolicy.updateCommits newest commit = 3
[junit4:junit4]   2> 10869 T428 C16 P50707 oasu.DefaultSolrCoreState.newIndexWriter New IndexWriter is ready to be used.
[junit4:junit4]   2> 10869 T428 C16 P50707 oass.SolrIndexSearcher.<init> Opening Searcher@1b167d55 main
[junit4:junit4]   2> 10870 T428 C16 P50707 oass.SolrIndexSearcher.getIndexDir WARNING WARNING: Directory impl does not support setting indexDir: org.apache.lucene.store.RateLimitedDirectoryWrapper
[junit4:junit4]   2> 10872 T427 oasc.SolrCore.registerSearcher [collection1] Registered new searcher Searcher@1b167d55 main{StandardDirectoryReader(segments_3:1:nrt)}
[junit4:junit4

[...truncated too long message...]

Test.java:795)
[junit4:junit4]    > 	at org.apache.solr.cloud.BasicDistributedZkTest.doTest(BasicDistributedZkTest.java:344)
[junit4:junit4]    > 	at org.apache.solr.BaseDistributedSearchTestCase.testDistribSearch(BaseDistributedSearchTestCase.java:697)
[junit4:junit4]    > 	at sun.reflect.NativeMethodAccessorImpl.invoke0(Native Method)
[junit4:junit4]    > 	at sun.reflect.NativeMethodAccessorImpl.invoke(NativeMethodAccessorImpl.java:39)
[junit4:junit4]    > 	at sun.reflect.DelegatingMethodAccessorImpl.invoke(DelegatingMethodAccessorImpl.java:25)
[junit4:junit4]    > 	at java.lang.reflect.Method.invoke(Method.java:597)
[junit4:junit4]    > 	at com.carrotsearch.randomizedtesting.RandomizedRunner.invoke(RandomizedRunner.java:1559)
[junit4:junit4]    > 	at com.carrotsearch.randomizedtesting.RandomizedRunner.access$600(RandomizedRunner.java:79)
[junit4:junit4]    > 	at com.carrotsearch.randomizedtesting.RandomizedRunner$6.evaluate(RandomizedRunner.java:738)
[junit4:junit4]    > 	at com.carrotsearch.randomizedtesting.RandomizedRunner$7.evaluate(RandomizedRunner.java:774)
[junit4:junit4]    > 	at com.carrotsearch.randomizedtesting.RandomizedRunner$8.evaluate(RandomizedRunner.java:787)
[junit4:junit4]    > 	at com.carrotsearch.randomizedtesting.rules.SystemPropertiesRestoreRule$1.evaluate(SystemPropertiesRestoreRule.java:53)
[junit4:junit4]    > 	at org.apache.lucene.util.TestRuleSetupTeardownChained$1.evaluate(TestRuleSetupTeardownChained.java:50)
[junit4:junit4]    > 	at org.apache.lucene.util.TestRuleFieldCacheSanity$1.evaluate(TestRuleFieldCacheSanity.java:51)
[junit4:junit4]    > 	at org.apache.lucene.util.AbstractBeforeAfterRule$1.evaluate(AbstractBeforeAfterRule.java:46)
[junit4:junit4]    > 	at com.carrotsearch.randomizedtesting.rules.SystemPropertiesInvariantRule$1.evaluate(SystemPropertiesInvariantRule.java:55)
[junit4:junit4]    > 	at org.apache.lucene.util.TestRuleThreadAndTestName$1.evaluate(TestRuleThreadAndTestName.java:49)
[junit4:junit4]    > 	at org.apache.lucene.util.TestRuleIgnoreAfterMaxFailures$1.evaluate(TestRuleIgnoreAfterMaxFailures.java:70)
[junit4:junit4]    > 	at org.apache.lucene.util.TestRuleMarkFailure$1.evaluate(TestRuleMarkFailure.java:48)
[junit4:junit4]    > 	at com.carrotsearch.randomizedtesting.rules.StatementAdapter.evaluate(StatementAdapter.java:36)
[junit4:junit4]    > 	at com.carrotsearch.randomizedtesting.ThreadLeakControl$StatementRunner.run(ThreadLeakControl.java:358)
[junit4:junit4]    > 	at com.carrotsearch.randomizedtesting.ThreadLeakControl.forkTimeoutingTask(ThreadLeakControl.java:782)
[junit4:junit4]    > 	at com.carrotsearch.randomizedtesting.ThreadLeakControl$3.evaluate(ThreadLeakControl.java:442)
[junit4:junit4]    > 	at com.carrotsearch.randomizedtesting.RandomizedRunner.runSingleTest(RandomizedRunner.java:746)
[junit4:junit4]    > 	at com.carrotsearch.randomizedtesting.RandomizedRunner$3.evaluate(RandomizedRunner.java:648)
[junit4:junit4]    > 	at com.carrotsearch.randomizedtesting.RandomizedRunner$4.evaluate(RandomizedRunner.java:683)
[junit4:junit4]    > 	at com.carrotsearch.randomizedtesting.RandomizedRunner$5.evaluate(RandomizedRunner.java:693)
[junit4:junit4]    > 	at com.carrotsearch.randomizedtesting.rules.StatementAdapter.evaluate(StatementAdapter.java:36)
[junit4:junit4]    > 	at com.carrotsearch.randomizedtesting.rules.SystemPropertiesRestoreRule$1.evaluate(SystemPropertiesRestoreRule.java:53)
[junit4:junit4]    > 	at org.apache.lucene.util.AbstractBeforeAfterRule$1.evaluate(AbstractBeforeAfterRule.java:46)
[junit4:junit4]    > 	at org.apache.lucene.util.TestRuleStoreClassName$1.evaluate(TestRuleStoreClassName.java:42)
[junit4:junit4]    > 	at com.carrotsearch.randomizedtesting.rules.SystemPropertiesInvariantRule$1.evaluate(SystemPropertiesInvariantRule.java:55)
[junit4:junit4]    > 	at com.carrotsearch.randomizedtesting.rules.NoShadowingOrOverridesOnMethodsRule$1.evaluate(NoShadowingOrOverridesOnMethodsRule.java:40)
[junit4:junit4]    > 	at com.carrotsearch.randomizedtesting.rules.NoShadowingOrOverridesOnMethodsRule$1.evaluate(NoShadowingOrOverridesOnMethodsRule.java:40)
[junit4:junit4]    > 	at com.carrotsearch.randomizedtesting.rules.StatementAdapter.evaluate(StatementAdapter.java:36)
[junit4:junit4]    > 	at org.apache.lucene.util.TestRuleAssertionsRequired$1.evaluate(TestRuleAssertionsRequired.java:44)
[junit4:junit4]    > 	at org.apache.lucene.util.TestRuleMarkFailure$1.evaluate(TestRuleMarkFailure.java:48)
[junit4:junit4]    > 	at org.apache.lucene.util.TestRuleIgnoreAfterMaxFailures$1.evaluate(TestRuleIgnoreAfterMaxFailures.java:70)
[junit4:junit4]    > 	at org.apache.lucene.util.TestRuleIgnoreTestSuites$1.evaluate(TestRuleIgnoreTestSuites.java:56)
[junit4:junit4]    > 	at com.carrotsearch.randomizedtesting.rules.StatementAdapter.evaluate(StatementAdapter.java:36)
[junit4:junit4]    > 	at com.carrotsearch.randomizedtesting.ThreadLeakControl$StatementRunner.run(ThreadLeakControl.java:358)
[junit4:junit4]    > 	at java.lang.Thread.run(Thread.java:662)
[junit4:junit4]   2> 378220 T1131 oas.SolrTestCaseJ4.deleteCore ###deleteCore
[junit4:junit4]   2> NOTE: test params are: codec=Lucene41: {n_f1=PostingsFormat(name=TestBloomFilteredLucene41Postings), foo_b=PostingsFormat(name=SimpleText), cat=MockFixedIntBlock(blockSize=490), foo_d=Pulsing41(freqCutoff=8 minBlockSize=21 maxBlockSize=86), foo_f=PostingsFormat(name=SimpleText), n_tl1=PostingsFormat(name=TestBloomFilteredLucene41Postings), n_d1=MockFixedIntBlock(blockSize=490), rnd_b=Pulsing41(freqCutoff=8 minBlockSize=21 maxBlockSize=86), intDefault=MockFixedIntBlock(blockSize=490), n_td1=PostingsFormat(name=TestBloomFilteredLucene41Postings), id=Pulsing41(freqCutoff=8 minBlockSize=21 maxBlockSize=86), timestamp=MockFixedIntBlock(blockSize=490), range_facet_sl=PostingsFormat(name=SimpleText), range_facet_si=PostingsFormat(name=TestBloomFilteredLucene41Postings), oddField_s=Pulsing41(freqCutoff=8 minBlockSize=21 maxBlockSize=86), sequence_i=Pulsing41(freqCutoff=8 minBlockSize=21 maxBlockSize=86), name=Pulsing41(freqCutoff=8 minBlockSize=21 maxBlockSize=86), foo_i=PostingsFormat(name=TestBloomFilteredLucene41Postings), regex_dup_B_s=MockFixedIntBlock(blockSize=490), multiDefault=PostingsFormat(name=TestBloomFilteredLucene41Postings), n_tf1=MockFixedIntBlock(blockSize=490), n_dt1=PostingsFormat(name=TestBloomFilteredLucene41Postings), genre_s=Pulsing41(freqCutoff=8 minBlockSize=21 maxBlockSize=86), author_t=PostingsFormat(name=TestBloomFilteredLucene41Postings), n_ti1=Pulsing41(freqCutoff=8 minBlockSize=21 maxBlockSize=86), range_facet_l=MockFixedIntBlock(blockSize=490), text=PostingsFormat(name=SimpleText), _version_=MockFixedIntBlock(blockSize=490), val_i=Pulsing41(freqCutoff=8 minBlockSize=21 maxBlockSize=86), SubjectTerms_mfacet=MockFixedIntBlock(blockSize=490), series_t=PostingsFormat(name=TestBloomFilteredLucene41Postings), a_t=MockFixedIntBlock(blockSize=490), n_tdt1=MockFixedIntBlock(blockSize=490), regex_dup_A_s=Pulsing41(freqCutoff=8 minBlockSize=21 maxBlockSize=86), price=PostingsFormat(name=SimpleText), other_tl1=MockFixedIntBlock(blockSize=490), n_l1=MockFixedIntBlock(blockSize=490), a_si=PostingsFormat(name=TestBloomFilteredLucene41Postings), inStock=Pulsing41(freqCutoff=8 minBlockSize=21 maxBlockSize=86)}, sim=DefaultSimilarity, locale=ca, timezone=Europe/Copenhagen
[junit4:junit4]   2> NOTE: Linux 3.2.0-34-generic i386/Oracle Corporation 1.6.0_33 (32-bit)/cpus=8,threads=1,free=140664776,total=536870912
[junit4:junit4]   2> NOTE: All tests run in this JVM: [TestRandomFaceting, SimplePostToolTest, ScriptEngineTest, SuggesterWFSTTest, TestSuggestSpellingConverter, SpellCheckCollatorTest, StatelessScriptUpdateProcessorFactoryTest, TestBadConfig, LeaderElectionIntegrationTest, TestAtomicUpdateErrorCases, NotRequiredUniqueKeyTest, DirectUpdateHandlerOptimizeTest, TestGroupingSearch, SolrPluginUtilsTest, CopyFieldTest, AlternateDirectoryTest, SampleTest, TestQuerySenderNoQuery, CurrencyFieldTest, CoreAdminHandlerTest, TestJoin, TestNumberUtils, AnalysisAfterCoreReloadTest, SortByFunctionTest, BinaryUpdateRequestHandlerTest, DistanceFunctionTest, TestBinaryResponseWriter, FieldAnalysisRequestHandlerTest, NumericFieldsTest, TestLFUCache, TermsComponentTest, SolrRequestParserTest, SimpleFacetsTest, TestRangeQuery, TestAnalyzedSuggestions, DistributedTermsComponentTest, SuggesterFSTTest, DirectSolrConnectionTest, CircularListTest, TestFastLRUCache, TestConfig, UniqFieldsUpdateProcessorFactoryTest, TestJmxMonitoredMap, SpatialFilterTest, SpellPossibilityIteratorTest, TestIndexingPerformance, TestPerFieldSimilarity, DistributedSpellCheckComponentTest, RequestHandlersTest, SolrCmdDistributorTest, TestSolrQueryParser, DateFieldTest, TestElisionMultitermQuery, TestExtendedDismaxParser, SolrCoreCheckLockOnStartupTest, BasicDistributedZkTest]
[junit4:junit4] Completed on J0 in 378.38s, 1 test, 1 error <<< FAILURES!

[...truncated 442 lines...]
BUILD FAILED
/mnt/ssd/jenkins/workspace/Lucene-Solr-4.x-Linux/build.xml:352: The following error occurred while executing this line:
/mnt/ssd/jenkins/workspace/Lucene-Solr-4.x-Linux/build.xml:39: The following error occurred while executing this line:
/mnt/ssd/jenkins/workspace/Lucene-Solr-4.x-Linux/solr/build.xml:178: The following error occurred while executing this line:
/mnt/ssd/jenkins/workspace/Lucene-Solr-4.x-Linux/solr/common-build.xml:438: The following error occurred while executing this line:
/mnt/ssd/jenkins/workspace/Lucene-Solr-4.x-Linux/lucene/common-build.xml:1171: The following error occurred while executing this line:
/mnt/ssd/jenkins/workspace/Lucene-Solr-4.x-Linux/lucene/common-build.xml:835: There were test failures: 239 suites, 994 tests, 1 error, 1 failure, 7 ignored (2 assumptions)

Total time: 45 minutes 58 seconds
Build step 'Invoke Ant' marked build as failure
Archiving artifacts
Recording test results
Description set: Java: 32bit/jrockit-jdk1.6.0_33-R28.2.4-4.1.0 -XnoOpt
Email was triggered for: Failure
Sending email for trigger: Failure



Mime
View raw message