lucene-dev mailing list archives

Site index · List index
Message view « Date » · « Thread »
Top « Date » · « Thread »
From Policeman Jenkins Server <jenk...@sd-datasolutions.de>
Subject [JENKINS] Lucene-Solr-4.x-Windows (64bit/jdk1.7.0_09) - Build # 2137 - Still Failing!
Date Wed, 12 Dec 2012 00:17:15 GMT
Build: http://jenkins.sd-datasolutions.de/job/Lucene-Solr-4.x-Windows/2137/
Java: 64bit/jdk1.7.0_09 -XX:+UseG1GC

4 tests failed.
FAILED:  org.apache.solr.cloud.BasicDistributedZk2Test.testDistribSearch

Error Message:
There are still nodes recoverying - waited for 180 seconds

Stack Trace:
java.lang.AssertionError: There are still nodes recoverying - waited for 180 seconds
	at __randomizedtesting.SeedInfo.seed([866AAAE369980E79:78C24FB1EC76E45]:0)
	at org.junit.Assert.fail(Assert.java:93)
	at org.apache.solr.cloud.AbstractDistribZkTestBase.waitForRecoveriesToFinish(AbstractDistribZkTestBase.java:165)
	at org.apache.solr.cloud.AbstractDistribZkTestBase.waitForRecoveriesToFinish(AbstractDistribZkTestBase.java:115)
	at org.apache.solr.cloud.AbstractDistribZkTestBase.waitForRecoveriesToFinish(AbstractDistribZkTestBase.java:110)
	at org.apache.solr.cloud.AbstractFullDistribZkTestBase.waitForRecoveriesToFinish(AbstractFullDistribZkTestBase.java:563)
	at org.apache.solr.cloud.BasicDistributedZk2Test.brindDownShardIndexSomeDocsAndRecover(BasicDistributedZk2Test.java:321)
	at org.apache.solr.cloud.BasicDistributedZk2Test.doTest(BasicDistributedZk2Test.java:83)
	at org.apache.solr.BaseDistributedSearchTestCase.testDistribSearch(BaseDistributedSearchTestCase.java:697)
	at sun.reflect.NativeMethodAccessorImpl.invoke0(Native Method)
	at sun.reflect.NativeMethodAccessorImpl.invoke(NativeMethodAccessorImpl.java:57)
	at sun.reflect.DelegatingMethodAccessorImpl.invoke(DelegatingMethodAccessorImpl.java:43)
	at java.lang.reflect.Method.invoke(Method.java:601)
	at com.carrotsearch.randomizedtesting.RandomizedRunner.invoke(RandomizedRunner.java:1559)
	at com.carrotsearch.randomizedtesting.RandomizedRunner.access$600(RandomizedRunner.java:79)
	at com.carrotsearch.randomizedtesting.RandomizedRunner$6.evaluate(RandomizedRunner.java:737)
	at com.carrotsearch.randomizedtesting.RandomizedRunner$7.evaluate(RandomizedRunner.java:773)
	at com.carrotsearch.randomizedtesting.RandomizedRunner$8.evaluate(RandomizedRunner.java:787)
	at com.carrotsearch.randomizedtesting.rules.SystemPropertiesRestoreRule$1.evaluate(SystemPropertiesRestoreRule.java:53)
	at org.apache.lucene.util.TestRuleSetupTeardownChained$1.evaluate(TestRuleSetupTeardownChained.java:50)
	at org.apache.lucene.util.TestRuleFieldCacheSanity$1.evaluate(TestRuleFieldCacheSanity.java:51)
	at org.apache.lucene.util.AbstractBeforeAfterRule$1.evaluate(AbstractBeforeAfterRule.java:46)
	at com.carrotsearch.randomizedtesting.rules.SystemPropertiesInvariantRule$1.evaluate(SystemPropertiesInvariantRule.java:55)
	at org.apache.lucene.util.TestRuleThreadAndTestName$1.evaluate(TestRuleThreadAndTestName.java:49)
	at org.apache.lucene.util.TestRuleIgnoreAfterMaxFailures$1.evaluate(TestRuleIgnoreAfterMaxFailures.java:70)
	at org.apache.lucene.util.TestRuleMarkFailure$1.evaluate(TestRuleMarkFailure.java:48)
	at com.carrotsearch.randomizedtesting.rules.StatementAdapter.evaluate(StatementAdapter.java:36)
	at com.carrotsearch.randomizedtesting.ThreadLeakControl$StatementRunner.run(ThreadLeakControl.java:358)
	at com.carrotsearch.randomizedtesting.ThreadLeakControl.forkTimeoutingTask(ThreadLeakControl.java:782)
	at com.carrotsearch.randomizedtesting.ThreadLeakControl$3.evaluate(ThreadLeakControl.java:442)
	at com.carrotsearch.randomizedtesting.RandomizedRunner.runSingleTest(RandomizedRunner.java:746)
	at com.carrotsearch.randomizedtesting.RandomizedRunner$3.evaluate(RandomizedRunner.java:648)
	at com.carrotsearch.randomizedtesting.RandomizedRunner$4.evaluate(RandomizedRunner.java:682)
	at com.carrotsearch.randomizedtesting.RandomizedRunner$5.evaluate(RandomizedRunner.java:693)
	at com.carrotsearch.randomizedtesting.rules.StatementAdapter.evaluate(StatementAdapter.java:36)
	at com.carrotsearch.randomizedtesting.rules.SystemPropertiesRestoreRule$1.evaluate(SystemPropertiesRestoreRule.java:53)
	at org.apache.lucene.util.AbstractBeforeAfterRule$1.evaluate(AbstractBeforeAfterRule.java:46)
	at org.apache.lucene.util.TestRuleStoreClassName$1.evaluate(TestRuleStoreClassName.java:42)
	at com.carrotsearch.randomizedtesting.rules.SystemPropertiesInvariantRule$1.evaluate(SystemPropertiesInvariantRule.java:55)
	at com.carrotsearch.randomizedtesting.rules.NoShadowingOrOverridesOnMethodsRule$1.evaluate(NoShadowingOrOverridesOnMethodsRule.java:39)
	at com.carrotsearch.randomizedtesting.rules.NoShadowingOrOverridesOnMethodsRule$1.evaluate(NoShadowingOrOverridesOnMethodsRule.java:39)
	at com.carrotsearch.randomizedtesting.rules.StatementAdapter.evaluate(StatementAdapter.java:36)
	at org.apache.lucene.util.TestRuleAssertionsRequired$1.evaluate(TestRuleAssertionsRequired.java:43)
	at org.apache.lucene.util.TestRuleMarkFailure$1.evaluate(TestRuleMarkFailure.java:48)
	at org.apache.lucene.util.TestRuleIgnoreAfterMaxFailures$1.evaluate(TestRuleIgnoreAfterMaxFailures.java:70)
	at org.apache.lucene.util.TestRuleIgnoreTestSuites$1.evaluate(TestRuleIgnoreTestSuites.java:55)
	at com.carrotsearch.randomizedtesting.rules.StatementAdapter.evaluate(StatementAdapter.java:36)
	at com.carrotsearch.randomizedtesting.ThreadLeakControl$StatementRunner.run(ThreadLeakControl.java:358)
	at java.lang.Thread.run(Thread.java:722)


FAILED:  org.apache.solr.cloud.BasicDistributedZkTest.testDistribSearch

Error Message:
Server at http://127.0.0.1:60844/solr returned non ok status:500, message:Server Error

Stack Trace:
org.apache.solr.common.SolrException: Server at http://127.0.0.1:60844/solr returned non ok status:500, message:Server Error
	at __randomizedtesting.SeedInfo.seed([866AAAE369980E79:78C24FB1EC76E45]:0)
	at org.apache.solr.client.solrj.impl.HttpSolrServer.request(HttpSolrServer.java:372)
	at org.apache.solr.client.solrj.impl.HttpSolrServer.request(HttpSolrServer.java:181)
	at org.apache.solr.client.solrj.request.CoreAdminRequest.process(CoreAdminRequest.java:429)
	at org.apache.solr.client.solrj.request.CoreAdminRequest.getStatus(CoreAdminRequest.java:472)
	at org.apache.solr.cloud.BasicDistributedZkTest.collectStartTimes(BasicDistributedZkTest.java:959)
	at org.apache.solr.cloud.BasicDistributedZkTest.testCollectionsAPI(BasicDistributedZkTest.java:795)
	at org.apache.solr.cloud.BasicDistributedZkTest.doTest(BasicDistributedZkTest.java:343)
	at org.apache.solr.BaseDistributedSearchTestCase.testDistribSearch(BaseDistributedSearchTestCase.java:697)
	at sun.reflect.NativeMethodAccessorImpl.invoke0(Native Method)
	at sun.reflect.NativeMethodAccessorImpl.invoke(NativeMethodAccessorImpl.java:57)
	at sun.reflect.DelegatingMethodAccessorImpl.invoke(DelegatingMethodAccessorImpl.java:43)
	at java.lang.reflect.Method.invoke(Method.java:601)
	at com.carrotsearch.randomizedtesting.RandomizedRunner.invoke(RandomizedRunner.java:1559)
	at com.carrotsearch.randomizedtesting.RandomizedRunner.access$600(RandomizedRunner.java:79)
	at com.carrotsearch.randomizedtesting.RandomizedRunner$6.evaluate(RandomizedRunner.java:737)
	at com.carrotsearch.randomizedtesting.RandomizedRunner$7.evaluate(RandomizedRunner.java:773)
	at com.carrotsearch.randomizedtesting.RandomizedRunner$8.evaluate(RandomizedRunner.java:787)
	at com.carrotsearch.randomizedtesting.rules.SystemPropertiesRestoreRule$1.evaluate(SystemPropertiesRestoreRule.java:53)
	at org.apache.lucene.util.TestRuleSetupTeardownChained$1.evaluate(TestRuleSetupTeardownChained.java:50)
	at org.apache.lucene.util.TestRuleFieldCacheSanity$1.evaluate(TestRuleFieldCacheSanity.java:51)
	at org.apache.lucene.util.AbstractBeforeAfterRule$1.evaluate(AbstractBeforeAfterRule.java:46)
	at com.carrotsearch.randomizedtesting.rules.SystemPropertiesInvariantRule$1.evaluate(SystemPropertiesInvariantRule.java:55)
	at org.apache.lucene.util.TestRuleThreadAndTestName$1.evaluate(TestRuleThreadAndTestName.java:49)
	at org.apache.lucene.util.TestRuleIgnoreAfterMaxFailures$1.evaluate(TestRuleIgnoreAfterMaxFailures.java:70)
	at org.apache.lucene.util.TestRuleMarkFailure$1.evaluate(TestRuleMarkFailure.java:48)
	at com.carrotsearch.randomizedtesting.rules.StatementAdapter.evaluate(StatementAdapter.java:36)
	at com.carrotsearch.randomizedtesting.ThreadLeakControl$StatementRunner.run(ThreadLeakControl.java:358)
	at com.carrotsearch.randomizedtesting.ThreadLeakControl.forkTimeoutingTask(ThreadLeakControl.java:782)
	at com.carrotsearch.randomizedtesting.ThreadLeakControl$3.evaluate(ThreadLeakControl.java:442)
	at com.carrotsearch.randomizedtesting.RandomizedRunner.runSingleTest(RandomizedRunner.java:746)
	at com.carrotsearch.randomizedtesting.RandomizedRunner$3.evaluate(RandomizedRunner.java:648)
	at com.carrotsearch.randomizedtesting.RandomizedRunner$4.evaluate(RandomizedRunner.java:682)
	at com.carrotsearch.randomizedtesting.RandomizedRunner$5.evaluate(RandomizedRunner.java:693)
	at com.carrotsearch.randomizedtesting.rules.StatementAdapter.evaluate(StatementAdapter.java:36)
	at com.carrotsearch.randomizedtesting.rules.SystemPropertiesRestoreRule$1.evaluate(SystemPropertiesRestoreRule.java:53)
	at org.apache.lucene.util.AbstractBeforeAfterRule$1.evaluate(AbstractBeforeAfterRule.java:46)
	at org.apache.lucene.util.TestRuleStoreClassName$1.evaluate(TestRuleStoreClassName.java:42)
	at com.carrotsearch.randomizedtesting.rules.SystemPropertiesInvariantRule$1.evaluate(SystemPropertiesInvariantRule.java:55)
	at com.carrotsearch.randomizedtesting.rules.NoShadowingOrOverridesOnMethodsRule$1.evaluate(NoShadowingOrOverridesOnMethodsRule.java:39)
	at com.carrotsearch.randomizedtesting.rules.NoShadowingOrOverridesOnMethodsRule$1.evaluate(NoShadowingOrOverridesOnMethodsRule.java:39)
	at com.carrotsearch.randomizedtesting.rules.StatementAdapter.evaluate(StatementAdapter.java:36)
	at org.apache.lucene.util.TestRuleAssertionsRequired$1.evaluate(TestRuleAssertionsRequired.java:43)
	at org.apache.lucene.util.TestRuleMarkFailure$1.evaluate(TestRuleMarkFailure.java:48)
	at org.apache.lucene.util.TestRuleIgnoreAfterMaxFailures$1.evaluate(TestRuleIgnoreAfterMaxFailures.java:70)
	at org.apache.lucene.util.TestRuleIgnoreTestSuites$1.evaluate(TestRuleIgnoreTestSuites.java:55)
	at com.carrotsearch.randomizedtesting.rules.StatementAdapter.evaluate(StatementAdapter.java:36)
	at com.carrotsearch.randomizedtesting.ThreadLeakControl$StatementRunner.run(ThreadLeakControl.java:358)
	at java.lang.Thread.run(Thread.java:722)


FAILED:  org.apache.solr.cloud.SyncSliceTest.testDistribSearch

Error Message:
There are still nodes recoverying - waited for 180 seconds

Stack Trace:
java.lang.AssertionError: There are still nodes recoverying - waited for 180 seconds
	at __randomizedtesting.SeedInfo.seed([866AAAE369980E79:78C24FB1EC76E45]:0)
	at org.junit.Assert.fail(Assert.java:93)
	at org.apache.solr.cloud.AbstractDistribZkTestBase.waitForRecoveriesToFinish(AbstractDistribZkTestBase.java:165)
	at org.apache.solr.cloud.AbstractDistribZkTestBase.waitForRecoveriesToFinish(AbstractDistribZkTestBase.java:115)
	at org.apache.solr.cloud.AbstractDistribZkTestBase.waitForRecoveriesToFinish(AbstractDistribZkTestBase.java:110)
	at org.apache.solr.cloud.AbstractFullDistribZkTestBase.waitForRecoveriesToFinish(AbstractFullDistribZkTestBase.java:563)
	at org.apache.solr.cloud.SyncSliceTest.doTest(SyncSliceTest.java:224)
	at org.apache.solr.BaseDistributedSearchTestCase.testDistribSearch(BaseDistributedSearchTestCase.java:697)
	at sun.reflect.NativeMethodAccessorImpl.invoke0(Native Method)
	at sun.reflect.NativeMethodAccessorImpl.invoke(NativeMethodAccessorImpl.java:57)
	at sun.reflect.DelegatingMethodAccessorImpl.invoke(DelegatingMethodAccessorImpl.java:43)
	at java.lang.reflect.Method.invoke(Method.java:601)
	at com.carrotsearch.randomizedtesting.RandomizedRunner.invoke(RandomizedRunner.java:1559)
	at com.carrotsearch.randomizedtesting.RandomizedRunner.access$600(RandomizedRunner.java:79)
	at com.carrotsearch.randomizedtesting.RandomizedRunner$6.evaluate(RandomizedRunner.java:737)
	at com.carrotsearch.randomizedtesting.RandomizedRunner$7.evaluate(RandomizedRunner.java:773)
	at com.carrotsearch.randomizedtesting.RandomizedRunner$8.evaluate(RandomizedRunner.java:787)
	at com.carrotsearch.randomizedtesting.rules.SystemPropertiesRestoreRule$1.evaluate(SystemPropertiesRestoreRule.java:53)
	at org.apache.lucene.util.TestRuleSetupTeardownChained$1.evaluate(TestRuleSetupTeardownChained.java:50)
	at org.apache.lucene.util.TestRuleFieldCacheSanity$1.evaluate(TestRuleFieldCacheSanity.java:51)
	at org.apache.lucene.util.AbstractBeforeAfterRule$1.evaluate(AbstractBeforeAfterRule.java:46)
	at com.carrotsearch.randomizedtesting.rules.SystemPropertiesInvariantRule$1.evaluate(SystemPropertiesInvariantRule.java:55)
	at org.apache.lucene.util.TestRuleThreadAndTestName$1.evaluate(TestRuleThreadAndTestName.java:49)
	at org.apache.lucene.util.TestRuleIgnoreAfterMaxFailures$1.evaluate(TestRuleIgnoreAfterMaxFailures.java:70)
	at org.apache.lucene.util.TestRuleMarkFailure$1.evaluate(TestRuleMarkFailure.java:48)
	at com.carrotsearch.randomizedtesting.rules.StatementAdapter.evaluate(StatementAdapter.java:36)
	at com.carrotsearch.randomizedtesting.ThreadLeakControl$StatementRunner.run(ThreadLeakControl.java:358)
	at com.carrotsearch.randomizedtesting.ThreadLeakControl.forkTimeoutingTask(ThreadLeakControl.java:782)
	at com.carrotsearch.randomizedtesting.ThreadLeakControl$3.evaluate(ThreadLeakControl.java:442)
	at com.carrotsearch.randomizedtesting.RandomizedRunner.runSingleTest(RandomizedRunner.java:746)
	at com.carrotsearch.randomizedtesting.RandomizedRunner$3.evaluate(RandomizedRunner.java:648)
	at com.carrotsearch.randomizedtesting.RandomizedRunner$4.evaluate(RandomizedRunner.java:682)
	at com.carrotsearch.randomizedtesting.RandomizedRunner$5.evaluate(RandomizedRunner.java:693)
	at com.carrotsearch.randomizedtesting.rules.StatementAdapter.evaluate(StatementAdapter.java:36)
	at com.carrotsearch.randomizedtesting.rules.SystemPropertiesRestoreRule$1.evaluate(SystemPropertiesRestoreRule.java:53)
	at org.apache.lucene.util.AbstractBeforeAfterRule$1.evaluate(AbstractBeforeAfterRule.java:46)
	at org.apache.lucene.util.TestRuleStoreClassName$1.evaluate(TestRuleStoreClassName.java:42)
	at com.carrotsearch.randomizedtesting.rules.SystemPropertiesInvariantRule$1.evaluate(SystemPropertiesInvariantRule.java:55)
	at com.carrotsearch.randomizedtesting.rules.NoShadowingOrOverridesOnMethodsRule$1.evaluate(NoShadowingOrOverridesOnMethodsRule.java:39)
	at com.carrotsearch.randomizedtesting.rules.NoShadowingOrOverridesOnMethodsRule$1.evaluate(NoShadowingOrOverridesOnMethodsRule.java:39)
	at com.carrotsearch.randomizedtesting.rules.StatementAdapter.evaluate(StatementAdapter.java:36)
	at org.apache.lucene.util.TestRuleAssertionsRequired$1.evaluate(TestRuleAssertionsRequired.java:43)
	at org.apache.lucene.util.TestRuleMarkFailure$1.evaluate(TestRuleMarkFailure.java:48)
	at org.apache.lucene.util.TestRuleIgnoreAfterMaxFailures$1.evaluate(TestRuleIgnoreAfterMaxFailures.java:70)
	at org.apache.lucene.util.TestRuleIgnoreTestSuites$1.evaluate(TestRuleIgnoreTestSuites.java:55)
	at com.carrotsearch.randomizedtesting.rules.StatementAdapter.evaluate(StatementAdapter.java:36)
	at com.carrotsearch.randomizedtesting.ThreadLeakControl$StatementRunner.run(ThreadLeakControl.java:358)
	at java.lang.Thread.run(Thread.java:722)


FAILED:  junit.framework.TestSuite.org.apache.solr.cloud.SyncSliceTest

Error Message:
ERROR: SolrIndexSearcher opens=45 closes=43

Stack Trace:
java.lang.AssertionError: ERROR: SolrIndexSearcher opens=45 closes=43
	at __randomizedtesting.SeedInfo.seed([866AAAE369980E79]:0)
	at org.junit.Assert.fail(Assert.java:93)
	at org.apache.solr.SolrTestCaseJ4.endTrackingSearchers(SolrTestCaseJ4.java:242)
	at org.apache.solr.SolrTestCaseJ4.afterClass(SolrTestCaseJ4.java:97)
	at sun.reflect.NativeMethodAccessorImpl.invoke0(Native Method)
	at sun.reflect.NativeMethodAccessorImpl.invoke(NativeMethodAccessorImpl.java:57)
	at sun.reflect.DelegatingMethodAccessorImpl.invoke(DelegatingMethodAccessorImpl.java:43)
	at java.lang.reflect.Method.invoke(Method.java:601)
	at com.carrotsearch.randomizedtesting.RandomizedRunner.invoke(RandomizedRunner.java:1559)
	at com.carrotsearch.randomizedtesting.RandomizedRunner.access$600(RandomizedRunner.java:79)
	at com.carrotsearch.randomizedtesting.RandomizedRunner$5.evaluate(RandomizedRunner.java:700)
	at com.carrotsearch.randomizedtesting.rules.StatementAdapter.evaluate(StatementAdapter.java:36)
	at com.carrotsearch.randomizedtesting.rules.SystemPropertiesRestoreRule$1.evaluate(SystemPropertiesRestoreRule.java:53)
	at org.apache.lucene.util.AbstractBeforeAfterRule$1.evaluate(AbstractBeforeAfterRule.java:46)
	at org.apache.lucene.util.TestRuleStoreClassName$1.evaluate(TestRuleStoreClassName.java:42)
	at com.carrotsearch.randomizedtesting.rules.SystemPropertiesInvariantRule$1.evaluate(SystemPropertiesInvariantRule.java:55)
	at com.carrotsearch.randomizedtesting.rules.NoShadowingOrOverridesOnMethodsRule$1.evaluate(NoShadowingOrOverridesOnMethodsRule.java:39)
	at com.carrotsearch.randomizedtesting.rules.NoShadowingOrOverridesOnMethodsRule$1.evaluate(NoShadowingOrOverridesOnMethodsRule.java:39)
	at com.carrotsearch.randomizedtesting.rules.StatementAdapter.evaluate(StatementAdapter.java:36)
	at org.apache.lucene.util.TestRuleAssertionsRequired$1.evaluate(TestRuleAssertionsRequired.java:43)
	at org.apache.lucene.util.TestRuleMarkFailure$1.evaluate(TestRuleMarkFailure.java:48)
	at org.apache.lucene.util.TestRuleIgnoreAfterMaxFailures$1.evaluate(TestRuleIgnoreAfterMaxFailures.java:70)
	at org.apache.lucene.util.TestRuleIgnoreTestSuites$1.evaluate(TestRuleIgnoreTestSuites.java:55)
	at com.carrotsearch.randomizedtesting.rules.StatementAdapter.evaluate(StatementAdapter.java:36)
	at com.carrotsearch.randomizedtesting.ThreadLeakControl$StatementRunner.run(ThreadLeakControl.java:358)
	at java.lang.Thread.run(Thread.java:722)




Build Log:
[...truncated 8435 lines...]
[junit4:junit4] Suite: org.apache.solr.cloud.SyncSliceTest
[junit4:junit4]   2> 12 T18 oas.SolrTestCaseJ4.setUp ###Starting testDistribSearch
[junit4:junit4]   2> Creating dataDir: C:\Users\JenkinsSlave\workspace\Lucene-Solr-4.x-Windows\solr\build\solr-core\test\J0\.\solrtest-SyncSliceTest-1355269716905
[junit4:junit4]   2> 19 T18 oasc.ZkTestServer.run STARTING ZK TEST SERVER
[junit4:junit4]   2> 202 T19 oasc.ZkTestServer$ZKServerMain.runFromConfig Starting server
[junit4:junit4]   2> 272 T19 oaz.Environment.logEnv Server environment:zookeeper.version=3.4.5-1392090, built on 09/30/2012 17:52 GMT
[junit4:junit4]   2> 273 T19 oaz.Environment.logEnv Server environment:host.name=JenkinsSlave-PC
[junit4:junit4]   2> 273 T19 oaz.Environment.logEnv Server environment:java.version=1.7.0_09
[junit4:junit4]   2> 273 T19 oaz.Environment.logEnv Server environment:java.vendor=Oracle Corporation
[junit4:junit4]   2> 274 T19 oaz.Environment.logEnv Server environment:java.home=C:\Users\JenkinsSlave\tools\java\64bit\jdk1.7.0_09\jre
[junit4:junit4]   2> 274 T19 oaz.Environment.logEnv Server environment:java.class.path=C:\Users\JenkinsSlave\workspace\Lucene-Solr-4.x-Windows\solr\build\solr-core\classes\test;C:\Users\JenkinsSlave\workspace\Lucene-Solr-4.x-Windows\solr\build\solr-test-framework\classes\java;C:\Users\JenkinsSlave\workspace\Lucene-Solr-4.x-Windows\solr\build\solr-core\test-files;C:\Users\JenkinsSlave\workspace\Lucene-Solr-4.x-Windows\lucene\build\test-framework\classes\java;C:\Users\JenkinsSlave\workspace\Lucene-Solr-4.x-Windows\lucene\build\codecs\classes\java;C:\Users\JenkinsSlave\workspace\Lucene-Solr-4.x-Windows\solr\build\solr-solrj\classes\java;C:\Users\JenkinsSlave\workspace\Lucene-Solr-4.x-Windows\solr\build\solr-core\classes\java;C:\Users\JenkinsSlave\workspace\Lucene-Solr-4.x-Windows\lucene\build\analysis\common\lucene-analyzers-common-4.1-SNAPSHOT.jar;C:\Users\JenkinsSlave\workspace\Lucene-Solr-4.x-Windows\lucene\build\analysis\kuromoji\lucene-analyzers-kuromoji-4.1-SNAPSHOT.jar;C:\Users\JenkinsSlave\workspace\Lucene-Solr-4.x-Windows\lucene\build\analysis\phonetic\lucene-analyzers-phonetic-4.1-SNAPSHOT.jar;C:\Users\JenkinsSlave\workspace\Lucene-Solr-4.x-Windows\lucene\build\highlighter\lucene-highlighter-4.1-SNAPSHOT.jar;C:\Users\JenkinsSlave\workspace\Lucene-Solr-4.x-Windows\lucene\build\memory\lucene-memory-4.1-SNAPSHOT.jar;C:\Users\JenkinsSlave\workspace\Lucene-Solr-4.x-Windows\lucene\build\misc\lucene-misc-4.1-SNAPSHOT.jar;C:\Users\JenkinsSlave\workspace\Lucene-Solr-4.x-Windows\lucene\build\spatial\lucene-spatial-4.1-SNAPSHOT.jar;C:\Users\JenkinsSlave\workspace\Lucene-Solr-4.x-Windows\lucene\build\suggest\lucene-suggest-4.1-SNAPSHOT.jar;C:\Users\JenkinsSlave\workspace\Lucene-Solr-4.x-Windows\lucene\build\grouping\lucene-grouping-4.1-SNAPSHOT.jar;C:\Users\JenkinsSlave\workspace\Lucene-Solr-4.x-Windows\lucene\build\queries\lucene-queries-4.1-SNAPSHOT.jar;C:\Users\JenkinsSlave\workspace\Lucene-Solr-4.x-Windows\lucene\build\queryparser\lucene-queryparser-4.1-SNAPSHOT.jar;C:\Users\JenkinsSlave\workspace\Lucene-Solr-4.x-Windows\solr\core\lib\cglib-nodep-2.2.jar;C:\Users\JenkinsSlave\workspace\Lucene-Solr-4.x-Windows\solr\core\lib\commons-cli-1.2.jar;C:\Users\JenkinsSlave\workspace\Lucene-Solr-4.x-Windows\solr\core\lib\commons-codec-1.7.jar;C:\Users\JenkinsSlave\workspace\Lucene-Solr-4.x-Windows\solr\core\lib\commons-fileupload-1.2.1.jar;C:\Users\JenkinsSlave\workspace\Lucene-Solr-4.x-Windows\solr\core\lib\commons-lang-2.6.jar;C:\Users\JenkinsSlave\workspace\Lucene-Solr-4.x-Windows\solr\core\lib\easymock-3.0.jar;C:\Users\JenkinsSlave\workspace\Lucene-Solr-4.x-Windows\solr\core\lib\guava-13.0.1.jar;C:\Users\JenkinsSlave\workspace\Lucene-Solr-4.x-Windows\solr\core\lib\javax.servlet-api-3.0.1.jar;C:\Users\JenkinsSlave\workspace\Lucene-Solr-4.x-Windows\solr\core\lib\metrics-core-2.1.2.jar;C:\Users\JenkinsSlave\workspace\Lucene-Solr-4.x-Windows\solr\core\lib\objenesis-1.2.jar;C:\Users\JenkinsSlave\workspace\Lucene-Solr-4.x-Windows\solr\core\lib\spatial4j-0.3.jar;C:\Users\JenkinsSlave\workspace\Lucene-Solr-4.x-Windows\solr\solrj\lib\commons-io-2.1.jar;C:\Users\JenkinsSlave\workspace\Lucene-Solr-4.x-Windows\solr\solrj\lib\httpclient-4.1.3.jar;C:\Users\JenkinsSlave\workspace\Lucene-Solr-4.x-Windows\solr\solrj\lib\httpcore-4.1.4.jar;C:\Users\JenkinsSlave\workspace\Lucene-Solr-4.x-Windows\solr\solrj\lib\httpmime-4.1.3.jar;C:\Users\JenkinsSlave\workspace\Lucene-Solr-4.x-Windows\solr\solrj\lib\jcl-over-slf4j-1.6.4.jar;C:\Users\JenkinsSlave\workspace\Lucene-Solr-4.x-Windows\solr\solrj\lib\log4j-over-slf4j-1.6.4.jar;C:\Users\JenkinsSlave\workspace\Lucene-Solr-4.x-Windows\solr\solrj\lib\slf4j-api-1.6.4.jar;C:\Users\JenkinsSlave\workspace\Lucene-Solr-4.x-Windows\solr\solrj\lib\slf4j-jdk14-1.6.4.jar;C:\Users\JenkinsSlave\workspace\Lucene-Solr-4.x-Windows\solr\solrj\lib\wstx-asl-3.2.7.jar;C:\Users\JenkinsSlave\workspace\Lucene-Solr-4.x-Windows\solr\solrj\lib\zookeeper-3.4.5.jar;C:\Users\JenkinsSlave\workspace\Lucene-Solr-4.x-Windows\solr\example\lib\jetty-continuation-8.1.8.v20121106.jar;C:\Users\JenkinsSlave\workspace\Lucene-Solr-4.x-Windows\solr\example\lib\jetty-deploy-8.1.8.v20121106.jar;C:\Users\JenkinsSlave\workspace\Lucene-Solr-4.x-Windows\solr\example\lib\jetty-http-8.1.8.v20121106.jar;C:\Users\JenkinsSlave\workspace\Lucene-Solr-4.x-Windows\solr\example\lib\jetty-io-8.1.8.v20121106.jar;C:\Users\JenkinsSlave\workspace\Lucene-Solr-4.x-Windows\solr\example\lib\jetty-jmx-8.1.8.v20121106.jar;C:\Users\JenkinsSlave\workspace\Lucene-Solr-4.x-Windows\solr\example\lib\jetty-security-8.1.8.v20121106.jar;C:\Users\JenkinsSlave\workspace\Lucene-Solr-4.x-Windows\solr\example\lib\jetty-server-8.1.8.v20121106.jar;C:\Users\JenkinsSlave\workspace\Lucene-Solr-4.x-Windows\solr\example\lib\jetty-servlet-8.1.8.v20121106.jar;C:\Users\JenkinsSlave\workspace\Lucene-Solr-4.x-Windows\solr\example\lib\jetty-util-8.1.8.v20121106.jar;C:\Users\JenkinsSlave\workspace\Lucene-Solr-4.x-Windows\solr\example\lib\jetty-webapp-8.1.8.v20121106.jar;C:\Users\JenkinsSlave\workspace\Lucene-Solr-4.x-Windows\solr\example\lib\jetty-xml-8.1.8.v20121106.jar;C:\Users\JenkinsSlave\workspace\Lucene-Solr-4.x-Windows\solr\example\lib\servlet-api-3.0.jar;C:\Users\JenkinsSlave\workspace\Lucene-Solr-4.x-Windows\solr\example\example-DIH\solr\db\lib\derby-10.9.1.0.jar;C:\Users\JenkinsSlave\workspace\Lucene-Solr-4.x-Windows\solr\example\example-DIH\solr\db\lib\hsqldb-1.8.0.10.jar;C:\Users\JenkinsSlave\workspace\Lucene-Solr-4.x-Windows\lucene\build\core\classes\java;C:\Users\JenkinsSlave\workspace\Lucene-Solr-4.x-Windows\lucene\test-framework\lib\junit-4.10.jar;C:\Users\JenkinsSlave\workspace\Lucene-Solr-4.x-Windows\lucene\test-framework\lib\randomizedtesting-runner-2.0.5.jar;C:\Users\JenkinsSlave\tools\Ant\ANT_1.8.2\lib\ant-launcher.jar;C:\Users\JenkinsSlave\.ant\lib\ivy-2.2.0.jar;C:\Users\JenkinsSlave\tools\Ant\ANT_1.8.2\lib\ant-antlr.jar;C:\Users\JenkinsSlave\tools\Ant\ANT_1.8.2\lib\ant-apache-bcel.jar;C:\Users\JenkinsSlave\tools\Ant\ANT_1.8.2\lib\ant-apache-bsf.jar;C:\Users\JenkinsSlave\tools\Ant\ANT_1.8.2\lib\ant-apache-log4j.jar;C:\Users\JenkinsSlave\tools\Ant\ANT_1.8.2\lib\ant-apache-oro.jar;C:\Users\JenkinsSlave\tools\Ant\ANT_1.8.2\lib\ant-apache-regexp.jar;C:\Users\JenkinsSlave\tools\Ant\ANT_1.8.2\lib\ant-apache-resolver.jar;C:\Users\JenkinsSlave\tools\Ant\ANT_1.8.2\lib\ant-apache-xalan2.jar;C:\Users\JenkinsSlave\tools\Ant\ANT_1.8.2\lib\ant-commons-logging.jar;C:\Users\JenkinsSlave\tools\Ant\ANT_1.8.2\lib\ant-commons-net.jar;C:\Users\JenkinsSlave\tools\Ant\ANT_1.8.2\lib\ant-jai.jar;C:\Users\JenkinsSlave\tools\Ant\ANT_1.8.2\lib\ant-javamail.jar;C:\Users\JenkinsSlave\tools\Ant\ANT_1.8.2\lib\ant-jdepend.jar;C:\Users\JenkinsSlave\tools\Ant\ANT_1.8.2\lib\ant-jmf.jar;C:\Users\JenkinsSlave\tools\Ant\ANT_1.8.2\lib\ant-jsch.jar;C:\Users\JenkinsSlave\tools\Ant\ANT_1.8.2\lib\ant-junit.jar;C:\Users\JenkinsSlave\tools\Ant\ANT_1.8.2\lib\ant-junit4.jar;C:\Users\JenkinsSlave\tools\Ant\ANT_1.8.2\lib\ant-netrexx.jar;C:\Users\JenkinsSlave\tools\Ant\ANT_1.8.2\lib\ant-swing.jar;C:\Users\JenkinsSlave\tools\Ant\ANT_1.8.2\lib\ant-testutil.jar;C:\Users\JenkinsSlave\tools\Ant\ANT_1.8.2\lib\ant.jar;C:\Users\JenkinsSlave\tools\java\64bit\jdk1.7.0_09\lib\tools.jar;C:\Users\JenkinsSlave\.ivy2\cache\com.carrotsearch.randomizedtesting\junit4-ant\jars\junit4-ant-2.0.5.jar
[junit4:junit4]   2> 275 T19 oaz.Environment.logEnv Server environment:java.library.path=C:\Users\JenkinsSlave\tools\java\64bit\jdk1.7.0_09\jre\bin;C:\Windows\Sun\Java\bin;C:\Windows\system32;C:\Windows;C:\Users\JenkinsSlave\tools\java\64bit\jdk1.7.0_09\bin;C:\Windows\system32;C:\Windows;C:\Windows\System32\Wbem;C:\Windows\System32\WindowsPowerShell\v1.0\;C:\Program Files (x86)\Subversion\bin;.
[junit4:junit4]   2> 276 T19 oaz.Environment.logEnv Server environment:java.io.tmpdir=.
[junit4:junit4]   2> 276 T19 oaz.Environment.logEnv Server environment:java.compiler=<NA>
[junit4:junit4]   2> 276 T19 oaz.Environment.logEnv Server environment:os.name=Windows 7
[junit4:junit4]   2> 277 T19 oaz.Environment.logEnv Server environment:os.arch=amd64
[junit4:junit4]   2> 277 T19 oaz.Environment.logEnv Server environment:os.version=6.1
[junit4:junit4]   2> 277 T19 oaz.Environment.logEnv Server environment:user.name=JenkinsSlave
[junit4:junit4]   2> 278 T19 oaz.Environment.logEnv Server environment:user.home=C:\Users\JenkinsSlave
[junit4:junit4]   2> 278 T19 oaz.Environment.logEnv Server environment:user.dir=C:\Users\JenkinsSlave\workspace\Lucene-Solr-4.x-Windows\solr\build\solr-core\test\J0
[junit4:junit4]   2> 309 T19 oazs.ZooKeeperServer.setTickTime tickTime set to 1000
[junit4:junit4]   2> 310 T19 oazs.ZooKeeperServer.setMinSessionTimeout minSessionTimeout set to -1
[junit4:junit4]   2> 310 T19 oazs.ZooKeeperServer.setMaxSessionTimeout maxSessionTimeout set to -1
[junit4:junit4]   2> 315 T19 oazs.NIOServerCnxnFactory.configure binding to port 0.0.0.0/0.0.0.0:0
[junit4:junit4]   2> 370 T19 oazsp.FileTxnSnapLog.save Snapshotting: 0x0 to C:\Users\JenkinsSlave\workspace\Lucene-Solr-4.x-Windows\solr\build\solr-core\test\J0\.\org.apache.solr.cloud.SyncSliceTest-1355269716905\zookeeper\server1\data\version-2\snapshot.0
[junit4:junit4]   2> 502 T18 oasc.ZkTestServer.run start zk server on port:60654
[junit4:junit4]   2> 602 T18 oaz.Environment.logEnv Client environment:zookeeper.version=3.4.5-1392090, built on 09/30/2012 17:52 GMT
[junit4:junit4]   2> 604 T18 oaz.Environment.logEnv Client environment:host.name=JenkinsSlave-PC
[junit4:junit4]   2> 605 T18 oaz.Environment.logEnv Client environment:java.version=1.7.0_09
[junit4:junit4]   2> 607 T18 oaz.Environment.logEnv Client environment:java.vendor=Oracle Corporation
[junit4:junit4]   2> 608 T18 oaz.Environment.logEnv Client environment:java.home=C:\Users\JenkinsSlave\tools\java\64bit\jdk1.7.0_09\jre
[junit4:junit4]   2> 609 T18 oaz.Environment.logEnv Client environment:java.class.path=C:\Users\JenkinsSlave\workspace\Lucene-Solr-4.x-Windows\solr\build\solr-core\classes\test;C:\Users\JenkinsSlave\workspace\Lucene-Solr-4.x-Windows\solr\build\solr-test-framework\classes\java;C:\Users\JenkinsSlave\workspace\Lucene-Solr-4.x-Windows\solr\build\solr-core\test-files;C:\Users\JenkinsSlave\workspace\Lucene-Solr-4.x-Windows\lucene\build\test-framework\classes\java;C:\Users\JenkinsSlave\workspace\Lucene-Solr-4.x-Windows\lucene\build\codecs\classes\java;C:\Users\JenkinsSlave\workspace\Lucene-Solr-4.x-Windows\solr\build\solr-solrj\classes\java;C:\Users\JenkinsSlave\workspace\Lucene-Solr-4.x-Windows\solr\build\solr-core\classes\java;C:\Users\JenkinsSlave\workspace\Lucene-Solr-4.x-Windows\lucene\build\analysis\common\lucene-analyzers-common-4.1-SNAPSHOT.jar;C:\Users\JenkinsSlave\workspace\Lucene-Solr-4.x-Windows\lucene\build\analysis\kuromoji\lucene-analyzers-kuromoji-4.1-SNAPSHOT.jar;C:\Users\JenkinsSlave\workspace\Lucene-Solr-4.x-Windows\lucene\build\analysis\phonetic\lucene-analyzers-phonetic-4.1-SNAPSHOT.jar;C:\Users\JenkinsSlave\workspace\Lucene-Solr-4.x-Windows\lucene\build\highlighter\lucene-highlighter-4.1-SNAPSHOT.jar;C:\Users\JenkinsSlave\workspace\Lucene-Solr-4.x-Windows\lucene\build\memory\lucene-memory-4.1-SNAPSHOT.jar;C:\Users\JenkinsSlave\workspace\Lucene-Solr-4.x-Windows\lucene\build\misc\lucene-misc-4.1-SNAPSHOT.jar;C:\Users\JenkinsSlave\workspace\Lucene-Solr-4.x-Windows\lucene\build\spatial\lucene-spatial-4.1-SNAPSHOT.jar;C:\Users\JenkinsSlave\workspace\Lucene-Solr-4.x-Windows\lucene\build\suggest\lucene-suggest-4.1-SNAPSHOT.jar;C:\Users\JenkinsSlave\workspace\Lucene-Solr-4.x-Windows\lucene\build\grouping\lucene-grouping-4.1-SNAPSHOT.jar;C:\Users\JenkinsSlave\workspace\Lucene-Solr-4.x-Windows\lucene\build\queries\lucene-queries-4.1-SNAPSHOT.jar;C:\Users\JenkinsSlave\workspace\Lucene-Solr-4.x-Windows\lucene\build\queryparser\lucene-queryparser-4.1-SNAPSHOT.jar;C:\Users\JenkinsSlave\workspace\Lucene-Solr-4.x-Windows\solr\core\lib\cglib-nodep-2.2.jar;C:\Users\JenkinsSlave\workspace\Lucene-Solr-4.x-Windows\solr\core\lib\commons-cli-1.2.jar;C:\Users\JenkinsSlave\workspace\Lucene-Solr-4.x-Windows\solr\core\lib\commons-codec-1.7.jar;C:\Users\JenkinsSlave\workspace\Lucene-Solr-4.x-Windows\solr\core\lib\commons-fileupload-1.2.1.jar;C:\Users\JenkinsSlave\workspace\Lucene-Solr-4.x-Windows\solr\core\lib\commons-lang-2.6.jar;C:\Users\JenkinsSlave\workspace\Lucene-Solr-4.x-Windows\solr\core\lib\easymock-3.0.jar;C:\Users\JenkinsSlave\workspace\Lucene-Solr-4.x-Windows\solr\core\lib\guava-13.0.1.jar;C:\Users\JenkinsSlave\workspace\Lucene-Solr-4.x-Windows\solr\core\lib\javax.servlet-api-3.0.1.jar;C:\Users\JenkinsSlave\workspace\Lucene-Solr-4.x-Windows\solr\core\lib\metrics-core-2.1.2.jar;C:\Users\JenkinsSlave\workspace\Lucene-Solr-4.x-Windows\solr\core\lib\objenesis-1.2.jar;C:\Users\JenkinsSlave\workspace\Lucene-Solr-4.x-Windows\solr\core\lib\spatial4j-0.3.jar;C:\Users\JenkinsSlave\workspace\Lucene-Solr-4.x-Windows\solr\solrj\lib\commons-io-2.1.jar;C:\Users\JenkinsSlave\workspace\Lucene-Solr-4.x-Windows\solr\solrj\lib\httpclient-4.1.3.jar;C:\Users\JenkinsSlave\workspace\Lucene-Solr-4.x-Windows\solr\solrj\lib\httpcore-4.1.4.jar;C:\Users\JenkinsSlave\workspace\Lucene-Solr-4.x-Windows\solr\solrj\lib\httpmime-4.1.3.jar;C:\Users\JenkinsSlave\workspace\Lucene-Solr-4.x-Windows\solr\solrj\lib\jcl-over-slf4j-1.6.4.jar;C:\Users\JenkinsSlave\workspace\Lucene-Solr-4.x-Windows\solr\solrj\lib\log4j-over-slf4j-1.6.4.jar;C:\Users\JenkinsSlave\workspace\Lucene-Solr-4.x-Windows\solr\solrj\lib\slf4j-api-1.6.4.jar;C:\Users\JenkinsSlave\workspace\Lucene-Solr-4.x-Windows\solr\solrj\lib\slf4j-jdk14-1.6.4.jar;C:\Users\JenkinsSlave\workspace\Lucene-Solr-4.x-Windows\solr\solrj\lib\wstx-asl-3.2.7.jar;C:\Users\JenkinsSlave\workspace\Lucene-Solr-4.x-Windows\solr\solrj\lib\zookeeper-3.4.5.jar;C:\Users\JenkinsSlave\workspace\Lucene-Solr-4.x-Windows\solr\example\lib\jetty-continuation-8.1.8.v20121106.jar;C:\Users\JenkinsSlave\workspace\Lucene-Solr-4.x-Windows\solr\example\lib\jetty-deploy-8.1.8.v20121106.jar;C:\Users\JenkinsSlave\workspace\Lucene-Solr-4.x-Windows\solr\example\lib\jetty-http-8.1.8.v20121106.jar;C:\Users\JenkinsSlave\workspace\Lucene-Solr-4.x-Windows\solr\example\lib\jetty-io-8.1.8.v20121106.jar;C:\Users\JenkinsSlave\workspace\Lucene-Solr-4.x-Windows\solr\example\lib\jetty-jmx-8.1.8.v20121106.jar;C:\Users\JenkinsSlave\workspace\Lucene-Solr-4.x-Windows\solr\example\lib\jetty-security-8.1.8.v20121106.jar;C:\Users\JenkinsSlave\workspace\Lucene-Solr-4.x-Windows\solr\example\lib\jetty-server-8.1.8.v20121106.jar;C:\Users\JenkinsSlave\workspace\Lucene-Solr-4.x-Windows\solr\example\lib\jetty-servlet-8.1.8.v20121106.jar;C:\Users\JenkinsSlave\workspace\Lucene-Solr-4.x-Windows\solr\example\lib\jetty-util-8.1.8.v20121106.jar;C:\Users\JenkinsSlave\workspace\Lucene-Solr-4.x-Windows\solr\example\lib\jetty-webapp-8.1.8.v20121106.jar;C:\Users\JenkinsSlave\workspace\Lucene-Solr-4.x-Windows\solr\example\lib\jetty-xml-8.1.8.v20121106.jar;C:\Users\JenkinsSlave\workspace\Lucene-Solr-4.x-Windows\solr\example\lib\servlet-api-3.0.jar;C:\Users\JenkinsSlave\workspace\Lucene-Solr-4.x-Windows\solr\example\example-DIH\solr\db\lib\derby-10.9.1.0.jar;C:\Users\JenkinsSlave\workspace\Lucene-Solr-4.x-Windows\solr\example\example-DIH\solr\db\lib\hsqldb-1.8.0.10.jar;C:\Users\JenkinsSlave\workspace\Lucene-Solr-4.x-Windows\lucene\build\core\classes\java;C:\Users\JenkinsSlave\workspace\Lucene-Solr-4.x-Windows\lucene\test-framework\lib\junit-4.10.jar;C:\Users\JenkinsSlave\workspace\Lucene-Solr-4.x-Windows\lucene\test-framework\lib\randomizedtesting-runner-2.0.5.jar;C:\Users\JenkinsSlave\tools\Ant\ANT_1.8.2\lib\ant-launcher.jar;C:\Users\JenkinsSlave\.ant\lib\ivy-2.2.0.jar;C:\Users\JenkinsSlave\tools\Ant\ANT_1.8.2\lib\ant-antlr.jar;C:\Users\JenkinsSlave\tools\Ant\ANT_1.8.2\lib\ant-apache-bcel.jar;C:\Users\JenkinsSlave\tools\Ant\ANT_1.8.2\lib\ant-apache-bsf.jar;C:\Users\JenkinsSlave\tools\Ant\ANT_1.8.2\lib\ant-apache-log4j.jar;C:\Users\JenkinsSlave\tools\Ant\ANT_1.8.2\lib\ant-apache-oro.jar;C:\Users\JenkinsSlave\tools\Ant\ANT_1.8.2\lib\ant-apache-regexp.jar;C:\Users\JenkinsSlave\tools\Ant\ANT_1.8.2\lib\ant-apache-resolver.jar;C:\Users\JenkinsSlave\tools\Ant\ANT_1.8.2\lib\ant-apache-xalan2.jar;C:\Users\JenkinsSlave\tools\Ant\ANT_1.8.2\lib\ant-commons-logging.jar;C:\Users\JenkinsSlave\tools\Ant\ANT_1.8.2\lib\ant-commons-net.jar;C:\Users\JenkinsSlave\tools\Ant\ANT_1.8.2\lib\ant-jai.jar;C:\Users\JenkinsSlave\tools\Ant\ANT_1.8.2\lib\ant-javamail.jar;C:\Users\JenkinsSlave\tools\Ant\ANT_1.8.2\lib\ant-jdepend.jar;C:\Users\JenkinsSlave\tools\Ant\ANT_1.8.2\lib\ant-jmf.jar;C:\Users\JenkinsSlave\tools\Ant\ANT_1.8.2\lib\ant-jsch.jar;C:\Users\JenkinsSlave\tools\Ant\ANT_1.8.2\lib\ant-junit.jar;C:\Users\JenkinsSlave\tools\Ant\ANT_1.8.2\lib\ant-junit4.jar;C:\Users\JenkinsSlave\tools\Ant\ANT_1.8.2\lib\ant-netrexx.jar;C:\Users\JenkinsSlave\tools\Ant\ANT_1.8.2\lib\ant-swing.jar;C:\Users\JenkinsSlave\tools\Ant\ANT_1.8.2\lib\ant-testutil.jar;C:\Users\JenkinsSlave\tools\Ant\ANT_1.8.2\lib\ant.jar;C:\Users\JenkinsSlave\tools\java\64bit\jdk1.7.0_09\lib\tools.jar;C:\Users\JenkinsSlave\.ivy2\cache\com.carrotsearch.randomizedtesting\junit4-ant\jars\junit4-ant-2.0.5.jar
[junit4:junit4]   2> 611 T18 oaz.Environment.logEnv Client environment:java.library.path=C:\Users\JenkinsSlave\tools\java\64bit\jdk1.7.0_09\jre\bin;C:\Windows\Sun\Java\bin;C:\Windows\system32;C:\Windows;C:\Users\JenkinsSlave\tools\java\64bit\jdk1.7.0_09\bin;C:\Windows\system32;C:\Windows;C:\Windows\System32\Wbem;C:\Windows\System32\WindowsPowerShell\v1.0\;C:\Program Files (x86)\Subversion\bin;.
[junit4:junit4]   2> 612 T18 oaz.Environment.logEnv Client environment:java.io.tmpdir=.
[junit4:junit4]   2> 613 T18 oaz.Environment.logEnv Client environment:java.compiler=<NA>
[junit4:junit4]   2> 613 T18 oaz.Environment.logEnv Client environment:os.name=Windows 7
[junit4:junit4]   2> 614 T18 oaz.Environment.logEnv Client environment:os.arch=amd64
[junit4:junit4]   2> 614 T18 oaz.Environment.logEnv Client environment:os.version=6.1
[junit4:junit4]   2> 615 T18 oaz.Environment.logEnv Client environment:user.name=JenkinsSlave
[junit4:junit4]   2> 615 T18 oaz.Environment.logEnv Client environment:user.home=C:\Users\JenkinsSlave
[junit4:junit4]   2> 616 T18 oaz.Environment.logEnv Client environment:user.dir=C:\Users\JenkinsSlave\workspace\Lucene-Solr-4.x-Windows\solr\build\solr-core\test\J0
[junit4:junit4]   2> 621 T18 oaz.ZooKeeper.<init> Initiating client connection, connectString=127.0.0.1:60654 sessionTimeout=10000 watcher=org.apache.solr.common.cloud.ConnectionManager@74bef851
[junit4:junit4]   2> 688 T18 oascc.ConnectionManager.waitForConnected Waiting for client to connect to ZooKeeper
[junit4:junit4]   2> 697 T24 oaz.ClientCnxn$SendThread.logStartConnect Opening socket connection to server 127.0.0.1/127.0.0.1:60654. Will not attempt to authenticate using SASL (access denied ("javax.security.auth.AuthPermission" "getLoginConfiguration"))
[junit4:junit4]   2> 699 T24 oaz.ClientCnxn$SendThread.primeConnection Socket connection established to 127.0.0.1/127.0.0.1:60654, initiating session
[junit4:junit4]   2> 731 T20 oazs.NIOServerCnxnFactory.run Accepted socket connection from /127.0.0.1:60657
[junit4:junit4]   2> 750 T20 oazs.ZooKeeperServer.processConnectRequest Client attempting to establish new session at /127.0.0.1:60657
[junit4:junit4]   2> 761 T22 oazsp.FileTxnLog.append Creating new log file: log.1
[junit4:junit4]   2> 808 T22 oazs.ZooKeeperServer.finishSessionInit Established session 0x13b8c5ebd2a0000 with negotiated timeout 10000 for client /127.0.0.1:60657
[junit4:junit4]   2> 809 T24 oaz.ClientCnxn$SendThread.onConnected Session establishment complete on server 127.0.0.1/127.0.0.1:60654, sessionid = 0x13b8c5ebd2a0000, negotiated timeout = 10000
[junit4:junit4]   2> 817 T25 oascc.ConnectionManager.process Watcher org.apache.solr.common.cloud.ConnectionManager@74bef851 name:ZooKeeperConnection Watcher:127.0.0.1:60654 got event WatchedEvent state:SyncConnected type:None path:null path:null type:None
[junit4:junit4]   2> 821 T18 oascc.ConnectionManager.waitForConnected Client is connected to ZooKeeper
[junit4:junit4]   2> 824 T18 oascc.SolrZkClient.makePath makePath: /solr
[junit4:junit4]   2> 908 T23 oazs.PrepRequestProcessor.pRequest2Txn Processed session termination for sessionid: 0x13b8c5ebd2a0000
[junit4:junit4]   2> 913 T20 oazs.NIOServerCnxn.closeSock Closed socket connection for client /127.0.0.1:60657 which had sessionid 0x13b8c5ebd2a0000
[junit4:junit4]   2> 914 T18 oaz.ZooKeeper.close Session: 0x13b8c5ebd2a0000 closed
[junit4:junit4]   2> 914 T18 oaz.ZooKeeper.<init> Initiating client connection, connectString=127.0.0.1:60654/solr sessionTimeout=10000 watcher=org.apache.solr.common.cloud.ConnectionManager@7a65c4d0
[junit4:junit4]   2> 916 T25 oaz.ClientCnxn$EventThread.run EventThread shut down
[junit4:junit4]   2> 917 T18 oascc.ConnectionManager.waitForConnected Waiting for client to connect to ZooKeeper
[junit4:junit4]   2> 918 T26 oaz.ClientCnxn$SendThread.logStartConnect Opening socket connection to server 127.0.0.1/127.0.0.1:60654. Will not attempt to authenticate using SASL (access denied ("javax.security.auth.AuthPermission" "getLoginConfiguration"))
[junit4:junit4]   2> 919 T26 oaz.ClientCnxn$SendThread.primeConnection Socket connection established to 127.0.0.1/127.0.0.1:60654, initiating session
[junit4:junit4]   2> 920 T20 oazs.NIOServerCnxnFactory.run Accepted socket connection from /127.0.0.1:60660
[junit4:junit4]   2> 921 T20 oazs.ZooKeeperServer.processConnectRequest Client attempting to establish new session at /127.0.0.1:60660
[junit4:junit4]   2> 924 T26 oaz.ClientCnxn$SendThread.onConnected Session establishment complete on server 127.0.0.1/127.0.0.1:60654, sessionid = 0x13b8c5ebd2a0001, negotiated timeout = 10000
[junit4:junit4]   2> 924 T22 oazs.ZooKeeperServer.finishSessionInit Established session 0x13b8c5ebd2a0001 with negotiated timeout 10000 for client /127.0.0.1:60660
[junit4:junit4]   2> 924 T27 oascc.ConnectionManager.process Watcher org.apache.solr.common.cloud.ConnectionManager@7a65c4d0 name:ZooKeeperConnection Watcher:127.0.0.1:60654/solr got event WatchedEvent state:SyncConnected type:None path:null path:null type:None
[junit4:junit4]   2> 924 T18 oascc.ConnectionManager.waitForConnected Client is connected to ZooKeeper
[junit4:junit4]   2> 945 T18 oascc.SolrZkClient.makePath makePath: /collections/collection1
[junit4:junit4]   2> 1002 T18 oascc.SolrZkClient.makePath makePath: /collections/collection1/shards
[junit4:junit4]   2> 1019 T18 oascc.SolrZkClient.makePath makePath: /collections/control_collection
[junit4:junit4]   2> 1027 T18 oascc.SolrZkClient.makePath makePath: /collections/control_collection/shards
[junit4:junit4]   2> 1054 T18 oasc.AbstractZkTestCase.putConfig put C:\Users\JenkinsSlave\workspace\Lucene-Solr-4.x-Windows\solr\build\solr-core\test-files\solr\collection1\conf\solrconfig.xml to /configs/conf1/solrconfig.xml
[junit4:junit4]   2> 1072 T18 oascc.SolrZkClient.makePath makePath: /configs/conf1/solrconfig.xml
[junit4:junit4]   2> 1089 T18 oasc.AbstractZkTestCase.putConfig put C:\Users\JenkinsSlave\workspace\Lucene-Solr-4.x-Windows\solr\build\solr-core\test-files\solr\collection1\conf\schema.xml to /configs/conf1/schema.xml
[junit4:junit4]   2> 1090 T18 oascc.SolrZkClient.makePath makePath: /configs/conf1/schema.xml
[junit4:junit4]   2> 1099 T18 oasc.AbstractZkTestCase.putConfig put C:\Users\JenkinsSlave\workspace\Lucene-Solr-4.x-Windows\solr\build\solr-core\test-files\solr\collection1\conf\solrconfig.xml to /configs/conf1/solrconfig.xml
[junit4:junit4]   2> 1101 T18 oascc.SolrZkClient.makePath makePath: /configs/conf1/solrconfig.xml
[junit4:junit4]   2> 1119 T18 oasc.AbstractZkTestCase.putConfig put C:\Users\JenkinsSlave\workspace\Lucene-Solr-4.x-Windows\solr\build\solr-core\test-files\solr\collection1\conf\stopwords.txt to /configs/conf1/stopwords.txt
[junit4:junit4]   2> 1119 T18 oascc.SolrZkClient.makePath makePath: /configs/conf1/stopwords.txt
[junit4:junit4]   2> 1127 T18 oasc.AbstractZkTestCase.putConfig put C:\Users\JenkinsSlave\workspace\Lucene-Solr-4.x-Windows\solr\build\solr-core\test-files\solr\collection1\conf\protwords.txt to /configs/conf1/protwords.txt
[junit4:junit4]   2> 1128 T18 oascc.SolrZkClient.makePath makePath: /configs/conf1/protwords.txt
[junit4:junit4]   2> 1136 T18 oasc.AbstractZkTestCase.putConfig put C:\Users\JenkinsSlave\workspace\Lucene-Solr-4.x-Windows\solr\build\solr-core\test-files\solr\collection1\conf\currency.xml to /configs/conf1/currency.xml
[junit4:junit4]   2> 1137 T18 oascc.SolrZkClient.makePath makePath: /configs/conf1/currency.xml
[junit4:junit4]   2> 1146 T18 oasc.AbstractZkTestCase.putConfig put C:\Users\JenkinsSlave\workspace\Lucene-Solr-4.x-Windows\solr\build\solr-core\test-files\solr\collection1\conf\open-exchange-rates.json to /configs/conf1/open-exchange-rates.json
[junit4:junit4]   2> 1146 T18 oascc.SolrZkClient.makePath makePath: /configs/conf1/open-exchange-rates.json
[junit4:junit4]   2> 1154 T18 oasc.AbstractZkTestCase.putConfig put C:\Users\JenkinsSlave\workspace\Lucene-Solr-4.x-Windows\solr\build\solr-core\test-files\solr\collection1\conf\mapping-ISOLatin1Accent.txt to /configs/conf1/mapping-ISOLatin1Accent.txt
[junit4:junit4]   2> 1155 T18 oascc.SolrZkClient.makePath makePath: /configs/conf1/mapping-ISOLatin1Accent.txt
[junit4:junit4]   2> 1163 T18 oasc.AbstractZkTestCase.putConfig put C:\Users\JenkinsSlave\workspace\Lucene-Solr-4.x-Windows\solr\build\solr-core\test-files\solr\collection1\conf\old_synonyms.txt to /configs/conf1/old_synonyms.txt
[junit4:junit4]   2> 1163 T18 oascc.SolrZkClient.makePath makePath: /configs/conf1/old_synonyms.txt
[junit4:junit4]   2> 1172 T18 oasc.AbstractZkTestCase.putConfig put C:\Users\JenkinsSlave\workspace\Lucene-Solr-4.x-Windows\solr\build\solr-core\test-files\solr\collection1\conf\synonyms.txt to /configs/conf1/synonyms.txt
[junit4:junit4]   2> 1172 T18 oascc.SolrZkClient.makePath makePath: /configs/conf1/synonyms.txt
[junit4:junit4]   2> 1183 T23 oazs.PrepRequestProcessor.pRequest2Txn Processed session termination for sessionid: 0x13b8c5ebd2a0001
[junit4:junit4]   2> 1185 T20 oazs.NIOServerCnxn.closeSock Closed socket connection for client /127.0.0.1:60660 which had sessionid 0x13b8c5ebd2a0001
[junit4:junit4]   2> 1186 T27 oaz.ClientCnxn$EventThread.run EventThread shut down
[junit4:junit4]   2> 1185 T18 oaz.ZooKeeper.close Session: 0x13b8c5ebd2a0001 closed
[junit4:junit4]   2> 1875 T18 oejs.Server.doStart jetty-8.1.8.v20121106
[junit4:junit4]   2> 2125 T18 oejs.AbstractConnector.doStart Started SelectChannelConnector@0.0.0.0:60661
[junit4:junit4]   2> 2184 T18 oasc.SolrResourceLoader.locateSolrHome JNDI not configured for solr (NoInitialContextEx)
[junit4:junit4]   2> 2184 T18 oasc.SolrResourceLoader.locateSolrHome using system property solr.solr.home: C:\Users\JenkinsSlave\workspace\Lucene-Solr-4.x-Windows\solr\build\solr-core\test\J0\.\org.apache.solr.cloud.SyncSliceTest-controljetty-1355269718080
[junit4:junit4]   2> 2185 T18 oasc.SolrResourceLoader.<init> new SolrResourceLoader for deduced Solr Home: 'C:\Users\JenkinsSlave\workspace\Lucene-Solr-4.x-Windows\solr\build\solr-core\test\J0\.\org.apache.solr.cloud.SyncSliceTest-controljetty-1355269718080\'
[junit4:junit4]   2> 2265 T18 oass.SolrDispatchFilter.init SolrDispatchFilter.init()
[junit4:junit4]   2> 2266 T18 oasc.SolrResourceLoader.locateSolrHome JNDI not configured for solr (NoInitialContextEx)
[junit4:junit4]   2> 2266 T18 oasc.SolrResourceLoader.locateSolrHome using system property solr.solr.home: C:\Users\JenkinsSlave\workspace\Lucene-Solr-4.x-Windows\solr\build\solr-core\test\J0\.\org.apache.solr.cloud.SyncSliceTest-controljetty-1355269718080
[junit4:junit4]   2> 2267 T18 oasc.CoreContainer$Initializer.initialize looking for solr.xml: C:\Users\JenkinsSlave\workspace\Lucene-Solr-4.x-Windows\solr\build\solr-core\test\J0\.\org.apache.solr.cloud.SyncSliceTest-controljetty-1355269718080\solr.xml
[junit4:junit4]   2> 2267 T18 oasc.CoreContainer.<init> New CoreContainer 747392319
[junit4:junit4]   2> 2270 T18 oasc.CoreContainer.load Loading CoreContainer using Solr Home: 'C:\Users\JenkinsSlave\workspace\Lucene-Solr-4.x-Windows\solr\build\solr-core\test\J0\.\org.apache.solr.cloud.SyncSliceTest-controljetty-1355269718080\'
[junit4:junit4]   2> 2271 T18 oasc.SolrResourceLoader.<init> new SolrResourceLoader for directory: 'C:\Users\JenkinsSlave\workspace\Lucene-Solr-4.x-Windows\solr\build\solr-core\test\J0\.\org.apache.solr.cloud.SyncSliceTest-controljetty-1355269718080\'
[junit4:junit4]   2> 2336 T18 oasc.CoreContainer.load Registering Log Listener
[junit4:junit4]   2> 2398 T18 oasc.CoreContainer.initZooKeeper Zookeeper client=127.0.0.1:60654/solr
[junit4:junit4]   2> 2435 T18 oasc.ZkController.checkChrootPath zkHost includes chroot
[junit4:junit4]   2> 2437 T18 oaz.ZooKeeper.<init> Initiating client connection, connectString=127.0.0.1:60654 sessionTimeout=60000 watcher=org.apache.solr.common.cloud.ConnectionManager@3b15947b
[junit4:junit4]   2> 2440 T18 oascc.ConnectionManager.waitForConnected Waiting for client to connect to ZooKeeper
[junit4:junit4]   2> 2442 T38 oaz.ClientCnxn$SendThread.logStartConnect Opening socket connection to server 127.0.0.1/127.0.0.1:60654. Will not attempt to authenticate using SASL (access denied ("javax.security.auth.AuthPermission" "getLoginConfiguration"))
[junit4:junit4]   2> 2443 T38 oaz.ClientCnxn$SendThread.primeConnection Socket connection established to 127.0.0.1/127.0.0.1:60654, initiating session
[junit4:junit4]   2> 2443 T20 oazs.NIOServerCnxnFactory.run Accepted socket connection from /127.0.0.1:60666
[junit4:junit4]   2> 2444 T20 oazs.ZooKeeperServer.processConnectRequest Client attempting to establish new session at /127.0.0.1:60666
[junit4:junit4]   2> 2456 T22 oazs.ZooKeeperServer.finishSessionInit Established session 0x13b8c5ebd2a0002 with negotiated timeout 20000 for client /127.0.0.1:60666
[junit4:junit4]   2> 2456 T38 oaz.ClientCnxn$SendThread.onConnected Session establishment complete on server 127.0.0.1/127.0.0.1:60654, sessionid = 0x13b8c5ebd2a0002, negotiated timeout = 20000
[junit4:junit4]   2> 2457 T39 oascc.ConnectionManager.process Watcher org.apache.solr.common.cloud.ConnectionManager@3b15947b name:ZooKeeperConnection Watcher:127.0.0.1:60654 got event WatchedEvent state:SyncConnected type:None path:null path:null type:None
[junit4:junit4]   2> 2458 T18 oascc.ConnectionManager.waitForConnected Client is connected to ZooKeeper
[junit4:junit4]   2> 2465 T23 oazs.PrepRequestProcessor.pRequest2Txn Processed session termination for sessionid: 0x13b8c5ebd2a0002
[junit4:junit4]   2> 2468 T20 oazs.NIOServerCnxn.closeSock Closed socket connection for client /127.0.0.1:60666 which had sessionid 0x13b8c5ebd2a0002
[junit4:junit4]   2> 2469 T18 oaz.ZooKeeper.close Session: 0x13b8c5ebd2a0002 closed
[junit4:junit4]   2> 2471 T39 oaz.ClientCnxn$EventThread.run EventThread shut down
[junit4:junit4]   2> 2473 T18 oaz.ZooKeeper.<init> Initiating client connection, connectString=127.0.0.1:60654/solr sessionTimeout=8000 watcher=org.apache.solr.common.cloud.ConnectionManager@13b8362e
[junit4:junit4]   2> 2475 T18 oascc.ConnectionManager.waitForConnected Waiting for client to connect to ZooKeeper
[junit4:junit4]   2> 2475 T40 oaz.ClientCnxn$SendThread.logStartConnect Opening socket connection to server 127.0.0.1/127.0.0.1:60654. Will not attempt to authenticate using SASL (access denied ("javax.security.auth.AuthPermission" "getLoginConfiguration"))
[junit4:junit4]   2> 2477 T40 oaz.ClientCnxn$SendThread.primeConnection Socket connection established to 127.0.0.1/127.0.0.1:60654, initiating session
[junit4:junit4]   2> 2477 T20 oazs.NIOServerCnxnFactory.run Accepted socket connection from /127.0.0.1:60669
[junit4:junit4]   2> 2478 T20 oazs.ZooKeeperServer.processConnectRequest Client attempting to establish new session at /127.0.0.1:60669
[junit4:junit4]   2> 2480 T22 oazs.ZooKeeperServer.finishSessionInit Established session 0x13b8c5ebd2a0003 with negotiated timeout 8000 for client /127.0.0.1:60669
[junit4:junit4]   2> 2480 T40 oaz.ClientCnxn$SendThread.onConnected Session establishment complete on server 127.0.0.1/127.0.0.1:60654, sessionid = 0x13b8c5ebd2a0003, negotiated timeout = 8000
[junit4:junit4]   2> 2481 T41 oascc.ConnectionManager.process Watcher org.apache.solr.common.cloud.ConnectionManager@13b8362e name:ZooKeeperConnection Watcher:127.0.0.1:60654/solr got event WatchedEvent state:SyncConnected type:None path:null path:null type:None
[junit4:junit4]   2> 2481 T18 oascc.ConnectionManager.waitForConnected Client is connected to ZooKeeper
[junit4:junit4]   2> 2497 T23 oazs.PrepRequestProcessor.pRequest Got user-level KeeperException when processing sessionid:0x13b8c5ebd2a0003 type:create cxid:0x2 zxid:0x1b txntype:-1 reqpath:n/a Error Path:/solr/overseer Error:KeeperErrorCode = NodeExists for /solr/overseer
[junit4:junit4]   2> 2511 T18 oascc.SolrZkClient.makePath makePath: /live_nodes
[junit4:junit4]   2> 2531 T18 oasc.ZkController.createEphemeralLiveNode Register node as live in ZooKeeper:/live_nodes/127.0.0.1:60661_solr
[junit4:junit4]   2> 2539 T23 oazs.PrepRequestProcessor.pRequest Got user-level KeeperException when processing sessionid:0x13b8c5ebd2a0003 type:delete cxid:0x7 zxid:0x1d txntype:-1 reqpath:n/a Error Path:/solr/live_nodes/127.0.0.1:60661_solr Error:KeeperErrorCode = NoNode for /solr/live_nodes/127.0.0.1:60661_solr
[junit4:junit4]   2> 2557 T18 oascc.SolrZkClient.makePath makePath: /live_nodes/127.0.0.1:60661_solr
[junit4:junit4]   2> 2588 T18 oashc.HttpShardHandlerFactory.getParameter Setting socketTimeout to: 0
[junit4:junit4]   2> 2589 T18 oashc.HttpShardHandlerFactory.getParameter Setting urlScheme to: http://
[junit4:junit4]   2> 2590 T18 oashc.HttpShardHandlerFactory.getParameter Setting connTimeout to: 0
[junit4:junit4]   2> 2591 T18 oashc.HttpShardHandlerFactory.getParameter Setting maxConnectionsPerHost to: 20
[junit4:junit4]   2> 2592 T18 oashc.HttpShardHandlerFactory.getParameter Setting corePoolSize to: 0
[junit4:junit4]   2> 2593 T18 oashc.HttpShardHandlerFactory.getParameter Setting maximumPoolSize to: 2147483647
[junit4:junit4]   2> 2593 T18 oashc.HttpShardHandlerFactory.getParameter Setting maxThreadIdleTime to: 5
[junit4:junit4]   2> 2594 T18 oashc.HttpShardHandlerFactory.getParameter Setting sizeOfQueue to: -1
[junit4:junit4]   2> 2594 T18 oashc.HttpShardHandlerFactory.getParameter Setting fairnessPolicy to: false
[junit4:junit4]   2> 2595 T18 oascsi.HttpClientUtil.createClient Creating new http client, config:maxConnectionsPerHost=20&maxConnections=10000&socketTimeout=0&connTimeout=0&retry=false
[junit4:junit4]   2> 2609 T18 oascc.SolrZkClient.makePath makePath: /overseer_elect/election
[junit4:junit4]   2> 2676 T23 oazs.PrepRequestProcessor.pRequest Got user-level KeeperException when processing sessionid:0x13b8c5ebd2a0003 type:delete cxid:0x15 zxid:0x22 txntype:-1 reqpath:n/a Error Path:/solr/overseer_elect/leader Error:KeeperErrorCode = NoNode for /solr/overseer_elect/leader
[junit4:junit4]   2> 2678 T18 oascc.SolrZkClient.makePath makePath: /overseer_elect/leader
[junit4:junit4]   2> 2686 T18 oasc.Overseer.start Overseer (id=88818956192317443-127.0.0.1:60661_solr-n_0000000000) starting
[junit4:junit4]   2> 2687 T23 oazs.PrepRequestProcessor.pRequest Got user-level KeeperException when processing sessionid:0x13b8c5ebd2a0003 type:create cxid:0x1a zxid:0x24 txntype:-1 reqpath:n/a Error Path:/solr/overseer Error:KeeperErrorCode = NodeExists for /solr/overseer
[junit4:junit4]   2> 2700 T23 oazs.PrepRequestProcessor.pRequest Got user-level KeeperException when processing sessionid:0x13b8c5ebd2a0003 type:create cxid:0x1b zxid:0x25 txntype:-1 reqpath:n/a Error Path:/solr/overseer Error:KeeperErrorCode = NodeExists for /solr/overseer
[junit4:junit4]   2> 2705 T23 oazs.PrepRequestProcessor.pRequest Got user-level KeeperException when processing sessionid:0x13b8c5ebd2a0003 type:create cxid:0x1c zxid:0x26 txntype:-1 reqpath:n/a Error Path:/solr/overseer Error:KeeperErrorCode = NodeExists for /solr/overseer
[junit4:junit4]   2> 2714 T23 oazs.PrepRequestProcessor.pRequest Got user-level KeeperException when processing sessionid:0x13b8c5ebd2a0003 type:create cxid:0x1d zxid:0x27 txntype:-1 reqpath:n/a Error Path:/solr/overseer Error:KeeperErrorCode = NodeExists for /solr/overseer
[junit4:junit4]   2> 2734 T18 oascc.SolrZkClient.makePath makePath: /clusterstate.json
[junit4:junit4]   2> 2737 T43 oasc.OverseerCollectionProcessor.run Process current queue of collection messages
[junit4:junit4]   2> 2743 T18 oascc.ZkStateReader.createClusterStateWatchersAndUpdate Updating cluster state from ZooKeeper... 
[junit4:junit4]   2> 2766 T42 oasc.Overseer$ClusterStateUpdater.run Starting to work on the main queue
[junit4:junit4]   2> 2819 T44 oasc.CoreContainer.create Creating SolrCore 'collection1' using instanceDir: C:\Users\JenkinsSlave\workspace\Lucene-Solr-4.x-Windows\solr\build\solr-core\test\J0\.\org.apache.solr.cloud.SyncSliceTest-controljetty-1355269718080\collection1
[junit4:junit4]   2> 2820 T44 oasc.ZkController.createCollectionZkNode Check for collection zkNode:control_collection
[junit4:junit4]   2> 2821 T44 oasc.ZkController.createCollectionZkNode Collection zkNode exists
[junit4:junit4]   2> 2821 T44 oasc.ZkController.readConfigName Load collection config from:/collections/control_collection
[junit4:junit4]   2> 2824 T44 oasc.SolrResourceLoader.<init> new SolrResourceLoader for directory: 'C:\Users\JenkinsSlave\workspace\Lucene-Solr-4.x-Windows\solr\build\solr-core\test\J0\.\org.apache.solr.cloud.SyncSliceTest-controljetty-1355269718080\collection1\'
[junit4:junit4]   2> 2827 T44 oasc.SolrResourceLoader.replaceClassLoader Adding 'file:/C:/Users/JenkinsSlave/workspace/Lucene-Solr-4.x-Windows/solr/build/solr-core/test/J0/org.apache.solr.cloud.SyncSliceTest-controljetty-1355269718080/collection1/lib/classes/' to classloader
[junit4:junit4]   2> 2828 T44 oasc.SolrResourceLoader.replaceClassLoader Adding 'file:/C:/Users/JenkinsSlave/workspace/Lucene-Solr-4.x-Windows/solr/build/solr-core/test/J0/org.apache.solr.cloud.SyncSliceTest-controljetty-1355269718080/collection1/lib/README' to classloader
[junit4:junit4]   2> 2974 T44 oasc.SolrConfig.<init> Using Lucene MatchVersion: LUCENE_41
[junit4:junit4]   2> 3090 T44 oasc.SolrConfig.<init> Loaded SolrConfig: solrconfig.xml
[junit4:junit4]   2> 3093 T44 oass.IndexSchema.readSchema Reading Solr Schema
[junit4:junit4]   2> 3145 T44 oass.IndexSchema.readSchema Schema name=test
[junit4:junit4]   2> 4080 T44 oass.OpenExchangeRatesOrgProvider.init Initialized with rates=open-exchange-rates.json, refreshInterval=1440.
[junit4:junit4]   2> 4096 T44 oass.IndexSchema.readSchema default search field in schema is text
[junit4:junit4]   2> 4100 T44 oass.IndexSchema.readSchema unique key field: id
[junit4:junit4]   2> 4142 T44 oass.FileExchangeRateProvider.reload Reloading exchange rates from file currency.xml
[junit4:junit4]   2> 4152 T44 oass.FileExchangeRateProvider.reload Reloading exchange rates from file currency.xml
[junit4:junit4]   2> 4159 T44 oass.OpenExchangeRatesOrgProvider.reload Reloading exchange rates from open-exchange-rates.json
[junit4:junit4]   2> 4163 T44 oass.OpenExchangeRatesOrgProvider.reload Reloading exchange rates from open-exchange-rates.json
[junit4:junit4]   2> 4168 T44 oasc.SolrCore.<init> [collection1] Opening new SolrCore at C:\Users\JenkinsSlave\workspace\Lucene-Solr-4.x-Windows\solr\build\solr-core\test\J0\.\org.apache.solr.cloud.SyncSliceTest-controljetty-1355269718080\collection1\, dataDir=.\org.apache.solr.cloud.SyncSliceTest-1355269716905/control/data\
[junit4:junit4]   2> 4175 T44 oasc.JmxMonitoredMap.<init> JMX monitoring is enabled. Adding Solr mbeans to JMX Server: com.sun.jmx.mbeanserver.JmxMBeanServer@2af6b7f
[junit4:junit4]   2> 4205 T44 oasc.SolrCore.getNewIndexDir New index directory detected: old=null new=.\org.apache.solr.cloud.SyncSliceTest-1355269716905/control/data\index/
[junit4:junit4]   2> 4206 T44 oasc.SolrCore.initIndex WARNING [collection1] Solr index directory '.\org.apache.solr.cloud.SyncSliceTest-1355269716905\control\data\index' doesn't exist. Creating new index...
[junit4:junit4]   2> 4207 T44 oasc.CachingDirectoryFactory.get return new directory for C:\Users\JenkinsSlave\workspace\Lucene-Solr-4.x-Windows\solr\build\solr-core\test\J0\.\org.apache.solr.cloud.SyncSliceTest-1355269716905\control\data\index forceNew:false
[junit4:junit4]   2> 4232 T44 oasc.SolrDeletionPolicy.onCommit SolrDeletionPolicy.onCommit: commits:num=1
[junit4:junit4]   2> 		commit{dir=RateLimitedDirectoryWrapper(NRTCachingDirectory(org.apache.lucene.store.MMapDirectory@C:\Users\JenkinsSlave\workspace\Lucene-Solr-4.x-Windows\solr\build\solr-core\test\J0\org.apache.solr.cloud.SyncSliceTest-1355269716905\control\data\index lockFactory=org.apache.lucene.store.NativeFSLockFactory@74c8057; maxCacheMB=48.0 maxMergeSizeMB=4.0)),segFN=segments_1,generation=1,filenames=[segments_1]
[junit4:junit4]   2> 4233 T44 oasc.SolrDeletionPolicy.updateCommits newest commit = 1
[junit4:junit4]   2> 4235 T44 oasc.SolrCore.initWriters created xml: solr.XMLResponseWriter
[junit4:junit4]   2> 4238 T44 oasup.UpdateRequestProcessorChain.init inserting DistributedUpdateProcessorFactory into updateRequestProcessorChain "dedupe"
[junit4:junit4]   2> 4238 T44 oasup.UpdateRequestProcessorChain.init inserting DistributedUpdateProcessorFactory into updateRequestProcessorChain "dedupe-allfields"
[junit4:junit4]   2> 4239 T44 oasup.UpdateRequestProcessorChain.init inserting DistributedUpdateProcessorFactory into updateRequestProcessorChain "stored_sig"
[junit4:junit4]   2> 4239 T44 oasup.UpdateRequestProcessorChain.init inserting DistributedUpdateProcessorFactory into updateRequestProcessorChain "uniq-fields"
[junit4:junit4]   2> 4240 T44 oasup.UpdateRequestProcessorChain.init inserting DistributedUpdateProcessorFactory into updateRequestProcessorChain "distrib-dup-test-chain-implicit"
[junit4:junit4]   2> 4241 T44 oasc.RequestHandlers.initHandlersFromConfig adding lazy requestHandler: solr.ReplicationHandler
[junit4:junit4]   2> 4241 T44 oasc.RequestHandlers.initHandlersFromConfig created /replication: solr.ReplicationHandler
[junit4:junit4]   2> 4244 T44 oasc.RequestHandlers.initHandlersFromConfig created standard: solr.StandardRequestHandler
[junit4:junit4]   2> 4246 T44 oasc.RequestHandlers.initHandlersFromConfig created /get: solr.RealTimeGetHandler
[junit4:junit4]   2> 4251 T44 oasc.RequestHandlers.initHandlersFromConfig created dismax: solr.SearchHandler
[junit4:junit4]   2> 4252 T44 oasc.RequestHandlers.initHandlersFromConfig created mock: org.apache.solr.core.MockQuerySenderListenerReqHandler
[junit4:junit4]   2> 4254 T44 oasc.RequestHandlers.initHandlersFromConfig created /admin/: org.apache.solr.handler.admin.AdminHandlers
[junit4:junit4]   2> 4256 T44 oasc.RequestHandlers.initHandlersFromConfig created defaults: solr.StandardRequestHandler
[junit4:junit4]   2> 4256 T44 oasc.RequestHandlers.initHandlersFromConfig adding lazy requestHandler: solr.StandardRequestHandler
[junit4:junit4]   2> 4257 T44 oasc.RequestHandlers.initHandlersFromConfig created lazy: solr.StandardRequestHandler
[junit4:junit4]   2> 4261 T44 oasc.RequestHandlers.initHandlersFromConfig created /update: solr.UpdateRequestHandler
[junit4:junit4]   2> 4263 T44 oasc.RequestHandlers.initHandlersFromConfig created /terms: org.apache.solr.handler.component.SearchHandler
[junit4:junit4]   2> 4264 T44 oasc.RequestHandlers.initHandlersFromConfig created spellCheckCompRH: org.apache.solr.handler.component.SearchHandler
[junit4:junit4]   2> 4265 T44 oasc.RequestHandlers.initHandlersFromConfig created spellCheckCompRH_Direct: org.apache.solr.handler.component.SearchHandler
[junit4:junit4]   2> 4266 T44 oasc.RequestHandlers.initHandlersFromConfig created spellCheckWithWordbreak: org.apache.solr.handler.component.SearchHandler
[junit4:junit4]   2> 4271 T44 oasc.RequestHandlers.initHandlersFromConfig created spellCheckWithWordbreak_Direct: org.apache.solr.handler.component.SearchHandler
[junit4:junit4]   2> 4273 T44 oasc.RequestHandlers.initHandlersFromConfig created spellCheckCompRH1: org.apache.solr.handler.component.SearchHandler
[junit4:junit4]   2> 4276 T44 oasc.RequestHandlers.initHandlersFromConfig created tvrh: org.apache.solr.handler.component.SearchHandler
[junit4:junit4]   2> 4279 T44 oasc.RequestHandlers.initHandlersFromConfig created /mlt: solr.MoreLikeThisHandler
[junit4:junit4]   2> 4281 T44 oasc.RequestHandlers.initHandlersFromConfig created /debug/dump: solr.DumpRequestHandler
[junit4:junit4]   2> 4296 T44 oashl.XMLLoader.init xsltCacheLifetimeSeconds=60
[junit4:junit4]   2> 4302 T44 oasc.SolrCore.initDeprecatedSupport WARNING solrconfig.xml uses deprecated <admin/gettableFiles>, Please update your config to use the ShowFileRequestHandler.
[junit4:junit4]   2> 4307 T44 oasc.SolrCore.initDeprecatedSupport WARNING adding ShowFileRequestHandler with hidden files: [SCHEMA.XML, OLD_SYNONYMS.TXT, STOPWORDS.TXT, PROTWORDS.TXT, OPEN-EXCHANGE-RATES.JSON, SYNONYMS.TXT, CURRENCY.XML, MAPPING-ISOLATIN1ACCENT.TXT]
[junit4:junit4]   2> 4319 T44 oass.SolrIndexSearcher.<init> Opening Searcher@13469fc2 main
[junit4:junit4]   2> 4320 T44 oass.SolrIndexSearcher.getIndexDir WARNING WARNING: Directory impl does not support setting indexDir: org.apache.lucene.store.RateLimitedDirectoryWrapper
[junit4:junit4]   2> 4349 T44 oasu.CommitTracker.<init> Hard AutoCommit: disabled
[junit4:junit4]   2> 4354 T44 oasu.CommitTracker.<init> Soft AutoCommit: disabled
[junit4:junit4]   2> 4355 T44 oashc.SpellCheckComponent.inform Initializing spell checkers
[junit4:junit4]   2> 4369 T44 oass.DirectSolrSpellChecker.init init: {name=direct,classname=DirectSolrSpellChecker,field=lowerfilt,minQueryLength=3}
[junit4:junit4]   2> 4445 T45 oasc.SolrCore.registerSearcher [collection1] Registered new searcher Searcher@13469fc2 main{StandardDirectoryReader(segments_1:1)}
[junit4:junit4]   2> 4458 T44 oasc.ZkController.publish publishing core=collection1 state=down
[junit4:junit4]   2> 4458 T44 oasc.ZkController.publish numShards not found on descriptor - reading it from system property
[junit4:junit4]   2> 4460 T23 oazs.PrepRequestProcessor.pRequest Got user-level KeeperException when processing sessionid:0x13b8c5ebd2a0003 type:create cxid:0x59 zxid:0x2a txntype:-1 reqpath:n/a Error Path:/solr/overseer/queue Error:KeeperErrorCode = NoNode for /solr/overseer/queue
[junit4:junit4]   2> 4497 T44 oasc.CoreContainer.register registering core: collection1
[junit4:junit4]   2> 4498 T44 oasc.ZkController.register Register shard - core:collection1 address:http://127.0.0.1:60661/solr shardId:control_shard
[junit4:junit4]   2> 4518 T44 oascsi.HttpClientUtil.createClient Creating new http client, config:maxConnections=10000&maxConnectionsPerHost=20&connTimeout=30000&socketTimeout=30000&retry=false
[junit4:junit4]   2> 4536 T44 oascc.SolrZkClient.makePath makePath: /collections/control_collection/leader_elect/control_shard/election
[junit4:junit4]   2> 4589 T23 oazs.PrepRequestProcessor.pRequest Got user-level KeeperException when processing sessionid:0x13b8c5ebd2a0003 type:delete cxid:0x68 zxid:0x31 txntype:-1 reqpath:n/a Error Path:/solr/collections/control_collection/leaders Error:KeeperErrorCode = NoNode for /solr/collections/control_collection/leaders
[junit4:junit4]   2> 4591 T44 oasc.ShardLeaderElectionContext.runLeaderProcess Running the leader process.
[junit4:junit4]   2> 4592 T23 oazs.PrepRequestProcessor.pRequest Got user-level KeeperException when processing sessionid:0x13b8c5ebd2a0003 type:create cxid:0x69 zxid:0x32 txntype:-1 reqpath:n/a Error Path:/solr/overseer Error:KeeperErrorCode = NodeExists for /solr/overseer
[junit4:junit4]   2> 4870 T42 oascc.ZkStateReader.updateClusterState Updating cloud state from ZooKeeper... 
[junit4:junit4]   2> 4872 T42 oasc.Overseer$ClusterStateUpdater.updateState Update state numShards=null message={
[junit4:junit4]   2> 	  "operation":"state",
[junit4:junit4]   2> 	  "numShards":null,
[junit4:junit4]   2> 	  "shard":"control_shard",
[junit4:junit4]   2> 	  "roles":null,
[junit4:junit4]   2> 	  "state":"down",
[junit4:junit4]   2> 	  "core":"collection1",
[junit4:junit4]   2> 	  "collection":"control_collection",
[junit4:junit4]   2> 	  "node_name":"127.0.0.1:60661_solr",
[junit4:junit4]   2> 	  "base_url":"http://127.0.0.1:60661/solr"}
[junit4:junit4]   2> 4883 T23 oazs.PrepRequestProcessor.pRequest Got user-level KeeperException when processing sessionid:0x13b8c5ebd2a0003 type:create cxid:0x70 zxid:0x34 txntype:-1 reqpath:n/a Error Path:/solr/overseer/queue-work Error:KeeperErrorCode = NoNode for /solr/overseer/queue-work
[junit4:junit4]   2> 4914 T41 oascc.ZkStateReader$2.process A cluster state change has occurred - updating... (1)
[junit4:junit4]   2> 5101 T44 oasc.ShardLeaderElectionContext.waitForReplicasToComeUp Enough replicas found to continue.
[junit4:junit4]   2> 5102 T44 oasc.ShardLeaderElectionContext.runLeaderProcess I may be the new leader - try and sync
[junit4:junit4]   2> 5103 T44 oasc.SyncStrategy.sync Sync replicas to http://127.0.0.1:60661/solr/collection1/
[junit4:junit4]   2> 5104 T44 oasc.SyncStrategy.syncReplicas Sync Success - now sync replicas to me
[junit4:junit4]   2> 5105 T44 oasc.SyncStrategy.syncToMe http://127.0.0.1:60661/solr/collection1/ has no replicas
[junit4:junit4]   2> 5105 T44 oasc.ShardLeaderElectionContext.runLeaderProcess I am the new leader: http://127.0.0.1:60661/solr/collection1/
[junit4:junit4]   2> 5106 T44 oascc.SolrZkClient.makePath makePath: /collections/control_collection/leaders/control_shard
[junit4:junit4]   2> 5125 T23 oazs.PrepRequestProcessor.pRequest Got user-level KeeperException when processing sessionid:0x13b8c5ebd2a0003 type:create cxid:0x8f zxid:0x3f txntype:-1 reqpath:n/a Error Path:/solr/overseer Error:KeeperErrorCode = NodeExists for /solr/overseer
[junit4:junit4]   2> 5433 T42 oascc.ZkStateReader.updateClusterState Updating cloud state from ZooKeeper... 
[junit4:junit4]   2> 5456 T41 oascc.ZkStateReader$2.process A cluster state change has occurred - updating... (1)
[junit4:junit4]   2> 5491 T44 oasc.ZkController.register We are http://127.0.0.1:60661/solr/collection1/ and leader is http://127.0.0.1:60661/solr/collection1/
[junit4:junit4]   2> 5497 T44 oasc.ZkController.register No LogReplay needed for core=collection1 baseURL=http://127.0.0.1:60661/solr
[junit4:junit4]   2> 5497 T44 oasc.ZkController.checkRecovery I am the leader, no recovery necessary
[junit4:junit4]   2> 5498 T44 oasc.ZkController.publish publishing core=collection1 state=active
[junit4:junit4]   2> 5499 T44 oasc.ZkController.publish numShards not found on descriptor - reading it from system property
[junit4:junit4]   2> 5507 T44 oascc.ZkStateReader.updateClusterState Updating cloud state from ZooKeeper... 
[junit4:junit4]   2> 5510 T18 oass.SolrDispatchFilter.init user.dir=C:\Users\JenkinsSlave\workspace\Lucene-Solr-4.x-Windows\solr\build\solr-core\test\J0
[junit4:junit4]   2> 5510 T18 oass.SolrDispatchFilter.init SolrDispatchFilter.init() done
[junit4:junit4]   2> 5556 T18 oascsi.HttpClientUtil.createClient Creating new http client, config:maxConnections=128&maxConnectionsPerHost=32&followRedirects=false
[junit4:junit4]   2> 5879 T18 oejs.Server.doStart jetty-8.1.8.v20121106
[junit4:junit4]   2> 5884 T18 oejs.AbstractConnector.doStart Started SelectChannelConnector@0.0.0.0:60670
[junit4:junit4]   2> 5885 T18 oasc.SolrResourceLoader.locateSolrHome JNDI not configured for solr (NoInitialContextEx)
[junit4:junit4]   2> 5886 T18 oasc.SolrResourceLoader.locateSolrHome using system property solr.solr.home: C:\Users\JenkinsSlave\workspace\Lucene-Solr-4.x-Windows\solr\build\solr-core\test\J0\.\solrtest-jetty1-1355269722463
[junit4:junit4]   2> 5886 T18 oasc.SolrResourceLoader.<init> new SolrResourceLoader for deduced Solr Home: 'C:\Users\JenkinsSlave\workspace\Lucene-Solr-4.x-Windows\solr\build\solr-core\test\J0\.\solrtest-jetty1-1355269722463\'
[junit4:junit4]   2> 5935 T18 oass.SolrDispatchFilter.init SolrDispatchFilter.init()
[junit4:junit4]   2> 5936 T18 oasc.SolrResourceLoader.locateSolrHome JNDI not configured for solr (NoInitialContextEx)
[junit4:junit4]   2> 5936 T18 oasc.SolrResourceLoader.locateSolrHome using system property solr.solr.home: C:\Users\JenkinsSlave\workspace\Lucene-Solr-4.x-Windows\solr\build\solr-core\test\J0\.\solrtest-jetty1-1355269722463
[junit4:junit4]   2> 5936 T18 oasc.CoreContainer$Initializer.initialize looking for solr.xml: C:\Users\JenkinsSlave\workspace\Lucene-Solr-4.x-Windows\solr\build\solr-core\test\J0\.\solrtest-jetty1-1355269722463\solr.xml
[junit4:junit4]   2> 5937 T18 oasc.CoreContainer.<init> New CoreContainer 1692141329
[junit4:junit4]   2> 5939 T18 oasc.CoreContainer.load Loading CoreContainer using Solr Home: 'C:\Users\JenkinsSlave\workspace\Lucene-Solr-4.x-Windows\solr\build\solr-core\test\J0\.\solrtest-jetty1-1355269722463\'
[junit4:junit4]   2> 5939 T18 oasc.SolrResourceLoader.<init> new SolrResourceLoader for directory: 'C:\Users\JenkinsSlave\workspace\Lucene-Solr-4.x-Windows\solr\build\solr-core\test\J0\.\solrtest-jetty1-1355269722463\'
[junit4:junit4]   2> 5975 T42 oascc.ZkStateReader.updateClusterState Updating cloud state from ZooKeeper... 
[junit4:junit4]   2> 5977 T42 oasc.Overseer$ClusterStateUpdater.updateState Update state numShards=null message={
[junit4:junit4]   2> 	  "operation":"state",
[junit4:junit4]   2> 	  "numShards":null,
[junit4:junit4]   2> 	  "shard":"control_shard",
[junit4:junit4]   2> 	  "roles":null,
[junit4:junit4]   2> 	  "state":"active",
[junit4:junit4]   2> 	  "core":"collection1",
[junit4:junit4]   2> 	  "collection":"control_collection",
[junit4:junit4]   2> 	  "node_name":"127.0.0.1:60661_solr",
[junit4:junit4]   2> 	  "base_url":"http://127.0.0.1:60661/solr"}
[junit4:junit4]   2> 5979 T18 oasc.CoreContainer.load Registering Log Listener
[junit4:junit4]   2> 6001 T41 oascc.ZkStateReader$2.process A cluster state change has occurred - updating... (1)
[junit4:junit4]   2> 6009 T18 oasc.CoreContainer.initZooKeeper Zookeeper client=127.0.0.1:60654/solr
[junit4:junit4]   2> 6010 T18 oasc.ZkController.checkChrootPath zkHost includes chroot
[junit4:junit4]   2> 6010 T18 oaz.ZooKeeper.<init> Initiating client connection, connectString=127.0.0.1:60654 sessionTimeout=60000 watcher=org.apache.solr.common.cloud.ConnectionManager@69f4f294
[junit4:junit4]   2> 6013 T18 oascc.ConnectionManager.waitForConnected Waiting for client to connect to ZooKeeper
[junit4:junit4]   2> 6013 T55 oaz.ClientCnxn$SendThread.logStartConnect Opening socket connection to server 127.0.0.1/127.0.0.1:60654. Will not attempt to authenticate using SASL (access denied ("javax.security.auth.AuthPermission" "getLoginConfiguration"))
[junit4:junit4]   2> 6014 T55 oaz.ClientCnxn$SendThread.primeConnection Socket connection established to 127.0.0.1/127.0.0.1:60654, initiating session
[junit4:junit4]   2> 6014 T20 oazs.NIOServerCnxnFactory.run Accepted socket connection from /127.0.0.1:60675
[junit4:junit4]   2> 6014 T20 oazs.ZooKeeperServer.processConnectRequest Client attempting to establish new session at /127.0.0.1:60675
[junit4:junit4]   2> 6017 T22 oazs.ZooKeeperServer.finishSessionInit Established session 0x13b8c5ebd2a0004 with negotiated timeout 20000 for client /127.0.0.1:60675
[junit4:junit4]   2> 6017 T55 oaz.ClientCnxn$SendThread.onConnected Session establishment complete on server 127.0.0.1/127.0.0.1:60654, sessionid = 0x13b8c5ebd2a0004, negotiated timeout = 20000
[junit4:junit4]   2> 6018 T56 oascc.ConnectionManager.process Watcher org.apache.solr.common.cloud.ConnectionManager@69f4f294 name:ZooKeeperConnection Watcher:127.0.0.1:60654 got event WatchedEvent state:SyncConnected type:None path:null path:null type:None
[junit4:junit4]   2> 6019 T18 oascc.ConnectionManager.waitForConnected Client is connected to ZooKeeper
[junit4:junit4]   2> 6021 T23 oazs.PrepRequestProcessor.pRequest2Txn Processed session termination for sessionid: 0x13b8c5ebd2a0004
[junit4:junit4]   2> 6023 T20 oazs.NIOServerCnxn.doIO WARNING caught end of stream exception EndOfStreamException: Unable to read additional data from client sessionid 0x13b8c5ebd2a0004, likely client has closed socket
[junit4:junit4]   2> 	at org.apache.zookeeper.server.NIOServerCnxn.doIO(NIOServerCnxn.java:220)
[junit4:junit4]   2> 	at org.apache.zookeeper.server.NIOServerCnxnFactory.run(NIOServerCnxnFactory.java:208)
[junit4:junit4]   2> 	at java.lang.Thread.run(Thread.java:722)
[junit4:junit4]   2> 
[junit4:junit4]   2> 6024 T56 oaz.ClientCnxn$EventThread.run EventThread shut down
[junit4:junit4]   2> 6023 T18 oaz.ZooKeeper.close Session: 0x13b8c5ebd2a0004 closed
[junit4:junit4]   2> 6026 T20 oazs.NIOServerCnxn.closeSock Closed socket connection for client /127.0.0.1:60675 which had sessionid 0x13b8c5ebd2a0004
[junit4:junit4]   2> 6028 T18 oaz.ZooKeeper.<init> Initiating client connection, connectString=127.0.0.1:60654/solr sessionTimeout=8000 watcher=org.apache.solr.common.cloud.ConnectionManager@55c7fee
[junit4:junit4]   2> 6031 T18 oascc.ConnectionManager.waitForConnected Waiting for client to connect to ZooKeeper
[junit4:junit4]   2> 6033 T57 oaz.ClientCnxn$SendThread.logStartConnect Opening socket connection to server 127.0.0.1/127.0.0.1:60654. Will not attempt to authenticate using SASL (access denied ("javax.security.auth.AuthPermission" "getLoginConfiguration"))
[junit4:junit4]   2> 6035 T57 oaz.ClientCnxn$SendThread.primeConnection Socket connection established to 127.0.0.1/127.0.0.1:60654, initiating session
[junit4:junit4]   2> 6035 T20 oazs.NIOServerCnxnFactory.run Accepted socket connection from /127.0.0.1:60678
[junit4:junit4]   2> 6036 T20 oazs.ZooKeeperServer.processConnectRequest Client attempting to establish new session at /127.0.0.1:60678
[junit4:junit4]   2> 6039 T22 oazs.ZooKeeperServer.finishSessionInit Established session 0x13b8c5ebd2a0005 with negotiated timeout 8000 for client /127.0.0.1:60678
[junit4:junit4]   2> 6039 T57 oaz.ClientCnxn$SendThread.onConnected Session establishment complete on server 127.0.0.1/127.0.0.1:60654, sessionid = 0x13b8c5ebd2a0005, negotiated timeout = 8000
[junit4:junit4]   2> 6041 T58 oascc.ConnectionManager.process Watcher org.apache.solr.common.cloud.ConnectionManager@55c7fee name:ZooKeeperConnection Watcher:127.0.0.1:60654/solr got event WatchedEvent state:SyncConnected type:None path:null path:null type:None
[junit4:junit4]   2> 6041 T18 oascc.ConnectionManager.waitForConnected Client is connected to ZooKeeper
[junit4:junit4]   2> 6043 T23 oazs.PrepRequestProcessor.pRequest Got user-level KeeperException when processing sessionid:0x13b8c5ebd2a0005 type:create cxid:0x1 zxid:0x4d txntype:-1 reqpath:n/a Error Path:/solr/overseer Error:KeeperErrorCode = NodeExists for /solr/overseer
[junit4:junit4]   2> 6046 T23 oazs.PrepRequestProcessor.pRequest Got user-level KeeperException when processing sessionid:0x13b8c5ebd2a0005 type:create cxid:0x2 zxid:0x4e txntype:-1 reqpath:n/a Error Path:/solr/overseer Error:KeeperErrorCode = NodeExists for /solr/overseer
[junit4:junit4]   2> 6049 T18 oasc.ZkController.createEphemeralLiveNode Register node as live in ZooKeeper:/live_nodes/127.0.0.1:60670_solr
[junit4:junit4]   2> 6050 T23 oazs.PrepRequestProcessor.pRequest Got user-level KeeperException when processing sessionid:0x13b8c5ebd2a0005 type:delete cxid:0x4 zxid:0x4f txntype:-1 reqpath:n/a Error Path:/solr/live_nodes/127.0.0.1:60670_solr Error:KeeperErrorCode = NoNode for /solr/live_nodes/127.0.0.1:60670_solr
[junit4:junit4]   2> 6052 T18 oascc.SolrZkClient.makePath makePath: /live_nodes/127.0.0.1:60670_solr
[junit4:junit4]   2> 6060 T41 oascc.ZkStateReader$3.process Updating live nodes... (2)
[junit4:junit4]   2> 6061 T41 oascc.ZkStateReader$2.process A cluster state change has occurred - updating... (2)
[junit4:junit4]   2> 6061 T18 oashc.HttpShardHandlerFactory.getParameter Setting socketTimeout to: 0
[junit4:junit4]   2> 6062 T18 oashc.HttpShardHandlerFactory.getParameter Setting urlScheme to: http://
[junit4:junit4]   2> 6063 T18 oashc.HttpShardHandlerFactory.getParameter Setting connTimeout to: 0
[junit4:junit4]   2> 6063 T18 oashc.HttpShardHandlerFactory.getParameter Setting maxConnectionsPerHost to: 20
[junit4:junit4]   2> 6064 T18 oashc.HttpShardHandlerFactory.getParameter Setting corePoolSize to: 0
[junit4:junit4]   2> 6064 T18 oashc.HttpShardHandlerFactory.getParameter Setting maximumPoolSize to: 2147483647
[junit4:junit4]   2> 6064 T18 oashc.HttpShardHandlerFactory.getParameter Setting maxThreadIdleTime to: 5
[junit4:junit4]   2> 6065 T18 oashc.HttpShardHandlerFactory.getParameter Setting sizeOfQueue to: -1
[junit4:junit4]   2> 6065 T18 oashc.HttpShardHandlerFactory.getParameter Setting fairnessPolicy to: false
[junit4:junit4]   2> 6066 T18 oascsi.HttpClientUtil.createClient Creating new http client, config:maxConnectionsPerHost=20&maxConnections=10000&socketTimeout=0&connTimeout=0&retry=false
[junit4:junit4]   2> 6094 T18 oascc.ZkStateReader.createClusterStateWatchersAndUpdate Updating cluster state from ZooKeeper... 
[junit4:junit4]   2> 6112 T59 oasc.CoreContainer.create Creating SolrCore 'collection1' using instanceDir: C:\Users\JenkinsSlave\workspace\Lucene-Solr-4.x-Windows\solr\build\solr-core\test\J0\.\solrtest-jetty1-1355269722463\collection1
[junit4:junit4]   2> 6112 T59 oasc.ZkController.createCollectionZkNode Check for collection zkNode:collection1
[junit4:junit4]   2> 6113 T59 oasc.ZkController.createCollectionZkNode Collection zkNode exists
[junit4:junit4]   2> 6113 T59 oasc.ZkController.readConfigName Load collection config from:/collections/collection1
[junit4:junit4]   2> 6116 T59 oasc.SolrResourceLoader.<init> new SolrResourceLoader for directory: 'C:\Users\JenkinsSlave\workspace\Lucene-Solr-4.x-Windows\solr\build\solr-core\test\J0\.\solrtest-jetty1-1355269722463\collection1\'
[junit4:junit4]   2> 6117 T59 oasc.SolrResourceLoader.replaceClassLoader Adding 'file:/C:/Users/JenkinsSlave/workspace/Lucene-Solr-4.x-Windows/solr/build/solr-core/test/J0/solrtest-jetty1-1355269722463/collection1/lib/classes/' to classloader
[junit4:junit4]   2> 6118 T59 oasc.SolrResourceLoader.replaceClassLoader Adding 'file:/C:/Users/JenkinsSlave/workspace/Lucene-Solr-4.x-Windows/solr/build/solr-core/test/J0/solrtest-jetty1-1355269722463/collection1/lib/README' to classloader
[junit4:junit4]   2> 6320 T59 oasc.SolrConfig.<init> Using Lucene MatchVersion: LUCENE_41
[junit4:junit4]   2> 6405 T59 oasc.SolrConfig.<init> Loaded SolrConfig: solrconfig.xml
[junit4:junit4]   2> 6407 T59 oass.IndexSchema.readSchema Reading Solr Schema
[junit4:junit4]   2> 6446 T59 oass.IndexSchema.readSchema Schema name=test
[junit4:junit4]   2> 7214 T59 oass.OpenExchangeRatesOrgProvider.init Initialized with rates=open-exchange-rates.json, refreshInterval=1440.
[junit4:junit4]   2> 7228 T59 oass.IndexSchema.readSchema default search field in schema is text
[junit4:junit4]   2> 7232 T59 oass.IndexSchema.readSchema unique key field: id
[junit4:junit4]   2> 7276 T59 oass.FileExchangeRateProvider.reload Reloading exchange rates from file currency.xml
[junit4:junit4]   2> 7282 T59 oass.FileExchangeRateProvider.reload Reloading exchange rates from file currency.xml
[junit4:junit4]   2> 7290 T59 oass.OpenExchangeRatesOrgProvider.reload Reloading exchange rates from open-exchange-rates.json
[junit4:junit4]   2> 7294 T59 oass.OpenExchangeRatesOrgProvider.reload Reloading exchange rates from open-exchange-rates.json
[junit4:junit4]   2> 7297 T59 oasc.SolrCore.<init> [collection1] Opening new SolrCore at C:\Users\JenkinsSlave\workspace\Lucene-Solr-4.x-Windows\solr\build\solr-core\test\J0\.\solrtest-jetty1-1355269722463\collection1\, dataDir=.\org.apache.solr.cloud.SyncSliceTest-1355269716905/jetty1\
[junit4:junit4]   2> 7298 T59 oasc.JmxMonitoredMap.<init> JMX monitoring is enabled. Adding Solr mbeans to JMX Server: com.sun.jmx.mbeanserver.JmxMBeanServer@2af6b7f
[junit4:junit4]   2> 7300 T59 oasc.SolrCore.getNewIndexDir New index directory detected: old=null new=.\org.apache.solr.cloud.SyncSliceTest-1355269716905/jetty1\index/
[junit4:junit4]   2> 7302 T59 oasc.SolrCore.initIndex WARNING [collection1] Solr index directory '.\org.apache.solr.cloud.SyncSliceTest-1355269716905\jetty1\index' doesn't exist. Creating new index...
[junit4:junit4]   2> 7304 T59 oasc.CachingDirectoryFactory.get return new directory for C:\Users\JenkinsSlave\workspace\Lucene-Solr-4.x-Windows\solr\build\solr-core\test\J0\.\org.apache.solr.cloud.SyncSliceTest-1355269716905\jetty1\index forceNew:false
[junit4:junit4]   2> 7324 T59 oasc.SolrDeletionPolicy.onCommit SolrDeletionPolicy.onCommit: commits:num=1
[junit4:junit4]   2> 		commit{dir=RateLimitedDirectoryWrapper(NRTCachingDirectory(org.apache.lucene.store.MMapDirectory@C:\Users\JenkinsSlave\workspace\Lucene-Solr-4.x-Windows\solr\build\solr-core\test\J0\org.apache.solr.cloud.SyncSliceTest-1355269716905\jetty1\index lockFactory=org.apache.lucene.store.NativeFSLockFactory@5e0054a2; maxCacheMB=48.0 maxMergeSizeMB=4.0)),segFN=segments_1,generation=1,filenames=[segments_1]
[junit4:junit4]   2> 7324 T59 oasc.SolrDeletionPolicy.updateCommits newest commit = 1
[junit4:junit4]   2> 7326 T59 oasc.SolrCore.initWriters created xml: solr.XMLResponseWriter
[junit4:junit4]   2> 7328 T59 oasup.UpdateRequestProcessorChain.init inserting DistributedUpdateProcessorFactory into updateRequestProcessorChain "dedupe"
[junit4:junit4]   2> 7328 T59 oasup.UpdateRequestProcessorChain.init inserting DistributedUpdateProcessorFactory into updateRequestProcessorChain "dedupe-allfields"
[junit4:junit4]   2> 7329 T59 oasup.UpdateRequestProcessorChain.init inserting DistributedUpdateProcessorFactory into updateRequestProcessorChain "stored_sig"
[junit4:junit4]   2> 7331 T59 oasup.UpdateRequestProcessorChain.init inserting DistributedUpdateProcessorFactory into updateRequestProcessorChain "uniq-fields"
[junit4:junit4]   2> 7332 T59 oasup.UpdateRequestProcessorChain.init inserting DistributedUpdateProcessorFactory into updateRequestProcessorChain "distrib-dup-test-chain-implicit"
[junit4:junit4]   2> 7332 T59 oasc.RequestHandlers.initHandlersFromConfig adding lazy requestHandler: solr.ReplicationHandler
[junit4:junit4]   2> 7333 T59 oasc.RequestHandlers.initHandlersFromConfig created /replication: solr.ReplicationHandler
[junit4:junit4]   2> 7334 T59 oasc.RequestHandlers.initHandlersFromConfig created standard: solr.StandardRequestHandler
[junit4:junit4]   2> 7335 T59 oasc.RequestHandlers.initHandlersFromConfig created /get: solr.RealTimeGetHandler
[junit4:junit4]   2> 7337 T59 oasc.RequestHandlers.initHandlersFromConfig created dismax: solr.SearchHandler
[junit4:junit4]   2> 7339 T59 oasc.RequestHandlers.initHandlersFromConfig created mock: org.apache.solr.core.MockQuerySenderListenerReqHandler
[junit4:junit4]   2> 7340 T59 oasc.RequestHandlers.initHandlersFromConfig created /admin/: org.apache.solr.handler.admin.AdminHandlers
[junit4:junit4]   2> 7341 T59 oasc.RequestHandlers.initHandlersFromConfig created defaults: solr.StandardRequestHandler
[junit4:junit4]   2> 7341 T59 oasc.RequestHandlers.initHandlersFromConfig adding lazy requestHandler: solr.StandardRequestHandler
[junit4:junit4]   2> 7342 T59 oasc.RequestHandlers.initHandlersFromConfig created lazy: solr.StandardRequestHandler
[junit4:junit4]   2> 7343 T59 oasc.RequestHandlers.initHandlersFromConfig created /update: solr.UpdateRequestHandler
[junit4:junit4]   2> 7346 T59 oasc.RequestHandlers.initHandlersFromConfig created /terms: org.apache.solr.handler.component.SearchHandler
[junit4:junit4]   2> 7347 T59 oasc.RequestHandlers.initHandlersFromConfig created spellCheckCompRH: org.apache.solr.handler.component.SearchHandler
[junit4:junit4]   2> 7349 T59 oasc.RequestHandlers.initHandlersFromConfig created spellCheckCompRH_Direct: org.apache.solr.handler.component.SearchHandler
[junit4:junit4]   2> 7351 T59 oasc.RequestHandlers.initHandlersFromConfig created spellCheckWithWordbreak: org.apache.solr.handler.component.SearchHandler
[junit4:junit4]   2> 7352 T59 oasc.RequestHandlers.initHandlersFromConfig created spellCheckWithWordbreak_Direct: org.apache.solr.handler.component.SearchHandler
[junit4:junit4]   2> 7354 T59 oasc.RequestHandlers.initHandlersFromConfig created spellCheckCompRH1: org.apache.solr.handler.component.SearchHandler
[junit4:junit4]   2> 7356 T59 oasc.RequestHandlers.initHandlersFromConfig created tvrh: org.apache.solr.handler.component.SearchHandler
[junit4:junit4]   2> 7357 T59 oasc.RequestHandlers.initHandlersFromConfig created /mlt: solr.MoreLikeThisHandler
[junit4:junit4]   2> 7359 T59 oasc.RequestHandlers.initHandlersFromConfig created /debug/dump: solr.DumpRequestHandler
[junit4:junit4]   2> 7368 T59 oashl.XMLLoader.init xsltCacheLifetimeSeconds=60
[junit4:junit4]   2> 7373 T59 oasc.SolrCore.initDeprecatedSupport WARNING solrconfig.xml uses deprecated <admin/gettableFiles>, Please update your config to use the ShowFileRequestHandler.
[junit4:junit4]   2> 7376 T59 oasc.SolrCore.initDeprecatedSupport WARNING adding ShowFileRequestHandler with hidden files: [SCHEMA.XML, OLD_SYNONYMS.TXT, STOPWORDS.TXT, PROTWORDS.TXT, OPEN-EXCHANGE-RATES.JSON, SYNONYMS.TXT, CURRENCY.XML, MAPPING-ISOLATIN1ACCENT.TXT]
[junit4:junit4]   2> 7382 T59 oass.SolrIndexSearcher.<init> Opening Searcher@53535917 main
[junit4:junit4]   2> 7383 T59 oass.SolrIndexSearcher.getIndexDir WARNING WARNING: Directory impl does not support setting indexDir: org.apache.lucene.store.RateLimitedDirectoryWrapper
[junit4:junit4]   2> 7385 T59 oasu.CommitTracker.<init> Hard AutoCommit: disabled
[junit4:junit4]   2> 7385 T59 oasu.CommitTracker.<init> Soft AutoCommit: disabled
[junit4:junit4]   2> 7386 T59 oashc.SpellCheckComponent.inform Initializing spell checkers
[junit4:junit4]   2> 7398 T59 oass.DirectSolrSpellChecker.init init: {name=direct,classname=DirectSolrSpellChecker,field=lowerfilt,minQueryLength=3}
[junit4:junit4]   2> 7490 T59 oasc.ZkController.publish publishing core=collection1 state=down
[junit4:junit4]   2> 7491 T59 oasc.ZkController.publish numShards not found on descriptor - reading it from system property
[junit4:junit4]   2> 7496 T60 oasc.SolrCore.registerSearcher [collection1] Registered new searcher Searcher@53535917 main{StandardDirectoryReader(segments_1:1)}
[junit4:junit4]   2> 7600 T42 oascc.ZkStateReader.updateClusterState Updating cloud state from ZooKeeper... 
[junit4:junit4]   2> 7602 T42 oasc.Overseer$ClusterStateUpdater.updateState Update state numShards=1 message={
[junit4:junit4]   2> 	  "operation":"state",
[junit4:junit4]   2> 	  "numShards":"1",
[junit4:junit4]   2> 	  "shard":null,
[junit4:junit4]   2> 	  "roles":null,
[junit4:junit4]   2> 	  "state":"down",
[junit4:junit4]   2> 	  "core":"collection1",
[junit4:junit4]   2> 	  "collection":"collection1",
[junit4:junit4]   2> 	  "node_name":"127.0.0.1:60670_solr",
[junit4:junit4]   2> 	  "base_url":"http://127.0.0.1:60670/solr"}
[junit4:junit4]   2> 7602 T42 oasc.Overseer$ClusterStateUpdater.createCollection Create collection collection1 with numShards 1
[junit4:junit4]   2> 7615 T42 oasc.Overseer$ClusterStateUpdater.updateState Assigning new node to shard shard=shard1
[junit4:junit4]   2> 7635 T41 oascc.ZkStateReader$2.process A cluster state change has occurred - updating... (2)
[junit4:junit4]   2> 7636 T58 oascc.ZkStateReader$2.process A cluster state change has occurred - updating... (2)
[junit4:junit4]   2> 7996 T59 oasc.CoreContainer.register registering core: collection1
[junit4:junit4]   2> 7996 T59 oasc.ZkController.register Register shard - core:collection1 address:http://127.0.0.1:60670/solr shardId:shard1
[junit4:junit4]   2> 7999 T59 oascc.SolrZkClient.makePath makePath: /collections/collection1/leader_elect/shard1/election
[junit4:junit4]   2> 8019 T23 oazs.PrepRequestProcessor.pRequest Got user-level KeeperException when processing sessionid:0x13b8c5ebd2a0005 type:delete cxid:0x43 zxid:0x5b txntype:-1 reqpath:n/a Error Path:/solr/collections/collection1/leaders Error:KeeperErrorCode = NoNode for /solr/collections/collection1/leaders
[junit4:junit4]   2> 8021 T59 oasc.ShardLeaderElectionContext.runLeaderProcess Running the leader process.
[junit4:junit4]   2> 8023 T23 oazs.PrepRequestProcessor.pRequest Got user-level KeeperException when processing sessionid:0x13b8c5ebd2a0005 type:create cxid:0x44 zxid:0x5c txntype:-1 reqpath:n/a Error Path:/solr/overseer Error:KeeperErrorCode = NodeExists for /solr/overseer
[junit4:junit4]   2> 8027 T59 oasc.ShardLeaderElectionContext.waitForReplicasToComeUp Enough replicas found to continue.
[junit4:junit4]   2> 8028 T59 oasc.ShardLeaderElectionContext.runLeaderProcess I may be the new leader - try and sync
[junit4:junit4]   2> 8028 T59 oasc.SyncStrategy.sync Sync replicas to http://127.0.0.1:60670/solr/collection1/
[junit4:junit4]   2> 8028 T59 oasc.SyncStrategy.syncReplicas Sync Success - now sync replicas to me
[junit4:junit4]   2> 8028 T59 oasc.SyncStrategy.syncToMe http://127.0.0.1:60670/solr/collection1/ has no replicas
[junit4:junit4]   2> 8028 T59 oasc.ShardLeaderElectionContext.runLeaderProcess I am the new leader: http://127.0.0.1:60670/solr/collection1/
[junit4:junit4]   2> 8029 T59 oascc.SolrZkClient.makePath makePath: /collections/collection1/leaders/shard1
[junit4:junit4]   2> 8037 T23 oazs.PrepRequestProcessor.pRequest Got user-level KeeperException when processing sessionid:0x13b8c5ebd2a0005 type:create cxid:0x4e zxid:0x60 txntype:-1 reqpath:n/a Error Path:/solr/overseer Error:KeeperErrorCode = NodeExists for /solr/overseer
[junit4:junit4]   2> 8151 T42 oascc.ZkStateReader.updateClusterState Updating cloud state from ZooKeeper... 
[junit4:junit4]   2> 8197 T41 oascc.ZkStateReader$2.process A cluster state change has occurred - updating... (2)
[junit4:junit4]   2> 8197 T58 oascc.ZkStateReader$2.process A cluster state change has occurred - updating... (2)
[junit4:junit4]   2> 8246 T59 oasc.ZkController.register We are http://127.0.0.1:60670/solr/collection1/ and leader is http://127.0.0.1:60670/solr/collection1/
[junit4:junit4]   2> 8246 T59 oasc.ZkController.register No LogReplay needed for core=collection1 baseURL=http://127.0.0.1:60670/solr
[junit4:junit4]   2> 8246 T59 oasc.ZkController.checkRecovery I am the leader, no recovery necessary
[junit4:junit4]   2> 8246 T59 oasc.ZkController.publish publishing core=collection1 state=active
[junit4:junit4]   2> 8247 T59 oasc.ZkController.publish numShards not found on descriptor - reading it from system property
[junit4:junit4]   2> 8250 T59 oascc.ZkStateReader.updateClusterState Updating cloud state from ZooKeeper... 
[junit4:junit4]   2> 8252 T18 oass.SolrDispatchFilter.init user.dir=C:\Users\JenkinsSlave\workspace\Lucene-Solr-4.x-Windows\solr\build\solr-core\test\J0
[junit4:junit4]   2> 8252 T18 oass.SolrDispatchFilter.init SolrDispatchFilter.init() done
[junit4:junit4]   2> 8253 T18 oascsi.HttpClientUtil.createClient Creating new http client, config:maxConnections=128&maxConnectionsPerHost=32&followRedirects=false
[junit4:junit4]   2> 8545 T18 oejs.Server.doStart jetty-8.1.8.v20121106
[junit4:junit4]   2> 8549 T18 oejs.AbstractConnector.doStart Started SelectChannelConnector@0.0.0.0:60679
[junit4:junit4]   2> 8550 T18 oasc.SolrResourceLoader.locateSolrHome JNDI not configured for solr (NoInitialContextEx)
[junit4:junit4]   2> 8551 T18 oasc.SolrResourceLoader.locateSolrHome using system property solr.solr.home: C:\Users\JenkinsSlave\workspace\Lucene-Solr-4.x-Windows\solr\build\solr-core\test\J0\.\solrtest-jetty2-1355269725155
[junit4:junit4]   2> 8551 T18 oasc.SolrResourceLoader.<init> new SolrResourceLoader for deduced Solr Home: 'C:\Users\JenkinsSlave\workspace\Lucene-Solr-4.x-Windows\solr\build\solr-core\test\J0\.\solrtest-jetty2-1355269725155\'
[junit4:junit4]   2> 8591 T18 oass.SolrDispatchFilter.init SolrDispatchFilter.init()
[junit4:junit4]   2> 8592 T18 oasc.SolrResourceLoader.locateSolrHome JNDI not configured for solr (NoInitialContextEx)
[junit4:junit4]   2> 8593 T18 oasc.SolrResourceLoader.locateSolrHome using system property solr.solr.home: C:\Users\JenkinsSlave\workspace\Lucene-Solr-4.x-Windows\solr\build\solr-core\test\J0\.\solrtest-jetty2-1355269725155
[junit4:junit4]   2> 8593 T18 oasc.CoreContainer$Initializer.initialize looking for solr.xml: C:\Users\JenkinsSlave\workspace\Lucene-Solr-4.x-Windows\solr\build\solr-core\test\J0\.\solrtest-jetty2-1355269725155\solr.xml
[junit4:junit4]   2> 8594 T18 oasc.CoreContainer.<init> New CoreContainer 477971446
[junit4:junit4]   2> 8595 T18 oasc.CoreContainer.load Loading CoreContainer using Solr Home: 'C:\Users\JenkinsSlave\workspace\Lucene-Solr-4.x-Windows\solr\build\solr-core\test\J0\.\solrtest-jetty2-1355269725155\'
[junit4:junit4]   2> 8595 T18 oasc.SolrResourceLoader.<init> new SolrResourceLoader for directory: 'C:\Users\JenkinsSlave\workspace\Lucene-Solr-4.x-Windows\solr\build\solr-core\test\J0\.\solrtest-jetty2-1355269725155\'
[junit4:junit4]   2> 8626 T18 oasc.CoreContainer.load Registering Log Listener
[junit4:junit4]   2> 8649 T18 oasc.CoreContainer.initZooKeeper Zookeeper client=127.0.0.1:60654/solr
[junit4:junit4]   2> 8649 T18 oasc.ZkController.checkChrootPath zkHost includes chroot
[junit4:junit4]   2> 8650 T18 oaz.ZooKeeper.<init> Initiating client connection, connectString=127.0.0.1:60654 sessionTimeout=60000 watcher=org.apache.solr.common.cloud.ConnectionManager@2d6cf1b9
[junit4:junit4]   2> 8652 T18 oascc.ConnectionManager.waitForConnected Waiting for client to connect to ZooKeeper
[junit4:junit4]   2> 8653 T70 oaz.ClientCnxn$SendThread.logStartConnect Opening socket connection to server 127.0.0.1/127.0.0.1:60654. Will not attempt to authenticate using SASL (access denied ("javax.security.auth.AuthPermission" "getLoginConfiguration"))
[junit4:junit4]   2> 8654 T70 oaz.ClientCnxn$SendThread.primeConnection Socket connection established to 127.0.0.1/127.0.0.1:60654, initiating session
[junit4:junit4]   2> 8654 T20 oazs.NIOServerCnxnFactory.run Accepted socket connection from /127.0.0.1:60684
[junit4:junit4]   2> 8655 T20 oazs.ZooKeeperServer.processConnectRequest Client attempting to establish new session at /127.0.0.1:60684
[junit4:junit4]   2> 8666 T22 oazs.ZooKeeperServer.finishSessionInit Established session 0x13b8c5ebd2a0006 with negotiated timeout 20000 for client /127.0.0.1:60684
[junit4:junit4]   2> 8666 T70 oaz.ClientCnxn$SendThread.onConnected Session establishment complete on server 127.0.0.1/127.0.0.1:60654, sessionid = 0x13b8c5ebd2a0006, negotiated timeout = 20000
[junit4:junit4]   2> 8666 T71 oascc.ConnectionManager.process Watcher org.apache.solr.common.cloud.ConnectionManager@2d6cf1b9 name:ZooKeeperConnection Watcher:127.0.0.1:60654 got event WatchedEvent state:SyncConnected type:None path:null path:null type:None
[junit4:junit4]   2> 8667 T18 oascc.ConnectionManager.waitForConnected Client is connected to ZooKeeper
[junit4:junit4]   2> 8670 T23 oazs.PrepRequestProcessor.pRequest2Txn Processed session termination for sessionid: 0x13b8c5ebd2a0006
[junit4:junit4]   2> 8672 T20 oazs.NIOServerCnxn.closeSock Closed socket connection for client /127.0.0.1:60684 which had sessionid 0x13b8c5ebd2a0006
[junit4:junit4]   2> 8673 T18 oaz.ZooKeeper.close Session: 0x13b8c5ebd2a0006 closed
[junit4:junit4]   2> 8673 T18 oaz.ZooKeeper.<init> Initiating client connection, connectString=127.0.0.1:60654/solr sessionTimeout=8000 watcher=org.apache.solr.common.cloud.ConnectionManager@68871741
[junit4:junit4]   2> 8675 T71 oaz.ClientCnxn$EventThread.run EventThread shut down
[junit4:junit4]   2> 8675 T18 oascc.ConnectionManager.waitForConnected Waiting for client to connect to ZooKeeper
[junit4:junit4]   2> 8676 T72 oaz.ClientCnxn$SendThread.logStartConnect Opening socket connection to server 127.0.0.1/127.0.0.1:60654. Will not attempt to authenticate using SASL (access denied ("javax.security.auth.AuthPermission" "getLoginConfiguration"))
[junit4:junit4]   2> 8678 T72 oaz.ClientCnxn$SendThread.primeConnection Socket connection established to 127.0.0.1/127.0.0.1:60654, initiating session
[junit4:junit4]   2> 8678 T20 oazs.NIOServerCnxnFactory.run Accepted socket connection from /127.0.0.1:60687
[junit4:junit4]   2> 8679 T20 oazs.ZooKeeperServer.processConnectRequest Client attempting to establish new session at /127.0.0.1:60687
[junit4:junit4]   2> 8683 T22 oazs.ZooKeeperServer.finishSessionInit Established session 0x13b8c5ebd2a0007 with negotiated timeout 8000 for client /127.0.0.1:60687
[junit4:junit4]   2> 8683 T72 oaz.ClientCnxn$SendThread.onConnected Session establishment complete on server 127.0.0.1/127.0.0.1:60654, sessionid = 0x13b8c5ebd2a0007, negotiated timeout = 8000
[junit4:junit4]   2> 8684 T73 oascc.ConnectionManager.process Watcher org.apache.solr.common.cloud.ConnectionManager@68871741 name:ZooKeeperConnection Watcher:127.0.0.1:60654/solr got event WatchedEvent state:SyncConnected type:None path:null path:null type:None
[junit4:junit4]   2> 8685 T18 oascc.ConnectionManager.waitForConnected Client is connected to ZooKeeper
[junit4:junit4]   2> 8686 T23 oazs.PrepRequestProcessor.pRequest Got user-level KeeperException when processing sessionid:0x13b8c5ebd2a0007 type:create cxid:0x1 zxid:0x6d txntype:-1 reqpath:n/a Error Path:/solr/overseer Error:KeeperErrorCode = NodeExists for /solr/overseer
[junit4:junit4]   2> 8688 T23 oazs.PrepRequestProcessor.pRequest Got user-level KeeperException when processing sessionid:0x13b8c5ebd2a0007 type:create cxid:0x2 zxid:0x6e txntype:-1 reqpath:n/a Error Path:/solr/overseer Error:KeeperErrorCode = NodeExists for /solr/overseer
[junit4:junit4]   2> 8691 T18 oasc.ZkController.createEphemeralLiveNode Register node as live in ZooKeeper:/live_nodes/127.0.0.1:60679_solr
[junit4:junit4]   2> 8692 T23 oazs.PrepRequestProcessor.pRequest Got user-level KeeperException when processing sessionid:0x13b8c5ebd2a0007 type:delete cxid:0x4 zxid:0x6f txntype:-1 reqpath:n/a Error Path:/solr/live_nodes/127.0.0.1:60679_solr Error:KeeperErrorCode = NoNode for /solr/live_nodes/127.0.0.1:60679_solr
[junit4:junit4]   2> 8693 T18 oascc.SolrZkClient.makePath makePath: /live_nodes/127.0.0.1:60679_solr
[junit4:junit4]   2> 8699 T41 oascc.ZkStateReader$3.process Updating live nodes... (3)
[junit4:junit4]   2> 8700 T41 oascc.ZkStateReader$2.process A cluster state change has occurred - updating... (3)
[junit4:junit4]   2> 8700 T58 oascc.ZkStateReader$3.process Updating live nodes... (3)
[junit4:junit4]   2> 8701 T18 oashc.HttpShardHandlerFactory.getParameter Setting socketTimeout to: 0
[junit4:junit4]   2> 8701 T58 oascc.ZkStateReader$2.process A cluster state change has occurred - updating... (3)
[junit4:junit4]   2> 8701 T18 oashc.HttpShardHandlerFactory.getParameter Setting urlScheme to: http://
[junit4:junit4]   2> 8702 T18 oashc.HttpShardHandlerFactory.getParameter Setting connTimeout to: 0
[junit4:junit4]   2> 8702 T18 oashc.HttpShardHandlerFactory.getParameter Setting maxConnectionsPerHost to: 20
[junit4:junit4]   2> 8702 T18 oashc.HttpShardHandlerFactory.getParameter Setting corePoolSize to: 0
[junit4:junit4]   2> 8703 T18 oashc.HttpShardHandlerFactory.getParameter Setting maximumPoolSize to: 2147483647
[junit4:junit4]   2> 8703 T18 oashc.HttpShardHandlerFactory.getParameter Setting maxThreadIdleTime to: 5
[junit4:junit4]   2> 8703 T18 oashc.HttpShardHandlerFactory.getParameter Setting sizeOfQueue to: -1
[junit4:junit4]   2> 8703 T18 oashc.HttpShardHandlerFactory.getParameter Setting fairnessPolicy to: false
[junit4:junit4]   2> 8704 T18 oascsi.HttpClientUtil.createClient Creating new http client, config:maxConnectionsPerHost=20&maxConnections=10000&socketTimeout=0&connTimeout=0&retry=false
[junit4:junit4]   2> 8713 T42 oascc.ZkStateReader.updateClusterState Updating cloud state from ZooKeeper... 
[junit4:junit4]   2> 8714 T42 oasc.Overseer$ClusterStateUpdater.updateState Update state numShards=1 message={
[junit4:junit4]   2> 	  "operation":"state",
[junit4:junit4]   2> 	  "numShards":"1",
[junit4:junit4]   2> 	  "shard":"shard1",
[junit4:junit4]   2> 	  "roles":null,
[junit4:junit4]   2> 	  "state":"active",
[junit4:junit4]   2> 	  "core":"collection1",
[junit4:junit4]   2> 	  "collection":"collection1",
[junit4:junit4]   2> 	  "node_name":"127.0.0.1:60670_solr",
[junit4:junit4]   2> 	  "base_url":"http://127.0.0.1:60670/solr"}
[junit4:junit4]   2> 8720 T18 oascc.ZkStateReader.createClusterStateWatchersAndUpdate Updating cluster state from ZooKeeper... 
[junit4:junit4]   2> 8725 T41 oascc.ZkStateReader$2.process A cluster state change has occurred - updating... (3)
[junit4:junit4]   2> 8726 T73 oascc.ZkStateReader$2.process A cluster state change has occurred - updating... (0)
[junit4:junit4]   2> 8727 T58 oascc.ZkStateReader$2.process A cluster state change has occurred - updating... (3)
[junit4:junit4]   2> 8737 T74 oasc.CoreContainer.create Creating SolrCore 'collection1' using instanceDir: C:\Users\JenkinsSlave\workspace\Lucene-Solr-4.x-Windows\solr\build\solr-core\test\J0\.\solrtest-jetty2-1355269725155\collection1
[junit4:junit4]   2> 8738 T74 oasc.ZkController.createCollectionZkNode Check for collection zkNode:collection1
[junit4:junit4]   2> 8738 T74 oasc.ZkController.createCollectionZkNode Collection zkNode exists
[junit4:junit4]   2> 8738 T74 oasc.ZkController.readConfigName Load collection config from:/collections/collection1
[junit4:junit4]   2> 8741 T74 oasc.SolrResourceLoader.<init> new SolrResourceLoader for directory: 'C:\Users\JenkinsSlave\workspace\Lucene-Solr-4.x-Windows\solr\build\solr-core\test\J0\.\solrtest-jetty2-1355269725155\collection1\'
[junit4:junit4]   2> 8742 T74 oasc.SolrResourceLoader.replaceClassLoader Adding 'file:/C:/Users/JenkinsSlave/workspace/Lucene-Solr-4.x-Windows/solr/build/solr-core/test/J0/solrtest-jetty2-1355269725155/collection1/lib/classes/' to classloader
[junit4:junit4]   2> 8744 T74 oasc.SolrResourceLoader.replaceClassLoader Adding 'file:/C:/Users/JenkinsSlave/workspace/Lucene-Solr-4.x-Windows/solr/build/solr-core/test/J0/solrtest-jetty2-1355269725155/collection1/lib/README' to classloader
[junit4:junit4]   2> 8819 T74 oasc.SolrConfig.<init> Using Lucene MatchVersion: LUCENE_41
[junit4:junit4]   2> 8907 T74 oasc.SolrConfig.<init> Loaded SolrConfig: solrconfig.xml
[junit4:junit4]   2> 8910 T74 oass.IndexSchema.readSchema Reading Solr Schema
[junit4:junit4]   2> 8982 T74 oass.IndexSchema.readSchema Schema name=test
[junit4:junit4]   2> 9700 T74 oass.OpenExchangeRatesOrgProvider.init Initialized with rates=open-exchange-rates.json, refreshInterval=1440.
[junit4:junit4]   2> 9715 T74 oass.IndexSchema.readSchema default search field in schema is text
[junit4:junit4]   2> 9720 T74 oass.IndexSchema.readSchema unique key field: id
[junit4:junit4]   2> 9794 T74 oass.FileExchangeRateProvider.reload Reloading exchange rates from file currency.xml
[junit4:junit4]   2> 9801 T74 oass.FileExchangeRateProvider.reload Reloading exchange rates from file currency.xml
[junit4:junit4]   2> 9809 T74 oass.OpenExchangeRatesOrgProvider.reload Reloading exchange rates from open-exchange-rates.json
[junit4:junit4]   2> 9813 T74 oass.OpenExchangeRatesOrgProvider.reload Reloading exchange rates from open-exchange-rates.json
[junit4:junit4]   2> 9818 T74 oasc.SolrCore.<init> [collection1] Opening new SolrCore at C:\Users\JenkinsSlave\workspace\Lucene-Solr-4.x-Windows\solr\build\solr-core\test\J0\.\solrtest-jetty2-1355269725155\collection1\, dataDir=.\org.apache.solr.cloud.SyncSliceTest-1355269716905/jetty2\
[junit4:junit4]   2> 9819 T74 oasc.JmxMonitoredMap.<init> JMX monitoring is enabled. Adding Solr mbeans to JMX Server: com.sun.jmx.mbeanserver.JmxMBeanServer@2af6b7f
[junit4:junit4]   2> 9821 T74 oasc.SolrCore.getNewIndexDir New index directory detected: old=null new=.\org.apache.solr.cloud.SyncSliceTest-1355269716905/jetty2\index/
[junit4:junit4]   2> 9823 T74 oasc.SolrCore.initIndex WARNING [collection1] Solr index directory '.\org.apache.solr.cloud.SyncSliceTest-1355269716905\jetty2\index' doesn't exist. Creating new index...
[junit4:junit4]   2> 9823 T74 oasc.CachingDirectoryFactory.get return new directory for C:\Users\JenkinsSlave\workspace\Lucene-Solr-4.x-Windows\solr\build\solr-core\test\J0\.\org.apache.solr.cloud.SyncSliceTest-1355269716905\jetty2\index forceNew:false
[junit4:junit4]   2> 9840 T74 oasc.SolrDeletionPolicy.onCommit SolrDeletionPolicy.onCommit: commits:num=1
[junit4:junit4]   2> 		commit{dir=RateLimitedDirectoryWrapper(NRTCachingDirectory(org.apache.lucene.store.MMapDirectory@C:\Users\JenkinsSlave\workspace\Lucene-Solr-4.x-Windows\solr\build\solr-core\test\J0\org.apache.solr.cloud.SyncSliceTest-1355269716905\jetty2\index lockFactory=org.apache.lucene.store.NativeFSLockFactory@53c3f229; maxCacheMB=48.0 maxMergeSizeMB=4.0)),segFN=segments_1,generation=1,filenames=[segments_1]
[junit4:junit4]   2> 9841 T74 oasc.SolrDeletionPolicy.updateCommits newest commit = 1
[junit4:junit4]   2> 9844 T74 oasc.SolrCore.initWriters created xml: solr.XMLResponseWriter
[junit4:junit4]   2> 9849 T74 oasup.UpdateRequestProcessorChain.init inserting DistributedUpdateProcessorFactory into updateRequestProcessorChain "dedupe"
[junit4:junit4]   2> 9849 T74 oasup.UpdateRequestProcessorChain.init inserting DistributedUpdateProcessorFactory into updateRequestProcessorChain "dedupe-allfields"
[junit4:junit4]   2> 9850 T74 oasup.UpdateRequestProcessorChain.init inserting DistributedUpdateProcessorFactory into updateRequestProcessorChain "stored_sig"
[junit4:junit4]   2> 9852 T74 oasup.UpdateRequestProcessorChain.init inserting DistributedUpdateProcessorFactory into updateRequestProcessorChain "uniq-fields"
[junit4:junit4]   2> 9853 T74 oasup.UpdateRequestProcessorChain.init inserting DistributedUpdateProcessorFactory into updateRequestProcessorChain "distrib-dup-test-chain-implicit"
[junit4:junit4]   2> 9853 T74 oasc.RequestHandlers.initHandlersFromConfig adding lazy requestHandler: solr.ReplicationHandler
[junit4:junit4]   2> 9854 T74 oasc.RequestHandlers.initHandlersFromConfig created /replication: solr.ReplicationHandler
[junit4:junit4]   2> 9871 T74 oasc.RequestHandlers.initHandlersFromConfig created standard: solr.StandardRequestHandler
[junit4:junit4]   2> 9874 T74 oasc.RequestHandlers.initHandlersFromConfig created /get: solr.RealTimeGetHandler
[junit4:junit4]   2> 9926 T74 oasc.RequestHandlers.initHandlersFromConfig created dismax: solr.SearchHandler
[junit4:junit4]   2> 9982 T74 oasc.RequestHandlers.initHandlersFromConfig created mock: org.apache.solr.core.MockQuerySenderListenerReqHandler
[junit4:junit4]   2> 9984 T74 oasc.RequestHandlers.initHandlersFromConfig created /admin/: org.apache.solr.handler.admin.AdminHandlers
[junit4:junit4]   2> 9986 T74 oasc.RequestHandlers.initHandlersFromConfig created defaults: solr.StandardRequestHandler
[junit4:junit4]   2> 9988 T74 oasc.RequestHandlers.initHandlersFromConfig adding lazy requestHandler: solr.StandardRequestHandler
[junit4:junit4]   2> 9988 T74 oasc.RequestHandlers.initHandlersFromConfig created lazy: solr.StandardRequestHandler
[junit4:junit4]   2> 10037 T74 oasc.RequestHandlers.initHandlersFromConfig created /update: solr.UpdateRequestHandler
[junit4:junit4]   2> 10038 T74 oasc.RequestHandlers.initHandlersFromConfig created /terms: org.apache.solr.handler.component.SearchHandler
[junit4:junit4]   2> 10040 T74 oasc.RequestHandlers.initHandlersFromConfig created spellCheckCompRH: org.apache.solr.handler.component.SearchHandler
[junit4:junit4]   2> 10041 T74 oasc.RequestHandlers.initHandlersFromConfig created spellCheckCompRH_Direct: org.apache.solr.handler.component.SearchHandler
[junit4:junit4]   2> 10044 T74 oasc.RequestHandlers.initHandlersFromConfig created spellCheckWithWordbreak: org.apache.solr.handler.component.SearchHandler
[junit4:junit4]   2> 10047 T74 oasc.RequestHandlers.initHandlersFromConfig created spellCheckWithWordbreak_Direct: org.apache.solr.handler.component.SearchHandler
[junit4:junit4]   2> 10049 T74 oasc.RequestHandlers.initHandlersFromConfig created spellCheckCompRH1: org.apache.solr.handler.component.SearchHandler
[junit4:junit4]   2> 10050 T74 oasc.RequestHandlers.initHandlersFromConfig created tvrh: org.apache.solr.handler.component.SearchHandler
[junit4:junit4]   2> 10052 T74 oasc.RequestHandlers.initHandlersFromConfig created /mlt: solr.MoreLikeThisHandler
[junit4:junit4]   2> 10053 T74 oasc.RequestHandlers.initHandlersFromConfig created /debug/dump: solr.DumpRequestHandler
[junit4:junit4]   2> 10064 T74 oashl.XMLLoader.init xsltCacheLifetimeSeconds=60
[junit4:junit4]   2> 10069 T74 oasc.SolrCore.initDeprecatedSupport WARNING solrconfig.xml uses deprecated <admin/gettableFiles>, Please update your config to use the ShowFileRequestHandler.
[junit4:junit4]   2> 10072 T74 oasc.SolrCore.initDeprecatedSupport WARNING adding ShowFileRequestHandler with hidden files: [SCHEMA.XML, OLD_SYNONYMS.TXT, STOPWORDS.TXT, PROTWORDS.TXT, OPEN-EXCHANGE-RATES.JSON, SYNONYMS.TXT, CURRENCY.XML, MAPPING-ISOLATIN1ACCENT.TXT]
[junit4:junit4]   2> 10094 T74 oass.SolrIndexSearcher.<init> Opening Searcher@4d995fb7 main
[junit4:junit4]   2> 10094 T74 oass.SolrIndexSearcher.getIndexDir WARNING WARNING: Directory impl does not support setting indexDir: org.apache.lucene.store.RateLimitedDirectoryWrapper
[junit4:junit4]   2> 10096 T74 oasu.CommitTracker.<init> Hard AutoCommit: disabled
[junit4:junit4]   2> 10096 T74 oasu.CommitTracker.<init> Soft AutoCommit: disabled
[junit4:junit4]   2> 10097 T74 oashc.SpellCheckComponent.inform Initializing spell checkers
[junit4:junit4]   2> 10109 T74 oass.DirectSolrSpellChecker.init init: {name=direct,classname=DirectSolrSpellChecker,field=lowerfilt,minQueryLength=3}
[junit4:junit4]   2> 10205 T75 oasc.SolrCore.registerSearcher [collection1] Registered new searcher Searcher@4d995fb7 main{StandardDirectoryReader(segments_1:1)}
[junit4:junit4]   2> 10211 T74 oasc.ZkController.publish publishing core=collection1 state=down
[junit4:junit4]   2> 10211 T74 oasc.ZkController.publish numShards not found on descriptor - reading it from system property
[junit4:junit4]   2> 10283 T42 oascc.ZkStateReader.updateClusterState Updating cloud state from ZooKeeper... 
[junit4:junit4]   2> 10284 T42 oasc.Overseer$ClusterStateUpdater.updateState Update state numShards=1 message={
[junit4:junit4]   2> 	  "operation":"state",
[junit4:junit4]   2> 	  "numShards":"1",
[junit4:junit4]   2> 	  "shard":null,
[junit4:junit4]   2> 	  "roles":null,
[junit4:junit4]   2> 	  "state":"down",
[junit4:junit4]   2> 	  "core":"collection1",
[junit4:junit4]   2> 	  "collection":"collection1",
[junit4:junit4]   2> 	  "node_name":"127.0.0.1:60679_solr",
[junit4:junit4]   2> 	  "base_url":"http://127.0.0.1:60679/solr"}
[junit4:junit4]   2> 10285 T42 oasc.Overseer$ClusterStateUpdater.updateState Collection already exists with numShards=1
[junit4:junit4]   2> 10285 T42 oasc.Overseer$ClusterStateUpdater.updateState Assigning new node to shard shard=shard1
[junit4:junit4]   2> 10295 T73 oascc.ZkStateReader$2.process A cluster state change has occurred - updating... (3)
[junit4:junit4]   2> 10296 T41 oascc.ZkStateReader$2.process A cluster state change has occurred - updating... (3)
[junit4:junit4]   2> 10296 T58 oascc.ZkStateReader$2.process A cluster state change has occurred - updating... (3)
[junit4:junit4]   2> 10718 T74 oasc.CoreContainer.register registering core: collection1
[junit4:junit4]   2> 10718 T74 oasc.ZkController.register Register shard - core:collection1 address:http://127.0.0.1:60679/solr shardId:shard1
[junit4:junit4]   2> 10726 T74 oasc.ZkController.register We are http://127.0.0.1:60679/solr/collection1/ and leader is http://127.0.0.1:60670/solr/collection1/
[junit4:junit4]   2> 10726 T74 oasc.ZkController.register No LogReplay needed for core=collection1 baseURL=http://127.0.0.1:60679/solr
[junit4:junit4]   2> 10726 T74 oasc.ZkController.checkRecovery Core needs to recover:collection1
[junit4:junit4]   2> 10727 T74 oasu.DefaultSolrCoreState.doRecovery Running recovery - first canceling any ongoing recovery
[junit4:junit4]   2> ASYNC  NEW_CORE C0 name=collection1 org.apache.solr.core.SolrCore@6af1a80d url=http://127.0.0.1:60679/solr/collection1 node=127.0.0.1:60679_solr
[junit4:junit4]   2> 10732 T76 C0 P60679 oasc.RecoveryStrategy.run Starting recovery process.  core=collection1 recoveringAfterStartup=true
[junit4:junit4]   2> 10733 T74 oascc.ZkStateReader.updateClusterState Updating cloud state from ZooKeeper... 
[junit4:junit4]   2> 10738 T76 C0 P60679 oasc.RecoveryStrategy.doRecovery ###### startupVersions=[]
[junit4:junit4]   2> 10738 T76 C0 P60679 oasc.ZkController.publish publishing core=collection1 state=recovering
[junit4:junit4]   2> 10738 T76 C0 P60679 oasc.ZkController.publish numShards not found on descriptor - reading it from system property
[junit4:junit4]   2> 10740 T18 oass.SolrDispatchFilter.init user.dir=C:\Users\JenkinsSlave\workspace\Lucene-Solr-4.x-Windows\solr\build\solr-core\test\J0
[junit4:junit4]   2> 10740 T18 oass.SolrDispatchFilter.init SolrDispatchFilter.init() done
[junit4:junit4]   2> 10741 T18 oascsi.HttpClientUtil.createClient Creating new http client, config:maxConnections=128&maxConnectionsPerHost=32&followRedirects=false
[junit4:junit4]   2> 10743 T76 C0 P60679 oasc.RecoveryStrategy.doRecovery Attempting to PeerSync from http://127.0.0.1:60670/solr/collection1/ core=collection1 - recoveringAfterStartup=true
[junit4:junit4]   2> 10752 T76 C0 P60679 oascsi.HttpClientUtil.createClient Creating new http client, config:maxConnectionsPerHost=20&maxConnections=10000&connTimeout=30000&socketTimeout=30000&retry=false
[junit4:junit4]   2> 10765 T76 C0 P60679 oasu.PeerSync.sync PeerSync: core=collection1 url=http://127.0.0.1:60679/solr START replicas=[http://127.0.0.1:60670/solr/collection1/] nUpdates=100
[junit4:junit4]   2> 10774 T76 C0 P60679 oasu.PeerSync.sync WARNING no frame of reference to tell of we've missed updates
[junit4:junit4]   2> 10780 T76 C0 P60679 oasc.RecoveryStrategy.doRecovery PeerSync Recovery was not successful - trying replication. core=collection1
[junit4:junit4]   2> 10780 T76 C0 P60679 oasc.RecoveryStrategy.doRecovery Starting Replication Recovery. core=collection1
[junit4:junit4]   2> 10780 T76 C0 P60679 oascsi.HttpClientUtil.createClient Creating new http client, config:maxConnections=128&maxConnectionsPerHost=32&followRedirects=false
[junit4:junit4]   2> 10844 T42 oascc.ZkStateReader.updateClusterState Updating cloud state from ZooKeeper... 
[junit4:junit4]   2> 10854 T42 oasc.Overseer$ClusterStateUpdater.updateState Update state numShards=1 message={
[junit4:junit4]   2> 	  "operation":"state",
[junit4:junit4]   2> 	  "numShards":"1",
[junit4:junit4]   2> 	  "shard":"shard1",
[junit4:junit4]   2> 	  "roles":null,
[junit4:junit4]   2> 	  "state":"recovering",
[junit4:junit4]   2> 	  "core":"collection1",
[junit4:junit4]   2> 	  "collection":"collection1",
[junit4:junit4]   2> 	  "node_name":"127.0.0.1:60679_solr",
[junit4:junit4]   2> 	  "base_url":"http://127.0.0.1:60679/solr"}
[junit4:junit4]   2> 10915 T58 oascc.ZkStateReader$2.process A cluster state change has occurred - updating... (3)
[junit4:junit4]   2> 10918 T73 oascc.ZkStateReader$2.process A cluster state change has occurred - updating... (3)
[junit4:junit4]   2> 10919 T41 oascc.ZkStateReader$2.process A cluster state change has occurred - updating... (3)
[junit4:junit4]   2> 11103 T18 oejs.Server.doStart jetty-8.1.8.v20121106
[junit4:junit4]   2> 11119 T18 oejs.AbstractConnector.doStart Started SelectChannelConnector@0.0.0.0:60688
[junit4:junit4]   2> 11120 T18 oasc.SolrResourceLoader.locateSolrHome JNDI not configured for solr (NoInitialContextEx)
[junit4:junit4]   2> 11120 T18 oasc.SolrResourceLoader.locateSolrHome using system property solr.solr.home: C:\Users\JenkinsSlave\workspace\Lucene-Solr-4.x-Windows\solr\build\solr-core\test\J0\.\solrtest-jetty3-1355269727643
[junit4:junit4]   2> 11121 T18 oasc.SolrResourceLoader.<init> new SolrResourceLoader for deduced Solr Home: 'C:\Users\JenkinsSlave\workspace\Lucene-Solr-4.x-Windows\solr\build\solr-core\test\J0\.\solrtest-jetty3-1355269727643\'
[junit4:junit4]   2> 11161 T18 oass.SolrDispatchFilter.init SolrDispatchFilter.init()
[junit4:junit4]   2> 11161 T18 oasc.SolrResourceLoader.locateSolrHome JNDI not configured for solr (NoInitialContextEx)
[junit4:junit4]   2> 11162 T18 oasc.SolrResourceLoader.locateSolrHome using system property solr.solr.home: C:\Users\JenkinsSlave\workspace\Lucene-Solr-4.x-Windows\solr\build\solr-core\test\J0\.\solrtest-jetty3-1355269727643
[junit4:junit4]   2> 11162 T18 oasc.CoreContainer$Initializer.initialize looking for solr.xml: C:\Users\JenkinsSlave\workspace\Lucene-Solr-4.x-Windows\solr\build\solr-core\test\J0\.\solrtest-jetty3-1355269727643\solr.xml
[junit4:junit4]   2> 11163 T18 oasc.CoreContainer.<init> New CoreContainer 220432488
[junit4:junit4]   2> 11165 T18 oasc.CoreContainer.load Loading CoreContainer using Solr Home: 'C:\Users\JenkinsSlave\workspace\Lucene-Solr-4.x-Windows\solr\build\solr-core\test\J0\.\solrtest-jetty3-1355269727643\'
[junit4:junit4]   2> 11165 T18 oasc.SolrResourceLoader.<init> new SolrResourceLoader for directory: 'C:\Users\JenkinsSlave\workspace\Lucene-Solr-4.x-Windows\solr\build\solr-core\test\J0\.\solrtest-jetty3-1355269727643\'
[junit4:junit4]   2> 11205 T18 oasc.CoreContainer.load Registering Log Listener
[junit4:junit4]   2> 11225 T18 oasc.CoreContainer.initZooKeeper Zookeeper client=127.0.0.1:60654/solr
[junit4:junit4]   2> 11226 T18 oasc.ZkController.checkChrootPath zkHost includes chroot
[junit4:junit4]   2> 11227 T18 oaz.ZooKeeper.<init> Initiating client connection, connectString=127.0.0.1:60654 sessionTimeout=60000 watcher=org.apache.solr.common.cloud.ConnectionManager@1eb01669
[junit4:junit4]   2> 11286 T18 oascc.ConnectionManager.waitForConnected Waiting for client to connect to ZooKeeper
[junit4:junit4]   2> 11288 T87 oaz.ClientCnxn$SendThread.logStartConnect Opening socket connection to server 127.0.0.1/127.0.0.1:60654. Will not attempt to authenticate using SASL (access denied ("javax.security.auth.AuthPermission" "getLoginConfiguration"))
[junit4:junit4]   2> 11289 T87 oaz.ClientCnxn$SendThread.primeConnection Socket connection established to 127.0.0.1/127.0.0.1:60654, initiating session
[junit4:junit4]   2> 11290 T20 oazs.NIOServerCnxnFactory.run Accepted socket connection from /127.0.0.1:60693
[junit4:junit4]   2> 11291 T20 oazs.ZooKeeperServer.processConnectRequest Client attempting to establish new session at /127.0.0.1:60693
[junit4:junit4]   2> 11309 T87 oaz.ClientCnxn$SendThread.onConnected Session establishment complete on server 127.0.0.1/127.0.0.1:60654, sessionid = 0x13b8c5ebd2a0008, negotiated timeout = 20000
[junit4:junit4]   2> 11310 T22 oazs.ZooKeeperServer.finishSessionInit Established session 0x13b8c5ebd2a0008 with negotiated timeout 20000 for client /127.0.0.1:60693
[junit4:junit4]   2> 11310 T88 oascc.ConnectionManager.process Watcher org.apache.solr.common.cloud.ConnectionManager@1eb01669 name:ZooKeeperConnection Watcher:127.0.0.1:60654 got event WatchedEvent state:SyncConnected type:None path:null path:null type:None
[junit4:junit4]   2> 11315 T18 oascc.ConnectionManager.waitForConnected Client is connected to ZooKeeper
[junit4:junit4]   2> 11324 T23 oazs.PrepRequestProcessor.pRequest2Txn Processed session termination for sessionid: 0x13b8c5ebd2a0008
[junit4:junit4]   2> 11327 T20 oazs.NIOServerCnxn.closeSock Closed socket connection for client /127.0.0.1:60693 which had sessionid 0x13b8c5ebd2a0008
[junit4:junit4]   2> 11329 T18 oaz.ZooKeeper.close Session: 0x13b8c5ebd2a0008 closed
[junit4:junit4]   2> 11330 T18 oaz.ZooKeeper.<init> Initiating client connection, connectString=127.0.0.1:60654/solr sessionTimeout=8000 watcher=org.apache.solr.common.cloud.ConnectionManager@4bfcbee9
[junit4:junit4]   2> 11332 T88 oaz.ClientCnxn$EventThread.run EventThread shut down
[junit4:junit4]   2> 11332 T18 oascc.ConnectionManager.waitForConnected Waiting for client to connect to ZooKeeper
[junit4:junit4]   2> 11352 T89 oaz.ClientCnxn$SendThread.logStartConnect Opening socket connection to server 127.0.0.1/127.0.0.1:60654. Will not attempt to authenticate using SASL (access denied ("javax.security.auth.AuthPermission" "getLoginConfiguration"))
[junit4:junit4]   2> 11353 T89 oaz.ClientCnxn$SendThread.primeConnection Socket connection established to 127.0.0.1/127.0.0.1:60654, initiating session
[junit4:junit4]   2> 11354 T20 oazs.NIOServerCnxnFactory.run Accepted socket connection from /127.0.0.1:60698
[junit4:junit4]   2> 11363 T20 oazs.ZooKeeperServer.processConnectRequest Client attempting to establish new session at /127.0.0.1:60698
[junit4:junit4]   2> 11371 T22 oazs.ZooKeeperServer.finishSessionInit Established session 0x13b8c5ebd2a0009 with negotiated timeout 8000 for client /127.0.0.1:60698
[junit4:junit4]   2> 11371 T89 oaz.ClientCnxn$SendThread.onConnected Session establishment complete on server 127.0.0.1/127.0.0.1:60654, sessionid = 0x13b8c5ebd2a0009, negotiated timeout = 8000
[junit4:junit4]   2> 11372 T90 oascc.ConnectionManager.process Watcher org.apache.solr.common.cloud.ConnectionManager@4bfcbee9 name:ZooKeeperConnection Watcher:127.0.0.1:60654/solr got event WatchedEvent state:SyncConnected type:None path:null path:null type:None
[junit4:junit4]   2> 11373 T18 oascc.ConnectionManager.waitForConnected Client is connected to ZooKeeper
[junit4:junit4]   2> 11389 T23 oazs.PrepRequestProcessor.pRequest Got user-level KeeperException when processing sessionid:0x13b8c5ebd2a0009 type:create cxid:0x1 zxid:0x84 txntype:-1 reqpath:n/a Error Path:/solr/overseer Error:KeeperErrorCode = NodeExists for /solr/overseer
[junit4:junit4]   2> 11395 T23 oazs.PrepRequestProcessor.pRequest Got user-level KeeperException when processing sessionid:0x13b8c5ebd2a0009 type:create cxid:0x2 zxid:0x85 txntype:-1 reqpath:n/a Error Path:/solr/overseer Error:KeeperErrorCode = NodeExists for /solr/overseer
[junit4:junit4]   2> 11412 T18 oasc.ZkController.createEphemeralLiveNode Register node as live in ZooKeeper:/live_nodes/127.0.0.1:60688_solr
[junit4:junit4]   2> 11414 T23 oazs.PrepRequestProcessor.pRequest Got user-level KeeperException when processing sessionid:0x13b8c5ebd2a0009 type:delete cxid:0x4 zxid:0x86 txntype:-1 reqpath:n/a Error Path:/solr/live_nodes/127.0.0.1:60688_solr Error:KeeperErrorCode = NoNode for /solr/live_nodes/127.0.0.1:60688_solr
[junit4:junit4]   2> 11417 T18 oascc.SolrZkClient.makePath makePath: /live_nodes/127.0.0.1:60688_solr
[junit4:junit4]   2> 11465 T58 oascc.ZkStateReader$3.process Updating live nodes... (4)
[junit4:junit4]   2> 11466 T58 oascc.ZkStateReader$2.process A cluster state change has occurred - updating... (4)
[junit4:junit4]   2> 11470 T41 oascc.ZkStateReader$3.process Updating live nodes... (4)
[junit4:junit4]   2> 11470 T73 oascc.ZkStateReader$3.process Updating live nodes... (4)
[junit4:junit4]   2> 11472 T41 oascc.ZkStateReader$2.process A cluster state change has occurred - updating... (4)
[junit4:junit4]   2> 11473 T73 oascc.ZkStateReader$2.process A cluster state change has occurred - updating... (4)
[junit4:junit4]   2> 11472 T18 oashc.HttpShardHandlerFactory.getParameter Setting socketTimeout to: 0
[junit4:junit4]   2> 11478 T18 oashc.HttpShardHandlerFactory.getParameter Setting urlScheme to: http://
[junit4:junit4]   2> 11479 T18 oashc.HttpShardHandlerFactory.getParameter Setting connTimeout to: 0
[junit4:junit4]   2> 11479 T18 oashc.HttpShardHandlerFactory.getParameter Setting maxConnectionsPerHost to: 20
[junit4:junit4]   2> 11481 T18 oashc.HttpShardHandlerFactory.getParameter Setting corePoolSize to: 0
[junit4:junit4]   2> 11482 T18 oashc.HttpShardHandlerFactory.getParameter Setting maximumPoolSize to: 2147483647
[junit4:junit4]   2> 11483 T18 oashc.HttpShardHandlerFactory.getParameter Setting maxThreadIdleTime to: 5
[junit4:junit4]   2> 11483 T18 oashc.HttpShardHandlerFactory.getParameter Setting sizeOfQueue to: -1
[junit4:junit4]   2> 11484 T18 oashc.HttpShardHandlerFactory.getParameter Setting fairnessPolicy to: false
[junit4:junit4]   2> 11485 T18 oascsi.HttpClientUtil.createClient Creating new http client, config:maxConnectionsPerHost=20&maxConnections=10000&socketTimeout=0&connTimeout=0&retry=false
[junit4:junit4]   2> 11533 T18 oascc.ZkStateReader.createClusterStateWatchersAndUpdate Updating cluster state from ZooKeeper... 
[junit4:junit4]   2> 11575 T91 oasc.CoreContainer.create Creating SolrCore 'collection1' using instanceDir: C:\Users\JenkinsSlave\workspace\Lucene-Solr-4.x-Windows\solr\build\solr-core\test\J0\.\solrtest-jetty3-1355269727643\collection1
[junit4:junit4]   2> 11575 T91 oasc.ZkController.createCollectionZkNode Check for collection zkNode:collection1
[junit4:junit4]   2> 11577 T91 oasc.ZkController.createCollectionZkNode Collection zkNode exists
[junit4:junit4]   2> 11577 T91 oasc.ZkController.readConfigName Load collection config from:/collections/collection1
[junit4:junit4]   2> 11581 T91 oasc.SolrResourceLoader.<init> new SolrResourceLoader for directory: 'C:\Users\JenkinsSlave\workspace\Lucene-Solr-4.x-Windows\solr\build\solr-core\test\J0\.\solrtest-jetty3-1355269727643\collection1\'
[junit4:junit4]   2> 11586 T91 oasc.SolrResourceLoader.replaceClassLoader Adding 'file:/C:/Users/JenkinsSlave/workspace/Lucene-Solr-4.x-Windows/solr/build/solr-core/test/J0/solrtest-jetty3-1355269727643/collection1/lib/classes/' to classloader
[junit4:junit4]   2> 11586 T91 oasc.SolrResourceLoader.replaceClassLoader Adding 'file:/C:/Users/JenkinsSlave/workspace/Lucene-Solr-4.x-Windows/solr/build/solr-core/test/J0/solrtest-jetty3-1355269727643/collection1/lib/README' to classloader
[junit4:junit4]   2> ASYNC  NEW_CORE C1 name=collection1 org.apache.solr.core.SolrCore@2fe7fbe9 url=http://127.0.0.1:60670/solr/collection1 node=127.0.0.1:60670_solr
[junit4:junit4]   2> 11896 T49 C1 P60670 REQ /get {distrib=false&qt=/get&wt=javabin&version=2&getVersions=100} status=0 QTime=22 
[junit4:junit4]   2> 11929 T91 oasc.SolrConfig.<init> Using Lucene MatchVersion: LUCENE_41
[junit4:junit4]   2> 12026 T91 oasc.SolrConfig.<init> Loaded SolrConfig: solrconfig.xml
[junit4:junit4]   2> 12029 T91 oass.IndexSchema.readSchema Reading Solr Schema
[junit4:junit4]   2> 12121 T91 oass.IndexSchema.readSchema Schema name=test
[junit4:junit4]   2> 12845 T91 oass.OpenExchangeRatesOrgProvider.init Initialized with rates=open-exchange-rates.json, refreshInterval=1440.
[junit4:junit4]   2> 12860 T91 oass.IndexSchema.readSchema default search field in schema is text
[junit4:junit4]   2> 12864 T91 oass.IndexSchema.readSchema unique key field: id
[junit4:junit4]   2> 12930 T91 oass.FileExchangeRateProvider.reload Reloading exchange rates from file currency.xml
[junit4:junit4]   2> 12942 T91 oass.FileExchangeRateProvider.reload Reloading exchange rates from file currency.xml
[junit4:junit4]   2> 12951 T91 oass.OpenExchangeRatesOrgProvider.reload Reloading exchange rates from open-exchange-rates.json
[junit4:junit4]   2> 12956 T91 oass.OpenExchangeRatesOrgProvider.reload Reloading exchange rates from open-exchange-rates.json
[junit4:junit4]   2> 12960 T91 oasc.SolrCore.<init> [collection1] Opening new SolrCore at C:\Users\JenkinsSlave\workspace\Lucene-Solr-4.x-Windows\solr\build\solr-core\test\J0\.\solrtest-jetty3-1355269727643\collection1\, dataDir=.\org.apache.solr.cloud.SyncSliceTest-1355269716905/jetty3\
[junit4:junit4]   2> 12960 T91 oasc.JmxMonitoredMap.<init> JMX monitoring is enabled. Adding Solr mbeans to JMX Server: com.sun.jmx.mbeanserver.JmxMBeanServer@2af6b7f
[junit4:junit4]   2> 12963 T91 oasc.SolrCore.getNewIndexDir New index directory detected: old=null new=.\org.apache.solr.cloud.SyncSliceTest-1355269716905/jetty3\index/
[junit4:junit4]   2> 12965 T91 oasc.SolrCore.initIndex WARNING [collection1] Solr index directory '.\org.apache.solr.cloud.SyncSliceTest-1355269716905\jetty3\index' doesn't exist. Creating new index...
[junit4:junit4]   2> 12966 T91 oasc.CachingDirectoryFactory.get return new directory for C:\Users\JenkinsSlave\workspace\Lucene-Solr-4.x-Windows\solr\build\solr-core\test\J0\.\org.apache.solr.cloud.SyncSliceTest-1355269716905\jetty3\index forceNew:false
[junit4:junit4]   2> 12982 T91 oasc.SolrDeletionPolicy.onCommit SolrDeletionPolicy.onCommit: commits:num=1
[junit4:junit4]   2> 		commit{dir=RateLimitedDirectoryWrapper(NRTCachingDirectory(org.apache.lucene.store.MMapDirectory@C:\Users\JenkinsSlave\workspace\Lucene-Solr-4.x-Windows\solr\build\solr-core\test\J0\org.apache.solr.cloud.SyncSliceTest-1355269716905\jetty3\index lockFactory=org.apache.lucene.store.NativeFSLockFactory@33441e9e; maxCacheMB=48.0 maxMergeSizeMB=4.0)),segFN=segments_1,generation=1,filenames=[segments_1]
[junit4:junit4]   2> 12982 T91 oasc.SolrDeletionPolicy.updateCommits newest commit = 1
[junit4:junit4]   2> 12985 T91 oasc.SolrCore.initWriters created xml: solr.XMLResponseWriter
[junit4:junit4]   2> 12988 T91 oasup.UpdateRequestProcessorChain.init inserting DistributedUpdateProcessorFactory into updateRequestProcessorChain "dedupe"
[junit4:junit4]   2> 12988 T91 oasup.UpdateRequestProcessorChain.init inserting DistributedUpdateProcessorFactory into updateRequestProcessorChain "dedupe-allfields"
[junit4:junit4]   2> 12988 T91 oasup.UpdateRequestProcessorChain.init inserting DistributedUpdateProcessorFactory into updateRequestProcessorChain "stored_sig"
[junit4:junit4]   2> 12990 T91 oasup.UpdateRequestProcessorChain.init inserting DistributedUpdateProcessorFactory into updateRequestProcessorChain "uniq-fields"
[junit4:junit4]   2> 12991 T91 oasup.UpdateRequestProcessorChain.init inserting DistributedUpdateProcessorFactory into updateRequestProcessorChain "distrib-dup-test-chain-implicit"
[junit4:junit4]   2> 12992 T91 oasc.RequestHandlers.initHandlersFromConfig adding lazy requestHandler: solr.ReplicationHandler
[junit4:junit4]   2> 12992 T91 oasc.RequestHandlers.initHandlersFromConfig created /replication: solr.ReplicationHandler
[junit4:junit4]   2> 12995 T91 oasc.RequestHandlers.initHandlersFromConfig created standard: solr.StandardRequestHandler
[junit4:junit4]   2> 12997 T91 oasc.RequestHandlers.initHandlersFromConfig created /get: solr.RealTimeGetHandler
[junit4:junit4]   2> 13000 T91 oasc.RequestHandlers.initHandlersFromConfig created dismax: solr.SearchHandler
[junit4:junit4]   2> 13002 T91 oasc.RequestHandlers.initHandlersFromConfig created mock: org.apache.solr.core.MockQuerySenderListenerReqHandler
[junit4:junit4]   2> 13003 T91 oasc.RequestHandlers.initHandlersFromConfig created /admin/: org.apache.solr.handler.admin.AdminHandlers
[junit4:junit4]   2> 13004 T91 oasc.RequestHandlers.initHandlersFromConfig created defaults: solr.StandardRequestHandler
[junit4:junit4]   2> 13004 T91 oasc.RequestHandlers.initHandlersFromConfig adding lazy requestHandler: solr.StandardRequestHandler
[junit4:junit4]   2> 13004 T91 oasc.RequestHandlers.initHandlersFromConfig created lazy: solr.StandardRequestHandler
[junit4:junit4]   2> 13007 T91 oasc.RequestHandlers.initHandlersFromConfig created /update: solr.UpdateRequestHandler
[junit4:junit4]   2> 13008 T91 oasc.RequestHandlers.initHandlersFromConfig created /terms: org.apache.solr.handler.component.SearchHandler
[junit4:junit4]   2> 13009 T91 oasc.RequestHandlers.initHandlersFromConfig created spellCheckCompRH: org.apache.solr.handler.component.SearchHandler
[junit4:junit4]   2> 13011 T91 oasc.RequestHandlers.initHandlersFromConfig created spellCheckCompRH_Direct: org.apache.solr.handler.component.SearchHandler
[junit4:junit4]   2> 13013 T91 oasc.RequestHandlers.initHandlersFromConfig created spellCheckWithWordbreak: org.apache.solr.handler.component.SearchHandler
[junit4:junit4]   2> 13015 T91 oasc.RequestHandlers.initHandlersFromConfig created spellCheckWithWordbreak_Direct: org.apache.solr.handler.component.SearchHandler
[junit4:junit4]   2> 13017 T91 oasc.RequestHandlers.initHandlersFromConfig created spellCheckCompRH1: org.apache.solr.handler.component.SearchHandler
[junit4:junit4]   2> 13019 T91 oasc.RequestHandlers.initHandlersFromConfig created tvrh: org.apache.solr.handler.component.SearchHandler
[junit4:junit4]   2> 13021 T91 oasc.RequestHandlers.initHandlersFromConfig created /mlt: solr.MoreLikeThisHandler
[junit4:junit4]   2> 13022 T91 oasc.RequestHandlers.initHandlersFromConfig created /debug/dump: solr.DumpRequestHandler
[junit4:junit4]   2> 13039 T91 oashl.XMLLoader.init xsltCacheLifetimeSeconds=60
[junit4:junit4]   2> 13048 T91 oasc.SolrCore.initDeprecatedSupport WARNING solrconfig.xml uses deprecated <admin/gettableFiles>, Please update your config to use the ShowFileRequestHandler.
[junit4:junit4]   2> 13051 T91 oasc.SolrCore.initDeprecatedSupport WARNING adding ShowFileRequestHandler with hidden files: [SCHEMA.XML, OLD_SYNONYMS.TXT, STOPWORDS.TXT, PROTWORDS.TXT, OPEN-EXCHANGE-RATES.JSON, SYNONYMS.TXT, CURRENCY.XML, MAPPING-ISOLATIN1ACCENT.TXT]
[junit4:junit4]   2> 13061 T91 oass.SolrIndexSearcher.<init> Opening Searcher@36163eae main
[junit4:junit4]   2> 13061 T91 oass.SolrIndexSearcher.getIndexDir WARNING WARNING: Directory impl does not support setting indexDir: org.apache.lucene.store.RateLimitedDirectoryWrapper
[junit4:junit4]   2> 13064 T91 oasu.CommitTracker.<init> Hard AutoCommit: disabled
[junit4:junit4]   2> 13065 T91 oasu.CommitTracker.<init> Soft AutoCommit: disabled
[junit4:junit4]   2> 13066 T91 oashc.SpellCheckComponent.inform Initializing spell checkers
[junit4:junit4]   2> 13082 T91 oass.DirectSolrSpellChecker.init init: {name=direct,classname=DirectSolrSpellChecker,field=lowerfilt,minQueryLength=3}
[junit4:junit4]   2> 13251 T91 oasc.ZkController.publish publishing core=collection1 state=down
[junit4:junit4]   2> 13251 T91 oasc.ZkController.publish numShards not found on descriptor - reading it from system property
[junit4:junit4]   2> 13258 T92 oasc.SolrCore.registerSearcher [collection1] Registered new searcher Searcher@36163eae main{StandardDirectoryReader(segments_1:1)}
[junit4:junit4]   2> 13787 T42 oascc.ZkStateReader.updateClusterState Updating cloud state from ZooKeeper... 
[junit4:junit4]   2> 13790 T42 oasc.Overseer$ClusterStateUpdater.updateState Update state numShards=1 message={
[junit4:junit4]   2> 	  "operation":"state",
[junit4:junit4]   2> 	  "numShards":"1",
[junit4:junit4]   2> 	  "shard":null,
[junit4:junit4]   2> 	  "roles":null,
[junit4:junit4]   2> 	  "state":"down",
[junit4:junit4]   2> 	  "core":"collection1",
[junit4:junit4]   2> 	  "collection":"collection1",
[junit4:junit4]   2> 	  "node_name":"127.0.0.1:60688_solr",
[junit4:junit4]   2> 	  "base_url":"http://127.0.0.1:60688/solr"}
[junit4:junit4]   2> 13791 T42 oasc.Overseer$ClusterStateUpdater.updateState Collection already exists with numShards=1
[junit4:junit4]   2> 13791 T42 oasc.Overseer$ClusterStateUpdater.updateState Assigning new node to shard shard=shard1
[junit4:junit4]   2> 13862 T41 oascc.ZkStateReader$2.process A cluster state change has occurred - updating... (4)
[junit4:junit4]   2> 13863 T90 oascc.ZkStateReader$2.process A cluster state change has occurred - updating... (4)
[junit4:junit4]   2> 13863 T58 oascc.ZkStateReader$2.process A cluster state change has occurred - updating... (4)
[junit4:junit4]   2>  C0_STATE=coll:collection1 core:collection1 props:{shard=shard1, roles=null, state=recovering, core=collection1, collection=collection1, node_name=127.0.0.1:60679_solr, base_url=http://127.0.0.1:60679/solr}
[junit4:junit4]   2> 13866 T76 C0 P60679 oasc.RecoveryStrategy.doRecovery Begin buffering updates. core=collection1
[junit4:junit4]   2> 13863 T73 oascc.ZkStateReader$2.process A cluster state change has occurred - updating... (4)
[junit4:junit4]   2> 13867 T76 C0 P60679 oasu.UpdateLog.bufferUpdates Starting to buffer updates. FSUpdateLog{state=ACTIVE, tlog=null}
[junit4:junit4]   2> 13870 T76 C0 P60679 oasc.RecoveryStrategy.replicate Attempting to replicate from http://127.0.0.1:60670/solr/collection1/. core=collection1
[junit4:junit4]   2> 13871 T76 C0 P60679 oascsi.HttpClientUtil.createClient Creating new http client, config:maxConnections=128&maxConnectionsPerHost=32&followRedirects=false
[junit4:junit4]   2> 13903 T54 C1 P60670 oascsi.HttpClientUtil.createClient Creating new http client, config:maxConnections=500&maxConnectionsPerHost=16
[junit4:junit4]   2> 13921 T54 C1 P60670 oasu.DirectUpdateHandler2.commit start commit{flags=0,_version_=0,optimize=false,openSearcher=false,waitSearcher=true,expungeDeletes=false,softCommit=false}
[junit4:junit4]   2> 13928 T54 C1 P60670 oasc.SolrDeletionPolicy.onInit SolrDeletionPolicy.onInit: commits:num=1
[junit4:junit4]   2> 		commit{dir=RateLimitedDirectoryWrapper(NRTCachingDirectory(org.apache.lucene.store.MMapDirectory@C:\Users\JenkinsSlave\workspace\Lucene-Solr-4.x-Windows\solr\build\solr-core\test\J0\org.apache.solr.cloud.SyncSliceTest-1355269716905\jetty1\index lockFactory=org.apache.lucene.store.NativeFSLockFactory@5e0054a2; maxCacheMB=48.0 maxMergeSizeMB=4.0)),segFN=segments_1,generation=1,filenames=[segments_1]
[junit4:junit4]   2> 13929 T54 C1 P60670 oasc.SolrDeletionPolicy.updateCommits newest commit = 1
[junit4:junit4]   2> 13959 T54 C1 P60670 oasc.SolrDeletionPolicy.onCommit SolrDeletionPolicy.onCommit: commits:num=2
[junit4:junit4]   2> 		commit{dir=RateLimitedDirectoryWrapper(NRTCachingDirectory(org.apache.lucene.store.MMapDirectory@C:\Users\JenkinsSlave\workspace\Lucene-Solr-4.x-Windows\solr\build\solr-core\test\J0\org.apache.solr.cloud.SyncSliceTest-1355269716905\jetty1\index lockFactory=org.apache.lucene.store.NativeFSLockFactory@5e0054a2; maxCacheMB=48.0 maxMergeSizeMB=4.0)),segFN=segments_1,generation=1,filenames=[segments_1]
[junit4:junit4]   2> 		commit{dir=RateLimitedDirectoryWrapper(NRTCachingDirectory(org.apache.lucene.store.MMapDirectory@C:\Users\JenkinsSlave\workspace\Lucene-Solr-4.x-Windows\solr\build\solr-core\test\J0\org.apache.solr.cloud.SyncSliceTest-1355269716905\jetty1\index lockFactory=org.apache.lucene.store.NativeFSLockFactory@5e0054a2; maxCacheMB=48.0 maxMergeSizeMB=4.0)),segFN=segments_2,generation=2,filenames=[segments_2]
[junit4:junit4]   2> 13959 T54 C1 P60670 oasc.SolrDeletionPolicy.updateCommits newest commit = 2
[junit4:junit4]   2> 13962 T54 C1 P60670 oass.SolrIndexSearcher.<init> Opening Searcher@630fde26 realtime
[junit4:junit4]   2> 13963 T54 C1 P60670 oass.SolrIndexSearcher.getIndexDir WARNING WARNING: Directory impl does not support setting indexDir: org.apache.lucene.store.RateLimitedDirectoryWrapper
[junit4:junit4]   2> 13963 T54 C1 P60670 oasu.DirectUpdateHandler2.commit end_commit_flush
[junit4:junit4]   2> 13964 T54 C1 P60670 /update {waitSearcher=true&openSearcher=false&commit=true&commit_end_point=true&wt=javabin&softCommit=false&version=2} {commit=} 0 70
[junit4:junit4]   2> 14006 T76 C0 P60679 oash.ReplicationHandler.inform Commits will be reserved for  10000
[junit4:junit4]   2> 14007 T76 C0 P60679 oascsi.HttpClientUtil.createClient Creating new http client, config:connTimeout=5000&socketTimeout=20000&allowCompression=false&maxConnections=10000&maxConnectionsPerHost=10000
[junit4:junit4]   2> 14022 T76 C0 P60679 oash.SnapPuller.<init>  No value set for 'pollInterval'. Timer Task not started.
[junit4:junit4]   2> 14059 T51 C1 P60670 oash.ReplicationHandler.inform Commits will be reserved for  10000
[junit4:junit4]   2> 14060 T51 C1 P60670 REQ /replication {command=indexversion&wt=javabin&qt=/replication&version=2} status=0 QTime=36 
[junit4:junit4]   2> 14061 T76 C0 P60679 oash.SnapPuller.fetchLatestIndex Master's generation: 2
[junit4:junit4]   2> 14061 T76 C0 P60679 oash.SnapPuller.fetchLatestIndex Slave's generation: 1
[junit4:junit4]   2> 14061 T76 C0 P60679 oash.SnapPuller.fetchLatestIndex Starting replication process
[junit4:junit4]   2> 14066 T49 C1 P60670 REQ /replication {command=filelist&generation=2&wt=javabin&qt=/replication&version=2} status=0 QTime=1 
[junit4:junit4]   2> 14068 T76 C0 P60679 oash.SnapPuller.fetchLatestIndex Number of files in latest index in master: 1
[junit4:junit4]   2> 14072 T76 C0 P60679 oash.SnapPuller.fetchLatestIndex Starting download to .\org.apache.solr.cloud.SyncSliceTest-1355269716905\jetty2\index.20121211214850961 fullCopy=true
[junit4:junit4]   2> 14086 T53 C1 P60670 REQ /replication {file=segments_2&command=filecontent&checksum=true&generation=2&qt=/replication&wt=filestream} status=0 QTime=5 
[junit4:junit4]   2> 14101 T76 C0 P60679 oash.SnapPuller.fetchLatestIndex Total time taken for download : 0 secs
[junit4:junit4]   2> 14119 T76 C0 P60679 oash.SnapPuller.modifyIndexProps New index installed. Updating index properties... index=index.20121211214850961
[junit4:junit4]   2> 14128 T76 C0 P60679 oasc.SolrCore.getNewIndexDir New index directory detected: old=.\org.apache.solr.cloud.SyncSliceTest-1355269716905/jetty2\index/ new=.\org.apache.solr.cloud.SyncSliceTest-1355269716905/jetty2\index.20121211214850961
[junit4:junit4]   2> 14131 T76 C0 P60679 oasc.CachingDirectoryFactory.get return new directory for C:\Users\JenkinsSlave\workspace\Lucene-Solr-4.x-Windows\solr\build\solr-core\test\J0\.\org.apache.solr.cloud.SyncSliceTest-1355269716905\jetty2\index.20121211214850961 forceNew:false
[junit4:junit4]   2> 14139 T76 C0 P60679 oasc.SolrDeletionPolicy.onInit SolrDeletionPolicy.onInit: commits:num=1
[junit4:junit4]   2> 		commit{dir=RateLimitedDirectoryWrapper(NRTCachingDirectory(org.apache.lucene.store.MMapDirectory@C:\Users\JenkinsSlave\workspace\Lucene-Solr-4.x-Windows\solr\build\solr-core\test\J0\org.apache.solr.cloud.SyncSliceTest-1355269716905\jetty2\index.20121211214850961 lockFactory=org.apache.lucene.store.NativeFSLockFactory@41a6492c; maxCacheMB=48.0 maxMergeSizeMB=4.0)),segFN=segments_2,generation=2,filenames=[segments_2]
[junit4:junit4]   2> 14140 T76 C0 P60679 oasc.SolrDeletionPolicy.updateCommits newest commit = 2
[junit4:junit4]   2> 14145 T76 C0 P60679 oasu.DefaultSolrCoreState.newIndexWriter Creating new IndexWriter...
[junit4:junit4]   2> 14146 T76 C0 P60679 oasu.DefaultSolrCoreState.newIndexWriter Waiting until IndexWriter is unused... core=collection1
[junit4:junit4]   2> 14146 T76 C0 P60679 oasu.DefaultSolrCoreState.newIndexWriter Rollback old IndexWriter... core=collection1
[junit4:junit4]   2> 14147 T76 C0 P60679 oasc.CachingDirectoryFactory.close Closing directory:C:\Users\JenkinsSlave\workspace\Lucene-Solr-4.x-Windows\solr\build\solr-core\test\J0\.\org.apache.solr.cloud.SyncSliceTest-1355269716905\jetty2\index.20121211214850961
[junit4:junit4]   2> 14149 T76 C0 P60679 oash.SnapPuller$2.onClose removing old index directory .\org.apache.solr.cloud.SyncSliceTest-1355269716905\jetty2\index
[junit4:junit4]   2> 14154 T76 C0 P60679 oasc.CachingDirectoryFactory.get return new directory for C:\Users\JenkinsSlave\workspace\Lucene-Solr-4.x-Windows\solr\build\solr-core\test\J0\.\org.apache.solr.cloud.SyncSliceTest-1355269716905\jetty2\index.20121211214850961 forceNew:true
[junit4:junit4]   2> 14158 T76 C0 P60679 oasc.SolrDeletionPolicy.onInit SolrDeletionPolicy.onInit: commits:num=1
[junit4:junit4]   2> 		commit{dir=RateLimitedDirectoryWrapper(NRTCachingDirectory(org.apache.lucene.store.MMapDirectory@C:\Users\JenkinsSlave\workspace\Lucene-Solr-4.x-Windows\solr\build\solr-core\test\J0\org.apache.solr.cloud.SyncSliceTest-1355269716905\jetty2\index.20121211214850961 lockFactory=org.apache.lucene.store.NativeFSLockFactory@647c5770; maxCacheMB=48.0 maxMergeSizeMB=4.0)),segFN=segments_2,generation=2,filenames=[segments_2]
[junit4:junit4]   2> 14159 T76 C0 P60679 oasc.SolrDeletionPolicy.updateCommits newest commit = 2
[junit4:junit4]   2> 14159 T76 C0 P60679 oasu.DefaultSolrCoreState.newIndexWriter New IndexWriter is ready to be used.
[junit4:junit4]   2> 14160 T76 C0 P60679 oass.SolrIndexSearcher.<init> Opening Searcher@69b56985 main
[junit4:junit4]   2> 14160 T76 C0 P60679 oass.SolrIndexSearcher.getIndexDir WARNING WARNING: Directory impl does not support setting indexDir: org.apache.lucene.store.RateLimitedDirectoryWrapper
[junit4:junit4]   2> 14171 T75 oasc.SolrCore.registerSearcher [collection1] Registered new searcher Searcher@69b56985 main{StandardDirectoryReader(segments_2:1:nrt)}
[junit4:junit4]   2> 14172 T76 C0 P60679 oasu.DirectUpdateHandler2.commit start commit{flags=0,_version_=0,optimize=false,openSearcher=false,waitSearcher=false,expungeDeletes=false,softCommit=false}
[junit4:junit4]   2> 14219 T76 C0 P60679 oasc.SolrDeletionPolicy.onCommit SolrDeletionPolicy.onCommit: commits:num=2
[junit4:junit4]   2> 		commit{dir=RateLimitedDirectoryWrapper(NRTCachingDirectory(org.apache.lucene.store.MMapDirectory@C:\Users\JenkinsSlave\workspace\Lucene-Solr-4.x-Windows\solr\build\solr-core\test\J0\org.apache.solr.cloud.SyncSliceTest-1355269716905\jetty2\index.20121211214850961 lockFactory=org.apache.lucene.store.NativeFSLockFactory@647c5770; maxCacheMB=48.0 maxMergeSizeMB=4.0)),segFN=segments_2,generation=2,filenames=[segments_2]
[junit4:junit4]   2> 		commit{dir=RateLimitedDirectoryWrapper(NRTCachingDirectory(org.apache.lucene.store.MMapDirectory@C:\Users\JenkinsSlave\workspace\Lucene-Solr-4.x-Windows\solr\build\solr-core\test\J0\org.apache.solr.cloud.SyncSliceTest-1355269716905\jetty2\index.20121211214850961 lockFactory=org.apache.lucene.store.NativeFSLockFactory@647c5770; maxCacheMB=48.0 maxMergeSizeMB=4.0)),segFN=segments_3,generation=3,filenames=[segments_3]
[junit4:junit4]   2> 14219 T76 C0 P60679 oasc.SolrDeletionPolicy.updateCommits newest commit = 3
[junit4:junit4]   2> 14223 T76 C0 P60679 oasu.DirectUpdateHandler2.commit end_commit_flush
[junit4:junit4]   2> 14224 T76 C0 P60679 oasc.RecoveryStrategy.replay No replay needed. core=collection1
[junit4:junit4]   2> 14225 T76 C0 P60679 oasc.RecoveryStrategy.doRecovery Replication Recovery was successful - registering as Active. core=collection1
[junit4:junit4]   2> 14225 T76 C0 P60679 oasc.ZkController.publish publishing core=collection1 state=active
[junit4:junit4]   2> 14225 T76 C0 P60679 oasc.ZkController.publish numShards not found on descriptor - reading it from system property
[junit4:junit4]   2> 14238 T76 C0 P60679 oasc.RecoveryStrategy.doRecovery Finished recovery process. core=collection1
[junit4:junit4]   2> 14278 T91 oasc.CoreContainer.register registering core: collection1
[junit4:junit4]   2> 14278 T91 oasc.ZkController.register Register shard - core:collection1 address:http://127.0.0.1:60688/solr shardId:shard1
[junit4:junit4]   2> 14301 T91 oasc.ZkController.register We are http://127.0.0.1:60688/solr/collection1/ and leader is http://127.0.0.1:60670/solr/collection1/
[junit4:junit4]   2> 14301 T91 oasc.ZkController.register No LogReplay needed for core=collection1 baseURL=http://127.0.0.1:60688/solr
[junit4:junit4]   2> 14302 T91 oasc.ZkController.checkRecovery Core needs to recover:collection1
[junit4:junit4]   2> 14302 T91 oasu.DefaultSolrCoreState.doRecovery Running recovery - first canceling any ongoing recovery
[junit4:junit4]   2> 14303 T91 oascc.ZkStateReader.updateClusterState Updating cloud state from ZooKeeper... 
[junit4:junit4]   2> 14306 T18 oass.SolrDispatchFilter.init user.dir=C:\Users\JenkinsSlave\workspace\Lucene-Solr-4.x-Windows\solr\build\solr-core\test\J0
[junit4:junit4]   2> 14306 T18 oass.SolrDispatchFilter.init SolrDispatchFilter.init() done
[junit4:junit4]   2> 14307 T18 oascsi.HttpClientUtil.createClient Creating new http client, config:maxConnections=128&maxConnectionsPerHost=32&followRedirects=false
[junit4:junit4]   2> ASYNC  NEW_CORE C2 name=collection1 org.apache.solr.core.SolrCore@7ab88e22 url=http://127.0.0.1:60688/solr/collection1 node=127.0.0.1:60688_solr
[junit4:junit4]   2> 14308 T94 C2 P60688 oasc.RecoveryStrategy.run Starting recovery process.  core=collection1 recoveringAfterStartup=true
[junit4:junit4]   2> 14309 T94 C2 P60688 oasc.RecoveryStrategy.doRecovery ###### startupVersions=[]
[junit4:junit4]   2> 14309 T94 C2 P60688 oasc.ZkController.publish publishing core=collection1 state=recovering
[junit4:junit4]   2> 14309 T94 C2 P60688 oasc.ZkController.publish numShards not found on descriptor - reading it from system property
[junit4:junit4]   2> 14337 T94 C2 P60688 oasc.RecoveryStrategy.doRecovery Attempting to PeerSync from http://127.0.0.1:60670/solr/collection1/ core=collection1 - recoveringAfterStartup=true
[junit4:junit4]   2> 14337 T94 C2 P60688 oasu.PeerSync.sync PeerSync: core=collection1 url=http://127.0.0.1:60688/solr START replicas=[http://127.0.0.1:60670/solr/collection1/] nUpdates=100
[junit4:junit4]   2> 14338 T94 C2 P60688 oasu.PeerSync.sync WARNING no frame of reference to tell of we've missed updates
[junit4:junit4]   2> 14338 T94 C2 P60688 oasc.RecoveryStrategy.doRecovery PeerSync Recovery was not successful - trying replication. core=collection1
[junit4:junit4]   2> 14339 T94 C2 P60688 oasc.RecoveryStrategy.doRecovery Starting Replication Recovery. core=collection1
[junit4:junit4]   2> 14339 T94 C2 P60688 oascsi.HttpClientUtil.createClient Creating new http client, config:maxConnections=128&maxConnectionsPerHost=32&followRedirects=false
[junit4:junit4]   2> 14351 T54 C1 P60670 REQ /get {distrib=false&qt=/get&wt=javabin&version=2&getVersions=100} status=0 QTime=0 
[junit4:junit4]   2> 14404 T42 oascc.ZkStateReader.updateClusterState Updating cloud state from ZooKeeper... 
[junit4:junit4]   2> 14405 T42 oasc.Overseer$ClusterStateUpdater.updateState Update state numShards=1 message={
[junit4:junit4]   2> 	  "operation":"state",
[junit4:junit4]   2> 	  "numShards":"1",
[junit4:junit4]   2> 	  "shard":"shard1",
[junit4:junit4]   2> 	  "roles":null,
[junit4:junit4]   2> 	  "state":"active",
[junit4:junit4]   2> 	  "core":"collection1",
[junit4:junit4]   2> 	  "collection":"collection1",
[junit4:junit4]   2> 	  "node_name":"127.0.0.1:60679_solr",
[junit4:junit4]   2> 	  "base_url":"http://127.0.0.1:60679/solr"}
[junit4:junit4]   2> 14442 T42 oasc.Overseer$ClusterStateUpdater.updateState Update state numShards=1 message={
[junit4:junit4]   2> 	  "operation":"state",
[junit4:junit4]   2> 	  "numShards":"1",
[junit4:junit4]   2> 	  "shard":"shard1",
[junit4:junit4]   2> 	  "roles":null,
[junit4:junit4]   2> 	  "state":"recovering",
[junit4:junit4]   2> 	  "core":"collection1",
[junit4:junit4]   2> 	  "collection":"collection1",
[junit4:junit4]   2> 	  "node_name":"127.0.0.1:60688_solr",
[junit4:junit4]   2> 	  "base_url":"http://127.0.0.1:60688/solr"}
[junit4:junit4]   2> 14518 T90 oascc.ZkStateReader$2.process A cluster state change has occurred - updating... (4)
[junit4:junit4]   2> 14518 T58 oascc.ZkStateReader$2.process A cluster state change has occurred - updating... (4)
[junit4:junit4]   2> 14519 T41 oascc.ZkStateReader$2.process A cluster state change has occurred - updating... (4)
[junit4:junit4]   2> 14519 T73 oascc.ZkStateReader$2.process A cluster state change has occurred - updating... (4)
[junit4:junit4]   2> 14658 T18 oejs.Server.doStart jetty-8.1.8.v20121106
[junit4:junit4]   2> 14662 T18 oejs.AbstractConnector.doStart Started SelectChannelConnector@0.0.0.0:60702
[junit4:junit4]   2> 14663 T18 oasc.SolrResourceLoader.locateSolrHome JNDI not configured for solr (NoInitialContextEx)
[junit4:junit4]   2> 14664 T18 oasc.SolrResourceLoader.locateSolrHome using system property solr.solr.home: C:\Users\JenkinsSlave\workspace\Lucene-Solr-4.x-Windows\solr\build\solr-core\test\J0\.\solrtest-jetty4-1355269731209
[junit4:junit4]   2> 14664 T18 oasc.SolrResourceLoader.<init> new SolrResourceLoader for deduced Solr Home: 'C:\Users\JenkinsSlave\workspace\Lucene-Solr-4.x-Windows\solr\build\solr-core\test\J0\.\solrtest-jetty4-1355269731209\'
[junit4:junit4]   2> 14710 T18 oass.SolrDispatchFilter.init SolrDispatchFilter.init()
[junit4:junit4]   2> 14711 T18 oasc.SolrResourceLoader.locateSolrHome JNDI not configured for solr (NoInitialContextEx)
[junit4:junit4]   2> 14711 T18 oasc.SolrResourceLoader.locateSolrHome using system property solr.solr.home: C:\Users\JenkinsSlave\workspace\Lucene-Solr-4.x-Windows\solr\build\solr-core\test\J0\.\solrtest-jetty4-1355269731209
[junit4:junit4]   2> 14712 T18 oasc.CoreContainer$Initializer.initialize looking for solr.xml: C:\Users\JenkinsSlave\workspace\Lucene-Solr-4.x-Windows\solr\build\solr-core\test\J0\.\solrtest-jetty4-1355269731209\solr.xml
[junit4:junit4]   2> 14713 T18 oasc.CoreContainer.<init> New CoreContainer 1563044536
[junit4:junit4]   2> 14713 T18 oasc.CoreContainer.load Loading CoreContainer using Solr Home: 'C:\Users\JenkinsSlave\workspace\Lucene-Solr-4.x-Windows\solr\build\solr-core\test\J0\.\solrtest-jetty4-1355269731209\'
[junit4:junit4]   2> 14713 T18 oasc.SolrResourceLoader.<init> new SolrResourceLoader for directory: 'C:\Users\JenkinsSlave\workspace\Lucene-Solr-4.x-Windows\solr\build\solr-core\test\J0\.\solrtest-jetty4-1355269731209\'
[junit4:junit4]   2> 14747 T18 oasc.CoreContainer.load Registering Log Listener
[junit4:junit4]   2> 14766 T18 oasc.CoreContainer.initZooKeeper Zookeeper client=127.0.0.1:60654/solr
[junit4:junit4]   2> 14767 T18 oasc.ZkController.checkChrootPath zkHost includes chroot
[junit4:junit4]   2> 14767 T18 oaz.ZooKeeper.<init> Initiating client connection, connectString=127.0.0.1:60654 sessionTimeout=60000 watcher=org.apache.solr.common.cloud.ConnectionManager@7490d128
[junit4:junit4]   2> 14769 T18 oascc.ConnectionManager.waitForConnected Waiting for client to connect to ZooKeeper
[junit4:junit4]   2> 14770 T105 oaz.ClientCnxn$SendThread.logStartConnect Opening socket connection to server 127.0.0.1/127.0.0.1:60654. Will not attempt to authenticate using SASL (access denied ("javax.security.auth.AuthPermission" "getLoginConfiguration"))
[junit4:junit4]   2> 14771 T105 oaz.ClientCnxn$SendThread.primeConnection Socket connection established to 127.0.0.1/127.0.0.1:60654, initiating session
[junit4:junit4]   2> 14771 T20 oazs.NIOServerCnxnFactory.run Accepted socket connection from /127.0.0.1:60707
[junit4:junit4]   2> 14772 T20 oazs.ZooKeeperServer.processConnectRequest Client attempting to establish new session at /127.0.0.1:60707
[junit4:junit4]   2> 14785 T22 oazs.ZooKeeperServer.finishSessionInit Established session 0x13b8c5ebd2a000a with negotiated timeout 20000 for client /127.0.0.1:60707
[junit4:junit4]   2> 14785 T105 oaz.ClientCnxn$SendThread.onConnected Session establishment complete on server 127.0.0.1/127.0.0.1:60654, sessionid = 0x13b8c5ebd2a000a, negotiated timeout = 20000
[junit4:junit4]   2> 14785 T106 oascc.ConnectionManager.process Watcher org.apache.solr.common.cloud.ConnectionManager@7490d128 name:ZooKeeperConnection Watcher:127.0.0.1:60654 got event WatchedEvent state:SyncConnected type:None path:null path:null type:None
[junit4:junit4]   2> 14786 T18 oascc.ConnectionManager.waitForConnected Client is connected to ZooKeeper
[junit4:junit4]   2> 14788 T23 oazs.PrepRequestProcessor.pRequest2Txn Processed session termination for sessionid: 0x13b8c5ebd2a000a
[junit4:junit4]   2> 14793 T106 oaz.ClientCnxn$EventThread.run EventThread shut down
[junit4:junit4]   2> 14793 T20 oazs.NIOServerCnxn.doIO WARNING caught end of stream exception EndOfStreamException: Unable to read additional data from client sessionid 0x13b8c5ebd2a000a, likely client has closed socket
[junit4:junit4]   2> 	at org.apache.zookeeper.server.NIOServerCnxn.doIO(NIOServerCnxn.java:220)
[junit4:junit4]   2> 	at org.apache.zookeeper.server.NIOServerCnxnFactory.run(NIOServerCnxnFactory.java:208)
[junit4:junit4]   2> 	at java.lang.Thread.run(Thread.java:722)
[junit4:junit4]   2> 
[junit4:junit4]   2> 14794 T20 oazs.NIOServerCnxn.closeSock Closed socket connection for client /127.0.0.1:60707 which had sessionid 0x13b8c5ebd2a000a
[junit4:junit4]   2> 14793 T18 oaz.ZooKeeper.close Session: 0x13b8c5ebd2a000a closed
[junit4:junit4]   2> 14794 T18 oaz.ZooKeeper.<init> Initiating client connection, connectString=127.0.0.1:60654/solr sessionTimeout=8000 watcher=org.apache.solr.common.cloud.ConnectionManager@d4ab5b8
[junit4:junit4]   2> 14796 T18 oascc.ConnectionManager.waitForConnected Waiting for client to connect to ZooKeeper
[junit4:junit4]   2> 14797 T107 oaz.ClientCnxn$SendThread.logStartConnect Opening socket connection to server 127.0.0.1/127.0.0.1:60654. Will not attempt to authenticate using SASL (access denied ("javax.security.auth.AuthPermission" "getLoginConfiguration"))
[junit4:junit4]   2> 14799 T107 oaz.ClientCnxn$SendThread.primeConnection Socket connection established to 127.0.0.1/127.0.0.1:60654, initiating session
[junit4:junit4]   2> 14799 T20 oazs.NIOServerCnxnFactory.run Accepted socket connection from /127.0.0.1:60710
[junit4:junit4]   2> 14800 T20 oazs.ZooKeeperServer.processConnectRequest Client attempting to establish new session at /127.0.0.1:60710
[junit4:junit4]   2> 14823 T22 oazs.ZooKeeperServer.finishSessionInit Established session 0x13b8c5ebd2a000b with negotiated timeout 8000 for client /127.0.0.1:60710
[junit4:junit4]   2> 14823 T107 oaz.ClientCnxn$SendThread.onConnected Session establishment complete on server 127.0.0.1/127.0.0.1:60654, sessionid = 0x13b8c5ebd2a000b, negotiated timeout = 8000
[junit4:junit4]   2> 14824 T108 oascc.ConnectionManager.process Watcher org.apache.solr.common.cloud.ConnectionManager@d4ab5b8 name:ZooKeeperConnection Watcher:127.0.0.1:60654/solr got event WatchedEvent state:SyncConnected type:None path:null path:null type:None
[junit4:junit4]   2> 14826 T18 oascc.ConnectionManager.waitForConnected Client is connected to ZooKeeper
[junit4:junit4]   2> 14829 T23 oazs.PrepRequestProcessor.pRequest Got user-level KeeperException when processing sessionid:0x13b8c5ebd2a000b type:create cxid:0x1 zxid:0x9b txntype:-1 reqpath:n/a Error Path:/solr/overseer Error:KeeperErrorCode = NodeExists for /solr/overseer
[junit4:junit4]   2> 14854 T23 oazs.PrepRequestProcessor.pRequest Got user-level KeeperException when processing sessionid:0x13b8c5ebd2a000b type:create cxid:0x2 zxid:0x9c txntype:-1 reqpath:n/a Error Path:/solr/overseer Error:KeeperErrorCode = NodeExists for /solr/overseer
[junit4:junit4]   2> 14874 T18 oasc.ZkController.createEphemeralLiveNode Register node as live in ZooKeeper:/live_nodes/127.0.0.1:60702_solr
[junit4:junit4]   2> 14875 T23 oazs.PrepRequestProcessor.pRequest Got user-level KeeperException when processing sessionid:0x13b8c5ebd2a000b type:delete cxid:0x4 zxid:0x9d txntype:-1 reqpath:n/a Error Path:/solr/live_nodes/127.0.0.1:60702_solr Error:KeeperErrorCode = NoNode for /solr/live_nodes/127.0.0.1:60702_solr
[junit4:junit4]   2> 14883 T18 oascc.SolrZkClient.makePath makePath: /live_nodes/127.0.0.1:60702_solr
[junit4:junit4]   2> 14895 T90 oascc.ZkStateReader$2.process A cluster state change has occurred - updating... (4)
[junit4:junit4]   2> 14898 T41 oascc.ZkStateReader$3.process Updating live nodes... (5)
[junit4:junit4]   2> 14899 T41 oascc.ZkStateReader$2.process A cluster state change has occurred - updating... (5)
[junit4:junit4]   2> 14899 T73 oascc.ZkStateReader$3.process Updating live nodes... (5)
[junit4:junit4]   2> 14901 T73 oascc.ZkStateReader$2.process A cluster state change has occurred - updating... (5)
[junit4:junit4]   2> 14902 T58 oascc.ZkStateReader$3.process Updating live nodes... (5)
[junit4:junit4]   2> 14903 T58 oascc.ZkStateReader$2.process A cluster state change has occurred - updating... (5)
[junit4:junit4]   2> 14904 T18 oashc.HttpShardHandlerFactory.getParameter Setting socketTimeout to: 0
[junit4:junit4]   2> 14904 T18 oashc.HttpShardHandlerFactory.getParameter Setting urlScheme to: http://
[junit4:junit4]   2> 14905 T18 oashc.HttpShardHandlerFactory.getParameter Setting connTimeout to: 0
[junit4:junit4]   2> 14905 T18 oashc.HttpShardHandlerFactory.getParameter Setting maxConnectionsPerHost to: 20
[junit4:junit4]   2> 14907 T18 oashc.HttpShardHandlerFactory.getParameter Setting corePoolSize to: 0
[junit4:junit4]   2> 14909 T18 oashc.HttpShardHandlerFactory.getParameter Setting maximumPoolSize to: 2147483647
[junit4:junit4]   2> 14910 T18 oashc.HttpShardHandlerFactory.getParameter Setting maxThreadIdleTime to: 5
[junit4:junit4]   2> 14912 T18 oashc.HttpShardHandlerFactory.getParameter Setting sizeOfQueue to: -1
[junit4:junit4]   2> 14912 T18 oashc.HttpShardHandlerFactory.getParameter Setting fairnessPolicy to: false
[junit4:junit4]   2> 14912 T90 oascc.ZkStateReader$3.process Updating live nodes... (5)
[junit4:junit4]   2> 14913 T18 oascsi.HttpClientUtil.createClient Creating new http client, config:maxConnectionsPerHost=20&maxConnections=10000&socketTimeout=0&connTimeout=0&retry=false
[junit4:junit4]   2> 14946 T18 oascc.ZkStateReader.createClusterStateWatchersAndUpdate Updating cluster state from ZooKeeper... 
[junit4:junit4]   2> 14956 T109 oasc.CoreContainer.create Creating SolrCore 'collection1' using instanceDir: C:\Users\JenkinsSlave\workspace\Lucene-Solr-4.x-Windows\solr\build\solr-core\test\J0\.\solrtest-jetty4-1355269731209\collection1
[junit4:junit4]   2> 14957 T109 oasc.ZkController.createCollectionZkNode Check for collection zkNode:collection1
[junit4:junit4]   2> 14958 T109 oasc.ZkController.createCollectionZkNode Collection zkNode exists
[junit4:junit4]   2> 14959 T109 oasc.ZkController.readConfigName Load collection config from:/collections/collection1
[junit4:junit4]   2> 14961 T109 oasc.SolrResourceLoader.<init> new SolrResourceLoader for directory: 'C:\Users\JenkinsSlave\workspace\Lucene-Solr-4.x-Windows\solr\build\solr-core\test\J0\.\solrtest-jetty4-1355269731209\collection1\'
[junit4:junit4]   2> 14962 T109 oasc.SolrResourceLoader.replaceClassLoader Adding 'file:/C:/Users/JenkinsSlave/workspace/Lucene-Solr-4.x-Windows/solr/build/solr-core/test/J0/solrtest-jetty4-1355269731209/collection1/lib/classes/' to classloader
[junit4:junit4]   2> 14963 T109 oasc.SolrResourceLoader.replaceClassLoader Adding 'file:/C:/Users/JenkinsSlave/workspace/Lucene-Solr-4.x-Windows/solr/build/solr-core/test/J0/solrtest-jetty4-1355269731209/collection1/lib/README' to classloader
[junit4:junit4]   2> 15027 T109 oasc.SolrConfig.<init> Using Lucene MatchVersion: LUCENE_41
[junit4:junit4]   2> 15103 T109 oasc.SolrConfig.<init> Loaded SolrConfig: solrconfig.xml
[junit4:junit4]   2> 15105 T109 oass.IndexSchema.readSchema Reading Solr Schema
[junit4:junit4]   2> 15126 T109 oass.IndexSchema.readSchema Schema name=test
[junit4:junit4]   2> 15909 T109 oass.OpenExchangeRatesOrgProvider.init Initialized with rates=open-exchange-rates.json, refreshInterval=1440.
[junit4:junit4]   2> 15923 T109 oass.IndexSchema.readSchema default search field in schema is text
[junit4:junit4]   2> 15927 T109 oass.IndexSchema.readSchema unique key field: id
[junit4:junit4]   2> 15959 T109 oass.FileExchangeRateProvider.reload Reloading exchange rates from file currency.xml
[junit4:junit4]   2> 15967 T109 oass.FileExchangeRateProvider.reload Reloading exchange rates from file currency.xml
[junit4:junit4]   2> 15973 T109 oass.OpenExchangeRatesOrgProvider.reload Reloading exchange rates from open-exchange-rates.json
[junit4:junit4]   2> 15977 T109 oass.OpenExchangeRatesOrgProvider.reload Reloading exchange rates from open-exchange-rates.json
[junit4:junit4]   2> 15979 T109 oasc.SolrCore.<init> [collection1] Opening new SolrCore at C:\Users\JenkinsSlave\workspace\Lucene-Solr-4.x-Windows\solr\build\solr-core\test\J0\.\solrtest-jetty4-1355269731209\collection1\, dataDir=.\org.apache.solr.cloud.SyncSliceTest-1355269716905/jetty4\
[junit4:junit4]   2> 15980 T109 oasc.JmxMonitoredMap.<init> JMX monitoring is enabled. Adding Solr mbeans to JMX Server: com.sun.jmx.mbeanserver.JmxMBeanServer@2af6b7f
[junit4:junit4]   2> 15982 T109 oasc.SolrCore.getNewIndexDir New index directory detected: old=null new=.\org.apache.solr.cloud.SyncSliceTest-1355269716905/jetty4\index/
[junit4:junit4]   2> 15982 T109 oasc.SolrCore.initIndex WARNING [collection1] Solr index directory '.\org.apache.solr.cloud.SyncSliceTest-1355269716905\jetty4\index' doesn't exist. Creating new index...
[junit4:junit4]   2> 15984 T109 oasc.CachingDirectoryFactory.get return new directory for C:\Users\JenkinsSlave\workspace\Lucene-Solr-4.x-Windows\solr\build\solr-core\test\J0\.\org.apache.solr.cloud.SyncSliceTest-1355269716905\jetty4\index forceNew:false
[junit4:junit4]   2> 15998 T109 oasc.SolrDeletionPolicy.onCommit SolrDeletionPolicy.onCommit: commits:num=1
[junit4:junit4]   2> 		commit{dir=RateLimitedDirectoryWrapper(NRTCachingDirectory(org.apache.lucene.store.MMapDirectory@C:\Users\JenkinsSlave\workspace\Lucene-Solr-4.x-Windows\solr\build\solr-core\test\J0\org.apache.solr.cloud.SyncSliceTest-1355269716905\jetty4\index lockFactory=org.apache.lucene.store.NativeFSLockFactory@5c2d8c20; maxCacheMB=48.0 maxMergeSizeMB=4.0)),segFN=segments_1,generation=1,filenames=[segments_1]
[junit4:junit4]   2> 15998 T109 oasc.SolrDeletionPolicy.updateCommits newest commit = 1
[junit4:junit4]   2> 16001 T109 oasc.SolrCore.initWriters created xml: solr.XMLResponseWriter
[junit4:junit4]   2> 16003 T109 oasup.UpdateRequestProcessorChain.init inserting DistributedUpdateProcessorFactory into updateRequestProcessorChain "dedupe"
[junit4:junit4]   2> 16003 T109 oasup.UpdateRequestProcessorChain.init inserting DistributedUpdateProcessorFactory into updateRequestProcessorChain "dedupe-allfields"
[junit4:junit4]   2> 16004 T109 oasup.UpdateRequestProcessorChain.init inserting DistributedUpdateProcessorFactory into updateRequestProcessorChain "stored_sig"
[junit4:junit4]   2> 16005 T109 oasup.UpdateRequestProcessorChain.init inserting DistributedUpdateProcessorFactory into updateRequestProcessorChain "uniq-fields"
[junit4:junit4]   2> 16006 T109 oasup.UpdateRequestProcessorChain.init inserting DistributedUpdateProcessorFactory into updateRequestProcessorChain "distrib-dup-test-chain-implicit"
[junit4:junit4]   2> 16006 T109 oasc.RequestHandlers.initHandlersFromConfig adding lazy requestHandler: solr.ReplicationHandler
[junit4:junit4]   2> 16007 T109 oasc.RequestHandlers.initHandlersFromConfig created /replication: solr.ReplicationHandler
[junit4:junit4]   2> 16008 T109 oasc.RequestHandlers.initHandlersFromConfig created standard: solr.StandardRequestHandler
[junit4:junit4]   2> 16009 T109 oasc.RequestHandlers.initHandlersFromConfig created /get: solr.RealTimeGetHandler
[junit4:junit4]   2> 16011 T109 oasc.RequestHandlers.initHandlersFromConfig created dismax: solr.SearchHandler
[junit4:junit4]   2> 16012 T109 oasc.RequestHandlers.initHandlersFromConfig created mock: org.apache.solr.core.MockQuerySenderListenerReqHandler
[junit4:junit4]   2> 16013 T109 oasc.RequestHandlers.initHandlersFromConfig created /admin/: org.apache.solr.handler.admin.AdminHandlers
[junit4:junit4]   2> 16014 T109 oasc.RequestHandlers.initHandlersFromConfig created defaults: solr.StandardRequestHandler
[junit4:junit4]   2> 16014 T109 oasc.RequestHandlers.initHandlersFromConfig adding lazy requestHandler: solr.StandardRequestHandler
[junit4:junit4]   2> 16015 T109 oasc.RequestHandlers.initHandlersFromConfig created lazy: solr.StandardRequestHandler
[junit4:junit4]   2> 16017 T109 oasc.RequestHandlers.initHandlersFromConfig created /update: solr.UpdateRequestHandler
[junit4:junit4]   2> 16018 T109 oasc.RequestHandlers.initHandlersFromConfig created /terms: org.apache.solr.handler.component.SearchHandler
[junit4:junit4]   2> 16020 T109 oasc.RequestHandlers.initHandlersFromConfig created spellCheckCompRH: org.apache.solr.handler.component.SearchHandler
[junit4:junit4]   2> 16021 T109 oasc.RequestHandlers.initHandlersFromConfig created spellCheckCompRH_Direct: org.apache.solr.handler.component.SearchHandler
[junit4:junit4]   2> 16022 T109 oasc.RequestHandlers.initHandlersFromConfig created spellCheckWithWordbreak: org.apache.solr.handler.component.SearchHandler
[junit4:junit4]   2> 16025 T109 oasc.RequestHandlers.initHandlersFromConfig created spellCheckWithWordbreak_Direct: org.apache.solr.handler.component.SearchHandler
[junit4:junit4]   2> 16027 T109 oasc.RequestHandlers.initHandlersFromConfig created spellCheckCompRH1: org.apache.solr.handler.component.SearchHandler
[junit4:junit4]   2> 16030 T109 oasc.RequestHandlers.initHandlersFromConfig created tvrh: org.apache.solr.handler.component.SearchHandler
[junit4:junit4]   2> 16030 T109 oasc.RequestHandlers.initHandlersFromConfig created /mlt: solr.MoreLikeThisHandler
[junit4:junit4]   2> 16033 T109 oasc.RequestHandlers.initHandlersFromConfig created /debug/dump: solr.DumpRequestHandler
[junit4:junit4]   2> 16049 T109 oashl.XMLLoader.init xsltCacheLifetimeSeconds=60
[junit4:junit4]   2> 16058 T109 oasc.SolrCore.initDeprecatedSupport WARNING solrconfig.xml uses deprecated <admin/gettableFiles>, Please update your config to use the ShowFileRequestHandler.
[junit4:junit4]   2> 16092 T109 oasc.SolrCore.initDeprecatedSupport WARNING adding ShowFileRequestHandler with hidden files: [SCHEMA.XML, OLD_SYNONYMS.TXT, STOPWORDS.TXT, PROTWORDS.TXT, OPEN-EXCHANGE-RATES.JSON, SYNONYMS.TXT, CURRENCY.XML, MAPPING-ISOLATIN1ACCENT.TXT]
[junit4:junit4]   2> 16099 T109 oass.SolrIndexSearcher.<init> Opening Searcher@13a9a4f9 main
[junit4:junit4]   2> 16099 T109 oass.SolrIndexSearcher.getIndexDir WARNING WARNING: Directory impl does not support setting indexDir: org.apache.lucene.store.RateLimitedDirectoryWrapper
[junit4:junit4]   2> 16101 T109 oasu.CommitTracker.<init> Hard AutoCommit: disabled
[junit4:junit4]   2> 16101 T109 oasu.CommitTracker.<init> Soft AutoCommit: disabled
[junit4:junit4]   2> 16102 T109 oashc.SpellCheckComponent.inform Initializing spell checkers
[junit4:junit4]   2> 16114 T109 oass.DirectSolrSpellChecker.init init: {name=direct,classname=DirectSolrSpellChecker,field=lowerfilt,minQueryLength=3}
[junit4:junit4]   2> 16186 T110 oasc.SolrCore.registerSearcher [collection1] Registered new searcher Searcher@13a9a4f9 main{StandardDirectoryReader(segments_1:1)}
[junit4:junit4]   2> 16196 T109 oasc.ZkController.publish publishing core=collection1 state=down
[junit4:junit4]   2> 16196 T109 oasc.ZkController.publish numShards not found on descriptor - reading it from system property
[junit4:junit4]   2> 16597 T42 oascc.ZkStateReader.updateClusterState Updating cloud state from ZooKeeper... 
[junit4:junit4]   2> 16599 T42 oasc.Overseer$ClusterStateUpdater.updateState Update state numShards=1 message={
[junit4:junit4]   2> 	  "operation":"state",
[junit4:junit4]   2> 	  "numShards":"1",
[junit4:junit4]   2> 	  "shard":null,
[junit4:junit4]   2> 	  "roles":null,
[junit4:junit4]   2> 	  "state":"down",
[junit4:junit4]   2> 	  "core":"collection1",
[junit4:junit4]   2> 	  "collection":"collection1",
[junit4:junit4]   2> 	  "node_name":"127.0.0.1:60702_solr",
[junit4:junit4]   2> 	  "base_url":"http://127.0.0.1:60702/solr"}
[junit4:junit4]   2> 16599 T42 oasc.Overseer$ClusterStateUpdater.updateState Collection already exists with numShards=1
[junit4:junit4]   2> 16599 T42 oasc.Overseer$ClusterStateUpdater.updateState Assigning new node to shard shard=shard1
[junit4:junit4]   2> 16611 T41 oascc.ZkStateReader$2.process A cluster state change has occurred - updating... (5)
[junit4:junit4]   2> 16612 T73 oascc.ZkStateReader$2.process A cluster state change has occurred - updating... (5)
[junit4:junit4]   2> 16612 T90 oascc.ZkStateReader$2.process A cluster state change has occurred - updating... (5)
[junit4:junit4]   2> 16613 T108 oascc.ZkStateReader$2.process A cluster state change has occurred - updating... (5)
[junit4:junit4]   2> 16614 T58 oascc.ZkStateReader$2.process A cluster state change has occurred - updating... (5)
[junit4:junit4]   2> 16699 T109 oasc.CoreContainer.register registering core: collection1
[junit4:junit4]   2> 16699 T109 oasc.ZkController.register Register shard - core:collection1 address:http://127.0.0.1:60702/solr shardId:shard1
[junit4:junit4]   2> 16706 T109 oasc.ZkController.register We are http://127.0.0.1:60702/solr/collection1/ and leader is http://127.0.0.1:60670/solr/collection1/
[junit4:junit4]   2> 16706 T109 oasc.ZkController.register No LogReplay needed for core=collection1 baseURL=http://127.0.0.1:60702/solr
[junit4:junit4]   2> 16706 T109 oasc.ZkController.checkRecovery Core needs to recover:collection1
[junit4:junit4]   2> 16707 T109 oasu.DefaultSolrCoreState.doRecovery Running recovery - first canceling any ongoing recovery
[junit4:junit4]   2> ASYNC  NEW_CORE C3 name=collection1 org.apache.solr.core.SolrCore@6772a6b0 url=http://127.0.0.1:60702/solr/collection1 node=127.0.0.1:60702_solr
[junit4:junit4]   2> 16707 T111 C3 P60702 oasc.RecoveryStrategy.run Starting recovery process.  core=collection1 recoveringAfterStartup=true
[junit4:junit4]   2> 16709 T111 C3 P60702 oasc.RecoveryStrategy.doRecovery ###### startupVersions=[]
[junit4:junit4]   2> 16709 T111 C3 P60702 oasc.ZkController.publish publishing core=collection1 state=recovering
[junit4:junit4]   2> 16709 T109 oascc.ZkStateReader.updateClusterState Updating cloud state from ZooKeeper... 
[junit4:junit4]   2> 16710 T111 C3 P60702 oasc.ZkController.publish numShards not found on descriptor - reading it from system property
[junit4:junit4]   2> 16712 T18 oass.SolrDispatchFilter.init user.dir=C:\Users\JenkinsSlave\workspace\Lucene-Solr-4.x-Windows\solr\build\solr-core\test\J0
[junit4:junit4]   2> 16712 T18 oass.SolrDispatchFilter.init SolrDispatchFilter.init() done
[junit4:junit4]   2> 16713 T18 oascsi.HttpClientUtil.createClient Creating new http client, config:maxConnections=128&maxConnectionsPerHost=32&followRedirects=false
[junit4:junit4]   2> 16725 T18 oaz.ZooKeeper.<init> Initiating client connection, connectString=127.0.0.1:60654/solr sessionTimeout=10000 watcher=org.apache.solr.common.cloud.ConnectionManager@228e339c
[junit4:junit4]   2> 16728 T18 oascc.ConnectionManager.waitForConnected Waiting for client to connect to ZooKeeper
[junit4:junit4]   2> 16729 T112 oaz.ClientCnxn$SendThread.logStartConnect Opening socket connection to server 127.0.0.1/127.0.0.1:60654. Will not attempt to authenticate using SASL (access denied ("javax.security.auth.AuthPermission" "getLoginConfiguration"))
[junit4:junit4]   2> 16730 T112 oaz.ClientCnxn$SendThread.primeConnection Socket connection established to 127.0.0.1/127.0.0.1:60654, initiating session
[junit4:junit4]   2> 16730 T20 oazs.NIOServerCnxnFactory.run Accepted socket connection from /127.0.0.1:60713
[junit4:junit4]   2> 16731 T111 C3 P60702 oasc.RecoveryStrategy.doRecovery Attempting to PeerSync from http://127.0.0.1:60670/solr/collection1/ core=collection1 - recoveringAfterStartup=true
[junit4:junit4]   2> 16731 T20 oazs.ZooKeeperServer.processConnectRequest Client attempting to establish new session at /127.0.0.1:60713
[junit4:junit4]   2> 16731 T111 C3 P60702 oasu.PeerSync.sync PeerSync: core=collection1 url=http://127.0.0.1:60702/solr START replicas=[http://127.0.0.1:60670/solr/collection1/] nUpdates=100
[junit4:junit4]   2> 16732 T111 C3 P60702 oasu.PeerSync.sync WARNING no frame of reference to tell of we've missed updates
[junit4:junit4]   2> 16732 T111 C3 P60702 oasc.RecoveryStrategy.doRecovery PeerSync Recovery was not successful - trying replication. core=collection1
[junit4:junit4]   2> 16733 T111 C3 P60702 oasc.RecoveryStrategy.doRecovery Starting Replication Recovery. core=collection1
[junit4:junit4]   2> 16734 T111 C3 P60702 oascsi.HttpClientUtil.createClient Creating new http client, config:maxConnections=128&maxConnectionsPerHost=32&followRedirects=false
[junit4:junit4]   2> 16733 T112 oaz.ClientCnxn$SendThread.onConnected Session establishment complete on server 127.0.0.1/127.0.0.1:60654, sessionid = 0x13b8c5ebd2a000c, negotiated timeout = 10000
[junit4:junit4]   2> 16736 T113 oascc.ConnectionManager.process Watcher org.apache.solr.common.cloud.ConnectionManager@228e339c name:ZooKeeperConnection Watcher:127.0.0.1:60654/solr got event WatchedEvent state:SyncConnected type:None path:null path:null type:None
[junit4:junit4]   2> 16737 T18 oascc.ConnectionManager.waitForConnected Client is connected to ZooKeeper
[junit4:junit4]   2> 16733 T22 oazs.ZooKeeperServer.finishSessionInit Established session 0x13b8c5ebd2a000c with negotiated timeout 10000 for client /127.0.0.1:60713
[junit4:junit4]   2> 16737 T51 C1 P60670 REQ /get {distrib=false&qt=/get&wt=javabin&version=2&getVersions=100} status=0 QTime=0 
[junit4:junit4]   2> 16739 T18 oascc.ZkStateReader.createClusterStateWatchersAndUpdate Updating cluster state from ZooKeeper... 
[junit4:junit4]   2> 16747 T18 oasc.ChaosMonkey.monkeyLog monkey: init - expire sessions:true cause connection loss:true
[junit4:junit4]   2> 16748 T18 oascsi.HttpClientUtil.createClient Creating new http client, config:
[junit4:junit4]   2> 16755 T18 oascc.ZkStateReader.updateClusterState Updating cloud state from ZooKeeper... 
[junit4:junit4]   2> 16758 T18 oasc.AbstractFullDistribZkTestBase.waitForThingsToLevelOut Wait for recoveries to finish - wait 15 for each attempt
[junit4:junit4]   2> 16758 T18 oasc.AbstractDistribZkTestBase.waitForRecoveriesToFinish Wait for recoveries to finish - collection: collection1 failOnTimeout:true timeout (sec):15
[junit4:junit4]   2> 16760 T18 oascc.ZkStateReader.updateClusterState Updating cloud state from ZooKeeper... 
[junit4:junit4]   2> 17132 T42 oascc.ZkStateReader.updateClusterState Updating cloud state from ZooKeeper... 
[junit4:junit4]   2> 17134 T42 oasc.Overseer$ClusterStateUpdater.updateState Update state numShards=1 message={
[junit4:junit4]   2> 	  "operation":"state",
[junit4:junit4]   2> 	  "numShards":"1",
[junit4:junit4]   2> 	  "shard":"shard1",
[junit4:junit4]   2> 	  "roles":null,
[junit4:junit4]   2> 	  "state":"recovering",
[junit4:junit4]   2> 	  "core":"collection1",
[junit4:junit4]   2> 	  "collection":"collection1",
[junit4:junit4]   2> 	  "node_name":"127.0.0.1:60702_solr",
[junit4:junit4]   2> 	  "base_url":"http://127.0.0.1:60702/solr"}
[junit4:junit4]   2> 17146 T108 oascc.ZkStateReader$2.process A cluster state change has occurred - updating... (5)
[junit4:junit4]   2> 17147 T113 oascc.ZkStateReader$2.process A cluster state change has occurred - updating... (5)
[junit4:junit4]   2> 17148 T73 oascc.ZkStateReader$2.process A cluster state change has occurred - updating... (5)
[junit4:junit4]   2> 17148 T41 oascc.ZkStateReader$2.process A cluster state change has occurred - updating... (5)
[junit4:junit4]   2> 17147 T90 oascc.ZkStateReader$2.process A cluster state change has occurred - updating... (5)
[junit4:junit4]   2> 17149 T58 oascc.ZkStateReader$2.process A cluster state change has occurred - updating... (5)
[junit4:junit4]   2>  C2_STATE=coll:collection1 core:collection1 props:{shard=shard1, roles=null, state=recovering, core=collection1, collection=collection1, node_name=127.0.0.1:60688_solr, base_url=http://127.0.0.1:60688/solr}
[junit4:junit4]   2> 17442 T94 C2 P60688 oasc.RecoveryStrategy.doRecovery Begin buffering updates. core=collection1
[junit4:junit4]   2> 17442 T94 C2 P60688 oasu.UpdateLog.bufferUpdates Starting to buffer updates. FSUpdateLog{state=ACTIVE, tlog=null}
[junit4:junit4]   2> 17442 T94 C2 P60688 oasc.RecoveryStrategy.replicate Attempting to replicate from http://127.0.0.1:60670/solr/collection1/. core=collection1
[junit4:junit4]   2> 17443 T94 C2 P60688 oascsi.HttpClientUtil.createClient Creating new http client, config:maxConnections=128&maxConnectionsPerHost=32&followRedirects=false
[junit4:junit4]   2> 17453 T50 C1 P60670 oasu.DirectUpdateHandler2.commit start commit{flags=0,_version_=0,optimize=false,openSearcher=false,waitSearcher=true,expungeDeletes=false,softCommit=false}
[junit4:junit4]   2> 17466 T50 C1 P60670 oasc.SolrDeletionPolicy.onCommit SolrDeletionPolicy.onCommit: commits:num=2
[junit4:junit4]   2> 		commit{dir=RateLimitedDirectoryWrapper(NRTCachingDirectory(org.apache.lucene.store.MMapDirectory@C:\Users\JenkinsSlave\workspace\Lucene-Solr-4.x-Windows\solr\build\solr-core\test\J0\org.apache.solr.cloud.SyncSliceTest-1355269716905\jetty1\index lockFactory=org.apache.lucene.store.NativeFSLockFactory@5e0054a2; maxCacheMB=48.0 maxMergeSizeMB=4.0)),segFN=segments_2,generation=2,filenames=[segments_2]
[junit4:junit4]   2> 		commit{dir=RateLimitedDirectoryWrapper(NRTCachingDirectory(org.apache.lucene.store.MMapDirectory@C:\Users\JenkinsSlave\workspace\Lucene-Solr-4.x-Windows\solr\build\solr-core\test\J0\org.apache.solr.cloud.SyncSliceTest-1355269716905\jetty1\index lockFactory=org.apache.lucene.store.NativeFSLockFactory@5e0054a2; maxCacheMB=48.0 maxMergeSizeMB=4.0)),segFN=segments_3,generation=3,filenames=[segments_3]
[junit4:junit4]   2> 17466 T50 C1 P60670 oasc.SolrDeletionPolicy.updateCommits newest commit = 3
[junit4:junit4]   2> 17468 T50 C1 P60670 oasu.DirectUpdateHandler2.commit end_commit_flush
[junit4:junit4]   2> 17468 T50 C1 P60670 /update {waitSearcher=true&openSearcher=false&commit=true&commit_end_point=true&wt=javabin&softCommit=false&version=2} {commit=} 0 15
[junit4:junit4]   2> 17470 T94 C2 P60688 oash.ReplicationHandler.inform Commits will be reserved for  10000
[junit4:junit4]   2> 17470 T94 C2 P60688 oash.SnapPuller.<init>  No value set for 'pollInterval'. Timer Task not started.
[junit4:junit4]   2> 17476 T49 C1 P60670 REQ /replication {command=indexversion&wt=javabin&qt=/replication&version=2} status=0 QTime=2 
[junit4:junit4]   2> 17477 T94 C2 P60688 oash.SnapPuller.fetchLatestIndex Master's generation: 3
[junit4:junit4]   2> 17477 T94 C2 P60688 oash.SnapPuller.fetchLatestIndex Slave's generation: 1
[junit4:junit4]   2> 17477 T94 C2 P60688 oash.SnapPuller.fetchLatestIndex Starting replication process
[junit4:junit4]   2> 17481 T51 C1 P60670 REQ /replication {command=filelist&generation=3&wt=javabin&qt=/replication&version=2} status=0 QTime=0 
[junit4:junit4]   2> 17483 T94 C2 P60688 oash.SnapPuller.fetchLatestIndex Number of files in latest index in master: 1
[junit4:junit4]   2> 17485 T94 C2 P60688 oash.SnapPuller.fetchLatestIndex Starting download to .\org.apache.solr.cloud.SyncSliceTest-1355269716905\jetty3\index.20121211214854376 fullCopy=true
[junit4:junit4]   2> 17493 T52 C1 P60670 REQ /replication {file=segments_3&command=filecontent&checksum=true&generation=3&qt=/replication&wt=filestream} status=0 QTime=0 
[junit4:junit4]   2> 17495 T94 C2 P60688 oash.SnapPuller.fetchLatestIndex Total time taken for download : 0 secs
[junit4:junit4]   2> 17497 T94 C2 P60688 oash.SnapPuller.modifyIndexProps New index installed. Updating index properties... index=index.20121211214854376
[junit4:junit4]   2> 17498 T94 C2 P60688 oasc.SolrCore.getNewIndexDir New index directory detected: old=.\org.apache.solr.cloud.SyncSliceTest-1355269716905/jetty3\index/ new=.\org.apache.solr.cloud.SyncSliceTest-1355269716905/jetty3\index.20121211214854376
[junit4:junit4]   2> 17499 T94 C2 P60688 oasc.CachingDirectoryFactory.get return new directory for C:\Users\JenkinsSlave\workspace\Lucene-Solr-4.x-Windows\solr\build\solr-core\test\J0\.\org.apache.solr.cloud.SyncSliceTest-1355269716905\jetty3\index.20121211214854376 forceNew:false
[junit4:junit4]   2> 17503 T94 C2 P60688 oasc.SolrDeletionPolicy.onInit SolrDeletionPolicy.onInit: commits:num=1
[junit4:junit4]   2> 		commit{dir=RateLimitedDirectoryWrapper(NRTCachingDirectory(org.apache.lucene.store.MMapDirectory@C:\Users\JenkinsSlave\workspace\Lucene-Solr-4.x-Windows\solr\build\solr-core\test\J0\org.apache.solr.cloud.SyncSliceTest-1355269716905\jetty3\index.20121211214854376 lockFactory=org.apache.lucene.store.NativeFSLockFactory@1e190849; maxCacheMB=48.0 maxMergeSizeMB=4.0)),segFN=segments_3,generation=3,filenames=[segments_3]
[junit4:junit4]   2> 17503 T94 C2 P60688 oasc.SolrDeletionPolicy.updateCommits newest commit = 3
[junit4:junit4]   2> 17506 T94 C2 P60688 oasu.DefaultSolrCoreState.newIndexWriter Creating new IndexWriter...
[junit4:junit4]   2> 17506 T94 C2 P60688 oasu.DefaultSolrCoreState.newIndexWriter Waiting until IndexWriter is unused... core=collection1
[junit4:junit4]   2> 17507 T94 C2 P60688 oasu.DefaultSolrCoreState.newIndexWriter Rollback old IndexWriter... core=collection1
[junit4:junit4]   2> 17508 T94 C2 P60688 oasc.CachingDirectoryFactory.close Closing directory:C:\Users\JenkinsSlave\workspace\Lucene-Solr-4.x-Windows\solr\build\solr-core\test\J0\.\org.apache.solr.cloud.SyncSliceTest-1355269716905\jetty3\index.20121211214854376
[junit4:junit4]   2> 17508 T94 C2 P60688 oash.SnapPuller$2.onClose removing old index directory .\org.apache.solr.cloud.SyncSliceTest-1355269716905\jetty3\index
[junit4:junit4]   2> 17514 T94 C2 P60688 oasc.CachingDirectoryFactory.get return new directory for C:\Users\JenkinsSlave\workspace\Lucene-Solr-4.x-Windows\solr\build\solr-core\test\J0\.\org.apache.solr.cloud.SyncSliceTest-1355269716905\jetty3\index.20121211214854376 forceNew:true
[junit4:junit4]   2> 17518 T94 C2 P60688 oasc.SolrDeletionPolicy.onInit SolrDeletionPolicy.onInit: commits:num=1
[junit4:junit4]   2> 		commit{dir=RateLimitedDirectoryWrapper(NRTCachingDirectory(org.apache.lucene.store.MMapDirectory@C:\Users\JenkinsSlave\workspace\Lucene-Solr-4.x-Windows\solr\build\solr-core\test\J0\org.apache.solr.cloud.SyncSliceTest-1355269716905\jetty3\index.20121211214854376 lockFactory=org.apache.lucene.store.NativeFSLockFactory@37a46134; maxCacheMB=48.0 maxMergeSizeMB=4.0)),segFN=segments_3,generation=3,filenames=[segments_3]
[junit4:junit4]   2> 17520 T94 C2 P60688 oasc.SolrDeletionPolicy.updateCommits newest commit = 3
[junit4:junit4]   2> 17520 T94 C2 P60688 oasu.DefaultSolrCoreState.newIndexWriter New IndexWriter is ready to be used.
[junit4:junit4]   2> 17521 T94 C2 P60688 oass.SolrIndexSearcher.<init> Opening Searcher@288ef68c main
[junit4:junit4]   2> 17521 T94 C2 P60688 oass.SolrIndexSearcher.getIndexDir WARNING WARNING: Directory impl does not support setting indexDir: org.apache.lucene.store.RateLimitedDirectoryWrapper
[junit4:junit4]   2> 17525 T92 oasc.SolrCore.registerSearcher [collection1] Registered new searcher Searcher@288ef68c main{StandardDirectoryReader(segments_3:1:nrt)}
[junit4:junit4]   2> 17527 T94 C2 P60688 oasu.DirectUpdateHandler2.commit start commit{flags=0,_version_=0,optimize=false,openSearcher=false,waitSearcher=false,expungeDeletes=false,softCommit=false}
[junit4:junit4]   2> 17532 T94 C2 P60688 oasc.SolrDeletionPolicy.onCommit SolrDe

[...truncated too long message...]

uate(SystemPropertiesRestoreRule.java:53)
[junit4:junit4]    > 	at org.apache.lucene.util.TestRuleSetupTeardownChained$1.evaluate(TestRuleSetupTeardownChained.java:50)
[junit4:junit4]    > 	at org.apache.lucene.util.TestRuleFieldCacheSanity$1.evaluate(TestRuleFieldCacheSanity.java:51)
[junit4:junit4]    > 	at org.apache.lucene.util.AbstractBeforeAfterRule$1.evaluate(AbstractBeforeAfterRule.java:46)
[junit4:junit4]    > 	at com.carrotsearch.randomizedtesting.rules.SystemPropertiesInvariantRule$1.evaluate(SystemPropertiesInvariantRule.java:55)
[junit4:junit4]    > 	at org.apache.lucene.util.TestRuleThreadAndTestName$1.evaluate(TestRuleThreadAndTestName.java:49)
[junit4:junit4]    > 	at org.apache.lucene.util.TestRuleIgnoreAfterMaxFailures$1.evaluate(TestRuleIgnoreAfterMaxFailures.java:70)
[junit4:junit4]    > 	at org.apache.lucene.util.TestRuleMarkFailure$1.evaluate(TestRuleMarkFailure.java:48)
[junit4:junit4]    > 	at com.carrotsearch.randomizedtesting.rules.StatementAdapter.evaluate(StatementAdapter.java:36)
[junit4:junit4]    > 	at com.carrotsearch.randomizedtesting.ThreadLeakControl$StatementRunner.run(ThreadLeakControl.java:358)
[junit4:junit4]    > 	at com.carrotsearch.randomizedtesting.ThreadLeakControl.forkTimeoutingTask(ThreadLeakControl.java:782)
[junit4:junit4]    > 	at com.carrotsearch.randomizedtesting.ThreadLeakControl$3.evaluate(ThreadLeakControl.java:442)
[junit4:junit4]    > 	at com.carrotsearch.randomizedtesting.RandomizedRunner.runSingleTest(RandomizedRunner.java:746)
[junit4:junit4]    > 	at com.carrotsearch.randomizedtesting.RandomizedRunner$3.evaluate(RandomizedRunner.java:648)
[junit4:junit4]    > 	at com.carrotsearch.randomizedtesting.RandomizedRunner$4.evaluate(RandomizedRunner.java:682)
[junit4:junit4]    > 	at com.carrotsearch.randomizedtesting.RandomizedRunner$5.evaluate(RandomizedRunner.java:693)
[junit4:junit4]    > 	at com.carrotsearch.randomizedtesting.rules.StatementAdapter.evaluate(StatementAdapter.java:36)
[junit4:junit4]    > 	at com.carrotsearch.randomizedtesting.rules.SystemPropertiesRestoreRule$1.evaluate(SystemPropertiesRestoreRule.java:53)
[junit4:junit4]    > 	at org.apache.lucene.util.AbstractBeforeAfterRule$1.evaluate(AbstractBeforeAfterRule.java:46)
[junit4:junit4]    > 	at org.apache.lucene.util.TestRuleStoreClassName$1.evaluate(TestRuleStoreClassName.java:42)
[junit4:junit4]    > 	at com.carrotsearch.randomizedtesting.rules.SystemPropertiesInvariantRule$1.evaluate(SystemPropertiesInvariantRule.java:55)
[junit4:junit4]    > 	at com.carrotsearch.randomizedtesting.rules.NoShadowingOrOverridesOnMethodsRule$1.evaluate(NoShadowingOrOverridesOnMethodsRule.java:39)
[junit4:junit4]    > 	at com.carrotsearch.randomizedtesting.rules.NoShadowingOrOverridesOnMethodsRule$1.evaluate(NoShadowingOrOverridesOnMethodsRule.java:39)
[junit4:junit4]    > 	at com.carrotsearch.randomizedtesting.rules.StatementAdapter.evaluate(StatementAdapter.java:36)
[junit4:junit4]    > 	at org.apache.lucene.util.TestRuleAssertionsRequired$1.evaluate(TestRuleAssertionsRequired.java:43)
[junit4:junit4]    > 	at org.apache.lucene.util.TestRuleMarkFailure$1.evaluate(TestRuleMarkFailure.java:48)
[junit4:junit4]    > 	at org.apache.lucene.util.TestRuleIgnoreAfterMaxFailures$1.evaluate(TestRuleIgnoreAfterMaxFailures.java:70)
[junit4:junit4]    > 	at org.apache.lucene.util.TestRuleIgnoreTestSuites$1.evaluate(TestRuleIgnoreTestSuites.java:55)
[junit4:junit4]    > 	at com.carrotsearch.randomizedtesting.rules.StatementAdapter.evaluate(StatementAdapter.java:36)
[junit4:junit4]    > 	at com.carrotsearch.randomizedtesting.ThreadLeakControl$StatementRunner.run(ThreadLeakControl.java:358)
[junit4:junit4]    > 	at java.lang.Thread.run(Thread.java:722)
[junit4:junit4]   2> 233191 T3707 oas.SolrTestCaseJ4.deleteCore ###deleteCore
[junit4:junit4]   2> NOTE: test params are: codec=Lucene3x, sim=RandomSimilarityProvider(queryNorm=false,coord=crazy): {}, locale=pt_PT, timezone=America/Coral_Harbour
[junit4:junit4]   2> NOTE: Windows 7 6.1 amd64/Oracle Corporation 1.7.0_09 (64-bit)/cpus=2,threads=2,free=329274144,total=516947968
[junit4:junit4]   2> NOTE: All tests run in this JVM: [FieldAnalysisRequestHandlerTest, SyncSliceTest, PrimitiveFieldTypeTest, UUIDFieldTest, TestUtils, TestDocSet, DateFieldTest, TestCodecSupport, NoCacheHeaderTest, PathHierarchyTokenizerFactoryTest, TestCharFilters, BasicDistributedZkTest, HighlighterTest, URLClassifyProcessorTest, NumericFieldsTest, SchemaVersionSpecificBehaviorTest, TestPhraseSuggestions, TestSolrXMLSerializer, TestCSVLoader, ShowFileRequestHandlerTest, QueryEqualityTest, ScriptEngineTest, SolrCoreTest, TestDefaultSimilarityFactory, TestDistributedGrouping, IndexSchemaRuntimeFieldTest, TestCollationKeyRangeQueries, QueryParsingTest, ResourceLoaderTest, WordBreakSolrSpellCheckerTest, BinaryUpdateRequestHandlerTest, SolrCoreCheckLockOnStartupTest, StatsComponentTest, TestRangeQuery, CacheHeaderTest, RequiredFieldsTest, TestFastOutputStream, ZkSolrClientTest, SpatialFilterTest, PeerSyncTest, DocumentAnalysisRequestHandlerTest, SortByFunctionTest, PolyFieldTest, TestSolrJ, TestPluginEnable, TestIndexingPerformance, CoreAdminHandlerTest, ConvertedLegacyTest, TestBinaryField, XmlUpdateRequestHandlerTest, TestRemoteStreaming, SuggesterWFSTTest, TestXIncludeConfig, OverseerTest, CircularListTest, IndexSchemaTest, IndexBasedSpellCheckerTest, QueryElevationComponentTest, TestAnalyzedSuggestions, TermsComponentTest, PreAnalyzedFieldTest, FileBasedSpellCheckerTest, TestSolrDeletionPolicy2, TestArbitraryIndexDir, TestReplicationHandler, BadComponentTest, TestUpdate, TestIndexSearcher, ReturnFieldsTest, SolrIndexConfigTest, XsltUpdateRequestHandlerTest, TestReversedWildcardFilterFactory, TestFaceting, DisMaxRequestHandlerTest, ZkControllerTest, TestGroupingSearch, PingRequestHandlerTest, TestValueSourceCache, FastVectorHighlighterTest, SimplePostToolTest, TestJoin, TestQueryTypes, SoftAutoCommitTest, TestSearchPerf, OutputWriterTest, TestCoreContainer, TestDocumentBuilder, ClusterStateUpdateTest, TimeZoneUtilsTest, TestPHPSerializedResponseWriter, IndexReaderFactoryTest, RequestHandlersTest, TestPropInjectDefaults, TestHashPartitioner, StandardRequestHandlerTest, TestLFUCache, ExternalFileFieldSortTest, TestFiltering, SampleTest, TestQuerySenderNoQuery, SimpleFacetsTest, SOLR749Test, TestZkChroot, TestSolrQueryParser, LeaderElectionIntegrationTest, TestConfig, AnalysisAfterCoreReloadTest, HighlighterConfigTest, SpellingQueryConverterTest, TestFoldingMultitermQuery, TestMergePolicyConfig, TestCollationField, LukeRequestHandlerTest, UpdateParamsTest, PrimUtilsTest, TestNumberUtils, RecoveryZkTest, SpellCheckComponentTest, FullSolrCloudDistribCmdsTest, LeaderElectionTest, DistributedSpellCheckComponentTest, TestRealTimeGet, TestRandomFaceting, TestDistributedSearch, SpellCheckCollatorTest, TestExtendedDismaxParser, AutoCommitTest, BasicZkTest, DistributedTermsComponentTest, TestRecovery, DirectUpdateHandlerTest, TestMultiCoreConfBootstrap, TestSort, DirectSolrSpellCheckerTest, BasicFunctionalityTest, SignatureUpdateProcessorFactoryTest, TestBinaryResponseWriter, TestJmxIntegration, TestFunctionQuery, TestTrie, SolrRequestParserTest, DirectSolrConnectionTest, TestWordDelimiterFilterFactory, TestCSVResponseWriter, MoreLikeThisHandlerTest, DocumentBuilderTest, MBeansHandlerTest, DistributedQueryElevationComponentTest, CurrencyFieldTest, TestPseudoReturnFields, DistanceFunctionTest, SolrInfoMBeanTest, MinimalSchemaTest, TermVectorComponentTest, JsonLoaderTest, TestSurroundQueryParser, DirectUpdateHandlerOptimizeTest, SolrPluginUtilsTest, DebugComponentTest, JSONWriterTest, SearchHandlerTest, TestOmitPositions, SuggesterFSTTest, CopyFieldTest, TestQueryUtils, LoggingHandlerTest, SuggesterTSTTest, SolrCmdDistributorTest, UniqFieldsUpdateProcessorFactoryTest, SuggesterTest, CSVRequestHandlerTest, NotRequiredUniqueKeyTest, BadIndexSchemaTest, TestSolrDeletionPolicy1, TestLuceneMatchVersion, UpdateRequestProcessorFactoryTest, TestPropInject, TestWriterPerf, AlternateDirectoryTest, FieldMutatingUpdateProcessorTest, DefaultValueUpdateProcessorTest, TestQuerySenderListener, MultiTermTest, TestSolrCoreProperties, TestJmxMonitoredMap, EchoParamsTest, SpellPossibilityIteratorTest, TestBM25SimilarityFactory, TestLMDirichletSimilarityFactory, TestPerFieldSimilarity, LegacyHTMLStripCharFilterTest, TestLMJelinekMercerSimilarityFactory, TestDFRSimilarityFactory, TestIBSimilarityFactory, TestFastLRUCache, DateMathParserTest, PluginInfoTest, OpenExchangeRatesOrgProviderTest, FileUtilsTest, TestSystemIdResolver, TestSuggestSpellingConverter, TestBadConfig, DOMUtilTest, TestLRUCache, RAMDirectoryFactoryTest, SystemInfoHandlerTest, ZkNodePropsTest, BasicDistributedZk2Test]
[junit4:junit4] Completed in 233.23s, 1 test, 1 failure <<< FAILURES!

[...truncated 73 lines...]
BUILD FAILED
C:\Users\JenkinsSlave\workspace\Lucene-Solr-4.x-Windows\build.xml:352: The following error occurred while executing this line:
C:\Users\JenkinsSlave\workspace\Lucene-Solr-4.x-Windows\build.xml:39: The following error occurred while executing this line:
C:\Users\JenkinsSlave\workspace\Lucene-Solr-4.x-Windows\solr\build.xml:178: The following error occurred while executing this line:
C:\Users\JenkinsSlave\workspace\Lucene-Solr-4.x-Windows\solr\common-build.xml:438: The following error occurred while executing this line:
C:\Users\JenkinsSlave\workspace\Lucene-Solr-4.x-Windows\lucene\common-build.xml:1171: The following error occurred while executing this line:
C:\Users\JenkinsSlave\workspace\Lucene-Solr-4.x-Windows\lucene\common-build.xml:835: There were test failures: 239 suites, 994 tests, 1 suite-level error, 1 error, 2 failures, 12 ignored (7 assumptions)

Total time: 49 minutes 9 seconds
Build step 'Invoke Ant' marked build as failure
Archiving artifacts
Recording test results
Description set: Java: 64bit/jdk1.7.0_09 -XX:+UseG1GC
Email was triggered for: Failure
Sending email for trigger: Failure



Mime
View raw message