lucene-dev mailing list archives

Site index · List index
Message view « Date » · « Thread »
Top « Date » · « Thread »
From Apache Jenkins Server <jenk...@builds.apache.org>
Subject [JENKINS] Lucene-Solr-Tests-4.x-Java6 - Build # 1158 - Failure
Date Tue, 25 Dec 2012 23:34:13 GMT
Build: https://builds.apache.org/job/Lucene-Solr-Tests-4.x-Java6/1158/

1 tests failed.
REGRESSION:  org.apache.solr.cloud.SyncSliceTest.testDistribSearch

Error Message:
shard1 should have just been set up to be inconsistent - but it's still consistent

Stack Trace:
java.lang.AssertionError: shard1 should have just been set up to be inconsistent - but it's still consistent
	at __randomizedtesting.SeedInfo.seed([225A79AD6860E61D:A3BCF7B51F3F8621]:0)
	at org.junit.Assert.fail(Assert.java:93)
	at org.junit.Assert.assertTrue(Assert.java:43)
	at org.junit.Assert.assertNotNull(Assert.java:526)
	at org.apache.solr.cloud.SyncSliceTest.doTest(SyncSliceTest.java:214)
	at org.apache.solr.BaseDistributedSearchTestCase.testDistribSearch(BaseDistributedSearchTestCase.java:794)
	at sun.reflect.NativeMethodAccessorImpl.invoke0(Native Method)
	at sun.reflect.NativeMethodAccessorImpl.invoke(NativeMethodAccessorImpl.java:57)
	at sun.reflect.DelegatingMethodAccessorImpl.invoke(DelegatingMethodAccessorImpl.java:43)
	at java.lang.reflect.Method.invoke(Method.java:616)
	at com.carrotsearch.randomizedtesting.RandomizedRunner.invoke(RandomizedRunner.java:1559)
	at com.carrotsearch.randomizedtesting.RandomizedRunner.access$600(RandomizedRunner.java:79)
	at com.carrotsearch.randomizedtesting.RandomizedRunner$6.evaluate(RandomizedRunner.java:737)
	at com.carrotsearch.randomizedtesting.RandomizedRunner$7.evaluate(RandomizedRunner.java:773)
	at com.carrotsearch.randomizedtesting.RandomizedRunner$8.evaluate(RandomizedRunner.java:787)
	at com.carrotsearch.randomizedtesting.rules.SystemPropertiesRestoreRule$1.evaluate(SystemPropertiesRestoreRule.java:53)
	at org.apache.lucene.util.TestRuleSetupTeardownChained$1.evaluate(TestRuleSetupTeardownChained.java:50)
	at org.apache.lucene.util.TestRuleFieldCacheSanity$1.evaluate(TestRuleFieldCacheSanity.java:51)
	at org.apache.lucene.util.AbstractBeforeAfterRule$1.evaluate(AbstractBeforeAfterRule.java:46)
	at com.carrotsearch.randomizedtesting.rules.SystemPropertiesInvariantRule$1.evaluate(SystemPropertiesInvariantRule.java:55)
	at org.apache.lucene.util.TestRuleThreadAndTestName$1.evaluate(TestRuleThreadAndTestName.java:49)
	at org.apache.lucene.util.TestRuleIgnoreAfterMaxFailures$1.evaluate(TestRuleIgnoreAfterMaxFailures.java:70)
	at org.apache.lucene.util.TestRuleMarkFailure$1.evaluate(TestRuleMarkFailure.java:48)
	at com.carrotsearch.randomizedtesting.rules.StatementAdapter.evaluate(StatementAdapter.java:36)
	at com.carrotsearch.randomizedtesting.ThreadLeakControl$StatementRunner.run(ThreadLeakControl.java:358)
	at com.carrotsearch.randomizedtesting.ThreadLeakControl.forkTimeoutingTask(ThreadLeakControl.java:782)
	at com.carrotsearch.randomizedtesting.ThreadLeakControl$3.evaluate(ThreadLeakControl.java:442)
	at com.carrotsearch.randomizedtesting.RandomizedRunner.runSingleTest(RandomizedRunner.java:746)
	at com.carrotsearch.randomizedtesting.RandomizedRunner$3.evaluate(RandomizedRunner.java:648)
	at com.carrotsearch.randomizedtesting.RandomizedRunner$4.evaluate(RandomizedRunner.java:682)
	at com.carrotsearch.randomizedtesting.RandomizedRunner$5.evaluate(RandomizedRunner.java:693)
	at com.carrotsearch.randomizedtesting.rules.StatementAdapter.evaluate(StatementAdapter.java:36)
	at com.carrotsearch.randomizedtesting.rules.SystemPropertiesRestoreRule$1.evaluate(SystemPropertiesRestoreRule.java:53)
	at org.apache.lucene.util.AbstractBeforeAfterRule$1.evaluate(AbstractBeforeAfterRule.java:46)
	at org.apache.lucene.util.TestRuleStoreClassName$1.evaluate(TestRuleStoreClassName.java:42)
	at com.carrotsearch.randomizedtesting.rules.SystemPropertiesInvariantRule$1.evaluate(SystemPropertiesInvariantRule.java:55)
	at com.carrotsearch.randomizedtesting.rules.NoShadowingOrOverridesOnMethodsRule$1.evaluate(NoShadowingOrOverridesOnMethodsRule.java:39)
	at com.carrotsearch.randomizedtesting.rules.NoShadowingOrOverridesOnMethodsRule$1.evaluate(NoShadowingOrOverridesOnMethodsRule.java:39)
	at com.carrotsearch.randomizedtesting.rules.StatementAdapter.evaluate(StatementAdapter.java:36)
	at org.apache.lucene.util.TestRuleAssertionsRequired$1.evaluate(TestRuleAssertionsRequired.java:43)
	at org.apache.lucene.util.TestRuleMarkFailure$1.evaluate(TestRuleMarkFailure.java:48)
	at org.apache.lucene.util.TestRuleIgnoreAfterMaxFailures$1.evaluate(TestRuleIgnoreAfterMaxFailures.java:70)
	at org.apache.lucene.util.TestRuleIgnoreTestSuites$1.evaluate(TestRuleIgnoreTestSuites.java:55)
	at com.carrotsearch.randomizedtesting.rules.StatementAdapter.evaluate(StatementAdapter.java:36)
	at com.carrotsearch.randomizedtesting.ThreadLeakControl$StatementRunner.run(ThreadLeakControl.java:358)
	at java.lang.Thread.run(Thread.java:679)




Build Log:
[...truncated 8329 lines...]
[junit4:junit4] Suite: org.apache.solr.cloud.SyncSliceTest
[junit4:junit4]   2> 0 T984 oas.BaseDistributedSearchTestCase.initHostContext Setting hostContext system property: /
[junit4:junit4]   2> 4 T984 oas.SolrTestCaseJ4.setUp ###Starting testDistribSearch
[junit4:junit4]   2> Creating dataDir: /usr/home/hudson/hudson-slave/workspace/Lucene-Solr-Tests-4.x-Java6/solr/build/solr-core/test/J0/./solrtest-SyncSliceTest-1356477997819
[junit4:junit4]   2> 5 T984 oasc.ZkTestServer.run STARTING ZK TEST SERVER
[junit4:junit4]   2> 6 T985 oasc.ZkTestServer$ZKServerMain.runFromConfig Starting server
[junit4:junit4]   2> 8 T985 oazs.ZooKeeperServer.setTickTime tickTime set to 1000
[junit4:junit4]   2> 8 T985 oazs.ZooKeeperServer.setMinSessionTimeout minSessionTimeout set to -1
[junit4:junit4]   2> 8 T985 oazs.ZooKeeperServer.setMaxSessionTimeout maxSessionTimeout set to -1
[junit4:junit4]   2> 8 T985 oazs.NIOServerCnxnFactory.configure binding to port 0.0.0.0/0.0.0.0:0
[junit4:junit4]   2> 9 T985 oazsp.FileTxnSnapLog.save Snapshotting: 0x0 to /usr/home/hudson/hudson-slave/workspace/Lucene-Solr-Tests-4.x-Java6/solr/build/solr-core/test/J0/./org.apache.solr.cloud.SyncSliceTest-1356477997819/zookeeper/server1/data/version-2/snapshot.0
[junit4:junit4]   2> 107 T984 oasc.ZkTestServer.run start zk server on port:40763
[junit4:junit4]   2> 107 T984 oaz.ZooKeeper.<init> Initiating client connection, connectString=127.0.0.1:40763 sessionTimeout=10000 watcher=org.apache.solr.common.cloud.ConnectionManager@551d0acc
[junit4:junit4]   2> 108 T984 oascc.ConnectionManager.waitForConnected Waiting for client to connect to ZooKeeper
[junit4:junit4]   2> 108 T990 oaz.ClientCnxn$SendThread.logStartConnect Opening socket connection to server localhost/127.0.0.1:40763. Will not attempt to authenticate using SASL (access denied (javax.security.auth.AuthPermission getLoginConfiguration))
[junit4:junit4]   2> 109 T990 oaz.ClientCnxn$SendThread.primeConnection Socket connection established to localhost/127.0.0.1:40763, initiating session
[junit4:junit4]   2> 109 T986 oazs.NIOServerCnxnFactory.run Accepted socket connection from /140.211.11.196:40764
[junit4:junit4]   2> 109 T986 oazs.ZooKeeperServer.processConnectRequest Client attempting to establish new session at /140.211.11.196:40764
[junit4:junit4]   2> 110 T988 oazsp.FileTxnLog.append Creating new log file: log.1
[junit4:junit4]   2> 111 T988 oazs.ZooKeeperServer.finishSessionInit Established session 0x13bd463a3000000 with negotiated timeout 10000 for client /140.211.11.196:40764
[junit4:junit4]   2> 111 T990 oaz.ClientCnxn$SendThread.onConnected Session establishment complete on server localhost/127.0.0.1:40763, sessionid = 0x13bd463a3000000, negotiated timeout = 10000
[junit4:junit4]   2> 112 T991 oascc.ConnectionManager.process Watcher org.apache.solr.common.cloud.ConnectionManager@551d0acc name:ZooKeeperConnection Watcher:127.0.0.1:40763 got event WatchedEvent state:SyncConnected type:None path:null path:null type:None
[junit4:junit4]   2> 112 T984 oascc.ConnectionManager.waitForConnected Client is connected to ZooKeeper
[junit4:junit4]   2> 112 T984 oascc.SolrZkClient.makePath makePath: /solr
[junit4:junit4]   2> 115 T989 oazs.PrepRequestProcessor.pRequest2Txn Processed session termination for sessionid: 0x13bd463a3000000
[junit4:junit4]   2> 116 T991 oaz.ClientCnxn$EventThread.run EventThread shut down
[junit4:junit4]   2> 116 T986 oazs.NIOServerCnxn.closeSock Closed socket connection for client /140.211.11.196:40764 which had sessionid 0x13bd463a3000000
[junit4:junit4]   2> 116 T984 oaz.ZooKeeper.close Session: 0x13bd463a3000000 closed
[junit4:junit4]   2> 117 T984 oaz.ZooKeeper.<init> Initiating client connection, connectString=127.0.0.1:40763/solr sessionTimeout=10000 watcher=org.apache.solr.common.cloud.ConnectionManager@1b10b8a3
[junit4:junit4]   2> 117 T984 oascc.ConnectionManager.waitForConnected Waiting for client to connect to ZooKeeper
[junit4:junit4]   2> 118 T992 oaz.ClientCnxn$SendThread.logStartConnect Opening socket connection to server localhost/127.0.0.1:40763. Will not attempt to authenticate using SASL (access denied (javax.security.auth.AuthPermission getLoginConfiguration))
[junit4:junit4]   2> 118 T992 oaz.ClientCnxn$SendThread.primeConnection Socket connection established to localhost/127.0.0.1:40763, initiating session
[junit4:junit4]   2> 118 T986 oazs.NIOServerCnxnFactory.run Accepted socket connection from /140.211.11.196:40765
[junit4:junit4]   2> 118 T986 oazs.ZooKeeperServer.processConnectRequest Client attempting to establish new session at /140.211.11.196:40765
[junit4:junit4]   2> 125 T988 oazs.ZooKeeperServer.finishSessionInit Established session 0x13bd463a3000001 with negotiated timeout 10000 for client /140.211.11.196:40765
[junit4:junit4]   2> 125 T992 oaz.ClientCnxn$SendThread.onConnected Session establishment complete on server localhost/127.0.0.1:40763, sessionid = 0x13bd463a3000001, negotiated timeout = 10000
[junit4:junit4]   2> 125 T993 oascc.ConnectionManager.process Watcher org.apache.solr.common.cloud.ConnectionManager@1b10b8a3 name:ZooKeeperConnection Watcher:127.0.0.1:40763/solr got event WatchedEvent state:SyncConnected type:None path:null path:null type:None
[junit4:junit4]   2> 125 T984 oascc.ConnectionManager.waitForConnected Client is connected to ZooKeeper
[junit4:junit4]   2> 125 T984 oascc.SolrZkClient.makePath makePath: /collections/collection1
[junit4:junit4]   2> 133 T984 oascc.SolrZkClient.makePath makePath: /collections/collection1/shards
[junit4:junit4]   2> 135 T984 oascc.SolrZkClient.makePath makePath: /collections/control_collection
[junit4:junit4]   2> 137 T984 oascc.SolrZkClient.makePath makePath: /collections/control_collection/shards
[junit4:junit4]   2> 140 T984 oasc.AbstractZkTestCase.putConfig put /usr/home/hudson/hudson-slave/workspace/Lucene-Solr-Tests-4.x-Java6/solr/build/solr-core/test-files/solr/collection1/conf/solrconfig.xml to /configs/conf1/solrconfig.xml
[junit4:junit4]   2> 141 T984 oascc.SolrZkClient.makePath makePath: /configs/conf1/solrconfig.xml
[junit4:junit4]   2> 153 T984 oasc.AbstractZkTestCase.putConfig put /usr/home/hudson/hudson-slave/workspace/Lucene-Solr-Tests-4.x-Java6/solr/build/solr-core/test-files/solr/collection1/conf/schema.xml to /configs/conf1/schema.xml
[junit4:junit4]   2> 154 T984 oascc.SolrZkClient.makePath makePath: /configs/conf1/schema.xml
[junit4:junit4]   2> 257 T984 oasc.AbstractZkTestCase.putConfig put /usr/home/hudson/hudson-slave/workspace/Lucene-Solr-Tests-4.x-Java6/solr/build/solr-core/test-files/solr/collection1/conf/stopwords.txt to /configs/conf1/stopwords.txt
[junit4:junit4]   2> 258 T984 oascc.SolrZkClient.makePath makePath: /configs/conf1/stopwords.txt
[junit4:junit4]   2> 261 T984 oasc.AbstractZkTestCase.putConfig put /usr/home/hudson/hudson-slave/workspace/Lucene-Solr-Tests-4.x-Java6/solr/build/solr-core/test-files/solr/collection1/conf/protwords.txt to /configs/conf1/protwords.txt
[junit4:junit4]   2> 261 T984 oascc.SolrZkClient.makePath makePath: /configs/conf1/protwords.txt
[junit4:junit4]   2> 265 T984 oasc.AbstractZkTestCase.putConfig put /usr/home/hudson/hudson-slave/workspace/Lucene-Solr-Tests-4.x-Java6/solr/build/solr-core/test-files/solr/collection1/conf/currency.xml to /configs/conf1/currency.xml
[junit4:junit4]   2> 265 T984 oascc.SolrZkClient.makePath makePath: /configs/conf1/currency.xml
[junit4:junit4]   2> 273 T984 oasc.AbstractZkTestCase.putConfig put /usr/home/hudson/hudson-slave/workspace/Lucene-Solr-Tests-4.x-Java6/solr/build/solr-core/test-files/solr/collection1/conf/open-exchange-rates.json to /configs/conf1/open-exchange-rates.json
[junit4:junit4]   2> 273 T984 oascc.SolrZkClient.makePath makePath: /configs/conf1/open-exchange-rates.json
[junit4:junit4]   2> 276 T984 oasc.AbstractZkTestCase.putConfig put /usr/home/hudson/hudson-slave/workspace/Lucene-Solr-Tests-4.x-Java6/solr/build/solr-core/test-files/solr/collection1/conf/mapping-ISOLatin1Accent.txt to /configs/conf1/mapping-ISOLatin1Accent.txt
[junit4:junit4]   2> 276 T984 oascc.SolrZkClient.makePath makePath: /configs/conf1/mapping-ISOLatin1Accent.txt
[junit4:junit4]   2> 279 T984 oasc.AbstractZkTestCase.putConfig put /usr/home/hudson/hudson-slave/workspace/Lucene-Solr-Tests-4.x-Java6/solr/build/solr-core/test-files/solr/collection1/conf/old_synonyms.txt to /configs/conf1/old_synonyms.txt
[junit4:junit4]   2> 279 T984 oascc.SolrZkClient.makePath makePath: /configs/conf1/old_synonyms.txt
[junit4:junit4]   2> 282 T984 oasc.AbstractZkTestCase.putConfig put /usr/home/hudson/hudson-slave/workspace/Lucene-Solr-Tests-4.x-Java6/solr/build/solr-core/test-files/solr/collection1/conf/synonyms.txt to /configs/conf1/synonyms.txt
[junit4:junit4]   2> 282 T984 oascc.SolrZkClient.makePath makePath: /configs/conf1/synonyms.txt
[junit4:junit4]   2> 290 T989 oazs.PrepRequestProcessor.pRequest2Txn Processed session termination for sessionid: 0x13bd463a3000001
[junit4:junit4]   2> 291 T993 oaz.ClientCnxn$EventThread.run EventThread shut down
[junit4:junit4]   2> 292 T986 oazs.NIOServerCnxn.closeSock Closed socket connection for client /140.211.11.196:40765 which had sessionid 0x13bd463a3000001
[junit4:junit4]   2> 291 T984 oaz.ZooKeeper.close Session: 0x13bd463a3000001 closed
[junit4:junit4]   2> 402 T984 oejs.Server.doStart jetty-8.1.8.v20121106
[junit4:junit4]   2> 407 T984 oejs.AbstractConnector.doStart Started SocketConnector@127.0.0.1:40766
[junit4:junit4]   2> 408 T984 oasc.SolrResourceLoader.locateSolrHome JNDI not configured for solr (NoInitialContextEx)
[junit4:junit4]   2> 408 T984 oasc.SolrResourceLoader.locateSolrHome using system property solr.solr.home: /usr/home/hudson/hudson-slave/workspace/Lucene-Solr-Tests-4.x-Java6/solr/build/solr-core/test/J0/./org.apache.solr.cloud.SyncSliceTest-controljetty-1356477998106
[junit4:junit4]   2> 409 T984 oasc.SolrResourceLoader.<init> new SolrResourceLoader for deduced Solr Home: '/usr/home/hudson/hudson-slave/workspace/Lucene-Solr-Tests-4.x-Java6/solr/build/solr-core/test/J0/./org.apache.solr.cloud.SyncSliceTest-controljetty-1356477998106/'
[junit4:junit4]   2> 435 T984 oass.SolrDispatchFilter.init SolrDispatchFilter.init()
[junit4:junit4]   2> 435 T984 oasc.SolrResourceLoader.locateSolrHome JNDI not configured for solr (NoInitialContextEx)
[junit4:junit4]   2> 436 T984 oasc.SolrResourceLoader.locateSolrHome using system property solr.solr.home: /usr/home/hudson/hudson-slave/workspace/Lucene-Solr-Tests-4.x-Java6/solr/build/solr-core/test/J0/./org.apache.solr.cloud.SyncSliceTest-controljetty-1356477998106
[junit4:junit4]   2> 436 T984 oasc.CoreContainer$Initializer.initialize looking for solr.xml: /usr/home/hudson/hudson-slave/workspace/Lucene-Solr-Tests-4.x-Java6/solr/build/solr-core/test/J0/./org.apache.solr.cloud.SyncSliceTest-controljetty-1356477998106/solr.xml
[junit4:junit4]   2> 436 T984 oasc.CoreContainer.<init> New CoreContainer 2013071116
[junit4:junit4]   2> 437 T984 oasc.CoreContainer.load Loading CoreContainer using Solr Home: '/usr/home/hudson/hudson-slave/workspace/Lucene-Solr-Tests-4.x-Java6/solr/build/solr-core/test/J0/./org.apache.solr.cloud.SyncSliceTest-controljetty-1356477998106/'
[junit4:junit4]   2> 437 T984 oasc.SolrResourceLoader.<init> new SolrResourceLoader for directory: '/usr/home/hudson/hudson-slave/workspace/Lucene-Solr-Tests-4.x-Java6/solr/build/solr-core/test/J0/./org.apache.solr.cloud.SyncSliceTest-controljetty-1356477998106/'
[junit4:junit4]   2> 458 T984 oashc.HttpShardHandlerFactory.getParameter Setting socketTimeout to: 30000
[junit4:junit4]   2> 459 T984 oashc.HttpShardHandlerFactory.getParameter Setting urlScheme to: http://
[junit4:junit4]   2> 459 T984 oashc.HttpShardHandlerFactory.getParameter Setting connTimeout to: 15000
[junit4:junit4]   2> 459 T984 oashc.HttpShardHandlerFactory.getParameter Setting maxConnectionsPerHost to: 20
[junit4:junit4]   2> 459 T984 oashc.HttpShardHandlerFactory.getParameter Setting corePoolSize to: 0
[junit4:junit4]   2> 460 T984 oashc.HttpShardHandlerFactory.getParameter Setting maximumPoolSize to: 2147483647
[junit4:junit4]   2> 460 T984 oashc.HttpShardHandlerFactory.getParameter Setting maxThreadIdleTime to: 5
[junit4:junit4]   2> 460 T984 oashc.HttpShardHandlerFactory.getParameter Setting sizeOfQueue to: -1
[junit4:junit4]   2> 461 T984 oashc.HttpShardHandlerFactory.getParameter Setting fairnessPolicy to: false
[junit4:junit4]   2> 461 T984 oascsi.HttpClientUtil.createClient Creating new http client, config:maxConnectionsPerHost=20&maxConnections=10000&socketTimeout=30000&connTimeout=15000&retry=false
[junit4:junit4]   2> 475 T984 oasc.CoreContainer.load Registering Log Listener
[junit4:junit4]   2> 493 T984 oasc.CoreContainer.initZooKeeper Zookeeper client=127.0.0.1:40763/solr
[junit4:junit4]   2> 493 T984 oasc.ZkController.checkChrootPath zkHost includes chroot
[junit4:junit4]   2> 494 T984 oaz.ZooKeeper.<init> Initiating client connection, connectString=127.0.0.1:40763 sessionTimeout=60000 watcher=org.apache.solr.common.cloud.ConnectionManager@4c967f6e
[junit4:junit4]   2> 495 T984 oascc.ConnectionManager.waitForConnected Waiting for client to connect to ZooKeeper
[junit4:junit4]   2> 495 T1003 oaz.ClientCnxn$SendThread.logStartConnect Opening socket connection to server localhost/127.0.0.1:40763. Will not attempt to authenticate using SASL (access denied (javax.security.auth.AuthPermission getLoginConfiguration))
[junit4:junit4]   2> 496 T1003 oaz.ClientCnxn$SendThread.primeConnection Socket connection established to localhost/127.0.0.1:40763, initiating session
[junit4:junit4]   2> 496 T986 oazs.NIOServerCnxnFactory.run Accepted socket connection from /140.211.11.196:40767
[junit4:junit4]   2> 496 T986 oazs.ZooKeeperServer.processConnectRequest Client attempting to establish new session at /140.211.11.196:40767
[junit4:junit4]   2> 498 T988 oazs.ZooKeeperServer.finishSessionInit Established session 0x13bd463a3000002 with negotiated timeout 20000 for client /140.211.11.196:40767
[junit4:junit4]   2> 498 T1003 oaz.ClientCnxn$SendThread.onConnected Session establishment complete on server localhost/127.0.0.1:40763, sessionid = 0x13bd463a3000002, negotiated timeout = 20000
[junit4:junit4]   2> 498 T1004 oascc.ConnectionManager.process Watcher org.apache.solr.common.cloud.ConnectionManager@4c967f6e name:ZooKeeperConnection Watcher:127.0.0.1:40763 got event WatchedEvent state:SyncConnected type:None path:null path:null type:None
[junit4:junit4]   2> 498 T984 oascc.ConnectionManager.waitForConnected Client is connected to ZooKeeper
[junit4:junit4]   2> 499 T989 oazs.PrepRequestProcessor.pRequest2Txn Processed session termination for sessionid: 0x13bd463a3000002
[junit4:junit4]   2> 500 T1004 oaz.ClientCnxn$EventThread.run EventThread shut down
[junit4:junit4]   2> 500 T986 oazs.NIOServerCnxn.closeSock Closed socket connection for client /140.211.11.196:40767 which had sessionid 0x13bd463a3000002
[junit4:junit4]   2> 500 T984 oaz.ZooKeeper.close Session: 0x13bd463a3000002 closed
[junit4:junit4]   2> 501 T984 oascsi.HttpClientUtil.createClient Creating new http client, config:maxConnections=500&maxConnectionsPerHost=16&socketTimeout=15000&connTimeout=30000
[junit4:junit4]   2> 508 T984 oaz.ZooKeeper.<init> Initiating client connection, connectString=127.0.0.1:40763/solr sessionTimeout=30000 watcher=org.apache.solr.common.cloud.ConnectionManager@dddbe21
[junit4:junit4]   2> 509 T984 oascc.ConnectionManager.waitForConnected Waiting for client to connect to ZooKeeper
[junit4:junit4]   2> 509 T1005 oaz.ClientCnxn$SendThread.logStartConnect Opening socket connection to server localhost/127.0.0.1:40763. Will not attempt to authenticate using SASL (access denied (javax.security.auth.AuthPermission getLoginConfiguration))
[junit4:junit4]   2> 510 T1005 oaz.ClientCnxn$SendThread.primeConnection Socket connection established to localhost/127.0.0.1:40763, initiating session
[junit4:junit4]   2> 510 T986 oazs.NIOServerCnxnFactory.run Accepted socket connection from /140.211.11.196:40768
[junit4:junit4]   2> 510 T986 oazs.ZooKeeperServer.processConnectRequest Client attempting to establish new session at /140.211.11.196:40768
[junit4:junit4]   2> 511 T988 oazs.ZooKeeperServer.finishSessionInit Established session 0x13bd463a3000003 with negotiated timeout 20000 for client /140.211.11.196:40768
[junit4:junit4]   2> 511 T1005 oaz.ClientCnxn$SendThread.onConnected Session establishment complete on server localhost/127.0.0.1:40763, sessionid = 0x13bd463a3000003, negotiated timeout = 20000
[junit4:junit4]   2> 512 T1006 oascc.ConnectionManager.process Watcher org.apache.solr.common.cloud.ConnectionManager@dddbe21 name:ZooKeeperConnection Watcher:127.0.0.1:40763/solr got event WatchedEvent state:SyncConnected type:None path:null path:null type:None
[junit4:junit4]   2> 512 T984 oascc.ConnectionManager.waitForConnected Client is connected to ZooKeeper
[junit4:junit4]   2> 513 T989 oazs.PrepRequestProcessor.pRequest Got user-level KeeperException when processing sessionid:0x13bd463a3000003 type:create cxid:0x2 zxid:0x1a txntype:-1 reqpath:n/a Error Path:/solr/overseer Error:KeeperErrorCode = NodeExists for /solr/overseer
[junit4:junit4]   2> 518 T984 oascc.SolrZkClient.makePath makePath: /live_nodes
[junit4:junit4]   2> 526 T984 oasc.ZkController.createEphemeralLiveNode Register node as live in ZooKeeper:/live_nodes/127.0.0.1:40766_
[junit4:junit4]   2> 527 T989 oazs.PrepRequestProcessor.pRequest Got user-level KeeperException when processing sessionid:0x13bd463a3000003 type:delete cxid:0x7 zxid:0x1c txntype:-1 reqpath:n/a Error Path:/solr/live_nodes/127.0.0.1:40766_ Error:KeeperErrorCode = NoNode for /solr/live_nodes/127.0.0.1:40766_
[junit4:junit4]   2> 528 T984 oascc.SolrZkClient.makePath makePath: /live_nodes/127.0.0.1:40766_
[junit4:junit4]   2> 530 T984 oascc.SolrZkClient.makePath makePath: /overseer_elect/election
[junit4:junit4]   2> 542 T989 oazs.PrepRequestProcessor.pRequest Got user-level KeeperException when processing sessionid:0x13bd463a3000003 type:delete cxid:0x15 zxid:0x21 txntype:-1 reqpath:n/a Error Path:/solr/overseer_elect/leader Error:KeeperErrorCode = NoNode for /solr/overseer_elect/leader
[junit4:junit4]   2> 543 T984 oascc.SolrZkClient.makePath makePath: /overseer_elect/leader
[junit4:junit4]   2> 552 T984 oasc.Overseer.start Overseer (id=88898142065393667-127.0.0.1:40766_-n_0000000000) starting
[junit4:junit4]   2> 553 T989 oazs.PrepRequestProcessor.pRequest Got user-level KeeperException when processing sessionid:0x13bd463a3000003 type:create cxid:0x1a zxid:0x23 txntype:-1 reqpath:n/a Error Path:/solr/overseer Error:KeeperErrorCode = NodeExists for /solr/overseer
[junit4:junit4]   2> 554 T989 oazs.PrepRequestProcessor.pRequest Got user-level KeeperException when processing sessionid:0x13bd463a3000003 type:create cxid:0x1b zxid:0x24 txntype:-1 reqpath:n/a Error Path:/solr/overseer Error:KeeperErrorCode = NodeExists for /solr/overseer
[junit4:junit4]   2> 560 T989 oazs.PrepRequestProcessor.pRequest Got user-level KeeperException when processing sessionid:0x13bd463a3000003 type:create cxid:0x1c zxid:0x25 txntype:-1 reqpath:n/a Error Path:/solr/overseer Error:KeeperErrorCode = NodeExists for /solr/overseer
[junit4:junit4]   2> 562 T989 oazs.PrepRequestProcessor.pRequest Got user-level KeeperException when processing sessionid:0x13bd463a3000003 type:create cxid:0x1d zxid:0x26 txntype:-1 reqpath:n/a Error Path:/solr/overseer Error:KeeperErrorCode = NodeExists for /solr/overseer
[junit4:junit4]   2> 563 T1008 oasc.OverseerCollectionProcessor.run Process current queue of collection messages
[junit4:junit4]   2> 564 T984 oascc.SolrZkClient.makePath makePath: /clusterstate.json
[junit4:junit4]   2> 576 T984 oascc.ZkStateReader.createClusterStateWatchersAndUpdate Updating cluster state from ZooKeeper... 
[junit4:junit4]   2> 577 T1007 oasc.Overseer$ClusterStateUpdater.run Starting to work on the main queue
[junit4:junit4]   2> 581 T1009 oasc.CoreContainer.create Creating SolrCore 'collection1' using instanceDir: /usr/home/hudson/hudson-slave/workspace/Lucene-Solr-Tests-4.x-Java6/solr/build/solr-core/test/J0/./org.apache.solr.cloud.SyncSliceTest-controljetty-1356477998106/collection1
[junit4:junit4]   2> 582 T1009 oasc.ZkController.createCollectionZkNode Check for collection zkNode:control_collection
[junit4:junit4]   2> 582 T1009 oasc.ZkController.createCollectionZkNode Collection zkNode exists
[junit4:junit4]   2> 582 T1009 oasc.ZkController.readConfigName Load collection config from:/collections/control_collection
[junit4:junit4]   2> 583 T1009 oasc.SolrResourceLoader.<init> new SolrResourceLoader for directory: '/usr/home/hudson/hudson-slave/workspace/Lucene-Solr-Tests-4.x-Java6/solr/build/solr-core/test/J0/./org.apache.solr.cloud.SyncSliceTest-controljetty-1356477998106/collection1/'
[junit4:junit4]   2> 584 T1009 oasc.SolrResourceLoader.replaceClassLoader Adding 'file:/usr/home/hudson/hudson-slave/workspace/Lucene-Solr-Tests-4.x-Java6/solr/build/solr-core/test/J0/org.apache.solr.cloud.SyncSliceTest-controljetty-1356477998106/collection1/lib/README' to classloader
[junit4:junit4]   2> 585 T1009 oasc.SolrResourceLoader.replaceClassLoader Adding 'file:/usr/home/hudson/hudson-slave/workspace/Lucene-Solr-Tests-4.x-Java6/solr/build/solr-core/test/J0/org.apache.solr.cloud.SyncSliceTest-controljetty-1356477998106/collection1/lib/classes/' to classloader
[junit4:junit4]   2> 621 T1009 oasc.SolrConfig.<init> Using Lucene MatchVersion: LUCENE_41
[junit4:junit4]   2> 671 T1009 oasc.SolrConfig.<init> Loaded SolrConfig: solrconfig.xml
[junit4:junit4]   2> 771 T1009 oass.IndexSchema.readSchema Reading Solr Schema
[junit4:junit4]   2> 777 T1009 oass.IndexSchema.readSchema Schema name=test
[junit4:junit4]   2> 1377 T1009 oass.OpenExchangeRatesOrgProvider.init Initialized with rates=open-exchange-rates.json, refreshInterval=1440.
[junit4:junit4]   2> 1391 T1009 oass.IndexSchema.readSchema default search field in schema is text
[junit4:junit4]   2> 1396 T1009 oass.IndexSchema.readSchema unique key field: id
[junit4:junit4]   2> 1411 T1009 oass.FileExchangeRateProvider.reload Reloading exchange rates from file currency.xml
[junit4:junit4]   2> 1416 T1009 oass.FileExchangeRateProvider.reload Reloading exchange rates from file currency.xml
[junit4:junit4]   2> 1421 T1009 oass.OpenExchangeRatesOrgProvider.reload Reloading exchange rates from open-exchange-rates.json
[junit4:junit4]   2> 1423 T1009 oass.OpenExchangeRatesOrgProvider.reload Reloading exchange rates from open-exchange-rates.json
[junit4:junit4]   2> 1424 T1009 oasc.SolrCore.<init> [collection1] Opening new SolrCore at /usr/home/hudson/hudson-slave/workspace/Lucene-Solr-Tests-4.x-Java6/solr/build/solr-core/test/J0/./org.apache.solr.cloud.SyncSliceTest-controljetty-1356477998106/collection1/, dataDir=./org.apache.solr.cloud.SyncSliceTest-1356477997819/control/data/
[junit4:junit4]   2> 1424 T1009 oasc.JmxMonitoredMap.<init> JMX monitoring is enabled. Adding Solr mbeans to JMX Server: com.sun.jmx.mbeanserver.JmxMBeanServer@5867df9
[junit4:junit4]   2> 1425 T1009 oasc.SolrCore.initDirectoryFactory solr.StandardDirectoryFactory
[junit4:junit4]   2> 1426 T1009 oasc.CachingDirectoryFactory.get return new directory for /usr/home/hudson/hudson-slave/workspace/Lucene-Solr-Tests-4.x-Java6/solr/build/solr-core/test/J0/./org.apache.solr.cloud.SyncSliceTest-1356477997819/control/data forceNew:false
[junit4:junit4]   2> 1427 T1009 oasc.CachingDirectoryFactory.close Releasing directory:/usr/home/hudson/hudson-slave/workspace/Lucene-Solr-Tests-4.x-Java6/solr/build/solr-core/test/J0/./org.apache.solr.cloud.SyncSliceTest-1356477997819/control/data
[junit4:junit4]   2> 1428 T1009 oasc.SolrCore.getNewIndexDir New index directory detected: old=null new=./org.apache.solr.cloud.SyncSliceTest-1356477997819/control/data/index/
[junit4:junit4]   2> 1428 T1009 oasc.SolrCore.initIndex WARNING [collection1] Solr index directory './org.apache.solr.cloud.SyncSliceTest-1356477997819/control/data/index' doesn't exist. Creating new index...
[junit4:junit4]   2> 1430 T1009 oasc.CachingDirectoryFactory.get return new directory for /usr/home/hudson/hudson-slave/workspace/Lucene-Solr-Tests-4.x-Java6/solr/build/solr-core/test/J0/./org.apache.solr.cloud.SyncSliceTest-1356477997819/control/data/index forceNew:false
[junit4:junit4]   2> 1436 T1009 oasc.SolrDeletionPolicy.onCommit SolrDeletionPolicy.onCommit: commits:num=1
[junit4:junit4]   2> 		commit{dir=RateLimitedDirectoryWrapper(org.apache.lucene.store.NIOFSDirectory@/usr/home/hudson/hudson-slave/workspace/Lucene-Solr-Tests-4.x-Java6/solr/build/solr-core/test/J0/org.apache.solr.cloud.SyncSliceTest-1356477997819/control/data/index lockFactory=org.apache.lucene.store.NativeFSLockFactory@14606a6a),segFN=segments_1,generation=1,filenames=[segments_1]
[junit4:junit4]   2> 1437 T1009 oasc.SolrDeletionPolicy.updateCommits newest commit = 1[segments_1]
[junit4:junit4]   2> 1437 T1009 oasc.CachingDirectoryFactory.close Releasing directory:/usr/home/hudson/hudson-slave/workspace/Lucene-Solr-Tests-4.x-Java6/solr/build/solr-core/test/J0/./org.apache.solr.cloud.SyncSliceTest-1356477997819/control/data/index
[junit4:junit4]   2> 1438 T1009 oasc.SolrCore.initWriters created xml: solr.XMLResponseWriter
[junit4:junit4]   2> 1440 T1009 oasup.UpdateRequestProcessorChain.init inserting DistributedUpdateProcessorFactory into updateRequestProcessorChain "dedupe"
[junit4:junit4]   2> 1440 T1009 oasup.UpdateRequestProcessorChain.init inserting DistributedUpdateProcessorFactory into updateRequestProcessorChain "dedupe-allfields"
[junit4:junit4]   2> 1440 T1009 oasup.UpdateRequestProcessorChain.init inserting DistributedUpdateProcessorFactory into updateRequestProcessorChain "stored_sig"
[junit4:junit4]   2> 1441 T1009 oasup.UpdateRequestProcessorChain.init inserting DistributedUpdateProcessorFactory into updateRequestProcessorChain "uniq-fields"
[junit4:junit4]   2> 1441 T1009 oasup.UpdateRequestProcessorChain.init inserting DistributedUpdateProcessorFactory into updateRequestProcessorChain "distrib-dup-test-chain-implicit"
[junit4:junit4]   2> 1442 T1009 oasc.RequestHandlers.initHandlersFromConfig adding lazy requestHandler: solr.ReplicationHandler
[junit4:junit4]   2> 1442 T1009 oasc.RequestHandlers.initHandlersFromConfig created /replication: solr.ReplicationHandler
[junit4:junit4]   2> 1443 T1009 oasc.RequestHandlers.initHandlersFromConfig created standard: solr.StandardRequestHandler
[junit4:junit4]   2> 1444 T1009 oasc.RequestHandlers.initHandlersFromConfig created /get: solr.RealTimeGetHandler
[junit4:junit4]   2> 1445 T1009 oasc.RequestHandlers.initHandlersFromConfig created dismax: solr.SearchHandler
[junit4:junit4]   2> 1446 T1009 oasc.RequestHandlers.initHandlersFromConfig created mock: org.apache.solr.core.MockQuerySenderListenerReqHandler
[junit4:junit4]   2> 1446 T1009 oasc.RequestHandlers.initHandlersFromConfig created /admin/: org.apache.solr.handler.admin.AdminHandlers
[junit4:junit4]   2> 1447 T1009 oasc.RequestHandlers.initHandlersFromConfig created defaults: solr.StandardRequestHandler
[junit4:junit4]   2> 1448 T1009 oasc.RequestHandlers.initHandlersFromConfig adding lazy requestHandler: solr.StandardRequestHandler
[junit4:junit4]   2> 1448 T1009 oasc.RequestHandlers.initHandlersFromConfig created lazy: solr.StandardRequestHandler
[junit4:junit4]   2> 1449 T1009 oasc.RequestHandlers.initHandlersFromConfig created /update: solr.UpdateRequestHandler
[junit4:junit4]   2> 1450 T1009 oasc.RequestHandlers.initHandlersFromConfig created /terms: org.apache.solr.handler.component.SearchHandler
[junit4:junit4]   2> 1451 T1009 oasc.RequestHandlers.initHandlersFromConfig created spellCheckCompRH: org.apache.solr.handler.component.SearchHandler
[junit4:junit4]   2> 1452 T1009 oasc.RequestHandlers.initHandlersFromConfig created spellCheckCompRH_Direct: org.apache.solr.handler.component.SearchHandler
[junit4:junit4]   2> 1453 T1009 oasc.RequestHandlers.initHandlersFromConfig created spellCheckWithWordbreak: org.apache.solr.handler.component.SearchHandler
[junit4:junit4]   2> 1454 T1009 oasc.RequestHandlers.initHandlersFromConfig created spellCheckWithWordbreak_Direct: org.apache.solr.handler.component.SearchHandler
[junit4:junit4]   2> 1454 T1009 oasc.RequestHandlers.initHandlersFromConfig created spellCheckCompRH1: org.apache.solr.handler.component.SearchHandler
[junit4:junit4]   2> 1455 T1009 oasc.RequestHandlers.initHandlersFromConfig created mltrh: org.apache.solr.handler.component.SearchHandler
[junit4:junit4]   2> 1456 T1009 oasc.RequestHandlers.initHandlersFromConfig created tvrh: org.apache.solr.handler.component.SearchHandler
[junit4:junit4]   2> 1457 T1009 oasc.RequestHandlers.initHandlersFromConfig created /mlt: solr.MoreLikeThisHandler
[junit4:junit4]   2> 1458 T1009 oasc.RequestHandlers.initHandlersFromConfig created /debug/dump: solr.DumpRequestHandler
[junit4:junit4]   2> 1466 T1009 oashl.XMLLoader.init xsltCacheLifetimeSeconds=60
[junit4:junit4]   2> 1471 T1009 oasc.SolrCore.initDeprecatedSupport WARNING solrconfig.xml uses deprecated <admin/gettableFiles>, Please update your config to use the ShowFileRequestHandler.
[junit4:junit4]   2> 1473 T1009 oasc.SolrCore.initDeprecatedSupport WARNING adding ShowFileRequestHandler with hidden files: [SCHEMA.XML, OLD_SYNONYMS.TXT, STOPWORDS.TXT, PROTWORDS.TXT, OPEN-EXCHANGE-RATES.JSON, SYNONYMS.TXT, CURRENCY.XML, MAPPING-ISOLATIN1ACCENT.TXT]
[junit4:junit4]   2> 1475 T1009 oasc.CachingDirectoryFactory.close Releasing directory:/usr/home/hudson/hudson-slave/workspace/Lucene-Solr-Tests-4.x-Java6/solr/build/solr-core/test/J0/./org.apache.solr.cloud.SyncSliceTest-1356477997819/control/data
[junit4:junit4]   2> 1477 T1009 oass.SolrIndexSearcher.<init> Opening Searcher@75e13dbe main
[junit4:junit4]   2> 1478 T1009 oasu.CommitTracker.<init> Hard AutoCommit: disabled
[junit4:junit4]   2> 1478 T1009 oasu.CommitTracker.<init> Soft AutoCommit: disabled
[junit4:junit4]   2> 1479 T1009 oashc.SpellCheckComponent.inform Initializing spell checkers
[junit4:junit4]   2> 1486 T1009 oass.DirectSolrSpellChecker.init init: {name=direct,classname=DirectSolrSpellChecker,field=lowerfilt,minQueryLength=3}
[junit4:junit4]   2> 1544 T1010 oasc.SolrCore.registerSearcher [collection1] Registered new searcher Searcher@75e13dbe main{StandardDirectoryReader(segments_1:1)}
[junit4:junit4]   2> 1546 T1009 oasc.ZkController.publish publishing core=collection1 state=down
[junit4:junit4]   2> 1546 T1009 oasc.ZkController.publish numShards not found on descriptor - reading it from system property
[junit4:junit4]   2> 1547 T989 oazs.PrepRequestProcessor.pRequest Got user-level KeeperException when processing sessionid:0x13bd463a3000003 type:create cxid:0x53 zxid:0x29 txntype:-1 reqpath:n/a Error Path:/solr/overseer/queue Error:KeeperErrorCode = NoNode for /solr/overseer/queue
[junit4:junit4]   2> 1582 T1007 oascc.ZkStateReader.updateClusterState Updating cloud state from ZooKeeper... 
[junit4:junit4]   2> 1583 T1007 oasc.Overseer$ClusterStateUpdater.updateState Update state numShards=1 message={
[junit4:junit4]   2> 	  "operation":"state",
[junit4:junit4]   2> 	  "numShards":"1",
[junit4:junit4]   2> 	  "shard":null,
[junit4:junit4]   2> 	  "roles":null,
[junit4:junit4]   2> 	  "state":"down",
[junit4:junit4]   2> 	  "core":"collection1",
[junit4:junit4]   2> 	  "collection":"control_collection",
[junit4:junit4]   2> 	  "node_name":"127.0.0.1:40766_",
[junit4:junit4]   2> 	  "base_url":"http://127.0.0.1:40766"}
[junit4:junit4]   2> 1583 T1007 oasc.Overseer$ClusterStateUpdater.createCollection Create collection control_collection with numShards 1
[junit4:junit4]   2> 1583 T1007 oasc.Overseer$ClusterStateUpdater.updateState Assigning new node to shard shard=shard1
[junit4:junit4]   2> 1584 T989 oazs.PrepRequestProcessor.pRequest Got user-level KeeperException when processing sessionid:0x13bd463a3000003 type:create cxid:0x5b zxid:0x2c txntype:-1 reqpath:n/a Error Path:/solr/overseer/queue-work Error:KeeperErrorCode = NoNode for /solr/overseer/queue-work
[junit4:junit4]   2> 1603 T1006 oascc.ZkStateReader$2.process A cluster state change: WatchedEvent state:SyncConnected type:NodeDataChanged path:/clusterstate.json, has occurred - updating... (live nodes size: 1)
[junit4:junit4]   2> 2558 T1009 oasc.CoreContainer.registerCore registering core: collection1
[junit4:junit4]   2> 2558 T1009 oasc.ZkController.register Register replica - core:collection1 address:http://127.0.0.1:40766 collection:control_collection shard:shard1
[junit4:junit4]   2> 2559 T1009 oascc.SolrZkClient.makePath makePath: /collections/control_collection/leader_elect/shard1/election
[junit4:junit4]   2> 2575 T989 oazs.PrepRequestProcessor.pRequest Got user-level KeeperException when processing sessionid:0x13bd463a3000003 type:delete cxid:0x78 zxid:0x36 txntype:-1 reqpath:n/a Error Path:/solr/collections/control_collection/leaders Error:KeeperErrorCode = NoNode for /solr/collections/control_collection/leaders
[junit4:junit4]   2> 2581 T1009 oasc.ShardLeaderElectionContext.runLeaderProcess Running the leader process.
[junit4:junit4]   2> 2581 T989 oazs.PrepRequestProcessor.pRequest Got user-level KeeperException when processing sessionid:0x13bd463a3000003 type:create cxid:0x79 zxid:0x37 txntype:-1 reqpath:n/a Error Path:/solr/overseer Error:KeeperErrorCode = NodeExists for /solr/overseer
[junit4:junit4]   2> 2590 T1009 oasc.ShardLeaderElectionContext.waitForReplicasToComeUp Enough replicas found to continue.
[junit4:junit4]   2> 2590 T1009 oasc.ShardLeaderElectionContext.runLeaderProcess I may be the new leader - try and sync
[junit4:junit4]   2> 2590 T1009 oasc.SyncStrategy.sync Sync replicas to http://127.0.0.1:40766/collection1/
[junit4:junit4]   2> 2591 T1009 oasc.SyncStrategy.syncReplicas Sync Success - now sync replicas to me
[junit4:junit4]   2> 2591 T1009 oasc.SyncStrategy.syncToMe http://127.0.0.1:40766/collection1/ has no replicas
[junit4:junit4]   2> 2591 T1009 oasc.ShardLeaderElectionContext.runLeaderProcess I am the new leader: http://127.0.0.1:40766/collection1/
[junit4:junit4]   2> 2591 T1009 oascc.SolrZkClient.makePath makePath: /collections/control_collection/leaders/shard1
[junit4:junit4]   2> 2596 T989 oazs.PrepRequestProcessor.pRequest Got user-level KeeperException when processing sessionid:0x13bd463a3000003 type:create cxid:0x83 zxid:0x3b txntype:-1 reqpath:n/a Error Path:/solr/overseer Error:KeeperErrorCode = NodeExists for /solr/overseer
[junit4:junit4]   2> 2608 T1007 oascc.ZkStateReader.updateClusterState Updating cloud state from ZooKeeper... 
[junit4:junit4]   2> 2622 T1006 oascc.ZkStateReader$2.process A cluster state change: WatchedEvent state:SyncConnected type:NodeDataChanged path:/clusterstate.json, has occurred - updating... (live nodes size: 1)
[junit4:junit4]   2> 2657 T1009 oasc.ZkController.register We are http://127.0.0.1:40766/collection1/ and leader is http://127.0.0.1:40766/collection1/
[junit4:junit4]   2> 2657 T1009 oasc.ZkController.register No LogReplay needed for core=collection1 baseURL=http://127.0.0.1:40766
[junit4:junit4]   2> 2657 T1009 oasc.ZkController.checkRecovery I am the leader, no recovery necessary
[junit4:junit4]   2> 2657 T1009 oasc.ZkController.publish publishing core=collection1 state=active
[junit4:junit4]   2> 2658 T1009 oasc.ZkController.publish numShards not found on descriptor - reading it from system property
[junit4:junit4]   2> 2694 T1009 oascc.ZkStateReader.updateClusterState Updating cloud state from ZooKeeper... 
[junit4:junit4]   2> 2695 T984 oass.SolrDispatchFilter.init user.dir=/usr/home/hudson/hudson-slave/workspace/Lucene-Solr-Tests-4.x-Java6/solr/build/solr-core/test/J0
[junit4:junit4]   2> 2696 T984 oass.SolrDispatchFilter.init SolrDispatchFilter.init() done
[junit4:junit4]   2> 2696 T984 oascsi.HttpClientUtil.createClient Creating new http client, config:maxConnections=128&maxConnectionsPerHost=32&followRedirects=false
[junit4:junit4]   2> 2714 T984 oascsi.HttpClientUtil.createClient Creating new http client, config:
[junit4:junit4]   2> 2725 T984 oaz.ZooKeeper.<init> Initiating client connection, connectString=127.0.0.1:40763/solr sessionTimeout=10000 watcher=org.apache.solr.common.cloud.ConnectionManager@27c90d11
[junit4:junit4]   2> 2726 T984 oascc.ConnectionManager.waitForConnected Waiting for client to connect to ZooKeeper
[junit4:junit4]   2> 2727 T1011 oaz.ClientCnxn$SendThread.logStartConnect Opening socket connection to server localhost/127.0.0.1:40763. Will not attempt to authenticate using SASL (access denied (javax.security.auth.AuthPermission getLoginConfiguration))
[junit4:junit4]   2> 2727 T1011 oaz.ClientCnxn$SendThread.primeConnection Socket connection established to localhost/127.0.0.1:40763, initiating session
[junit4:junit4]   2> 2727 T986 oazs.NIOServerCnxnFactory.run Accepted socket connection from /140.211.11.196:40769
[junit4:junit4]   2> 2728 T986 oazs.ZooKeeperServer.processConnectRequest Client attempting to establish new session at /140.211.11.196:40769
[junit4:junit4]   2> 2733 T988 oazs.ZooKeeperServer.finishSessionInit Established session 0x13bd463a3000004 with negotiated timeout 10000 for client /140.211.11.196:40769
[junit4:junit4]   2> 2733 T1011 oaz.ClientCnxn$SendThread.onConnected Session establishment complete on server localhost/127.0.0.1:40763, sessionid = 0x13bd463a3000004, negotiated timeout = 10000
[junit4:junit4]   2> 2734 T1012 oascc.ConnectionManager.process Watcher org.apache.solr.common.cloud.ConnectionManager@27c90d11 name:ZooKeeperConnection Watcher:127.0.0.1:40763/solr got event WatchedEvent state:SyncConnected type:None path:null path:null type:None
[junit4:junit4]   2> 2734 T984 oascc.ConnectionManager.waitForConnected Client is connected to ZooKeeper
[junit4:junit4]   2> 2735 T984 oascc.ZkStateReader.createClusterStateWatchersAndUpdate Updating cluster state from ZooKeeper... 
[junit4:junit4]   2> 2737 T984 oasc.ChaosMonkey.monkeyLog monkey: init - expire sessions:true cause connection loss:true
[junit4:junit4]   2> 2923 T984 oejs.Server.doStart jetty-8.1.8.v20121106
[junit4:junit4]   2> 2926 T984 oejs.AbstractConnector.doStart Started SocketConnector@127.0.0.1:40770
[junit4:junit4]   2> 2928 T984 oasc.SolrResourceLoader.locateSolrHome JNDI not configured for solr (NoInitialContextEx)
[junit4:junit4]   2> 2928 T984 oasc.SolrResourceLoader.locateSolrHome using system property solr.solr.home: /usr/home/hudson/hudson-slave/workspace/Lucene-Solr-Tests-4.x-Java6/solr/build/solr-core/test/J0/./org.apache.solr.cloud.SyncSliceTest-jetty1-1356478000552
[junit4:junit4]   2> 2929 T984 oasc.SolrResourceLoader.<init> new SolrResourceLoader for deduced Solr Home: '/usr/home/hudson/hudson-slave/workspace/Lucene-Solr-Tests-4.x-Java6/solr/build/solr-core/test/J0/./org.apache.solr.cloud.SyncSliceTest-jetty1-1356478000552/'
[junit4:junit4]   2> 2970 T984 oass.SolrDispatchFilter.init SolrDispatchFilter.init()
[junit4:junit4]   2> 2971 T984 oasc.SolrResourceLoader.locateSolrHome JNDI not configured for solr (NoInitialContextEx)
[junit4:junit4]   2> 2971 T984 oasc.SolrResourceLoader.locateSolrHome using system property solr.solr.home: /usr/home/hudson/hudson-slave/workspace/Lucene-Solr-Tests-4.x-Java6/solr/build/solr-core/test/J0/./org.apache.solr.cloud.SyncSliceTest-jetty1-1356478000552
[junit4:junit4]   2> 2971 T984 oasc.CoreContainer$Initializer.initialize looking for solr.xml: /usr/home/hudson/hudson-slave/workspace/Lucene-Solr-Tests-4.x-Java6/solr/build/solr-core/test/J0/./org.apache.solr.cloud.SyncSliceTest-jetty1-1356478000552/solr.xml
[junit4:junit4]   2> 2972 T984 oasc.CoreContainer.<init> New CoreContainer 1977140389
[junit4:junit4]   2> 2973 T984 oasc.CoreContainer.load Loading CoreContainer using Solr Home: '/usr/home/hudson/hudson-slave/workspace/Lucene-Solr-Tests-4.x-Java6/solr/build/solr-core/test/J0/./org.apache.solr.cloud.SyncSliceTest-jetty1-1356478000552/'
[junit4:junit4]   2> 2973 T984 oasc.SolrResourceLoader.<init> new SolrResourceLoader for directory: '/usr/home/hudson/hudson-slave/workspace/Lucene-Solr-Tests-4.x-Java6/solr/build/solr-core/test/J0/./org.apache.solr.cloud.SyncSliceTest-jetty1-1356478000552/'
[junit4:junit4]   2> 2999 T984 oashc.HttpShardHandlerFactory.getParameter Setting socketTimeout to: 30000
[junit4:junit4]   2> 2999 T984 oashc.HttpShardHandlerFactory.getParameter Setting urlScheme to: http://
[junit4:junit4]   2> 3000 T984 oashc.HttpShardHandlerFactory.getParameter Setting connTimeout to: 15000
[junit4:junit4]   2> 3000 T984 oashc.HttpShardHandlerFactory.getParameter Setting maxConnectionsPerHost to: 20
[junit4:junit4]   2> 3001 T984 oashc.HttpShardHandlerFactory.getParameter Setting corePoolSize to: 0
[junit4:junit4]   2> 3002 T984 oashc.HttpShardHandlerFactory.getParameter Setting maximumPoolSize to: 2147483647
[junit4:junit4]   2> 3002 T984 oashc.HttpShardHandlerFactory.getParameter Setting maxThreadIdleTime to: 5
[junit4:junit4]   2> 3003 T984 oashc.HttpShardHandlerFactory.getParameter Setting sizeOfQueue to: -1
[junit4:junit4]   2> 3004 T984 oashc.HttpShardHandlerFactory.getParameter Setting fairnessPolicy to: false
[junit4:junit4]   2> 3004 T984 oascsi.HttpClientUtil.createClient Creating new http client, config:maxConnectionsPerHost=20&maxConnections=10000&socketTimeout=30000&connTimeout=15000&retry=false
[junit4:junit4]   2> 3025 T984 oasc.CoreContainer.load Registering Log Listener
[junit4:junit4]   2> 3044 T984 oasc.CoreContainer.initZooKeeper Zookeeper client=127.0.0.1:40763/solr
[junit4:junit4]   2> 3044 T984 oasc.ZkController.checkChrootPath zkHost includes chroot
[junit4:junit4]   2> 3045 T984 oaz.ZooKeeper.<init> Initiating client connection, connectString=127.0.0.1:40763 sessionTimeout=60000 watcher=org.apache.solr.common.cloud.ConnectionManager@1f7de7e6
[junit4:junit4]   2> 3046 T984 oascc.ConnectionManager.waitForConnected Waiting for client to connect to ZooKeeper
[junit4:junit4]   2> 3046 T1022 oaz.ClientCnxn$SendThread.logStartConnect Opening socket connection to server localhost/127.0.0.1:40763. Will not attempt to authenticate using SASL (access denied (javax.security.auth.AuthPermission getLoginConfiguration))
[junit4:junit4]   2> 3047 T1022 oaz.ClientCnxn$SendThread.primeConnection Socket connection established to localhost/127.0.0.1:40763, initiating session
[junit4:junit4]   2> 3048 T986 oazs.NIOServerCnxnFactory.run Accepted socket connection from /140.211.11.196:40771
[junit4:junit4]   2> 3048 T986 oazs.ZooKeeperServer.processConnectRequest Client attempting to establish new session at /140.211.11.196:40771
[junit4:junit4]   2> 3050 T988 oazs.ZooKeeperServer.finishSessionInit Established session 0x13bd463a3000005 with negotiated timeout 20000 for client /140.211.11.196:40771
[junit4:junit4]   2> 3050 T1022 oaz.ClientCnxn$SendThread.onConnected Session establishment complete on server localhost/127.0.0.1:40763, sessionid = 0x13bd463a3000005, negotiated timeout = 20000
[junit4:junit4]   2> 3051 T1023 oascc.ConnectionManager.process Watcher org.apache.solr.common.cloud.ConnectionManager@1f7de7e6 name:ZooKeeperConnection Watcher:127.0.0.1:40763 got event WatchedEvent state:SyncConnected type:None path:null path:null type:None
[junit4:junit4]   2> 3051 T984 oascc.ConnectionManager.waitForConnected Client is connected to ZooKeeper
[junit4:junit4]   2> 3052 T989 oazs.PrepRequestProcessor.pRequest2Txn Processed session termination for sessionid: 0x13bd463a3000005
[junit4:junit4]   2> 3071 T1023 oaz.ClientCnxn$EventThread.run EventThread shut down
[junit4:junit4]   2> 3071 T986 oazs.NIOServerCnxn.closeSock Closed socket connection for client /140.211.11.196:40771 which had sessionid 0x13bd463a3000005
[junit4:junit4]   2> 3071 T984 oaz.ZooKeeper.close Session: 0x13bd463a3000005 closed
[junit4:junit4]   2> 3072 T984 oascsi.HttpClientUtil.createClient Creating new http client, config:maxConnections=500&maxConnectionsPerHost=16&socketTimeout=15000&connTimeout=30000
[junit4:junit4]   2> 3083 T984 oaz.ZooKeeper.<init> Initiating client connection, connectString=127.0.0.1:40763/solr sessionTimeout=30000 watcher=org.apache.solr.common.cloud.ConnectionManager@70a7329f
[junit4:junit4]   2> 3084 T984 oascc.ConnectionManager.waitForConnected Waiting for client to connect to ZooKeeper
[junit4:junit4]   2> 3084 T1024 oaz.ClientCnxn$SendThread.logStartConnect Opening socket connection to server localhost/127.0.0.1:40763. Will not attempt to authenticate using SASL (access denied (javax.security.auth.AuthPermission getLoginConfiguration))
[junit4:junit4]   2> 3084 T1024 oaz.ClientCnxn$SendThread.primeConnection Socket connection established to localhost/127.0.0.1:40763, initiating session
[junit4:junit4]   2> 3085 T986 oazs.NIOServerCnxnFactory.run Accepted socket connection from /140.211.11.196:40772
[junit4:junit4]   2> 3085 T986 oazs.ZooKeeperServer.processConnectRequest Client attempting to establish new session at /140.211.11.196:40772
[junit4:junit4]   2> 3087 T988 oazs.ZooKeeperServer.finishSessionInit Established session 0x13bd463a3000006 with negotiated timeout 20000 for client /140.211.11.196:40772
[junit4:junit4]   2> 3087 T1024 oaz.ClientCnxn$SendThread.onConnected Session establishment complete on server localhost/127.0.0.1:40763, sessionid = 0x13bd463a3000006, negotiated timeout = 20000
[junit4:junit4]   2> 3087 T1025 oascc.ConnectionManager.process Watcher org.apache.solr.common.cloud.ConnectionManager@70a7329f name:ZooKeeperConnection Watcher:127.0.0.1:40763/solr got event WatchedEvent state:SyncConnected type:None path:null path:null type:None
[junit4:junit4]   2> 3087 T984 oascc.ConnectionManager.waitForConnected Client is connected to ZooKeeper
[junit4:junit4]   2> 3089 T989 oazs.PrepRequestProcessor.pRequest Got user-level KeeperException when processing sessionid:0x13bd463a3000006 type:create cxid:0x1 zxid:0x49 txntype:-1 reqpath:n/a Error Path:/solr/overseer Error:KeeperErrorCode = NodeExists for /solr/overseer
[junit4:junit4]   2> 3090 T989 oazs.PrepRequestProcessor.pRequest Got user-level KeeperException when processing sessionid:0x13bd463a3000006 type:create cxid:0x2 zxid:0x4a txntype:-1 reqpath:n/a Error Path:/solr/overseer Error:KeeperErrorCode = NodeExists for /solr/overseer
[junit4:junit4]   2> 3098 T984 oasc.ZkController.createEphemeralLiveNode Register node as live in ZooKeeper:/live_nodes/127.0.0.1:40770_
[junit4:junit4]   2> 3099 T989 oazs.PrepRequestProcessor.pRequest Got user-level KeeperException when processing sessionid:0x13bd463a3000006 type:delete cxid:0x4 zxid:0x4b txntype:-1 reqpath:n/a Error Path:/solr/live_nodes/127.0.0.1:40770_ Error:KeeperErrorCode = NoNode for /solr/live_nodes/127.0.0.1:40770_
[junit4:junit4]   2> 3100 T984 oascc.SolrZkClient.makePath makePath: /live_nodes/127.0.0.1:40770_
[junit4:junit4]   2> 3103 T1006 oascc.ZkStateReader$2.process A cluster state change: WatchedEvent state:SyncConnected type:NodeChildrenChanged path:/live_nodes, has occurred - updating... (live nodes size: 1)
[junit4:junit4]   2> 3103 T1012 oascc.ZkStateReader$3.process Updating live nodes... (2)
[junit4:junit4]   2> 3111 T1006 oascc.ZkStateReader$3.process Updating live nodes... (2)
[junit4:junit4]   2> 3112 T984 oascc.ZkStateReader.createClusterStateWatchersAndUpdate Updating cluster state from ZooKeeper... 
[junit4:junit4]   2> 3120 T1026 oasc.CoreContainer.create Creating SolrCore 'collection1' using instanceDir: /usr/home/hudson/hudson-slave/workspace/Lucene-Solr-Tests-4.x-Java6/solr/build/solr-core/test/J0/./org.apache.solr.cloud.SyncSliceTest-jetty1-1356478000552/collection1
[junit4:junit4]   2> 3120 T1026 oasc.ZkController.createCollectionZkNode Check for collection zkNode:collection1
[junit4:junit4]   2> 3121 T1026 oasc.ZkController.createCollectionZkNode Collection zkNode exists
[junit4:junit4]   2> 3121 T1026 oasc.ZkController.readConfigName Load collection config from:/collections/collection1
[junit4:junit4]   2> 3122 T1026 oasc.SolrResourceLoader.<init> new SolrResourceLoader for directory: '/usr/home/hudson/hudson-slave/workspace/Lucene-Solr-Tests-4.x-Java6/solr/build/solr-core/test/J0/./org.apache.solr.cloud.SyncSliceTest-jetty1-1356478000552/collection1/'
[junit4:junit4]   2> 3123 T1026 oasc.SolrResourceLoader.replaceClassLoader Adding 'file:/usr/home/hudson/hudson-slave/workspace/Lucene-Solr-Tests-4.x-Java6/solr/build/solr-core/test/J0/org.apache.solr.cloud.SyncSliceTest-jetty1-1356478000552/collection1/lib/README' to classloader
[junit4:junit4]   2> 3124 T1026 oasc.SolrResourceLoader.replaceClassLoader Adding 'file:/usr/home/hudson/hudson-slave/workspace/Lucene-Solr-Tests-4.x-Java6/solr/build/solr-core/test/J0/org.apache.solr.cloud.SyncSliceTest-jetty1-1356478000552/collection1/lib/classes/' to classloader
[junit4:junit4]   2> 3127 T1007 oascc.ZkStateReader.updateClusterState Updating cloud state from ZooKeeper... 
[junit4:junit4]   2> 3128 T1007 oasc.Overseer$ClusterStateUpdater.updateState Update state numShards=1 message={
[junit4:junit4]   2> 	  "operation":"state",
[junit4:junit4]   2> 	  "numShards":"1",
[junit4:junit4]   2> 	  "shard":"shard1",
[junit4:junit4]   2> 	  "roles":null,
[junit4:junit4]   2> 	  "state":"active",
[junit4:junit4]   2> 	  "core":"collection1",
[junit4:junit4]   2> 	  "collection":"control_collection",
[junit4:junit4]   2> 	  "node_name":"127.0.0.1:40766_",
[junit4:junit4]   2> 	  "base_url":"http://127.0.0.1:40766"}
[junit4:junit4]   2> 3141 T1006 oascc.ZkStateReader$2.process A cluster state change: WatchedEvent state:SyncConnected type:NodeDataChanged path:/clusterstate.json, has occurred - updating... (live nodes size: 2)
[junit4:junit4]   2> 3141 T1012 oascc.ZkStateReader$2.process A cluster state change: WatchedEvent state:SyncConnected type:NodeDataChanged path:/clusterstate.json, has occurred - updating... (live nodes size: 2)
[junit4:junit4]   2> 3141 T1025 oascc.ZkStateReader$2.process A cluster state change: WatchedEvent state:SyncConnected type:NodeDataChanged path:/clusterstate.json, has occurred - updating... (live nodes size: 2)
[junit4:junit4]   2> 3195 T1026 oasc.SolrConfig.<init> Using Lucene MatchVersion: LUCENE_41
[junit4:junit4]   2> 3266 T1026 oasc.SolrConfig.<init> Loaded SolrConfig: solrconfig.xml
[junit4:junit4]   2> 3367 T1026 oass.IndexSchema.readSchema Reading Solr Schema
[junit4:junit4]   2> 3373 T1026 oass.IndexSchema.readSchema Schema name=test
[junit4:junit4]   2> 3987 T1026 oass.OpenExchangeRatesOrgProvider.init Initialized with rates=open-exchange-rates.json, refreshInterval=1440.
[junit4:junit4]   2> 3996 T1026 oass.IndexSchema.readSchema default search field in schema is text
[junit4:junit4]   2> 3999 T1026 oass.IndexSchema.readSchema unique key field: id
[junit4:junit4]   2> 4024 T1026 oass.FileExchangeRateProvider.reload Reloading exchange rates from file currency.xml
[junit4:junit4]   2> 4027 T1026 oass.FileExchangeRateProvider.reload Reloading exchange rates from file currency.xml
[junit4:junit4]   2> 4030 T1026 oass.OpenExchangeRatesOrgProvider.reload Reloading exchange rates from open-exchange-rates.json
[junit4:junit4]   2> 4031 T1026 oass.OpenExchangeRatesOrgProvider.reload Reloading exchange rates from open-exchange-rates.json
[junit4:junit4]   2> 4032 T1026 oasc.SolrCore.<init> [collection1] Opening new SolrCore at /usr/home/hudson/hudson-slave/workspace/Lucene-Solr-Tests-4.x-Java6/solr/build/solr-core/test/J0/./org.apache.solr.cloud.SyncSliceTest-jetty1-1356478000552/collection1/, dataDir=./org.apache.solr.cloud.SyncSliceTest-1356477997819/jetty1/
[junit4:junit4]   2> 4032 T1026 oasc.JmxMonitoredMap.<init> JMX monitoring is enabled. Adding Solr mbeans to JMX Server: com.sun.jmx.mbeanserver.JmxMBeanServer@5867df9
[junit4:junit4]   2> 4033 T1026 oasc.SolrCore.initDirectoryFactory solr.StandardDirectoryFactory
[junit4:junit4]   2> 4033 T1026 oasc.CachingDirectoryFactory.get return new directory for /usr/home/hudson/hudson-slave/workspace/Lucene-Solr-Tests-4.x-Java6/solr/build/solr-core/test/J0/./org.apache.solr.cloud.SyncSliceTest-1356477997819/jetty1 forceNew:false
[junit4:junit4]   2> 4034 T1026 oasc.CachingDirectoryFactory.close Releasing directory:/usr/home/hudson/hudson-slave/workspace/Lucene-Solr-Tests-4.x-Java6/solr/build/solr-core/test/J0/./org.apache.solr.cloud.SyncSliceTest-1356477997819/jetty1
[junit4:junit4]   2> 4034 T1026 oasc.SolrCore.getNewIndexDir New index directory detected: old=null new=./org.apache.solr.cloud.SyncSliceTest-1356477997819/jetty1/index/
[junit4:junit4]   2> 4034 T1026 oasc.SolrCore.initIndex WARNING [collection1] Solr index directory './org.apache.solr.cloud.SyncSliceTest-1356477997819/jetty1/index' doesn't exist. Creating new index...
[junit4:junit4]   2> 4036 T1026 oasc.CachingDirectoryFactory.get return new directory for /usr/home/hudson/hudson-slave/workspace/Lucene-Solr-Tests-4.x-Java6/solr/build/solr-core/test/J0/./org.apache.solr.cloud.SyncSliceTest-1356477997819/jetty1/index forceNew:false
[junit4:junit4]   2> 4066 T1026 oasc.SolrDeletionPolicy.onCommit SolrDeletionPolicy.onCommit: commits:num=1
[junit4:junit4]   2> 		commit{dir=RateLimitedDirectoryWrapper(org.apache.lucene.store.NIOFSDirectory@/usr/home/hudson/hudson-slave/workspace/Lucene-Solr-Tests-4.x-Java6/solr/build/solr-core/test/J0/org.apache.solr.cloud.SyncSliceTest-1356477997819/jetty1/index lockFactory=org.apache.lucene.store.NativeFSLockFactory@65b1e8f4),segFN=segments_1,generation=1,filenames=[segments_1]
[junit4:junit4]   2> 4066 T1026 oasc.SolrDeletionPolicy.updateCommits newest commit = 1[segments_1]
[junit4:junit4]   2> 4066 T1026 oasc.CachingDirectoryFactory.close Releasing directory:/usr/home/hudson/hudson-slave/workspace/Lucene-Solr-Tests-4.x-Java6/solr/build/solr-core/test/J0/./org.apache.solr.cloud.SyncSliceTest-1356477997819/jetty1/index
[junit4:junit4]   2> 4067 T1026 oasc.SolrCore.initWriters created xml: solr.XMLResponseWriter
[junit4:junit4]   2> 4068 T1026 oasup.UpdateRequestProcessorChain.init inserting DistributedUpdateProcessorFactory into updateRequestProcessorChain "dedupe"
[junit4:junit4]   2> 4068 T1026 oasup.UpdateRequestProcessorChain.init inserting DistributedUpdateProcessorFactory into updateRequestProcessorChain "dedupe-allfields"
[junit4:junit4]   2> 4069 T1026 oasup.UpdateRequestProcessorChain.init inserting DistributedUpdateProcessorFactory into updateRequestProcessorChain "stored_sig"
[junit4:junit4]   2> 4069 T1026 oasup.UpdateRequestProcessorChain.init inserting DistributedUpdateProcessorFactory into updateRequestProcessorChain "uniq-fields"
[junit4:junit4]   2> 4069 T1026 oasup.UpdateRequestProcessorChain.init inserting DistributedUpdateProcessorFactory into updateRequestProcessorChain "distrib-dup-test-chain-implicit"
[junit4:junit4]   2> 4069 T1026 oasc.RequestHandlers.initHandlersFromConfig adding lazy requestHandler: solr.ReplicationHandler
[junit4:junit4]   2> 4070 T1026 oasc.RequestHandlers.initHandlersFromConfig created /replication: solr.ReplicationHandler
[junit4:junit4]   2> 4070 T1026 oasc.RequestHandlers.initHandlersFromConfig created standard: solr.StandardRequestHandler
[junit4:junit4]   2> 4071 T1026 oasc.RequestHandlers.initHandlersFromConfig created /get: solr.RealTimeGetHandler
[junit4:junit4]   2> 4072 T1026 oasc.RequestHandlers.initHandlersFromConfig created dismax: solr.SearchHandler
[junit4:junit4]   2> 4073 T1026 oasc.RequestHandlers.initHandlersFromConfig created mock: org.apache.solr.core.MockQuerySenderListenerReqHandler
[junit4:junit4]   2> 4073 T1026 oasc.RequestHandlers.initHandlersFromConfig created /admin/: org.apache.solr.handler.admin.AdminHandlers
[junit4:junit4]   2> 4074 T1026 oasc.RequestHandlers.initHandlersFromConfig created defaults: solr.StandardRequestHandler
[junit4:junit4]   2> 4074 T1026 oasc.RequestHandlers.initHandlersFromConfig adding lazy requestHandler: solr.StandardRequestHandler
[junit4:junit4]   2> 4074 T1026 oasc.RequestHandlers.initHandlersFromConfig created lazy: solr.StandardRequestHandler
[junit4:junit4]   2> 4075 T1026 oasc.RequestHandlers.initHandlersFromConfig created /update: solr.UpdateRequestHandler
[junit4:junit4]   2> 4075 T1026 oasc.RequestHandlers.initHandlersFromConfig created /terms: org.apache.solr.handler.component.SearchHandler
[junit4:junit4]   2> 4076 T1026 oasc.RequestHandlers.initHandlersFromConfig created spellCheckCompRH: org.apache.solr.handler.component.SearchHandler
[junit4:junit4]   2> 4077 T1026 oasc.RequestHandlers.initHandlersFromConfig created spellCheckCompRH_Direct: org.apache.solr.handler.component.SearchHandler
[junit4:junit4]   2> 4077 T1026 oasc.RequestHandlers.initHandlersFromConfig created spellCheckWithWordbreak: org.apache.solr.handler.component.SearchHandler
[junit4:junit4]   2> 4078 T1026 oasc.RequestHandlers.initHandlersFromConfig created spellCheckWithWordbreak_Direct: org.apache.solr.handler.component.SearchHandler
[junit4:junit4]   2> 4079 T1026 oasc.RequestHandlers.initHandlersFromConfig created spellCheckCompRH1: org.apache.solr.handler.component.SearchHandler
[junit4:junit4]   2> 4079 T1026 oasc.RequestHandlers.initHandlersFromConfig created mltrh: org.apache.solr.handler.component.SearchHandler
[junit4:junit4]   2> 4080 T1026 oasc.RequestHandlers.initHandlersFromConfig created tvrh: org.apache.solr.handler.component.SearchHandler
[junit4:junit4]   2> 4081 T1026 oasc.RequestHandlers.initHandlersFromConfig created /mlt: solr.MoreLikeThisHandler
[junit4:junit4]   2> 4082 T1026 oasc.RequestHandlers.initHandlersFromConfig created /debug/dump: solr.DumpRequestHandler
[junit4:junit4]   2> 4087 T1026 oashl.XMLLoader.init xsltCacheLifetimeSeconds=60
[junit4:junit4]   2> 4091 T1026 oasc.SolrCore.initDeprecatedSupport WARNING solrconfig.xml uses deprecated <admin/gettableFiles>, Please update your config to use the ShowFileRequestHandler.
[junit4:junit4]   2> 4092 T1026 oasc.SolrCore.initDeprecatedSupport WARNING adding ShowFileRequestHandler with hidden files: [SCHEMA.XML, OLD_SYNONYMS.TXT, STOPWORDS.TXT, PROTWORDS.TXT, OPEN-EXCHANGE-RATES.JSON, SYNONYMS.TXT, CURRENCY.XML, MAPPING-ISOLATIN1ACCENT.TXT]
[junit4:junit4]   2> 4094 T1026 oasc.CachingDirectoryFactory.close Releasing directory:/usr/home/hudson/hudson-slave/workspace/Lucene-Solr-Tests-4.x-Java6/solr/build/solr-core/test/J0/./org.apache.solr.cloud.SyncSliceTest-1356477997819/jetty1
[junit4:junit4]   2> 4095 T1026 oass.SolrIndexSearcher.<init> Opening Searcher@5e00c43b main
[junit4:junit4]   2> 4096 T1026 oasu.CommitTracker.<init> Hard AutoCommit: disabled
[junit4:junit4]   2> 4096 T1026 oasu.CommitTracker.<init> Soft AutoCommit: disabled
[junit4:junit4]   2> 4097 T1026 oashc.SpellCheckComponent.inform Initializing spell checkers
[junit4:junit4]   2> 4102 T1026 oass.DirectSolrSpellChecker.init init: {name=direct,classname=DirectSolrSpellChecker,field=lowerfilt,minQueryLength=3}
[junit4:junit4]   2> 4155 T1027 oasc.SolrCore.registerSearcher [collection1] Registered new searcher Searcher@5e00c43b main{StandardDirectoryReader(segments_1:1)}
[junit4:junit4]   2> 4158 T1026 oasc.ZkController.publish publishing core=collection1 state=down
[junit4:junit4]   2> 4158 T1026 oasc.ZkController.publish numShards not found on descriptor - reading it from system property
[junit4:junit4]   2> 4653 T1007 oascc.ZkStateReader.updateClusterState Updating cloud state from ZooKeeper... 
[junit4:junit4]   2> 4654 T1007 oasc.Overseer$ClusterStateUpdater.updateState Update state numShards=1 message={
[junit4:junit4]   2> 	  "operation":"state",
[junit4:junit4]   2> 	  "numShards":"1",
[junit4:junit4]   2> 	  "shard":null,
[junit4:junit4]   2> 	  "roles":null,
[junit4:junit4]   2> 	  "state":"down",
[junit4:junit4]   2> 	  "core":"collection1",
[junit4:junit4]   2> 	  "collection":"collection1",
[junit4:junit4]   2> 	  "node_name":"127.0.0.1:40770_",
[junit4:junit4]   2> 	  "base_url":"http://127.0.0.1:40770"}
[junit4:junit4]   2> 4654 T1007 oasc.Overseer$ClusterStateUpdater.createCollection Create collection collection1 with numShards 1
[junit4:junit4]   2> 4654 T1007 oasc.Overseer$ClusterStateUpdater.updateState Assigning new node to shard shard=shard1
[junit4:junit4]   2> 4667 T1025 oascc.ZkStateReader$2.process A cluster state change: WatchedEvent state:SyncConnected type:NodeDataChanged path:/clusterstate.json, has occurred - updating... (live nodes size: 2)
[junit4:junit4]   2> 4667 T1006 oascc.ZkStateReader$2.process A cluster state change: WatchedEvent state:SyncConnected type:NodeDataChanged path:/clusterstate.json, has occurred - updating... (live nodes size: 2)
[junit4:junit4]   2> 4667 T1012 oascc.ZkStateReader$2.process A cluster state change: WatchedEvent state:SyncConnected type:NodeDataChanged path:/clusterstate.json, has occurred - updating... (live nodes size: 2)
[junit4:junit4]   2> 5160 T1026 oasc.CoreContainer.registerCore registering core: collection1
[junit4:junit4]   2> 5160 T1026 oasc.ZkController.register Register replica - core:collection1 address:http://127.0.0.1:40770 collection:collection1 shard:shard1
[junit4:junit4]   2> 5161 T1026 oascc.SolrZkClient.makePath makePath: /collections/collection1/leader_elect/shard1/election
[junit4:junit4]   2> 5177 T989 oazs.PrepRequestProcessor.pRequest Got user-level KeeperException when processing sessionid:0x13bd463a3000006 type:delete cxid:0x45 zxid:0x5b txntype:-1 reqpath:n/a Error Path:/solr/collections/collection1/leaders Error:KeeperErrorCode = NoNode for /solr/collections/collection1/leaders
[junit4:junit4]   2> 5182 T1026 oasc.ShardLeaderElectionContext.runLeaderProcess Running the leader process.
[junit4:junit4]   2> 5183 T989 oazs.PrepRequestProcessor.pRequest Got user-level KeeperException when processing sessionid:0x13bd463a3000006 type:create cxid:0x46 zxid:0x5c txntype:-1 reqpath:n/a Error Path:/solr/overseer Error:KeeperErrorCode = NodeExists for /solr/overseer
[junit4:junit4]   2> 5192 T1026 oasc.ShardLeaderElectionContext.waitForReplicasToComeUp Enough replicas found to continue.
[junit4:junit4]   2> 5192 T1026 oasc.ShardLeaderElectionContext.runLeaderProcess I may be the new leader - try and sync
[junit4:junit4]   2> 5192 T1026 oasc.SyncStrategy.sync Sync replicas to http://127.0.0.1:40770/collection1/
[junit4:junit4]   2> 5192 T1026 oasc.SyncStrategy.syncReplicas Sync Success - now sync replicas to me
[junit4:junit4]   2> 5193 T1026 oasc.SyncStrategy.syncToMe http://127.0.0.1:40770/collection1/ has no replicas
[junit4:junit4]   2> 5193 T1026 oasc.ShardLeaderElectionContext.runLeaderProcess I am the new leader: http://127.0.0.1:40770/collection1/
[junit4:junit4]   2> 5193 T1026 oascc.SolrZkClient.makePath makePath: /collections/collection1/leaders/shard1
[junit4:junit4]   2> 5197 T989 oazs.PrepRequestProcessor.pRequest Got user-level KeeperException when processing sessionid:0x13bd463a3000006 type:create cxid:0x50 zxid:0x60 txntype:-1 reqpath:n/a Error Path:/solr/overseer Error:KeeperErrorCode = NodeExists for /solr/overseer
[junit4:junit4]   2> 5680 T1007 oascc.ZkStateReader.updateClusterState Updating cloud state from ZooKeeper... 
[junit4:junit4]   2> 5703 T1012 oascc.ZkStateReader$2.process A cluster state change: WatchedEvent state:SyncConnected type:NodeDataChanged path:/clusterstate.json, has occurred - updating... (live nodes size: 2)
[junit4:junit4]   2> 5703 T1025 oascc.ZkStateReader$2.process A cluster state change: WatchedEvent state:SyncConnected type:NodeDataChanged path:/clusterstate.json, has occurred - updating... (live nodes size: 2)
[junit4:junit4]   2> 5703 T1006 oascc.ZkStateReader$2.process A cluster state change: WatchedEvent state:SyncConnected type:NodeDataChanged path:/clusterstate.json, has occurred - updating... (live nodes size: 2)
[junit4:junit4]   2> 5717 T1026 oasc.ZkController.register We are http://127.0.0.1:40770/collection1/ and leader is http://127.0.0.1:40770/collection1/
[junit4:junit4]   2> 5717 T1026 oasc.ZkController.register No LogReplay needed for core=collection1 baseURL=http://127.0.0.1:40770
[junit4:junit4]   2> 5717 T1026 oasc.ZkController.checkRecovery I am the leader, no recovery necessary
[junit4:junit4]   2> 5717 T1026 oasc.ZkController.publish publishing core=collection1 state=active
[junit4:junit4]   2> 5718 T1026 oasc.ZkController.publish numShards not found on descriptor - reading it from system property
[junit4:junit4]   2> 5720 T1026 oascc.ZkStateReader.updateClusterState Updating cloud state from ZooKeeper... 
[junit4:junit4]   2> 5721 T984 oass.SolrDispatchFilter.init user.dir=/usr/home/hudson/hudson-slave/workspace/Lucene-Solr-Tests-4.x-Java6/solr/build/solr-core/test/J0
[junit4:junit4]   2> 5721 T984 oass.SolrDispatchFilter.init SolrDispatchFilter.init() done
[junit4:junit4]   2> 5722 T984 oascsi.HttpClientUtil.createClient Creating new http client, config:maxConnections=128&maxConnectionsPerHost=32&followRedirects=false
[junit4:junit4]   2> 5925 T984 oejs.Server.doStart jetty-8.1.8.v20121106
[junit4:junit4]   2> 5928 T984 oejs.AbstractConnector.doStart Started SocketConnector@127.0.0.1:40773
[junit4:junit4]   2> 5929 T984 oasc.SolrResourceLoader.locateSolrHome JNDI not configured for solr (NoInitialContextEx)
[junit4:junit4]   2> 5929 T984 oasc.SolrResourceLoader.locateSolrHome using system property solr.solr.home: /usr/home/hudson/hudson-slave/workspace/Lucene-Solr-Tests-4.x-Java6/solr/build/solr-core/test/J0/./org.apache.solr.cloud.SyncSliceTest-jetty2-1356478003553
[junit4:junit4]   2> 5930 T984 oasc.SolrResourceLoader.<init> new SolrResourceLoader for deduced Solr Home: '/usr/home/hudson/hudson-slave/workspace/Lucene-Solr-Tests-4.x-Java6/solr/build/solr-core/test/J0/./org.apache.solr.cloud.SyncSliceTest-jetty2-1356478003553/'
[junit4:junit4]   2> 5972 T984 oass.SolrDispatchFilter.init SolrDispatchFilter.init()
[junit4:junit4]   2> 5972 T984 oasc.SolrResourceLoader.locateSolrHome JNDI not configured for solr (NoInitialContextEx)
[junit4:junit4]   2> 5973 T984 oasc.SolrResourceLoader.locateSolrHome using system property solr.solr.home: /usr/home/hudson/hudson-slave/workspace/Lucene-Solr-Tests-4.x-Java6/solr/build/solr-core/test/J0/./org.apache.solr.cloud.SyncSliceTest-jetty2-1356478003553
[junit4:junit4]   2> 5973 T984 oasc.CoreContainer$Initializer.initialize looking for solr.xml: /usr/home/hudson/hudson-slave/workspace/Lucene-Solr-Tests-4.x-Java6/solr/build/solr-core/test/J0/./org.apache.solr.cloud.SyncSliceTest-jetty2-1356478003553/solr.xml
[junit4:junit4]   2> 5974 T984 oasc.CoreContainer.<init> New CoreContainer 490258680
[junit4:junit4]   2> 5974 T984 oasc.CoreContainer.load Loading CoreContainer using Solr Home: '/usr/home/hudson/hudson-slave/workspace/Lucene-Solr-Tests-4.x-Java6/solr/build/solr-core/test/J0/./org.apache.solr.cloud.SyncSliceTest-jetty2-1356478003553/'
[junit4:junit4]   2> 5975 T984 oasc.SolrResourceLoader.<init> new SolrResourceLoader for directory: '/usr/home/hudson/hudson-slave/workspace/Lucene-Solr-Tests-4.x-Java6/solr/build/solr-core/test/J0/./org.apache.solr.cloud.SyncSliceTest-jetty2-1356478003553/'
[junit4:junit4]   2> 6000 T984 oashc.HttpShardHandlerFactory.getParameter Setting socketTimeout to: 30000
[junit4:junit4]   2> 6000 T984 oashc.HttpShardHandlerFactory.getParameter Setting urlScheme to: http://
[junit4:junit4]   2> 6001 T984 oashc.HttpShardHandlerFactory.getParameter Setting connTimeout to: 15000
[junit4:junit4]   2> 6001 T984 oashc.HttpShardHandlerFactory.getParameter Setting maxConnectionsPerHost to: 20
[junit4:junit4]   2> 6002 T984 oashc.HttpShardHandlerFactory.getParameter Setting corePoolSize to: 0
[junit4:junit4]   2> 6002 T984 oashc.HttpShardHandlerFactory.getParameter Setting maximumPoolSize to: 2147483647
[junit4:junit4]   2> 6003 T984 oashc.HttpShardHandlerFactory.getParameter Setting maxThreadIdleTime to: 5
[junit4:junit4]   2> 6003 T984 oashc.HttpShardHandlerFactory.getParameter Setting sizeOfQueue to: -1
[junit4:junit4]   2> 6003 T984 oashc.HttpShardHandlerFactory.getParameter Setting fairnessPolicy to: false
[junit4:junit4]   2> 6004 T984 oascsi.HttpClientUtil.createClient Creating new http client, config:maxConnectionsPerHost=20&maxConnections=10000&socketTimeout=30000&connTimeout=15000&retry=false
[junit4:junit4]   2> 6026 T984 oasc.CoreContainer.load Registering Log Listener
[junit4:junit4]   2> 6048 T984 oasc.CoreContainer.initZooKeeper Zookeeper client=127.0.0.1:40763/solr
[junit4:junit4]   2> 6049 T984 oasc.ZkController.checkChrootPath zkHost includes chroot
[junit4:junit4]   2> 6049 T984 oaz.ZooKeeper.<init> Initiating client connection, connectString=127.0.0.1:40763 sessionTimeout=60000 watcher=org.apache.solr.common.cloud.ConnectionManager@314dd9ee
[junit4:junit4]   2> 6050 T984 oascc.ConnectionManager.waitForConnected Waiting for client to connect to ZooKeeper
[junit4:junit4]   2> 6051 T1037 oaz.ClientCnxn$SendThread.logStartConnect Opening socket connection to server localhost/127.0.0.1:40763. Will not attempt to authenticate using SASL (access denied (javax.security.auth.AuthPermission getLoginConfiguration))
[junit4:junit4]   2> 6052 T1037 oaz.ClientCnxn$SendThread.primeConnection Socket connection established to localhost/127.0.0.1:40763, initiating session
[junit4:junit4]   2> 6052 T986 oazs.NIOServerCnxnFactory.run Accepted socket connection from /140.211.11.196:40774
[junit4:junit4]   2> 6052 T986 oazs.ZooKeeperServer.processConnectRequest Client attempting to establish new session at /140.211.11.196:40774
[junit4:junit4]   2> 6055 T988 oazs.ZooKeeperServer.finishSessionInit Established session 0x13bd463a3000007 with negotiated timeout 20000 for client /140.211.11.196:40774
[junit4:junit4]   2> 6055 T1037 oaz.ClientCnxn$SendThread.onConnected Session establishment complete on server localhost/127.0.0.1:40763, sessionid = 0x13bd463a3000007, negotiated timeout = 20000
[junit4:junit4]   2> 6055 T1038 oascc.ConnectionManager.process Watcher org.apache.solr.common.cloud.ConnectionManager@314dd9ee name:ZooKeeperConnection Watcher:127.0.0.1:40763 got event WatchedEvent state:SyncConnected type:None path:null path:null type:None
[junit4:junit4]   2> 6055 T984 oascc.ConnectionManager.waitForConnected Client is connected to ZooKeeper
[junit4:junit4]   2> 6057 T989 oazs.PrepRequestProcessor.pRequest2Txn Processed session termination for sessionid: 0x13bd463a3000007
[junit4:junit4]   2> 6069 T986 oazs.NIOServerCnxn.closeSock Closed socket connection for client /140.211.11.196:40774 which had sessionid 0x13bd463a3000007
[junit4:junit4]   2> 6069 T1038 oaz.ClientCnxn$EventThread.run EventThread shut down
[junit4:junit4]   2> 6069 T984 oaz.ZooKeeper.close Session: 0x13bd463a3000007 closed
[junit4:junit4]   2> 6070 T984 oascsi.HttpClientUtil.createClient Creating new http client, config:maxConnections=500&maxConnectionsPerHost=16&socketTimeout=15000&connTimeout=30000
[junit4:junit4]   2> 6081 T984 oaz.ZooKeeper.<init> Initiating client connection, connectString=127.0.0.1:40763/solr sessionTimeout=30000 watcher=org.apache.solr.common.cloud.ConnectionManager@22d1230d
[junit4:junit4]   2> 6082 T984 oascc.ConnectionManager.waitForConnected Waiting for client to connect to ZooKeeper
[junit4:junit4]   2> 6083 T1039 oaz.ClientCnxn$SendThread.logStartConnect Opening socket connection to server localhost/127.0.0.1:40763. Will not attempt to authenticate using SASL (access denied (javax.security.auth.AuthPermission getLoginConfiguration))
[junit4:junit4]   2> 6083 T1039 oaz.ClientCnxn$SendThread.primeConnection Socket connection established to localhost/127.0.0.1:40763, initiating session
[junit4:junit4]   2> 6083 T986 oazs.NIOServerCnxnFactory.run Accepted socket connection from /140.211.11.196:40775
[junit4:junit4]   2> 6084 T986 oazs.ZooKeeperServer.processConnectRequest Client attempting to establish new session at /140.211.11.196:40775
[junit4:junit4]   2> 6085 T988 oazs.ZooKeeperServer.finishSessionInit Established session 0x13bd463a3000008 with negotiated timeout 20000 for client /140.211.11.196:40775
[junit4:junit4]   2> 6085 T1039 oaz.ClientCnxn$SendThread.onConnected Session establishment complete on server localhost/127.0.0.1:40763, sessionid = 0x13bd463a3000008, negotiated timeout = 20000
[junit4:junit4]   2> 6086 T1040 oascc.ConnectionManager.process Watcher org.apache.solr.common.cloud.ConnectionManager@22d1230d name:ZooKeeperConnection Watcher:127.0.0.1:40763/solr got event WatchedEvent state:SyncConnected type:None path:null path:null type:None
[junit4:junit4]   2> 6086 T984 oascc.ConnectionManager.waitForConnected Client is connected to ZooKeeper
[junit4:junit4]   2> 6087 T989 oazs.PrepRequestProcessor.pRequest Got user-level KeeperException when processing sessionid:0x13bd463a3000008 type:create cxid:0x1 zxid:0x6d txntype:-1 reqpath:n/a Error Path:/solr/overseer Error:KeeperErrorCode = NodeExists for /solr/overseer
[junit4:junit4]   2> 6089 T989 oazs.PrepRequestProcessor.pRequest Got user-level KeeperException when processing sessionid:0x13bd463a3000008 type:create cxid:0x2 zxid:0x6e txntype:-1 reqpath:n/a Error Path:/solr/overseer Error:KeeperErrorCode = NodeExists for /solr/overseer
[junit4:junit4]   2> 6090 T984 oasc.ZkController.createEphemeralLiveNode Register node as live in ZooKeeper:/live_nodes/127.0.0.1:40773_
[junit4:junit4]   2> 6091 T989 oazs.PrepRequestProcessor.pRequest Got user-level KeeperException when processing sessionid:0x13bd463a3000008 type:delete cxid:0x4 zxid:0x6f txntype:-1 reqpath:n/a Error Path:/solr/live_nodes/127.0.0.1:40773_ Error:KeeperErrorCode = NoNode for /solr/live_nodes/127.0.0.1:40773_
[junit4:junit4]   2> 6098 T984 oascc.SolrZkClient.makePath makePath: /live_nodes/127.0.0.1:40773_
[junit4:junit4]   2> 6100 T1025 oascc.ZkStateReader$2.process A cluster state change: WatchedEvent state:SyncConnected type:NodeChildrenChanged path:/live_nodes, has occurred - updating... (live nodes size: 2)
[junit4:junit4]   2> 6100 T1006 oascc.ZkStateReader$2.process A cluster state change: WatchedEvent state:SyncConnected type:NodeChildrenChanged path:/live_nodes, has occurred - updating... (live nodes size: 2)
[junit4:junit4]   2> 6101 T1012 oascc.ZkStateReader$3.process Updating live nodes... (3)
[junit4:junit4]   2> 6101 T1012 oascc.ZkStateReader$2.process A cluster state change: WatchedEvent state:SyncConnected type:NodeChildrenChanged path:/live_nodes, has occurred - updating... (live nodes size: 3)
[junit4:junit4]   2> 6102 T1025 oascc.ZkStateReader$3.process Updating live nodes... (3)
[junit4:junit4]   2> 6103 T1006 oascc.ZkStateReader$3.process Updating live nodes... (3)
[junit4:junit4]   2> 6105 T984 oascc.ZkStateReader.createClusterStateWatchersAndUpdate Updating cluster state from ZooKeeper... 
[junit4:junit4]   2> 6113 T1041 oasc.CoreContainer.create Creating SolrCore 'collection1' using instanceDir: /usr/home/hudson/hudson-slave/workspace/Lucene-Solr-Tests-4.x-Java6/solr/build/solr-core/test/J0/./org.apache.solr.cloud.SyncSliceTest-jetty2-1356478003553/collection1
[junit4:junit4]   2> 6113 T1041 oasc.ZkController.createCollectionZkNode Check for collection zkNode:collection1
[junit4:junit4]   2> 6114 T1041 oasc.ZkController.createCollectionZkNode Collection zkNode exists
[junit4:junit4]   2> 6114 T1041 oasc.ZkController.readConfigName Load collection config from:/collections/collection1
[junit4:junit4]   2> 6116 T1041 oasc.SolrResourceLoader.<init> new SolrResourceLoader for directory: '/usr/home/hudson/hudson-slave/workspace/Lucene-Solr-Tests-4.x-Java6/solr/build/solr-core/test/J0/./org.apache.solr.cloud.SyncSliceTest-jetty2-1356478003553/collection1/'
[junit4:junit4]   2> 6117 T1041 oasc.SolrResourceLoader.replaceClassLoader Adding 'file:/usr/home/hudson/hudson-slave/workspace/Lucene-Solr-Tests-4.x-Java6/solr/build/solr-core/test/J0/org.apache.solr.cloud.SyncSliceTest-jetty2-1356478003553/collection1/lib/README' to classloader
[junit4:junit4]   2> 6117 T1041 oasc.SolrResourceLoader.replaceClassLoader Adding 'file:/usr/home/hudson/hudson-slave/workspace/Lucene-Solr-Tests-4.x-Java6/solr/build/solr-core/test/J0/org.apache.solr.cloud.SyncSliceTest-jetty2-1356478003553/collection1/lib/classes/' to classloader
[junit4:junit4]   2> 6174 T1041 oasc.SolrConfig.<init> Using Lucene MatchVersion: LUCENE_41
[junit4:junit4]   2> 6209 T1007 oascc.ZkStateReader.updateClusterState Updating cloud state from ZooKeeper... 
[junit4:junit4]   2> 6210 T1007 oasc.Overseer$ClusterStateUpdater.updateState Update state numShards=1 message={
[junit4:junit4]   2> 	  "operation":"state",
[junit4:junit4]   2> 	  "numShards":"1",
[junit4:junit4]   2> 	  "shard":"shard1",
[junit4:junit4]   2> 	  "roles":null,
[junit4:junit4]   2> 	  "state":"active",
[junit4:junit4]   2> 	  "core":"collection1",
[junit4:junit4]   2> 	  "collection":"collection1",
[junit4:junit4]   2> 	  "node_name":"127.0.0.1:40770_",
[junit4:junit4]   2> 	  "base_url":"http://127.0.0.1:40770"}
[junit4:junit4]   2> 6223 T1025 oascc.ZkStateReader$2.process A cluster state change: WatchedEvent state:SyncConnected type:NodeDataChanged path:/clusterstate.json, has occurred - updating... (live nodes size: 3)
[junit4:junit4]   2> 6223 T1006 oascc.ZkStateReader$2.process A cluster state change: WatchedEvent state:SyncConnected type:NodeDataChanged path:/clusterstate.json, has occurred - updating... (live nodes size: 3)
[junit4:junit4]   2> 6223 T1040 oascc.ZkStateReader$2.process A cluster state change: WatchedEvent state:SyncConnected type:NodeDataChanged path:/clusterstate.json, has occurred - updating... (live nodes size: 3)
[junit4:junit4]   2> 6223 T1012 oascc.ZkStateReader$2.process A cluster state change: WatchedEvent state:SyncConnected type:NodeDataChanged path:/clusterstate.json, has occurred - updating... (live nodes size: 3)
[junit4:junit4]   2> 6257 T1041 oasc.SolrConfig.<init> Loaded SolrConfig: solrconfig.xml
[junit4:junit4]   2> 6358 T1041 oass.IndexSchema.readSchema Reading Solr Schema
[junit4:junit4]   2> 6364 T1041 oass.IndexSchema.readSchema Schema name=test
[junit4:junit4]   2> 7006 T1041 oass.OpenExchangeRatesOrgProvider.init Initialized with rates=open-exchange-rates.json, refreshInterval=1440.
[junit4:junit4]   2> 7015 T1041 oass.IndexSchema.readSchema default search field in schema is text
[junit4:junit4]   2> 7018 T1041 oass.IndexSchema.readSchema unique key field: id
[junit4:junit4]   2> 7029 T1041 oass.FileExchangeRateProvider.reload Reloading exchange rates from file currency.xml
[junit4:junit4]   2> 7033 T1041 oass.FileExchangeRateProvider.reload Reloading exchange rates from file currency.xml
[junit4:junit4]   2> 7036 T1041 oass.OpenExchangeRatesOrgProvider.reload Reloading exchange rates from open-exchange-rates.json
[junit4:junit4]   2> 7037 T1041 oass.OpenExchangeRatesOrgProvider.reload Reloading exchange rates from open-exchange-rates.json
[junit4:junit4]   2> 7038 T1041 oasc.SolrCore.<init> [collection1] Opening new SolrCore at /usr/home/hudson/hudson-slave/workspace/Lucene-Solr-Tests-4.x-Java6/solr/build/solr-core/test/J0/./org.apache.solr.cloud.SyncSliceTest-jetty2-1356478003553/collection1/, dataDir=./org.apache.solr.cloud.SyncSliceTest-1356477997819/jetty2/
[junit4:junit4]   2> 7038 T1041 oasc.JmxMonitoredMap.<init> JMX monitoring is enabled. Adding Solr mbeans to JMX Server: com.sun.jmx.mbeanserver.JmxMBeanServer@5867df9
[junit4:junit4]   2> 7039 T1041 oasc.SolrCore.initDirectoryFactory solr.StandardDirectoryFactory
[junit4:junit4]   2> 7039 T1041 oasc.CachingDirectoryFactory.get return new directory for /usr/home/hudson/hudson-slave/workspace/Lucene-Solr-Tests-4.x-Java6/solr/build/solr-core/test/J0/./org.apache.solr.cloud.SyncSliceTest-1356477997819/jetty2 forceNew:false
[junit4:junit4]   2> 7040 T1041 oasc.CachingDirectoryFactory.close Releasing directory:/usr/home/hudson/hudson-slave/workspace/Lucene-Solr-Tests-4.x-Java6/solr/build/solr-core/test/J0/./org.apache.solr.cloud.SyncSliceTest-1356477997819/jetty2
[junit4:junit4]   2> 7040 T1041 oasc.SolrCore.getNewIndexDir New index directory detected: old=null new=./org.apache.solr.cloud.SyncSliceTest-1356477997819/jetty2/index/
[junit4:junit4]   2> 7040 T1041 oasc.SolrCore.initIndex WARNING [collection1] Solr index directory './org.apache.solr.cloud.SyncSliceTest-1356477997819/jetty2/index' doesn't exist. Creating new index...
[junit4:junit4]   2> 7041 T1041 oasc.CachingDirectoryFactory.get return new directory for /usr/home/hudson/hudson-slave/workspace/Lucene-Solr-Tests-4.x-Java6/solr/build/solr-core/test/J0/./org.apache.solr.cloud.SyncSliceTest-1356477997819/jetty2/index forceNew:false
[junit4:junit4]   2> 7045 T1041 oasc.SolrDeletionPolicy.onCommit SolrDeletionPolicy.onCommit: commits:num=1
[junit4:junit4]   2> 		commit{dir=RateLimitedDirectoryWrapper(org.apache.lucene.store.NIOFSDirectory@/usr/home/hudson/hudson-slave/workspace/Lucene-Solr-Tests-4.x-Java6/solr/build/solr-core/test/J0/org.apache.solr.cloud.SyncSliceTest-1356477997819/jetty2/index lockFactory=org.apache.lucene.store.NativeFSLockFactory@3bf2bb22),segFN=segments_1,generation=1,filenames=[segments_1]
[junit4:junit4]   2> 7045 T1041 oasc.SolrDeletionPolicy.updateCommits newest commit = 1[segments_1]
[junit4:junit4]   2> 7046 T1041 oasc.CachingDirectoryFactory.close Releasing directory:/usr/home/hudson/hudson-slave/workspace/Lucene-Solr-Tests-4.x-Java6/solr/build/solr-core/test/J0/./org.apache.solr.cloud.SyncSliceTest-1356477997819/jetty2/index
[junit4:junit4]   2> 7046 T1041 oasc.SolrCore.initWriters created xml: solr.XMLResponseWriter
[junit4:junit4]   2> 7047 T1041 oasup.UpdateRequestProcessorChain.init inserting DistributedUpdateProcessorFactory into updateRequestProcessorChain "dedupe"
[junit4:junit4]   2> 7048 T1041 oasup.UpdateRequestProcessorChain.init inserting DistributedUpdateProcessorFactory into updateRequestProcessorChain "dedupe-allfields"
[junit4:junit4]   2> 7048 T1041 oasup.UpdateRequestProcessorChain.init inserting DistributedUpdateProcessorFactory into updateRequestProcessorChain "stored_sig"
[junit4:junit4]   2> 7048 T1041 oasup.UpdateRequestProcessorChain.init inserting DistributedUpdateProcessorFactory into updateRequestProcessorChain "uniq-fields"
[junit4:junit4]   2> 7049 T1041 oasup.UpdateRequestProcessorChain.init inserting DistributedUpdateProcessorFactory into updateRequestProcessorChain "distrib-dup-test-chain-implicit"
[junit4:junit4]   2> 7049 T1041 oasc.RequestHandlers.initHandlersFromConfig adding lazy requestHandler: solr.ReplicationHandler
[junit4:junit4]   2> 7049 T1041 oasc.RequestHandlers.initHandlersFromConfig created /replication: solr.ReplicationHandler
[junit4:junit4]   2> 7050 T1041 oasc.RequestHandlers.initHandlersFromConfig created standard: solr.StandardRequestHandler
[junit4:junit4]   2> 7051 T1041 oasc.RequestHandlers.initHandlersFromConfig created /get: solr.RealTimeGetHandler
[junit4:junit4]   2> 7051 T1041 oasc.RequestHandlers.initHandlersFromConfig created dismax: solr.SearchHandler
[junit4:junit4]   2> 7052 T1041 oasc.RequestHandlers.initHandlersFromConfig created mock: org.apache.solr.core.MockQuerySenderListenerReqHandler
[junit4:junit4]   2> 7052 T1041 oasc.RequestHandlers.initHandlersFromConfig created /admin/: org.apache.solr.handler.admin.AdminHandlers
[junit4:junit4]   2> 7053 T1041 oasc.RequestHandlers.initHandlersFromConfig created defaults: solr.StandardRequestHandler
[junit4:junit4]   2> 7053 T1041 oasc.RequestHandlers.initHandlersFromConfig adding lazy requestHandler: solr.StandardRequestHandler
[junit4:junit4]   2> 7053 T1041 oasc.RequestHandlers.initHandlersFromConfig created lazy: solr.StandardRequestHandler
[junit4:junit4]   2> 7054 T1041 oasc.RequestHandlers.initHandlersFromConfig created /update: solr.UpdateRequestHandler
[junit4:junit4]   2> 7055 T1041 oasc.RequestHandlers.initHandlersFromConfig created /terms: org.apache.solr.handler.component.SearchHandler
[junit4:junit4]   2> 7055 T1041 oasc.RequestHandlers.initHandlersFromConfig created spellCheckCompRH: org.apache.solr.handler.component.SearchHandler
[junit4:junit4]   2> 7056 T1041 oasc.RequestHandlers.initHandlersFromConfig created spellCheckCompRH_Direct: org.apache.solr.handler.component.SearchHandler
[junit4:junit4]   2> 7057 T1041 oasc.RequestHandlers.initHandlersFromConfig created spellCheckWithWordbreak: org.apache.solr.handler.component.SearchHandler
[junit4:junit4]   2> 7057 T1041 oasc.RequestHandlers.initHandlersFromConfig created spellCheckWithWordbreak_Direct: org.apache.solr.handler.component.SearchHandler
[junit4:junit4]   2> 7058 T1041 oasc.RequestHandlers.initHandlersFromConfig created spellCheckCompRH1: org.apache.solr.handler.component.SearchHandler
[junit4:junit4]   2> 7059 T1041 oasc.RequestHandlers.initHandlersFromConfig created mltrh: org.apache.solr.handler.component.SearchHandler
[junit4:junit4]   2> 7059 T1041 oasc.RequestHandlers.initHandlersFromConfig created tvrh: org.apache.solr.handler.component.SearchHandler
[junit4:junit4]   2> 7060 T1041 oasc.RequestHandlers.initHandlersFromConfig created /mlt: solr.MoreLikeThisHandler
[junit4:junit4]   2> 7061 T1041 oasc.RequestHandlers.initHandlersFromConfig created /debug/dump: solr.DumpRequestHandler
[junit4:junit4]   2> 7066 T1041 oashl.XMLLoader.init xsltCacheLifetimeSeconds=60
[junit4:junit4]   2> 7070 T1041 oasc.SolrCore.initDeprecatedSupport WARNING solrconfig.xml uses deprecated <admin/gettableFiles>, Please update your config to use the ShowFileRequestHandler.
[junit4:junit4]   2> 7071 T1041 oasc.SolrCore.initDeprecatedSupport WARNING adding ShowFileRequestHandler with hidden files: [SCHEMA.XML, OLD_SYNONYMS.TXT, STOPWORDS.TXT, PROTWORDS.TXT, OPEN-EXCHANGE-RATES.JSON, SYNONYMS.TXT, CURRENCY.XML, MAPPING-ISOLATIN1ACCENT.TXT]
[junit4:junit4]   2> 7073 T1041 oasc.CachingDirectoryFactory.close Releasing directory:/usr/home/hudson/hudson-slave/workspace/Lucene-Solr-Tests-4.x-Java6/solr/build/solr-core/test/J0/./org.apache.solr.cloud.SyncSliceTest-1356477997819/jetty2
[junit4:junit4]   2> 7075 T1041 oass.SolrIndexSearcher.<init> Opening Searcher@4e34dcf8 main
[junit4:junit4]   2> 7075 T1041 oasu.CommitTracker.<init> Hard AutoCommit: disabled
[junit4:junit4]   2> 7076 T1041 oasu.CommitTracker.<init> Soft AutoCommit: disabled
[junit4:junit4]   2> 7076 T1041 oashc.SpellCheckComponent.inform Initializing spell checkers
[junit4:junit4]   2> 7081 T1041 oass.DirectSolrSpellChecker.init init: {name=direct,classname=DirectSolrSpellChecker,field=lowerfilt,minQueryLength=3}
[junit4:junit4]   2> 7124 T1042 oasc.SolrCore.registerSearcher [collection1] Registered new searcher Searcher@4e34dcf8 main{StandardDirectoryReader(segments_1:1)}
[junit4:junit4]   2> 7127 T1041 oasc.ZkController.publish publishing core=collection1 state=down
[junit4:junit4]   2> 7127 T1041 oasc.ZkController.publish numShards not found on descriptor - reading it from system property
[junit4:junit4]   2> 7230 T1007 oascc.ZkStateReader.updateClusterState Updating cloud state from ZooKeeper... 
[junit4:junit4]   2> 7231 T1007 oasc.Overseer$ClusterStateUpdater.updateState Update state numShards=1 message={
[junit4:junit4]   2> 	  "operation":"state",
[junit4:junit4]   2> 	  "numShards":"1",
[junit4:junit4]   2> 	  "shard":null,
[junit4:junit4]   2> 	  "roles":null,
[junit4:junit4]   2> 	  "state":"down",
[junit4:junit4]   2> 	  "core":"collection1",
[junit4:junit4]   2> 	  "collection":"collection1",
[junit4:junit4]   2> 	  "node_name":"127.0.0.1:40773_",
[junit4:junit4]   2> 	  "base_url":"http://127.0.0.1:40773"}
[junit4:junit4]   2> 7231 T1007 oasc.Overseer$ClusterStateUpdater.updateState Collection already exists with numShards=1
[junit4:junit4]   2> 7231 T1007 oasc.Overseer$ClusterStateUpdater.updateState Assigning new node to shard shard=shard1
[junit4:junit4]   2> 7235 T1012 oascc.ZkStateReader$2.process A cluster state change: WatchedEvent state:SyncConnected type:NodeDataChanged path:/clusterstate.json, has occurred - updating... (live nodes size: 3)
[junit4:junit4]   2> 7235 T1025 oascc.ZkStateReader$2.process A cluster state change: WatchedEvent state:SyncConnected type:NodeDataChanged path:/clusterstate.json, has occurred - updating... (live nodes size: 3)
[junit4:junit4]   2> 7235 T1040 oascc.ZkStateReader$2.process A cluster state change: WatchedEvent state:SyncConnected type:NodeDataChanged path:/clusterstate.json, has occurred - updating... (live nodes size: 3)
[junit4:junit4]   2> 7235 T1006 oascc.ZkStateReader$2.process A cluster state change: WatchedEvent state:SyncConnected type:NodeDataChanged path:/clusterstate.json, has occurred - updating... (live nodes size: 3)
[junit4:junit4]   2> 8129 T1041 oasc.CoreContainer.registerCore registering core: collection1
[junit4:junit4]   2> 8129 T1041 oasc.ZkController.register Register replica - core:collection1 address:http://127.0.0.1:40773 collection:collection1 shard:shard1
[junit4:junit4]   2> 8137 T1041 oasc.ZkController.register We are http://127.0.0.1:40773/collection1/ and leader is http://127.0.0.1:40770/collection1/
[junit4:junit4]   2> 8137 T1041 oasc.ZkController.register No LogReplay needed for core=collection1 baseURL=http://127.0.0.1:40773
[junit4:junit4]   2> 8137 T1041 oasc.ZkController.checkRecovery Core needs to recover:collection1
[junit4:junit4]   2> 8137 T1041 oasu.DefaultSolrCoreState.doRecovery Running recovery - first canceling any ongoing recovery
[junit4:junit4]   2> ASYNC  NEW_CORE C65 name=collection1 org.apache.solr.core.SolrCore@33048394 url=http://127.0.0.1:40773/collection1 node=127.0.0.1:40773_ C65_STATE=coll:collection1 core:collection1 props:{shard=null, roles=null, state=down, core=collection1, collection=collection1, node_name=127.0.0.1:40773_, base_url=http://127.0.0.1:40773}
[junit4:junit4]   2> 8138 T1043 C65 P40773 oasc.RecoveryStrategy.run Starting recovery process.  core=collection1 recoveringAfterStartup=true
[junit4:junit4]   2> 8139 T1043 C65 P40773 oasc.RecoveryStrategy.doRecovery ###### startupVersions=[]
[junit4:junit4]   2> 8138 T1041 oascc.ZkStateReader.updateClusterState Updating cloud state from ZooKeeper... 
[junit4:junit4]   2> 8139 T1043 C65 P40773 oasc.ZkController.publish publishing core=collection1 state=recovering
[junit4:junit4]   2> 8139 T1043 C65 P40773 oasc.ZkController.publish numShards not found on descriptor - reading it from system property
[junit4:junit4]   2> 8140 T984 oass.SolrDispatchFilter.init user.dir=/usr/home/hudson/hudson-slave/workspace/Lucene-Solr-Tests-4.x-Java6/solr/build/solr-core/test/J0
[junit4:junit4]   2> 8140 T984 oass.SolrDispatchFilter.init SolrDispatchFilter.init() done
[junit4:junit4]   2> 8140 T984 oascsi.HttpClientUtil.createClient Creating new http client, config:maxConnections=128&maxConnectionsPerHost=32&followRedirects=false
[junit4:junit4]   2> 8145 T1043 C65 P40773 oascsi.HttpClientUtil.createClient Creating new http client, config:maxConnections=128&maxConnectionsPerHost=32&followRedirects=false
[junit4:junit4]   2> 8250 T1007 oascc.ZkStateReader.updateClusterState Updating cloud state from ZooKeeper... 
[junit4:junit4]   2> 8251 T1007 oasc.Overseer$ClusterStateUpdater.updateState Update state numShards=1 message={
[junit4:junit4]   2> 	  "operation":"state",
[junit4:junit4]   2> 	  "numShards":"1",
[junit4:junit4]   2> 	  "shard":"shard1",
[junit4:junit4]   2> 	  "roles":null,
[junit4:junit4]   2> 	  "state":"recovering",
[junit4:junit4]   2> 	  "core":"collection1",
[junit4:junit4]   2> 	  "collection":"collection1",
[junit4:junit4]   2> 	  "node_name":"127.0.0.1:40773_",
[junit4:junit4]   2> 	  "base_url":"http://127.0.0.1:40773"}
[junit4:junit4]   2> 8264 T1025 oascc.ZkStateReader$2.process A cluster state change: WatchedEvent state:SyncConnected type:NodeDataChanged path:/clusterstate.json, has occurred - updating... (live nodes size: 3)
[junit4:junit4]   2> 8264 T1012 oascc.ZkStateReader$2.process A cluster state change: WatchedEvent state:SyncConnected type:NodeDataChanged path:/clusterstate.json, has occurred - updating... (live nodes size: 3)
[junit4:junit4]   2> 8264 T1040 oascc.ZkStateReader$2.process A cluster state change: WatchedEvent state:SyncConnected type:NodeDataChanged path:/clusterstate.json, has occurred - updating... (live nodes size: 3)
[junit4:junit4]   2> 8264 T1006 oascc.ZkStateReader$2.process A cluster state change: WatchedEvent state:SyncConnected type:NodeDataChanged path:/clusterstate.json, has occurred - updating... (live nodes size: 3)
[junit4:junit4]   2> 8274 T984 oejs.Server.doStart jetty-8.1.8.v20121106
[junit4:junit4]   2> 8276 T984 oejs.AbstractConnector.doStart Started SocketConnector@127.0.0.1:40777
[junit4:junit4]   2> 8277 T984 oasc.SolrResourceLoader.locateSolrHome JNDI not configured for solr (NoInitialContextEx)
[junit4:junit4]   2> 8277 T984 oasc.SolrResourceLoader.locateSolrHome using system property solr.solr.home: /usr/home/hudson/hudson-slave/workspace/Lucene-Solr-Tests-4.x-Java6/solr/build/solr-core/test/J0/./org.apache.solr.cloud.SyncSliceTest-jetty3-1356478005966
[junit4:junit4]   2> 8277 T984 oasc.SolrResourceLoader.<init> new SolrResourceLoader for deduced Solr Home: '/usr/home/hudson/hudson-slave/workspace/Lucene-Solr-Tests-4.x-Java6/solr/build/solr-core/test/J0/./org.apache.solr.cloud.SyncSliceTest-jetty3-1356478005966/'
[junit4:junit4]   2> 8305 T984 oass.SolrDispatchFilter.init SolrDispatchFilter.init()
[junit4:junit4]   2> 8305 T984 oasc.SolrResourceLoader.locateSolrHome JNDI not configured for solr (NoInitialContextEx)
[junit4:junit4]   2> 8305 T984 oasc.SolrResourceLoader.locateSolrHome using system property solr.solr.home: /usr/home/hudson/hudson-slave/workspace/Lucene-Solr-Tests-4.x-Java6/solr/build/solr-core/test/J0/./org.apache.solr.cloud.SyncSliceTest-jetty3-1356478005966
[junit4:junit4]   2> 8306 T984 oasc.CoreContainer$Initializer.initialize looking for solr.xml: /usr/home/hudson/hudson-slave/workspace/Lucene-Solr-Tests-4.x-Java6/solr/build/solr-core/test/J0/./org.apache.solr.cloud.SyncSliceTest-jetty3-1356478005966/solr.xml
[junit4:junit4]   2> 8306 T984 oasc.CoreContainer.<init> New CoreContainer 778061756
[junit4:junit4]   2> 8307 T984 oasc.CoreContainer.load Loading CoreContainer using Solr Home: '/usr/home/hudson/hudson-slave/workspace/Lucene-Solr-Tests-4.x-Java6/solr/build/solr-core/test/J0/./org.apache.solr.cloud.SyncSliceTest-jetty3-1356478005966/'
[junit4:junit4]   2> 8307 T984 oasc.SolrResourceLoader.<init> new SolrResourceLoader for directory: '/usr/home/hudson/hudson-slave/workspace/Lucene-Solr-Tests-4.x-Java6/solr/build/solr-core/test/J0/./org.apache.solr.cloud.SyncSliceTest-jetty3-1356478005966/'
[junit4:junit4]   2> 8323 T984 oashc.HttpShardHandlerFactory.getParameter Setting socketTimeout to: 30000
[junit4:junit4]   2> 8324 T984 oashc.HttpShardHandlerFactory.getParameter Setting urlScheme to: http://
[junit4:junit4]   2> 8324 T984 oashc.HttpShardHandlerFactory.getParameter Setting connTimeout to: 15000
[junit4:junit4]   2> 8324 T984 oashc.HttpShardHandlerFactory.getParameter Setting maxConnectionsPerHost to: 20
[junit4:junit4]   2> 8325 T984 oashc.HttpShardHandlerFactory.getParameter Setting corePoolSize to: 0
[junit4:junit4]   2> 8325 T984 oashc.HttpShardHandlerFactory.getParameter Setting maximumPoolSize to: 2147483647
[junit4:junit4]   2> 8325 T984 oashc.HttpShardHandlerFactory.getParameter Setting maxThreadIdleTime to: 5
[junit4:junit4]   2> 8326 T984 oashc.HttpShardHandlerFactory.getParameter Setting sizeOfQueue to: -1
[junit4:junit4]   2> 8326 T984 oashc.HttpShardHandlerFactory.getParameter Setting fairnessPolicy to: false
[junit4:junit4]   2> 8326 T984 oascsi.HttpClientUtil.createClient Creating new http client, config:maxConnectionsPerHost=20&maxConnections=10000&socketTimeout=30000&connTimeout=15000&retry=false
[junit4:junit4]   2> 8340 T984 oasc.CoreContainer.load Registering Log Listener
[junit4:junit4]   2> 8354 T984 oasc.CoreContainer.initZooKeeper Zookeeper client=127.0.0.1:40763/solr
[junit4:junit4]   2> 8354 T984 oasc.ZkController.checkChrootPath zkHost includes chroot
[junit4:junit4]   2> 8355 T984 oaz.ZooKeeper.<init> Initiating client connection, connectString=127.0.0.1:40763 sessionTimeout=60000 watcher=org.apache.solr.common.cloud.ConnectionManager@3625c746
[junit4:junit4]   2> 8355 T984 oascc.ConnectionManager.waitForConnected Waiting for client to connect to ZooKeeper
[junit4:junit4]   2> 8356 T1053 oaz.ClientCnxn$SendThread.logStartConnect Opening socket connection to server localhost/127.0.0.1:40763. Will not attempt to authenticate using SASL (access denied (javax.security.auth.AuthPermission getLoginConfiguration))
[junit4:junit4]   2> 8357 T1053 oaz.ClientCnxn$SendThread.primeConnection Socket connection established to localhost/127.0.0.1:40763, initiating session
[junit4:junit4]   2> 8357 T986 oazs.NIOServerCnxnFactory.run Accepted socket connection from /140.211.11.196:40778
[junit4:junit4]   2> 8358 T986 oazs.ZooKeeperServer.processConnectRequest Client attempting to establish new session at /140.211.11.196:40778
[junit4:junit4]   2> 8359 T988 oazs.ZooKeeperServer.finishSessionInit Established session 0x13bd463a3000009 with negotiated timeout 20000 for client /140.211.11.196:40778
[junit4:junit4]   2> 8359 T1053 oaz.ClientCnxn$SendThread.onConnected Session establishment complete on server localhost/127.0.0.1:40763, sessionid = 0x13bd463a3000009, negotiated timeout = 20000
[junit4:junit4]   2> 8360 T1054 oascc.ConnectionManager.process Watcher org.apache.solr.common.cloud.ConnectionManager@3625c746 name:ZooKeeperConnection Watcher:127.0.0.1:40763 got event WatchedEvent state:SyncConnected type:None path:null path:null type:None
[junit4:junit4]   2> 8360 T984 oascc.ConnectionManager.waitForConnected Client is connected to ZooKeeper
[junit4:junit4]   2> 8361 T989 oazs.PrepRequestProcessor.pRequest2Txn Processed session termination for sessionid: 0x13bd463a3000009
[junit4:junit4]   2> 8362 T1054 oaz.ClientCnxn$EventThread.run EventThread shut down
[junit4:junit4]   2> 8362 T984 oaz.ZooKeeper.close Session: 0x13bd463a3000009 closed
[junit4:junit4]   2> 8362 T986 oazs.NIOServerCnxn.closeSock Closed socket connection for client /140.211.11.196:40778 which had sessionid 0x13bd463a3000009
[junit4:junit4]   2> 8363 T984 oascsi.HttpClientUtil.createClient Creating new http client, config:maxConnections=500&maxConnectionsPerHost=16&socketTimeout=15000&connTimeout=30000
[junit4:junit4]   2> 8369 T984 oaz.ZooKeeper.<init> Initiating client connection, connectString=127.0.0.1:40763/solr sessionTimeout=30000 watcher=org.apache.solr.common.cloud.ConnectionManager@3479b1d
[junit4:junit4]   2> 8370 T984 oascc.ConnectionManager.waitForConnected Waiting for client to connect to ZooKeeper
[junit4:junit4]   2> 8370 T1055 oaz.ClientCnxn$SendThread.logStartConnect Opening socket connection to server localhost/127.0.0.1:40763. Will not attempt to authenticate using SASL (access denied (javax.security.auth.AuthPermission getLoginConfiguration))
[junit4:junit4]   2> 8371 T1055 oaz.ClientCnxn$SendThread.primeConnection Socket connection established to localhost/127.0.0.1:40763, initiating session
[junit4:junit4]   2> 8371 T986 oazs.NIOServerCnxnFactory.run Accepted socket connection from /140.211.11.196:40779
[junit4:junit4]   2> 8371 T986 oazs.ZooKeeperServer.processConnectRequest Client attempting to establish new session at /140.211.11.196:40779
[junit4:junit4]   2> 8372 T988 oazs.ZooKeeperServer.finishSessionInit Established session 0x13bd463a300000a with negotiated timeout 20000 for client /140.211.11.196:40779
[junit4:junit4]   2> 8372 T1055 oaz.ClientCnxn$SendThread.onConnected Session establishment complete on server localhost/127.0.0.1:40763, sessionid = 0x13bd463a300000a, negotiated timeout = 20000
[junit4:junit4]   2> 8373 T1056 oascc.ConnectionManager.process Watcher org.apache.solr.common.cloud.ConnectionManager@3479b1d name:ZooKeeperConnection Watcher:127.0.0.1:40763/solr got event WatchedEvent state:SyncConnected type:None path:null path:null type:None
[junit4:junit4]   2> 8373 T984 oascc.ConnectionManager.waitForConnected Client is connected to ZooKeeper
[junit4:junit4]   2> 8374 T989 oazs.PrepRequestProcessor.pRequest Got user-level KeeperException when processing sessionid:0x13bd463a300000a type:create cxid:0x1 zxid:0x84 txntype:-1 reqpath:n/a Error Path:/solr/overseer Error:KeeperErrorCode = NodeExists for /solr/overseer
[junit4:junit4]   2> 8375 T989 oazs.PrepRequestProcessor.pRequest Got user-level KeeperException when processing sessionid:0x13bd463a300000a type:create cxid:0x2 zxid:0x85 txntype:-1 reqpath:n/a Error Path:/solr/overseer Error:KeeperErrorCode = NodeExists for /solr/overseer
[junit4:junit4]   2> 8383 T984 oasc.ZkController.createEphemeralLiveNode Register node as live in ZooKeeper:/live_nodes/127.0.0.1:40777_
[junit4:junit4]   2> 8384 T989 oazs.PrepRequestProcessor.pRequest Got user-level KeeperException when processing sessionid:0x13bd463a300000a type:delete cxid:0x4 zxid:0x86 txntype:-1 reqpath:n/a Error Path:/solr/live_nodes/127.0.0.1:40777_ Error:KeeperErrorCode = NoNode for /solr/live_nodes/127.0.0.1:40777_
[junit4:junit4]   2> 8385 T984 oascc.SolrZkClient.makePath makePath: /live_nodes/127.0.0.1:40777_
[junit4:junit4]   2> 8387 T1025 oascc.ZkStateReader$2.process A cluster state change: WatchedEvent state:SyncConnected type:NodeChildrenChanged path:/live_nodes, has occurred - updating... (live nodes size: 3)
[junit4:junit4]   2> 8387 T1006 oascc.ZkStateReader$2.process A cluster state change: WatchedEvent state:SyncConnected type:NodeChildrenChanged path:/live_nodes, has occurred - updating... (live nodes size: 3)
[junit4:junit4]   2> 8388 T1040 oascc.ZkStateReader$3.process Updating live nodes... (4)
[junit4:junit4]   2> 8388 T1012 oascc.ZkStateReader$3.process Updating live nodes... (4)
[junit4:junit4]   2> 8388 T1040 oascc.ZkStateReader$2.process A cluster state change: WatchedEvent state:SyncConnected type:NodeChildrenChanged path:/live_nodes, has occurred - updating... (live nodes size: 4)
[junit4:junit4]   2> 8388 T1012 oascc.ZkStateReader$2.process A cluster state change: WatchedEvent state:SyncConnected type:NodeChildrenChanged path:/live_nodes, has occurred - updating... (live nodes size: 4)
[junit4:junit4]   2> 8389 T1025 oascc.ZkStateReader$3.process Updating live nodes... (4)
[junit4:junit4]   2> 8395 T1006 oascc.ZkStateReader$3.process Updating live nodes... (4)
[junit4:junit4]   2> 8396 T984 oascc.ZkStateReader.createClusterStateWatchersAndUpdate Updating cluster state from ZooKeeper... 
[junit4:junit4]   2> 8403 T1057 oasc.CoreContainer.create Creating SolrCore 'collection1' using instanceDir: /usr/home/hudson/hudson-slave/workspace/Lucene-Solr-Tests-4.x-Java6/solr/build/solr-core/test/J0/./org.apache.solr.cloud.SyncSliceTest-jetty3-1356478005966/collection1
[junit4:junit4]   2> 8403 T1057 oasc.ZkController.createCollectionZkNode Check for collection zkNode:collection1
[junit4:junit4]   2> 8404 T1057 oasc.ZkController.createCollectionZkNode Collection zkNode exists
[junit4:junit4]   2> 8404 T1057 oasc.ZkController.readConfigName Load collection config from:/collections/collection1
[junit4:junit4]   2> 8405 T1057 oasc.SolrResourceLoader.<init> new SolrResourceLoader for directory: '/usr/home/hudson/hudson-slave/workspace/Lucene-Solr-Tests-4.x-Java6/solr/build/solr-core/test/J0/./org.apache.solr.cloud.SyncSliceTest-jetty3-1356478005966/collection1/'
[junit4:junit4]   2> 8407 T1057 oasc.SolrResourceLoader.replaceClassLoader Adding 'file:/usr/home/hudson/hudson-slave/workspace/Lucene-Solr-Tests-4.x-Java6/solr/build/solr-core/test/J0/org.apache.solr.cloud.SyncSliceTest-jetty3-1356478005966/collection1/lib/README' to classloader
[junit4:junit4]   2> 8407 T1057 oasc.SolrResourceLoader.replaceClassLoader Adding 'file:/usr/home/hudson/hudson-slave/workspace/Lucene-Solr-Tests-4.x-Java6/solr/build/solr-core/test/J0/org.apache.solr.cloud.SyncSliceTest-jetty3-1356478005966/collection1/lib/classes/' to classloader
[junit4:junit4]   2> 8463 T1057 oasc.SolrConfig.<init> Using Lucene MatchVersion: LUCENE_41
[junit4:junit4]   2> 8513 T1057 oasc.SolrConfig.<init> Loaded SolrConfig: solrconfig.xml
[junit4:junit4]   2> 8614 T1057 oass.IndexSchema.readSchema Reading Solr Schema
[junit4:junit4]   2> 8618 T1057 oass.IndexSchema.readSchema Schema name=test
[junit4:junit4]   2> 9055 T1057 oass.OpenExchangeRatesOrgProvider.init Initialized with rates=open-exchange-rates.json, refreshInterval=1440.
[junit4:junit4]   2> 9063 T1057 oass.IndexSchema.readSchema default search field in schema is text
[junit4:junit4]   2> 9066 T1057 oass.IndexSchema.readSchema unique key field: id
[junit4:junit4]   2> 9079 T1057 oass.FileExchangeRateProvider.reload Reloading exchange rates from file currency.xml
[junit4:junit4]   2> 9208 T1057 oass.FileExchangeRateProvider.reload Reloading exchange rates from file currency.xml
[junit4:junit4]   2> 9213 T1057 oass.OpenExchangeRatesOrgProvider.reload Reloading exchange rates from open-exchange-rates.json
[junit4:junit4]   2> 9214 T1057 oass.OpenExchangeRatesOrgProvider.reload Reloading exchange rates from open-exchange-rates.json
[junit4:junit4]   2> 9215 T1057 oasc.SolrCore.<init> [collection1] Opening new SolrCore at /usr/home/hudson/hudson-slave/workspace/Lucene-Solr-Tests-4.x-Java6/solr/build/solr-core/test/J0/./org.apache.solr.cloud.SyncSliceTest-jetty3-1356478005966/collection1/, dataDir=./org.apache.solr.cloud.SyncSliceTest-1356477997819/jetty3/
[junit4:junit4]   2> 9215 T1057 oasc.JmxMonitoredMap.<init> JMX monitoring is enabled. Adding Solr mbeans to JMX Server: com.sun.jmx.mbeanserver.JmxMBeanServer@5867df9
[junit4:junit4]   2> 9216 T1057 oasc.SolrCore.initDirectoryFactory solr.StandardDirectoryFactory
[junit4:junit4]   2> 9217 T1057 oasc.CachingDirectoryFactory.get return new directory for /usr/home/hudson/hudson-slave/workspace/Lucene-Solr-Tests-4.x-Java6/solr/build/solr-core/test/J0/./org.apache.solr.cloud.SyncSliceTest-1356477997819/jetty3 forceNew:false
[junit4:junit4]   2> 9217 T1057 oasc.CachingDirectoryFactory.close Releasing directory:/usr/home/hudson/hudson-slave/workspace/Lucene-Solr-Tests-4.x-Java6/solr/build/solr-core/test/J0/./org.apache.solr.cloud.SyncSliceTest-1356477997819/jetty3
[junit4:junit4]   2> 9218 T1057 oasc.SolrCore.getNewIndexDir New index directory detected: old=null new=./org.apache.solr.cloud.SyncSliceTest-1356477997819/jetty3/index/
[junit4:junit4]   2> 9218 T1057 oasc.SolrCore.initIndex WARNING [collection1] Solr index directory './org.apache.solr.cloud.SyncSliceTest-1356477997819/jetty3/index' doesn't exist. Creating new index...
[junit4:junit4]   2> 9219 T1057 oasc.CachingDirectoryFactory.get return new directory for /usr/home/hudson/hudson-slave/workspace/Lucene-Solr-Tests-4.x-Java6/solr/build/solr-core/test/J0/./org.apache.solr.cloud.SyncSliceTest-1356477997819/jetty3/index forceNew:false
[junit4:junit4]   2> 9224 T1057 oasc.SolrDeletionPolicy.onCommit SolrDeletionPolicy.onCommit: commits:num=1
[junit4:junit4]   2> 		commit{dir=RateLimitedDirectoryWrapper(org.apache.lucene.store.NIOFSDirectory@/usr/home/hudson/hudson-slave/workspace/Lucene-Solr-Tests-4.x-Java6/solr/build/solr-core/test/J0/org.apache.solr.cloud.SyncSliceTest-1356477997819/jetty3/index lockFactory=org.apache.lucene.store.NativeFSLockFactory@6dd90afc),segFN=segments_1,generation=1,filenames=[segments_1]
[junit4:junit4]   2> 9225 T1057 oasc.SolrDeletionPolicy.updateCommits newest commit = 1[segments_1]
[junit4:junit4]   2> 9226 T1057 oasc.CachingDirectoryFactory.close Releasing directory:/usr/home/hudson/hudson-slave/workspace/Lucene-Solr-Tests-4.x-Java6/solr/build/solr-core/test/J0/./org.apache.solr.cloud.SyncSliceTest-1356477997819/jetty3/index
[junit4:junit4]   2> 9226 T1057 oasc.SolrCore.initWriters created xml: solr.XMLResponseWriter
[junit4:junit4]   2> 9228 T1057 oasup.UpdateRequestProcessorChain.init inserting DistributedUpdateProcessorFactory into updateRequestProcessorChain "dedupe"
[junit4:junit4]   2> 9228 T1057 oasup.UpdateRequestProcessorChain.init inserting DistributedUpdateProcessorFactory into updateRequestProcessorChain "dedupe-allfields"
[junit4:junit4]   2> 9229 T1057 oasup.UpdateRequestProcessorChain.init inserting DistributedUpdateProcessorFactory into updateRequestProcessorChain "stored_sig"
[junit4:junit4]   2> 9229 T1057 oasup.UpdateRequestProcessorChain.init inserting DistributedUpdateProcessorFactory into updateRequestProcessorChain "uniq-fields"
[junit4:junit4]   2> 9230 T1057 oasup.UpdateRequestProcessorChain.init inserting DistributedUpdateProcessorFactory into updateRequestProcessorChain "distrib-dup-test-chain-implicit"
[junit4:junit4]   2> 9230 T1057 oasc.RequestHandlers.initHandlersFromConfig adding lazy requestHandler: solr.ReplicationHandler
[junit4:junit4]   2> 9230 T1057 oasc.RequestHandlers.initHandlersFromConfig created /replication: solr.ReplicationHandler
[junit4:junit4]   2> 9232 T1057 oasc.RequestHandlers.initHandlersFromConfig created standard: solr.StandardRequestHandler
[junit4:junit4]   2> 9233 T1057 oasc.RequestHandlers.initHandlersFromConfig created /get: solr.RealTimeGetHandler
[junit4:junit4]   2> 9234 T1057 oasc.RequestHandlers.initHandlersFromConfig created dismax: solr.SearchHandler
[junit4:junit4]   2> 9235 T1057 oasc.RequestHandlers.initHandlersFromConfig created mock: org.apache.solr.core.MockQuerySenderListenerReqHandler
[junit4:junit4]   2> 9235 T1057 oasc.RequestHandlers.initHandlersFromConfig created /admin/: org.apache.solr.handler.admin.AdminHandlers
[junit4:junit4]   2> 9236 T1057 oasc.RequestHandlers.initHandlersFromConfig created defaults: solr.StandardRequestHandler
[junit4:junit4]   2> 9236 T1057 oasc.RequestHandlers.initHandlersFromConfig adding lazy requestHandler: solr.StandardRequestHandler
[junit4:junit4]   2> 9237 T1057 oasc.RequestHandlers.initHandlersFromConfig created lazy: solr.StandardRequestHandler
[junit4:junit4]   2> 9238 T1057 oasc.RequestHandlers.initHandlersFromConfig created /update: solr.UpdateRequestHandler
[junit4:junit4]   2> 9239 T1057 oasc.RequestHandlers.initHandlersFromConfig created /terms: org.apache.solr.handler.component.SearchHandler
[junit4:junit4]   2> 9240 T1057 oasc.RequestHandlers.initHandlersFromConfig created spellCheckCompRH: org.apache.solr.handler.component.SearchHandler
[junit4:junit4]   2> 9241 T1057 oasc.RequestHandlers.initHandlersFromConfig created spellCheckCompRH_Direct: org.apache.solr.handler.component.SearchHandler
[junit4:junit4]   2> 9242 T1057 oasc.RequestHandlers.initHandlersFromConfig created spellCheckWithWordbreak: org.apache.solr.handler.component.SearchHandler
[junit4:junit4]   2> 9243 T1057 oasc.RequestHandlers.initHandlersFromConfig created spellCheckWithWordbreak_Direct: org.apache.solr.handler.component.SearchHandler
[junit4:junit4]   2> 9244 T1057 oasc.RequestHandlers.initHandlersFromConfig created spellCheckCompRH1: org.apache.solr.handler.component.SearchHandler
[junit4:junit4]   2> 9245 T1057 oasc.RequestHandlers.initHandlersFromConfig created mltrh: org.apache.solr.handler.component.SearchHandler
[junit4:junit4]   2> 9246 T1057 oasc.RequestHandlers.initHandlersFromConfig created tvrh: org.apache.solr.handler.component.SearchHandler
[junit4:junit4]   2> 9247 T1057 oasc.RequestHandlers.initHandlersFromConfig created /mlt: solr.MoreLikeThisHandler
[junit4:junit4]   2> 9248 T1057 oasc.RequestHandlers.initHandlersFromConfig created /debug/dump: solr.DumpRequestHandler
[junit4:junit4]   2> 9256 T1057 oashl.XMLLoader.init xsltCacheLifetimeSeconds=60
[junit4:junit4]   2> 9261 T1057 oasc.SolrCore.initDeprecatedSupport WARNING solrconfig.xml uses deprecated <admin/gettableFiles>, Please update your config to use the ShowFileRequestHandler.
[junit4:junit4]   2> 9262 T1057 oasc.SolrCore.initDeprecatedSupport WARNING adding ShowFileRequestHandler with hidden files: [SCHEMA.XML, OLD_SYNONYMS.TXT, STOPWORDS.TXT, PROTWORDS.TXT, OPEN-EXCHANGE-RATES.JSON, SYNONYMS.TXT, CURRENCY.XML, MAPPING-ISOLATIN1ACCENT.TXT]
[junit4:junit4]   2> 9265 T1057 oasc.CachingDirectoryFactory.close Releasing directory:/usr/home/hudson/hudson-slave/workspace/Lucene-Solr-Tests-4.x-Java6/solr/build/solr-core/test/J0/./org.apache.solr.cloud.SyncSliceTest-1356477997819/jetty3
[junit4:junit4]   2> 9267 T1057 oass.SolrIndexSearcher.<init> Opening Searcher@3778170e main
[junit4:junit4]   2> 9268 T1057 oasu.CommitTracker.<init> Hard AutoCommit: disabled
[junit4:junit4]   2> 9268 T1057 oasu.CommitTracker.<init> Soft AutoCommit: disabled
[junit4:junit4]   2> 9269 T1057 oashc.SpellCheckComponent.inform Initializing spell checkers
[junit4:junit4]   2> 9275 T1057 oass.DirectSolrSpellChecker.init init: {name=direct,classname=DirectSolrSpellChecker,field=lowerfilt,minQueryLength=3}
[junit4:junit4]   2> 9386 T1058 oasc.SolrCore.registerSearcher [collection1] Registered new searcher Searcher@3778170e main{StandardDirectoryReader(segments_1:1)}
[junit4:junit4]   2> 9388 T1057 oasc.ZkController.publish publishing core=collection1 state=down
[junit4:junit4]   2> 9389 T1057 oasc.ZkController.publish numShards not found on descriptor - reading it from system property
[junit4:junit4]   2> 9773 T1007 oascc.ZkStateReader.updateClusterState Updating cloud state from ZooKeeper... 
[junit4:junit4]   2> 9774 T1007 oasc.Overseer$ClusterStateUpdater.updateState Update state numShards=1 message={
[junit4:junit4]   2> 	  "operation":"state",
[junit4:junit4]   2> 	  "numShards":"1",
[junit4:junit4]   2> 	  "shard":null,
[junit4:junit4]   2> 	  "roles":null,
[junit4:junit4]   2> 	  "state":"down",
[junit4:junit4]   2> 	  "core":"collection1",
[junit4:junit4]   2> 	  "collection":"collection1",
[junit4:junit4]   2> 	  "node_name":"127.0.0.1:40777_",
[junit4:junit4]   2> 	  "base_url":"http://127.0.0.1:40777"}
[junit4:junit4]   2> 9775 T1007 oasc.Overseer$ClusterStateUpdater.updateState Collection already exists with numShards=1
[junit4:junit4]   2> 9775 T1007 oasc.Overseer$ClusterStateUpdater.updateState Assigning new node to shard shard=shard1
[junit4:junit4]   2> 9788 T1025 oascc.ZkStateReader$2.process A cluster state change: WatchedEvent state:SyncConnected type:NodeDataChanged path:/clusterstate.json, has occurred - updating... (live nodes size: 4)
[junit4:junit4]   2> 9788 T1056 oascc.ZkStateReader$2.process A cluster state change: WatchedEvent state:SyncConnected type:NodeDataChanged path:/clusterstate.json, has occurred - updating... (live nodes size: 4)
[junit4:junit4]   2> 9788 T1012 oascc.ZkStateReader$2.process A cluster state change: WatchedEvent state:SyncConnected type:NodeDataChanged path:/clusterstate.json, has occurred - updating... (live nodes size: 4)
[junit4:junit4]   2> 9788 T1006 oascc.ZkStateReader$2.process A cluster state change: WatchedEvent state:SyncConnected type:NodeDataChanged path:/clusterstate.json, has occurred - updating... (live nodes size: 4)
[junit4:junit4]   2> 9788 T1040 oascc.ZkStateReader$2.process A cluster state change: WatchedEvent state:SyncConnected type:NodeDataChanged path:/clusterstate.json, has occurred - updating... (live nodes size: 4)
[junit4:junit4]   2> 10391 T1057 oasc.CoreContainer.registerCore registering core: collection1
[junit4:junit4]   2> 10391 T1057 oasc.ZkController.register Register replica - core:collection1 address:http://127.0.0.1:40777 collection:collection1 shard:shard1
[junit4:junit4]   2> 10396 T1057 oasc.ZkController.register We are http://127.0.0.1:40777/collection1/ and leader is http://127.0.0.1:40770/collection1/
[junit4:junit4]   2> 10396 T1057 oasc.ZkController.register No LogReplay needed for core=collection1 baseURL=http://127.0.0.1:40777
[junit4:junit4]   2> 10397 T1057 oasc.ZkController.checkRecovery Core needs to recover:collection1
[junit4:junit4]   2> 10397 T1057 oasu.DefaultSolrCoreState.doRecovery Running recovery - first canceling any ongoing recovery
[junit4:junit4]   2> ASYNC  NEW_CORE C66 name=collection1 org.apache.solr.core.SolrCore@410a11a2 url=http://127.0.0.1:40777/collection1 node=127.0.0.1:40777_ C66_STATE=coll:collection1 core:collection1 props:{shard=null, roles=null, state=down, core=collection1, collection=collection1, node_name=127.0.0.1:40777_, base_url=http://127.0.0.1:40777}
[junit4:junit4]   2> 10397 T1059 C66 P40777 oasc.RecoveryStrategy.run Starting recovery process.  core=collection1 recoveringAfterStartup=true
[junit4:junit4]   2> 10398 T1057 oascc.ZkStateReader.updateClusterState Updating cloud state from ZooKeeper... 
[junit4:junit4]   2> 10398 T1059 C66 P40777 oasc.RecoveryStrategy.doRecovery ###### startupVersions=[]
[junit4:junit4]   2> 10399 T1059 C66 P40777 oasc.ZkController.publish publishing core=collection1 state=recovering
[junit4:junit4]   2> 10399 T1059 C66 P40777 oasc.ZkController.publish numShards not found on descriptor - reading it from system property
[junit4:junit4]   2> 10399 T984 oass.SolrDispatchFilter.init user.dir=/usr/home/hudson/hudson-slave/workspace/Lucene-Solr-Tests-4.x-Java6/solr/build/solr-core/test/J0
[junit4:junit4]   2> 10400 T1059 C66 P40777 oascsi.HttpClientUtil.createClient Creating new http client, config:maxConnections=128&maxConnectionsPerHost=32&followRedirects=false
[junit4:junit4]   2> 10400 T984 oass.SolrDispatchFilter.init SolrDispatchFilter.init() done
[junit4:junit4]   2> 10401 T984 oascsi.HttpClientUtil.createClient Creating new http client, config:maxConnections=128&maxConnectionsPerHost=32&followRedirects=false
[junit4:junit4]   2> 10663 T984 oejs.Server.doStart jetty-8.1.8.v20121106
[junit4:junit4]   2> 10667 T984 oejs.AbstractConnector.doStart Started SocketConnector@127.0.0.1:40781
[junit4:junit4]   2> 10668 T984 oasc.SolrResourceLoader.locateSolrHome JNDI not configured for solr (NoInitialContextEx)
[junit4:junit4]   2> 10669 T984 oasc.SolrResourceLoader.locateSolrHome using system property solr.solr.home: /usr/home/hudson/hudson-slave/workspace/Lucene-Solr-Tests-4.x-Java6/solr/build/solr-core/test/J0/./org.apache.solr.cloud.SyncSliceTest-jetty4-1356478008232
[junit4:junit4]   2> 10669 T984 oasc.SolrResourceLoader.<init> new SolrResourceLoader for deduced Solr Home: '/usr/home/hudson/hudson-slave/workspace/Lucene-Solr-Tests-4.x-Java6/solr/build/solr-core/test/J0/./org.apache.solr.cloud.SyncSliceTest-jetty4-1356478008232/'
[junit4:junit4]   2> 10724 T984 oass.SolrDispatchFilter.init SolrDispatchFilter.init()
[junit4:junit4]   2> 10725 T984 oasc.SolrResourceLoader.locateSolrHome JNDI not configured for solr (NoInitialContextEx)
[junit4:junit4]   2> 10725 T984 oasc.SolrResourceLoader.locateSolrHome using system property solr.solr.home: /usr/home/hudson/hudson-slave/workspace/Lucene-Solr-Tests-4.x-Java6/solr/build/solr-core/test/J0/./org.apache.solr.cloud.SyncSliceTest-jetty4-1356478008232
[junit4:junit4]   2> 10726 T984 oasc.CoreContainer$Initializer.initialize looking for solr.xml: /usr/home/hudson/hudson-slave/workspace/Lucene-Solr-Tests-4.x-Java6/solr/build/solr-core/test/J0/./org.apache.solr.cloud.SyncSliceTest-jetty4-1356478008232/solr.xml
[junit4:junit4]   2> 10727 T984 oasc.CoreContainer.<init> New CoreContainer 1915743085
[junit4:junit4]   2> 10728 T984 oasc.CoreContainer.load Loading CoreContainer using Solr Home: '/usr/home/hudson/hudson-slave/workspace/Lucene-Solr-Tests-4.x-Java6/solr/build/solr-core/test/J0/./org.apache.solr.cloud.SyncSliceTest-jetty4-1356478008232/'
[junit4:junit4]   2> 10729 T984 oasc.SolrResourceLoader.<init> new SolrResourceLoader for directory: '/usr/home/hudson/hudson-slave/workspace/Lucene-Solr-Tests-4.x-Java6/solr/build/solr-core/test/J0/./org.apache.solr.cloud.SyncSliceTest-jetty4-1356478008232/'
[junit4:junit4]   2> 10763 T984 oashc.HttpShardHandlerFactory.getParameter Setting socketTimeout to: 30000
[junit4:junit4]   2> 10764 T984 oashc.HttpShardHandlerFactory.getParameter Setting urlScheme to: http://
[junit4:junit4]   2> 10764 T984 oashc.HttpShardHandlerFactory.getParameter Setting connTimeout to: 15000
[junit4:junit4]   2> 10765 T984 oashc.HttpShardHandlerFactory.getParameter Setting maxConnectionsPerHost to: 20
[junit4:junit4]   2> 10766 T984 oashc.HttpShardHandlerFactory.getParameter Setting corePoolSize to: 0
[junit4:junit4]   2> 10767 T984 oashc.HttpShardHandlerFactory.getParameter Setting maximumPoolSize to: 2147483647
[junit4:junit4]   2> 10767 T984 oashc.HttpShardHandlerFactory.getParameter Setting maxThreadIdleTime to: 5
[junit4:junit4]   2> 10768 T984 oashc.HttpShardHandlerFactory.getParameter Setting sizeOfQueue to: -1
[junit4:junit4]   2> 10769 T984 oashc.HttpShardHandlerFactory.getParameter Setting fairnessPolicy to: false
[junit4:junit4]   2> 10769 T984 oascsi.HttpClientUtil.createClient Creating new http client, config:maxConnectionsPerHost=20&maxConnections=10000&socketTimeout=30000&connTimeout=15000&retry=false
[junit4:junit4]   2> 10796 T1007 oascc.ZkStateReader.updateClusterState Updating cloud state from ZooKeeper... 
[junit4:junit4]   2> 10796 T1007 oasc.Overseer$ClusterStateUpdater.updateState Update state numShards=1 message={
[junit4:junit4]   2> 	  "operation":"state",
[junit4:junit4]   2> 	  "numShards":"1",
[junit4:junit4]   2> 	  "shard":"shard1",
[junit4:junit4]   2> 	  "roles":null,
[junit4:junit4]   2> 	  "state":"recovering",
[junit4:junit4]   2> 	  "core":"collection1",
[junit4:junit4]   2> 	  "collection":"collection1",
[junit4:junit4]   2> 	  "node_name":"127.0.0.1:40777_",
[junit4:junit4]   2> 	  "base_url":"http://127.0.0.1:40777"}
[junit4:junit4]   2> 10798 T984 oasc.CoreContainer.load Registering Log Listener
[junit4:junit4]   2> 10814 T1025 oascc.ZkStateReader$2.process A cluster state change: WatchedEvent state:SyncConnected type:NodeDataChanged path:/clusterstate.json, has occurred - updating... (live nodes size: 4)
[junit4:junit4]   2> 10815 T1040 oascc.ZkStateReader$2.process A cluster state change: WatchedEvent state:SyncConnected type:NodeDataChanged path:/clusterstate.json, has occurred - updating... (live nodes size: 4)
[junit4:junit4]   2> 10814 T1012 oascc.ZkStateReader$2.process A cluster state change: WatchedEvent state:SyncConnected type:NodeDataChanged path:/clusterstate.json, has occurred - updating... (live nodes size: 4)
[junit4:junit4]   2> 10814 T1056 oascc.ZkStateReader$2.process A cluster state change: WatchedEvent state:SyncConnected type:NodeDataChanged path:/clusterstate.json, has occurred - updating... (live nodes size: 4)
[junit4:junit4]   2> 10814 T1006 oascc.ZkStateReader$2.process A cluster state change: WatchedEvent state:SyncConnected type:NodeDataChanged path:/clusterstate.json, has occurred - updating... (live nodes size: 4)
[junit4:junit4]   2> 10826 T984 oasc.CoreContainer.initZooKeeper Zookeeper client=127.0.0.1:40763/solr
[junit4:junit4]   2> 10826 T984 oasc.ZkController.checkChrootPath zkHost includes chroot
[junit4:junit4]   2> 10827 T984 oaz.ZooKeeper.<init> Initiating client connection, connectString=127.0.0.1:40763 sessionTimeout=60000 watcher=org.apache.solr.common.cloud.ConnectionManager@12cbc3d7
[junit4:junit4]   2> 10828 T984 oascc.ConnectionManager.waitForConnected Waiting for client to connect to ZooKeeper
[junit4:junit4]   2> 10829 T1069 oaz.ClientCnxn$SendThread.logStartConnect Opening socket connection to server localhost/127.0.0.1:40763. Will not attempt to authenticate using SASL (access denied (javax.security.auth.AuthPermission getLoginConfiguration))
[junit4:junit4]   2> 10829 T1069 oaz.ClientCnxn$SendThread.primeConnection Socket connection established to localhost/127.0.0.1:40763, initiating session
[junit4:junit4]   2> 10829 T986 oazs.NIOServerCnxnFactory.run Accepted socket connection from /140.211.11.196:40782
[junit4:junit4]   2> 10830 T986 oazs.ZooKeeperServer.processConnectRequest Client attempting to establish new session at /140.211.11.196:40782
[junit4:junit4]   2> 10831 T988 oazs.ZooKeeperServer.finishSessionInit Established session 0x13bd463a300000b with negotiated timeout 20000 for client /140.211.11.196:40782
[junit4:junit4]   2> 10831 T1069 oaz.ClientCnxn$SendThread.onConnected Session establishment complete on server localhost/127.0.0.1:40763, sessionid = 0x13bd463a300000b, negotiated timeout = 20000
[junit4:junit4]   2> 10832 T1070 oascc.ConnectionManager.process Watcher org.apache.solr.common.cloud.ConnectionManager@12cbc3d7 name:ZooKeeperConnection Watcher:127.0.0.1:40763 got event WatchedEvent state:SyncConnected type:None path:null path:null type:None
[junit4:junit4]   2> 10832 T984 oascc.ConnectionManager.waitForConnected Client is connected to ZooKeeper
[junit4:junit4]   2> 10834 T989 oazs.PrepRequestProcessor.pRequest2Txn Processed session termination for sessionid: 0x13bd463a300000b
[junit4:junit4]   2> 10835 T1070 oaz.ClientCnxn$EventThread.run EventThread shut down
[junit4:junit4]   2> 10835 T986 oazs.NIOServerCnxn.closeSock Closed socket connection for client /140.211.11.196:40782 which had sessionid 0x13bd463a300000b
[junit4:junit4]   2> 10835 T984 oaz.ZooKeeper.close Session: 0x13bd463a300000b closed
[junit4:junit4]   2> 10836 T984 oascsi.HttpClientUtil.createClient Creating new http client, config:maxConnections=500&maxConnectionsPerHost=16&socketTimeout=15000&connTimeout=30000
[junit4:junit4]   2> 10849 T984 oaz.ZooKeeper.<init> Initiating client connection, connectString=127.0.0.1:40763/solr sessionTimeout=30000 watcher=org.apache.solr.common.cloud.ConnectionManager@59364c36
[junit4:junit4]   2> 10851 T984 oascc.ConnectionManager.waitForConnected Waiting for client to connect to ZooKeeper
[junit4:junit4]   2> 10851 T1071 oaz.ClientCnxn$SendThread.logStartConnect Opening socket connection to server localhost/127.0.0.1:40763. Will not attempt to authenticate using SASL (access denied (javax.security.auth.AuthPermission getLoginConfiguration))
[junit4:junit4]   2> 10852 T1071 oaz.ClientCnxn$SendThread.primeConnection Socket connection established to localhost/127.0.0.1:40763, initiating session
[junit4:junit4]   2> 10852 T986 oazs.NIOServerCnxnFactory.run Accepted socket connection from /140.211.11.196:40783
[junit4:junit4]   2> 10852 T986 oazs.ZooKeeperServer.processConnectRequest Client attempting to establish new session at /140.211.11.196:40783
[junit4:junit4]   2> 10854 T988 oazs.ZooKeeperServer.finishSessionInit Established session 0x13bd463a300000c with negotiated timeout 20000 for client /140.211.11.196:40783
[junit4:junit4]   2> 10854 T1071 oaz.ClientCnxn$SendThread.onConnected Session establishment complete on server localhost/127.0.0.1:40763, sessionid = 0x13bd463a300000c, negotiated timeout = 20000
[junit4:junit4]   2> 10854 T1072 oascc.ConnectionManager.process Watcher org.apache.solr.common.cloud.ConnectionManager@59364c36 name:ZooKeeperConnection Watcher:127.0.0.1:40763/solr got event WatchedEvent state:SyncConnected type:None path:null path:null type:None
[junit4:junit4]   2> 10854 T984 oascc.ConnectionManager.waitForConnected Client is connected to ZooKeeper
[junit4:junit4]   2> 10856 T989 oazs.PrepRequestProcessor.pRequest Got user-level KeeperException when processing sessionid:0x13bd463a300000c type:create cxid:0x1 zxid:0x97 txntype:-1 reqpath:n/a Error Path:/solr/overseer Error:KeeperErrorCode = NodeExists for /solr/overseer
[junit4:junit4]   2> 10857 T989 oazs.PrepRequestProcessor.pRequest Got user-level KeeperException when processing sessionid:0x13bd463a300000c type:create cxid:0x2 zxid:0x98 txntype:-1 reqpath:n/a Error Path:/solr/overseer Error:KeeperErrorCode = NodeExists for /solr/overseer
[junit4:junit4]   2> 10865 T984 oasc.ZkController.createEphemeralLiveNode Register node as live in ZooKeeper:/live_nodes/127.0.0.1:40781_
[junit4:junit4]   2> 10865 T989 oazs.PrepRequestProcessor.pRequest Got user-level KeeperException when processing sessionid:0x13bd463a300000c type:delete cxid:0x4 zxid:0x99 txntype:-1 reqpath:n/a Error Path:/solr/live_nodes/127.0.0.1:40781_ Error:KeeperErrorCode = NoNode for /solr/live_nodes/127.0.0.1:40781_
[junit4:junit4]   2> 10866 T984 oascc.SolrZkClient.makePath makePath: /live_nodes/127.0.0.1:40781_
[junit4:junit4]   2> 10869 T1025 oascc.ZkStateReader$2.process A cluster state change: WatchedEvent state:SyncConnected type:NodeChildrenChanged path:/live_nodes, has occurred - updating... (live nodes size: 4)
[junit4:junit4]   2> 10869 T1006 oascc.ZkStateReader$2.process A cluster state change: WatchedEvent state:SyncConnected type:NodeChildrenChanged path:/live_nodes, has occurred - updating... (live nodes size: 4)
[junit4:junit4]   2> 10870 T1012 oascc.ZkStateReader$3.process Updating live nodes... (5)
[junit4:junit4]   2> 10870 T1056 oascc.ZkStateReader$3.process Updating live nodes... (5)
[junit4:junit4]   2> 10870 T1040 oascc.ZkStateReader$3.process Updating live nodes... (5)
[junit4:junit4]   2> 10870 T1012 oascc.ZkStateReader$2.process A cluster state change: WatchedEvent state:SyncConnected type:NodeChildrenChanged path:/live_nodes, has occurred - updating... (live nodes size: 5)
[junit4:junit4]   2> 10870 T1056 oascc.ZkStateReader$2.process A cluster state change: WatchedEvent state:SyncConnected type:NodeChildrenChanged path:/live_nodes, has occurred - updating... (live nodes size: 5)
[junit4:junit4]   2> 10870 T1040 oascc.ZkStateReader$2.process A cluster state change: WatchedEvent state:SyncConnected type:NodeChildrenChanged path:/live_nodes, has occurred - updating... (live nodes size: 5)
[junit4:junit4]   2> 10871 T1025 oascc.ZkStateReader$3.process Updating live nodes... (5)
[junit4:junit4]   2> 10871 T1006 oascc.ZkStateReader$3.process Updating live nodes... (5)
[junit4:junit4]   2> 10878 T984 oascc.ZkStateReader.createClusterStateWatchersAndUpdate Updating cluster state from ZooKeeper... 
[junit4:junit4]   2> 10886 T1073 oasc.CoreContainer.create Creating SolrCore 'collection1' using instanceDir: /usr/home/hudson/hudson-slave/workspace/Lucene-Solr-Tests-4.x-Java6/solr/build/solr-core/test/J0/./org.apache.solr.cloud.SyncSliceTest-jetty4-1356478008232/collection1
[junit4:junit4]   2> 10886 T1073 oasc.ZkController.createCollectionZkNode Check for collection zkNode:collection1
[junit4:junit4]   2> 10887 T1073 oasc.ZkController.createCollectionZkNode Collection zkNode exists
[junit4:junit4]   2> 10887 T1073 oasc.ZkController.readConfigName Load collection config from:/collections/collection1
[junit4:junit4]   2> 10888 T1073 oasc.SolrResourceLoader.<init> new SolrResourceLoader for directory: '/usr/home/hudson/hudson-slave/workspace/Lucene-Solr-Tests-4.x-Java6/solr/build/solr-core/test/J0/./org.apache.solr.cloud.SyncSliceTest-jetty4-1356478008232/collection1/'
[junit4:junit4]   2> 10890 T1073 oasc.SolrResourceLoader.replaceClassLoader Adding 'file:/usr/home/hudson/hudson-slave/workspace/Lucene-Solr-Tests-4.x-Java6/solr/build/solr-core/test/J0/org.apache.solr.cloud.SyncSliceTest-jetty4-1356478008232/collection1/lib/classes/' to classloader
[junit4:junit4]   2> 10890 T1073 oasc.SolrResourceLoader.replaceClassLoader Adding 'file:/usr/home/hudson/hudson-slave/workspace/Lucene-Solr-Tests-4.x-Java6/solr/build/solr-core/test/J0/org.apache.solr.cloud.SyncSliceTest-jetty4-1356478008232/collection1/lib/README' to classloader
[junit4:junit4]   2> 10945 T1073 oasc.SolrConfig.<init> Using Lucene MatchVersion: LUCENE_41
[junit4:junit4]   2> 11017 T1073 oasc.SolrConfig.<init> Loaded SolrConfig: solrconfig.xml
[junit4:junit4]   2> 11118 T1073 oass.IndexSchema.readSchema Reading Solr Schema
[junit4:junit4]   2> 11124 T1073 oass.IndexSchema.readSchema Schema name=test
[junit4:junit4]   2>  C65_STATE=coll:collection1 core:collection1 props:{shard=shard1, roles=null, state=recovering, core=collection1, collection=collection1, node_name=127.0.0.1:40773_, base_url=http://127.0.0.1:40773}
[junit4:junit4]   2> 11160 T1043 C65 P40773 oasc.RecoveryStrategy.doRecovery Attempting to PeerSync from http://127.0.0.1:40770/collection1/ core=collection1 - recoveringAfterStartup=true
[junit4:junit4]   2> 11160 T1043 C65 P40773 oasu.PeerSync.sync PeerSync: core=collection1 url=http://127.0.0.1:40773 START replicas=[http://127.0.0.1:40770/collection1/] nUpdates=100
[junit4:junit4]   2> 11161 T1043 C65 P40773 oasu.PeerSync.sync WARNING no frame of reference to tell of we've missed updates
[junit4:junit4]   2> 11161 T1043 C65 P40773 oasc.RecoveryStrategy.doRecovery PeerSync Recovery was not successful - trying replication. core=collection1
[junit4:junit4]   2> 11161 T1043 C65 P40773 oasc.RecoveryStrategy.doRecovery Starting Replication Recovery. core=collection1
[junit4:junit4]   2> 11162 T1043 C65 P40773 oasc.RecoveryStrategy.doRecovery Begin buffering updates. core=collection1
[junit4:junit4]   2> 11162 T1043 C65 P40773 oasu.UpdateLog.bufferUpdates Starting to buffer updates. FSUpdateLog{state=ACTIVE, tlog=null}
[junit4:junit4]   2> 11162 T1043 C65 P40773 oasc.RecoveryStrategy.replicate Attempting to replicate from http://127.0.0.1:40770/collection1/. core=collection1
[junit4:junit4]   2> 11162 T1043 C65 P40773 oascsi.HttpClientUtil.createClient Creating new http client, config:maxConnections=128&maxConnectionsPerHost=32&followRedirects=false
[junit4:junit4]   2> ASYNC  NEW_CORE C67 name=collection1 org.apache.solr.core.SolrCore@2d2d2e54 url=http://127.0.0.1:40770/collection1 node=127.0.0.1:40770_ C67_STATE=coll:collection1 core:collection1 props:{shard=shard1, roles=null, state=active, core=collection1, collection=collection1, node_name=127.0.0.1:40770_, base_url=http://127.0.0.1:40770, leader=true}
[junit4:junit4]   2> 11168 T1017 C67 P40770 REQ /get {distrib=false&qt=/get&wt=javabin&version=2&getVersions=100} status=0 QTime=0 
[junit4:junit4]   2> 11178 T1018 C67 P40770 oasu.DirectUpdateHandler2.commit start commit{flags=0,_version_=0,optimize=false,openSearcher=false,waitSearcher=true,expungeDeletes=false,softCommit=false}
[junit4:junit4]   2> 11179 T1018 C67 P40770 oasc.CachingDirectoryFactory.close Releasing directory:/usr/home/hudson/hudson-slave/workspace/Lucene-Solr-Tests-4.x-Java6/solr/build/solr-core/test/J0/./org.apache.solr.cloud.SyncSliceTest-1356477997819/jetty1
[junit4:junit4]   2> 11183 T1018 C67 P40770 oasc.SolrDeletionPolicy.onInit SolrDeletionPolicy.onInit: commits:num=1
[junit4:junit4]   2> 		commit{dir=RateLimitedDirectoryWrapper(org.apache.lucene.store.NIOFSDirectory@/usr/home/hudson/hudson-slave/workspace/Lucene-Solr-Tests-4.x-Java6/solr/build/solr-core/test/J0/org.apache.solr.cloud.SyncSliceTest-1356477997819/jetty1/index lockFactory=org.apache.lucene.store.NativeFSLockFactory@65b1e8f4),segFN=segments_1,generation=1,filenames=[segments_1]
[junit4:junit4]   2> 11184 T1018 C67 P40770 oasc.SolrDeletionPolicy.updateCommits newest commit = 1[segments_1]
[junit4:junit4]   2> 11188 T1018 C67 P40770 oasc.SolrDeletionPolicy.onCommit SolrDeletionPolicy.onCommit: commits:num=2
[junit4:junit4]   2> 		commit{dir=RateLimitedDirectoryWrapper(org.apache.lucene.store.NIOFSDirectory@/usr/home/hudson/hudson-slave/workspace/Lucene-Solr-Tests-4.x-Java6/solr/build/solr-core/test/J0/org.apache.solr.cloud.SyncSliceTest-1356477997819/jetty1/index lockFactory=org.apache.lucene.store.NativeFSLockFactory@65b1e8f4),segFN=segments_1,generation=1,filenames=[segments_1]
[junit4:junit4]   2> 		commit{dir=RateLimitedDirectoryWrapper(org.apache.lucene.store.NIOFSDirectory@/usr/home/hudson/hudson-slave/workspace/Lucene-Solr-Tests-4.x-Java6/solr/build/solr-core/test/J0/org.apache.solr.cloud.SyncSliceTest-1356477997819/jetty1/index lockFactory=org.apache.lucene.store.NativeFSLockFactory@65b1e8f4),segFN=segments_2,generation=2,filenames=[segments_2]
[junit4:junit4]   2> 11188 T1018 C67 P40770 oasc.SolrDeletionPolicy.updateCommits newest commit = 2[segments_2]
[junit4:junit4]   2> 11189 T1018 C67 P40770 oasc.CachingDirectoryFactory.close Releasing directory:/usr/home/hudson/hudson-slave/workspace/Lucene-Solr-Tests-4.x-Java6/solr/build/solr-core/test/J0/./org.apache.solr.cloud.SyncSliceTest-1356477997819/jetty1
[junit4:junit4]   2> 11190 T1018 C67 P40770 oass.SolrIndexSearcher.<init> Opening Searcher@68c2e151 realtime
[junit4:junit4]   2> 11190 T1018 C67 P40770 oasu.DirectUpdateHandler2.commit end_commit_flush
[junit4:junit4]   2> 11191 T1018 C67 P40770 /update {waitSearcher=true&openSearcher=false&commit=true&commit_end_point=true&wt=javabin&softCommit=false&version=2} {commit=} 0 13
[junit4:junit4]   2> 11192 T1043 C65 P40773 oash.ReplicationHandler.inform Commits will be reserved for  10000
[junit4:junit4]   2> 11192 T1043 C65 P40773 oash.SnapPuller.<init>  No value set for 'pollInterval'. Timer Task not started.
[junit4:junit4]   2> 11197 T1019 C67 P40770 oash.ReplicationHandler.inform Commits will be reserved for  10000
[junit4:junit4]   2> 11197 T1019 C67 P40770 REQ /replication {command=indexversion&wt=javabin&qt=/replication&version=2} status=0 QTime=3 
[junit4:junit4]   2> 11198 T1043 C65 P40773 oash.SnapPuller.fetchLatestIndex Master's generation: 2
[junit4:junit4]   2> 11198 T1043 C65 P40773 oash.SnapPuller.fetchLatestIndex Slave's generation: 1
[junit4:junit4]   2> 11198 T1043 C65 P40773 oash.SnapPuller.fetchLatestIndex Starting replication process
[junit4:junit4]   2> 11200 T1019 C67 P40770 oasc.CachingDirectoryFactory.close Releasing directory:/usr/home/hudson/hudson-slave/workspace/Lucene-Solr-Tests-4.x-Java6/solr/build/solr-core/test/J0/./org.apache.solr.cloud.SyncSliceTest-1356477997819/jetty1
[junit4:junit4]   2> 11201 T1019 C67 P40770 oasc.CachingDirectoryFactory.close Releasing directory:/usr/home/hudson/hudson-slave/workspace/Lucene-Solr-Tests-4.x-Java6/solr/build/solr-core/test/J0/./org.apache.solr.cloud.SyncSliceTest-1356477997819/jetty1/index
[junit4:junit4]   2> 11202 T1019 C67 P40770 REQ /replication {command=filelist&generation=2&wt=javabin&qt=/replication&version=2} status=0 QTime=2 
[junit4:junit4]   2> 11202 T1043 C65 P40773 oash.SnapPuller.fetchLatestIndex Number of files in latest index in master: 1
[junit4:junit4]   2> 11204 T1043 C65 P40773 oasc.CachingDirectoryFactory.get return new directory for /usr/home/hudson/hudson-slave/workspace/Lucene-Solr-Tests-4.x-Java6/solr/build/solr-core/test/J0/./org.apache.solr.cloud.SyncSliceTest-1356477997819/jetty2/index.20121225172649017 forceNew:false
[junit4:junit4]   2> 11204 T1043 C65 P40773 oasc.CachingDirectoryFactory.close Releasing directory:/usr/home/hudson/hudson-slave/workspace/Lucene-Solr-Tests-4.x-Java6/solr/build/solr-core/test/J0/./org.apache.solr.cloud.SyncSliceTest-1356477997819/jetty2
[junit4:junit4]   2> 11205 T1043 C65 P40773 oash.SnapPuller.fetchLatestIndex Starting download to RateLimitedDirectoryWrapper(org.apache.lucene.store.NIOFSDirectory@/usr/home/hudson/hudson-slave/workspace/Lucene-Solr-Tests-4.x-Java6/solr/build/solr-core/test/J0/org.apache.solr.cloud.SyncSliceTest-1356477997819/jetty2/index.20121225172649017 lockFactory=org.apache.lucene.store.NativeFSLockFactory@6ef2740c) fullCopy=true
[junit4:junit4]   2> 11208 T1019 C67 P40770 REQ /replication {file=segments_2&command=filecontent&checksum=true&generation=2&qt=/replication&wt=filestream} status=0 QTime=0 
[junit4:junit4]   2> 11210 T1043 C65 P40773 oasc.CachingDirectoryFactory.close Releasing directory:/usr/home/hudson/hudson-slave/workspace/Lucene-Solr-Tests-4.x-Java6/solr/build/solr-core/test/J0/./org.apache.solr.cloud.SyncSliceTest-1356477997819/jetty2/index
[junit4:junit4]   2> 11210 T1043 C65 P40773 oash.SnapPuller.fetchLatestIndex Total time taken for download : 0 secs
[junit4:junit4]   2> 11211 T1043 C65 P40773 oash.SnapPuller.modifyIndexProps New index installed. Updating index properties... index=index.20121225172649017
[junit4:junit4]   2> 11212 T1043 C65 P40773 oasc.CachingDirectoryFactory.close Releasing directory:/usr/home/hudson/hudson-slave/workspace/Lucene-Solr-Tests-4.x-Java6/solr/build/solr-core/test/J0/./org.apache.solr.cloud.SyncSliceTest-1356477997819/jetty2
[junit4:junit4]   2> 11213 T1043 C65 P40773 oasc.CachingDirectoryFactory.close Releasing directory:/usr/home/hudson/hudson-slave/workspace/Lucene-Solr-Tests-4.x-Java6/solr/build/solr-core/test/J0/./org.apache.solr.cloud.SyncSliceTest-1356477997819/jetty2
[junit4:junit4]   2> 11213 T1043 C65 P40773 oasc.SolrCore.getNewIndexDir New index directory detected: old=./org.apache.solr.cloud.SyncSliceTest-1356477997819/jetty2/index/ new=./org.apache.solr.cloud.SyncSliceTest-1356477997819/jetty2/index.20121225172649017
[junit4:junit4]   2> 11217 T1043 C65 P40773 oasc.SolrDeletionPolicy.onInit SolrDeletionPolicy.onInit: commits:num=1
[junit4:junit4]   2> 		commit{dir=RateLimitedDirectoryWrapper(org.apache.lucene.store.NIOFSDirectory@/usr/home/hudson/hudson-slave/workspace/Lucene-Solr-Tests-4.x-Java6/solr/build/solr-core/test/J0/org.apache.solr.cloud.SyncSliceTest-1356477997819/jetty2/index.20121225172649017 lockFactory=org.apache.lucene.store.NativeFSLockFactory@6ef2740c),segFN=segments_2,generation=2,filenames=[segments_2]
[junit4:junit4]   2> 11218 T1043 C65 P40773 oasc.SolrDeletionPolicy.updateCommits newest commit = 2[segments_2]
[junit4:junit4]   2> 11219 T1043 C65 P40773 oasc.CachingDirectoryFactory.close Releasing directory:/usr/home/hudson/hudson-slave/workspace/Lucene-Solr-Tests-4.x-Java6/solr/build/solr-core/test/J0/./org.apache.solr.cloud.SyncSliceTest-1356477997819/jetty2
[junit4:junit4]   2> 11220 T1043 C65 P40773 oasu.DefaultSolrCoreState.newIndexWriter Creating new IndexWriter...
[junit4:junit4]   2> 11220 T1043 C65 P40773 oasu.DefaultSolrCoreState.newIndexWriter Waiting until IndexWriter is unused... core=collection1
[junit4:junit4]   2> 11220 T1043 C65 P40773 oasu.DefaultSolrCoreState.newIndexWriter Rollback old IndexWriter... core=collection1
[junit4:junit4]   2> 11221 T1043 C65 P40773 oasc.CachingDirectoryFactory.close Releasing directory:/usr/home/hudson/hudson-slave/workspace/Lucene-Solr-Tests-4.x-Java6/solr/build/solr-core/test/J0/./org.apache.solr.cloud.SyncSliceTest-1356477997819/jetty2/index.20121225172649017
[junit4:junit4]   2> 11222 T1043 C65 P40773 oasc.CachingDirectoryFactory.close Releasing directory:/usr/home/hudson/hudson-slave/workspace/Lucene-Solr-Tests-4.x-Java6/solr/build/solr-core/test/J0/./org.apache.solr.cloud.SyncSliceTest-1356477997819/jetty2
[junit4:junit4]   2> 11226 T1043 C65 P40773 oasc.SolrDeletionPolicy.onInit SolrDeletionPolicy.onInit: commits:num=1
[junit4:junit4]   2> 		commit{dir=RateLimitedDirectoryWrapper(org.apache.lucene.store.NIOFSDirectory@/usr/home/hudson/hudson-slave/workspace/Lucene-Solr-Tests-4.x-Java6/solr/build/solr-core/test/J0/org.apache.solr.cloud.SyncSliceTest-1356477997819/jetty2/index.20121225172649017 lockFactory=org.apache.lucene.store.NativeFSLockFactory@6ef2740c),segFN=segments_2,generation=2,filenames=[segments_2]
[junit4:junit4]   2> 11226 T1043 C65 P40773 oasc.SolrDeletionPolicy.updateCommits newest commit = 2[segments_2]
[junit4:junit4]   2> 11227 T1043 C65 P40773 oasu.DefaultSolrCoreState.newIndexWriter New IndexWriter is ready to be used.
[junit4:junit4]   2> 11227 T1043 C65 P40773 oasc.CachingDirectoryFactory.close Releasing directory:/usr/home/hudson/hudson-slave/workspace/Lucene-Solr-Tests-4.x-Java6/solr/build/solr-core/test/J0/./org.apache.solr.cloud.SyncSliceTest-1356477997819/jetty2
[junit4:junit4]   2> 11228 T1043 C65 P40773 oass.SolrIndexSearcher.<init> Opening Searcher@497b679e main
[junit4:junit4]   2> 11230 T1042 oasc.SolrCore.registerSearcher [collection1] Registered new searcher Searcher@497b679e main{StandardDirectoryReader(segments_2:1:nrt)}
[junit4:junit4]   2> 11230 T1042 oasc.CachingDirectoryFactory.close Releasing directory:/usr/home/hudson/hudson-slave/workspace/Lucene-Solr-Tests-4.x-Java6/solr/build/solr-core/test/J0/./org.apache.solr.cloud.SyncSliceTest-1356477997819/jetty2/index
[junit4:junit4]   2> 11231 T1043 C65 P40773 oasu.DirectUpdateHandler2.commit start commit{flags=0,_version_=0,optimize=false,openSearcher=false,waitSearcher=false,expungeDeletes=false,softCommit=false}
[junit4:junit4]   2> 11233 T1043 C65 P40773 oasc.SolrDeletionPolicy.onCommit SolrDeletionPolicy.onCommit: commits:num=2
[junit4:junit4]   2> 		commit{dir=RateLimitedDirectoryWrapper(org.apache.lucene.store.NIOFSDirectory@/usr/home/hudson/hudson-slave/workspace/Lucene-Solr-Tests-4.x-Java6/solr/build/solr-core/test/J0/org.apache.solr.cloud.SyncSliceTest-1356477997819/jetty2/index.20121225172649017 lockFactory=org.apache.lucene.store.NativeFSLockFactory@6ef2740c),segFN=segments_2,generation=2,filenames=[segments_2]
[junit4:junit4]   2> 		commit{dir=RateLimitedDirectoryWrapper(org.apache.lucene.store.NIOFSDirectory@/usr/home/hudson/hudson-slave/workspace/Lucene-Solr-Tests-4.x-Java6/solr/build/solr-core/test/J0/org.apache.solr.cloud.SyncSliceTest-1356477997819/jetty2/index.20121225172649017 lockFactory=org.apache.lucene.store.NativeFSLockFactory@6ef2740c),segFN=segments_3,generation=3,filenames=[segments_3]
[junit4:junit4]   2> 11234 T1043 C65 P40773 oasc.SolrDeletionPolicy.updateCommits newest commit = 3[segments_3]
[junit4:junit4]   2> 11235 T1043 C65 P40773 oasc.CachingDirectoryFactory.close Releasing directory:/usr/home/hudson/hudson-slave/workspace/Lucene-Solr-Tests-4.x-Java6/solr/build/solr-core/test/J0/./org.apache.solr.cloud.SyncSliceTest-1356477997819/jetty2
[junit4:junit4]   2> 11235 T1043 C65 P40773 oasu.DirectUpdateHandler2.commit end_commit_flush
[junit4:junit4]   2> 11235 T1043 C65 P40773 oasc.CachingDirectoryFactory.close Releasing directory:/usr/home/hudson/hudson-slave/workspace/Lucene-Solr-Tests-4.x-Java6/solr/build/solr-core/test/J0/./org.apache.solr.cloud.SyncSliceTest-1356477997819/jetty2/index.20121225172649017
[junit4:junit4]   2> 11236 T1043 C65 P40773 oasc.CachingDirectoryFactory.close Releasing directory:/usr/home/hudson/hudson-slave/workspace/Lucene-Solr-Tests-4.x-Java6/solr/build/solr-core/test/J0/./org.apache.solr.cloud.SyncSliceTest-1356477997819/jetty2/index
[junit4:junit4]   2> 11236 T1043 C65 P40773 oasc.RecoveryStrategy.replay No replay needed. core=collection1
[junit4:junit4]   2> 11236 T1043 C65 P40773 oasc.RecoveryStrategy.doRecovery Replication Recovery was successful - registering as Active. core=collection1
[junit4:junit4]   2> 11236 T1043 C65 P40773 oasc.ZkController.publish publishing core=collection1 state=active
[junit4:junit4]   2> 11236 T1043 C65 P40773 oasc.ZkController.publish numShards not found on descriptor - reading it from system property
[junit4:junit4]   2> 11238 T1043 C65 P40773 oasc.RecoveryStrategy.doRecovery Finished recovery process. core=collection1
[junit4:junit4]   2> 11321 T1007 oascc.ZkStateReader.updateClusterState Updating cloud state from ZooKeeper... 
[junit4:junit4]   2> 11322 T1007 oasc.Overseer$ClusterStateUpdater.updateState Update state numShards=1 message={
[junit4:junit4]   2> 	  "operation":"state",
[junit4:junit4]   2> 	  "numShards":"1",
[junit4:junit4]   2> 	  "shard":"shard1",
[junit4:junit4]   2> 	  "roles":null,
[junit4:junit4]   2> 	  "state":"active",
[junit4:junit4]   2> 	  "core":"collection1",
[junit4:junit4]   2> 	  "collection":"collection1",
[junit4:junit4]   2> 	  "node_name":"127.0.0.1:40773_",
[junit4:junit4]   2> 	  "base_url":"http://127.0.0.1:40773"}
[junit4:junit4]   2> 11333 T1012 oascc.ZkStateReader$2.process A cluster state change: WatchedEvent state:SyncConnected type:NodeDataChanged path:/clusterstate.json, has occurred - updating... (live nodes size: 5)
[junit4:junit4]   2> 11333 T1025 oascc.ZkStateReader$2.process A cluster state change: WatchedEvent state:SyncConnected type:NodeDataChanged path:/clusterstate.json, has occurred - updating... (live nodes size: 5)
[junit4:junit4]   2> 11334 T1056 oascc.ZkStateReader$2.process A cluster state change: WatchedEvent state:SyncConnected type:NodeDataChanged path:/clusterstate.json, has occurred - updating... (live nodes size: 5)
[junit4:junit4]   2> 11333 T1006 oascc.ZkStateReader$2.process A cluster state change: WatchedEvent state:SyncConnected type:NodeDataChanged path:/clusterstate.json, has occurred - updating... (live nodes size: 5)
[junit4:junit4]   2> 11334 T1040 oascc.ZkStateReader$2.process A cluster state change: WatchedEvent state:SyncConnected type:NodeDataChanged path:/clusterstate.json, has occurred - updating... (live nodes size: 5)
[junit4:junit4]   2> 11333 T1072 oascc.ZkStateReader$2.process A cluster state change: WatchedEvent state:SyncConnected type:NodeDataChanged path:/clusterstate.json, has occurred - updating... (live nodes size: 5)
[junit4:junit4]   2> 11791 T1073 oass.OpenExchangeRatesOrgProvider.init Initialized with rates=open-exchange-rates.json, refreshInterval=1440.
[junit4:junit4]   2> 11804 T1073 oass.IndexSchema.readSchema default search field in schema is text
[junit4:junit4]   2> 11808 T1073 oass.IndexSchema.readSchema unique key field: id
[junit4:junit4]   2> 11824 T1073 oass.FileExchangeRateProvider.reload Reloading exchange rates from file currency.xml
[junit4:junit4]   2> 11835 T1073 oass.FileExchangeRateProvider.reload Reloading exchange rates from file currency.xml
[junit4:junit4]   2> 11840 T1073 oass.OpenExchangeRatesOrgProvider.reload Reloading exchange rates from open-exchange-rates.json
[junit4:junit4]   2> 11842 T1073 oass.OpenExchangeRatesOrgProvider.reload Reloading exchange rates from open-exchange-rates.json
[junit4:junit4]   2> 11843 T1073 oasc.SolrCore.<init> [collection1] Opening new SolrCore at /usr/home/hudson/hudson-slave/workspace/Lucene-Solr-Tests-4.x-Java6/solr/build/solr-core/test/J0/./org.apache.solr.cloud.SyncSliceTest-jetty4-1356478008232/collection1/, dataDir=./org.apache.solr.cloud.SyncSliceTest-1356477997819/jetty4/
[junit4:junit4]   2> 11843 T1073 oasc.JmxMonitoredMap.<init> JMX monitoring is enabled. Adding Solr mbeans to JMX Server: com.sun.jmx.mbeanserver.JmxMBeanServer@5867df9
[junit4:junit4]   2> 11844 T1073 oasc.SolrCore.initDirectoryFactory solr.StandardDirectoryFactory
[junit4:junit4]   2> 11844 T1073 oasc.CachingDirectoryFactory.get return new directory for /usr/home/hudson/hudson-slave/workspace/Lucene-Solr-Tests-4.x-Java6/solr/build/solr-core/test/J0/./org.apache.solr.cloud.SyncSliceTest-1356477997819/jetty4 forceNew:false
[junit4:junit4]   2> 11845 T1073 oasc.CachingDirectoryFactory.close Releasing directory:/usr/home/hudson/hudson-slave/workspace/Lucene-Solr-Tests-4.x-Java6/solr/build/solr-core/test/J0/./org.apache.solr.cloud.SyncSliceTest-1356477997819/jetty4
[junit4:junit4]   2> 11845 T1073 oasc.SolrCore.getNewIndexDir New index directory detected: old=null new=./org.apache.solr.cloud.SyncSliceTest-1356477997819/jetty4/index/
[junit4:junit4]   2> 11846 T1073 oasc.SolrCore.initIndex WARNING [collection1] Solr index directory './org.apache.solr.cloud.SyncSliceTest-1356477997819/jetty4/index' doesn't exist. Creating new index...
[junit4:junit4]   2> 11847 T1073 oasc.CachingDirectoryFactory.get return new directory for /usr/home/hudson/hudson-slave/workspace/Lucene-Solr-Tests-4.x-Java6/solr/build/solr-core/test/J0/./org.apache.solr.cloud.SyncSliceTest-1356477997819/jetty4/index forceNew:false
[junit4:junit4]   2> 11853 T1073 oasc.SolrDeletionPolicy.onCommit SolrDeletionPolicy.onCommit: commits:num=1
[junit4:junit4]   2> 		commit{dir=RateLimitedDirectoryWrapper(org.apache.lucene.store.NIOFSDirectory@/usr/home/hudson/hudson-slave/workspace/Lucene-Solr-Tests-4.x-Java6/solr/build/solr-core/test/J0/org.apache.solr.cloud.SyncSliceTest-1356477997819/jetty4/index lockFactory=org.apache.lucene.store.NativeFSLockFactory@2d6c8cdb),segFN=segments_1,generation=1,filenames=[segments_1]
[junit4:junit4]   2> 11853 T1073 oasc.SolrDeletionPolicy.updateCommits newest commit = 1[segments_1]
[junit4:junit4]   2> 11854 T1073 oasc.CachingDirectoryFactory.close Releasing directory:/usr/home/hudson/hudson-slave/workspace/Lucene-Solr-Tests-4.x-Java6/solr/build/solr-core/test/J0/./org.apache.solr.cloud.SyncSliceTest-1356477997819/jetty4/index
[junit4:junit4]   2> 11854 T1073 oasc.SolrCore.initWriters created xml: solr.XMLResponseWriter
[junit4:junit4]   2> 11856 T1073 oasup.UpdateRequestProcessorChain.init inserting DistributedUpdateProcessorFactory into updateRequestProcessorChain "dedupe"
[junit4:junit4]   2> 11857 T1073 oasup.UpdateRequestProcessorChain.init inserting DistributedUpdateProcessorFactory into updateRequestProcessorChain "dedupe-allfields"
[junit4:junit4]   2> 11857 T1073 oasup.UpdateRequestProcessorChain.init inserting DistributedUpdateProcessorFactory into updateRequestProcessorChain "stored_sig"
[junit4:junit4]   2> 11857 T1073 oasup.UpdateRequestProcessorChain.init inserting DistributedUpdateProcessorFactory into updateRequestProcessorChain "uniq-fields"
[junit4:junit4]   2> 11858 T1073 oasup.UpdateRequestProcessorChain.init inserting DistributedUpdateProcessorFactory into updateRequestProcessorChain "distrib-dup-test-chain-implicit"
[junit4:junit4]   2> 11858 T1073 oasc.RequestHandlers.initHandlersFromConfig adding lazy requestHandler: solr.ReplicationHandler
[junit4:junit4]   2> 11859 T1073 oasc.RequestHandlers.initHandlersFromConfig created /replication: solr.ReplicationHandler
[junit4:junit4]   2> 11860 T1073 oasc.RequestHandlers.initHandlersFromConfig created standard: solr.StandardRequestHandler
[junit4:junit4]   2> 11861 T1073 oasc.RequestHandlers.initHandlersFromConfig created /get: solr.RealTimeGetHandler
[junit4:junit4]   2> 11862 T1073 oasc.RequestHandlers.initHandlersFromConfig created dismax: solr.SearchHandler
[junit4:junit4]   2> 11863 T1073 oasc.RequestHandlers.initHandlersFromConfig created mock: org.apache.solr.core.MockQuerySenderListenerReqHandler
[junit4:junit4]   2> 11864 T1073 oasc.RequestHandlers.initHandlersFromConfig created /admin/: org.apache.solr.handler.admin.AdminHandlers
[junit4:junit4]   2> 11865 T1073 oasc.RequestHandlers.initHandlersFromConfig created defaults: solr.StandardRequestHandler
[junit4:junit4]   2> 11865 T1073 oasc.RequestHandlers.initHandlersFromConfig adding lazy requestHandler: solr.StandardRequestHandler
[junit4:junit4]   2> 11865 T1073 oasc.RequestHandlers.initHandlersFromConfig created lazy: solr.StandardRequestHandler
[junit4:junit4]   2> 11867 T1073 oasc.RequestHandlers.initHandlersFromConfig created /update: solr.UpdateRequestHandler
[junit4:junit4]   2> 11868 T1073 oasc.RequestHandlers.initHandlersFromConfig created /terms: org.apache.solr.handler.component.SearchHandler
[junit4:junit4]   2> 11869 T1073 oasc.RequestHandlers.initHandlersFromConfig created spellCheckCompRH: org.apache.solr.handler.component.SearchHandler
[junit4:junit4]   2> 11870 T1073 oasc.RequestHandlers.initHandlersFromConfig created spellCheckCompRH_Direct: org.apache.solr.handler.component.SearchHandler
[junit4:junit4]   2> 11871 T1073 oasc.RequestHandlers.initHandlersFromConfig created spellCheckWithWordbreak: org.apache.solr.handler.component.SearchHandler
[junit4:junit4]   2> 11872 T1073 oasc.RequestHandlers.initHandlersFromConfig created spellCheckWithWordbreak_Direct: org.apache.solr.handler.component.SearchHandler
[junit4:junit4]   2> 11873 T1073 oasc.RequestHandlers.initHandlersFromConfig created spellCheckCompRH1: org.apache.solr.handler.component.SearchHandler
[junit4:junit4]   2> 11874 T1073 oasc.RequestHandlers.initHandlersFromConfig created mltrh: org.apache.solr.handler.component.SearchHandler
[junit4:junit4]   2> 11875 T1073 oasc.RequestHandlers.initHandlersFromConfig created tvrh: org.apache.solr.handler.component.SearchHandler
[junit4:junit4]   2> 11876 T1073 oasc.RequestHandlers.initHandlersFromConfig created /mlt: solr.MoreLikeThisHandler
[junit4:junit4]   2> 11877 T1073 oasc.RequestHandlers.initHandlersFromConfig created /debug/dump: solr.DumpRequestHandler
[junit4:junit4]   2> 11885 T1073 oashl.XMLLoader.init xsltCacheLifetimeSeconds=60
[junit4:junit4]   2> 11891 T1073 oasc.SolrCore.initDeprecatedSupport WARNING solrconfig.xml uses deprecated <admin/gettableFiles>, Please update your config to use the ShowFileRequestHandler.
[junit4:junit4]   2> 11893 T1073 oasc.SolrCore.initDeprecatedSupport WARNING adding ShowFileRequestHandler with hidden files: [SCHEMA.XML, OLD_SYNONYMS.TXT, STOPWORDS.TXT, PROTWORDS.TXT, OPEN-EXCHANGE-RATES.JSON, SYNONYMS.TXT, CURRENCY.XML, MAPPING-ISOLATIN1ACCENT.TXT]
[junit4:junit4]   2> 11896 T1073 oasc.CachingDirectoryFactory.close Releasing directory:/usr/home/hudson/hudson-slave/workspace/Lucene-Solr-Tests-4.x-Java6/solr/build/solr-core/test/J0/./org.apache.solr.cloud.SyncSliceTest-1356477997819/jetty4
[junit4:junit4]   2> 11898 T1073 oass.SolrIndexSearcher.<init> Opening Searcher@52d7e2fd main
[junit4:junit4]   2> 11899 T1073 oasu.CommitTracker.<init> Hard AutoCommit: disabled
[junit4:junit4]   2> 11899 T1073 oasu.CommitTracker.<init> Soft AutoCommit: disabled
[junit4:junit4]   2> 11899 T1073 oashc.SpellCheckComponent.inform Initializing spell checkers
[junit4:junit4]   2> 11906 T1073 oass.DirectSolrSpellChecker.init init: {name=direct,classname=DirectSolrSpellChecker,field=lowerfilt,minQueryLength=3}
[junit4:junit4]   2> 11965 T1076 oasc.SolrCore.registerSearcher [collection1] Registered new searcher Searcher@52d7e2fd main{StandardDirectoryReader(segments_1:1)}
[junit4:junit4]   2> 11968 T1073 oasc.ZkController.publish publishing core=collection1 state=down
[junit4:junit4]   2> 11968 T1073 oasc.ZkController.publish numShards not found on descriptor - reading it from system property
[junit4:junit4]   2> 12340 T1007 oascc.ZkStateReader.updateClusterState Updating cloud state from ZooKeeper... 
[junit4:junit4]   2> 12341 T1007 oasc.Overseer$ClusterStateUpdater.updateState Update state numShards=1 message={
[junit4:junit4]   2> 	  "operation":"state",
[junit4:junit4]   2> 	  "numShards":"1",
[junit4:junit4]   2> 	  "shard":null,
[junit4:junit4]   2> 	  "roles":null,
[junit4:junit4]   2> 	  "state":"down",
[junit4:junit4]   2> 	  "core":"collection1",
[junit4:junit4]   2> 	  "collection":"collection1",
[junit4:junit4]   2> 	  "node_name":"127.0.0.1:40781_",
[junit4:junit4]   2> 	  "base_url":"http://127.0.0.1:40781"}
[junit4:junit4]   2> 12341 T1007 oasc.Overseer$ClusterStateUpdater.updateState Collection already exists with numShards=1
[junit4:junit4]   2> 12342 T1007 oasc.Overseer$ClusterStateUpdater.updateState Assigning new node to shard shard=shard1
[junit4:junit4]   2> 12357 T1012 oascc.ZkStateReader$2.process A cluster state change: WatchedEvent state:SyncConnected type:NodeDataChanged path:/clusterstate.json, has occurred - updating... (live nodes size: 5)
[junit4:junit4]   2> 12357 T1072 oascc.ZkStateReader$2.process A cluster state change: WatchedEvent state:SyncConnected type:NodeDataChanged path:/clusterstate.json, has occurred - updating... (live nodes size: 5)
[junit4:junit4]   2> 12357 T1040 oascc.ZkStateReader$2.process A cluster state change: WatchedEvent state:SyncConnected type:NodeDataChanged path:/clusterstate.json, has occurred - updating... (live nodes size: 5)
[junit4:junit4]   2> 12357 T1056 oascc.ZkStateReader$2.process A cluster state change: WatchedEvent state:SyncConnected type:NodeDataChanged path:/clusterstate.json, has occurred - updating... (live nodes size: 5)
[junit4:junit4]   2> 12357 T1025 oascc.ZkStateReader$2.process A cluster state change: WatchedEvent state:SyncConnected type:NodeDataChanged path:/clusterstate.json, has occurred - updating... (live nodes size: 5)
[junit4:junit4]   2> 12357 T1006 oascc.ZkStateReader$2.process A cluster state change: WatchedEvent state:SyncConnected type:NodeDataChanged path:/clusterstate.json, has occurred - updating... (live nodes size: 5)
[junit4:junit4]   2> 12971 T1073 oasc.CoreContainer.registerCore registering core: collection1
[junit4:junit4]   2> 12971 T1073 oasc.ZkController.register Register replica - core:collection1 address:http://127.0.0.1:40781 collection:collection1 shard:shard1
[junit4:junit4]   2> 12974 T1073 oasc.ZkController.register We are http://127.0.0.1:40781/collection1/ and leader is http://127.0.0.1:40770/collection1/
[junit4:junit4]   2> 12974 T1073 oasc.ZkController.register No LogReplay needed for core=collection1 baseURL=http://127.0.0.1:40781
[junit4:junit4]   2> 12974 T1073 oasc.ZkController.checkRecovery Core needs to recover:collection1
[junit4:junit4]   2> 12975 T1073 oasu.DefaultSolrCoreState.doRecovery Running recovery - first canceling any ongoing recovery
[junit4:junit4]   2> ASYNC  NEW_CORE C68 name=collection1 org.apache.solr.core.SolrCore@89c5e02 url=http://127.0.0.1:40781/collection1 node=127.0.0.1:40781_ C68_STATE=coll:collection1 core:collection1 props:{shard=null, roles=null, state=down, core=collection1, collection=collection1, node_name=127.0.0.1:40781_, base_url=http://127.0.0.1:40781}
[junit4:junit4]   2> 12975 T1077 C68 P40781 oasc.RecoveryStrategy.run Starting recovery process.  core=collection1 recoveringAfterStartup=true
[junit4:junit4]   2> 12975 T1073 oascc.ZkStateReader.updateClusterState Updating cloud state from ZooKeeper... 
[junit4:junit4]   2> 12976 T1077 C68 P40781 oasc.RecoveryStrategy.doRecovery ###### startupVersions=[]
[junit4:junit4]   2> 12977 T1077 C68 P40781 oasc.ZkController.publish publishing core=collection1 state=recovering
[junit4:junit4]   2> 12977 T1077 C68 P40781 oasc.ZkController.publish numShards not found on descriptor - reading it from system property
[junit4:junit4]   2> 12977 T984 oass.SolrDispatchFilter.init user.dir=/usr/home/hudson/hudson-slave/workspace/Lucene-Solr-Tests-4.x-Java6/solr/build/solr-core/test/J0
[junit4:junit4]   2> 12978 T984 oass.SolrDispatchFilter.init SolrDispatchFilter.init() done
[junit4:junit4]   2> 12978 T1077 C68 P40781 oascsi.HttpClientUtil.createClient Creating new http client, config:maxConnections=128&maxConnectionsPerHost=32&followRedirects=false
[junit4:junit4]   2> 12978 T984 oascsi.HttpClientUtil.createClient Creating new http client, config:maxConnections=128&maxConnectionsPerHost=32&followRedirects=false
[junit4:junit4]   2> 12993 T984 oascc.ZkStateReader.updateClusterState Updating cloud state from ZooKeeper... 
[junit4:junit4]   2> 12994 T984 oasc.AbstractFullDistribZkTestBase.waitForThingsToLevelOut Wait for recoveries to finish - wait 15 for each attempt
[junit4:junit4]   2> 12995 T984 oasc.AbstractDistribZkTestBase.waitForRecoveriesToFinish Wait for recoveries to finish - collection: collection1 failOnTimeout:true timeout (sec):15
[junit4:junit4]   2> 12995 T984 oascc.ZkStateReader.updateClusterState Updating cloud state from ZooKeeper... 
[junit4:junit4]   2> 13363 T1007 oascc.ZkStateReader.updateClusterState Updating cloud state from ZooKeeper... 
[junit4:junit4]   2> 13364 T1007 oasc.Overseer$ClusterStateUpdater.updateState Update state numShards=1 message={
[junit4:junit4]   2> 	  "operation":"state",
[junit4:junit4]   2> 	  "numShards":"1",
[junit4:junit4]   2> 	  "shard":"shard1",
[junit4:junit4]   2> 	  "roles":null,
[junit4:junit4]   2> 	  "state":"recovering",
[junit4:junit4]   2> 	  "core":"collection1",
[junit4:junit4]   2> 	  "collection":"collection1",
[junit4:junit4]   2> 	  "node_name":"127.0.0.1:40781_",
[junit4:junit4]   2> 	  "base_url":"http://127.0.0.1:40781"}
[junit4:junit4]   2> 13383 T1012 oascc.ZkStateReader$2.process A cluster state change: WatchedEvent state:SyncConnected type:NodeDataChanged path:/clusterstate.json, has occurred - updating... (live nodes size: 5)
[junit4:junit4]   2> 13383 T1025 oascc.ZkStateReader$2.process A cluster state change: WatchedEvent state:SyncConnected type:NodeDataChanged path:/clusterstate.json, has occurred - updating... (live nodes size: 5)
[junit4:junit4]   2> 13383 T1056 oascc.ZkStateReader$2.process A cluster state change: WatchedEvent state:SyncConnected type:NodeDataChanged path:/clusterstate.json, has occurred - updating... (live nodes size: 5)
[junit4:junit4]   2> 13383 T1072 oascc.ZkStateReader$2.process A cluster state change: WatchedEvent state:SyncConnected type:NodeDataChanged path:/clusterstate.json, has occurred - updating... (live nodes size: 5)
[junit4:junit4]   2> 13383 T1006 oascc.ZkStateReader$2.process A cluster state change: WatchedEvent state:SyncConnected type:NodeDataChanged path:/clusterstate.json, has occurred - updating... (live nodes size: 5)
[junit4:junit4]   2> 13383 T1040 oascc.ZkStateReader$2.process A cluster state change: WatchedEvent state:SyncConnected type:NodeDataChanged path:/clusterstate.json, has occurred - updating... (live nodes size: 5)
[junit4:junit4]   2>  C66_STATE=coll:collection1 core:collection1 props:{shard=shard1, roles=null, state=recovering, core=collection1, collection=collection1, node_name=127.0.0.1:40777_, base_url=http://127.0.0.1:40777}
[junit4:junit4]   2> 13421 T1059 C66 P40777 oasc.RecoveryStrategy.doRecovery Attempting to PeerSync from http://127.0.0.1:40770/collection1/ core=collection1 - recoveringAfterStartup=true
[junit4:junit4]   2> 13421 T1059 C66 P40777 oasu.PeerSync.sync PeerSync: core=collection1 url=http://127.0.0.1:40777 START replicas=[http://127.0.0.1:40770/collection1/] nUpdates=100
[junit4:junit4]   2> 13421 T1059 C66 P40777 oasu.PeerSync.sync WARNING no frame of reference to tell of we've missed updates
[junit4:junit4]   2> 13422 T1059 C66 P40777 oasc.RecoveryStrategy.doRecovery PeerSync Recovery was not successful - trying replication. core=collection1
[junit4:junit4]   2> 13422 T1059 C66 P40777 oasc.RecoveryStrategy.doRecovery Starting Replication Recovery. core=collection1
[junit4:junit4]   2> 13422 T1059 C66 P40777 oasc.RecoveryStrategy.doRecovery Begin buffering updates. core=collection1
[junit4:junit4]   2> 13422 T1059 C66 P40777 oasu.UpdateLog.bufferUpdates Starting to buffer updates. FSUpdateLog{state=ACTIVE, tlog=null}
[junit4:junit4]   2> 13422 T1059 C66 P40777 oasc.RecoveryStrategy.replicate Attempting to replicate from http://127.0.0.1:40770/collection1/. core=collection1
[junit4:junit4]   2> 13422 T1059 C66 P40777 oascsi.HttpClientUtil.createClient Creating new http client, config:maxConnections=128&maxConnectionsPerHost=32&followRedirects=false
[junit4:junit4]   2> 13424 T1017 C67 P40770 REQ /get {distrib=false&qt=/get&wt=javabin&version=2&getVersions=100} status=0 QTime=0 
[junit4:junit4]   2> 13431 T1021 C67 P40770 oasu.DirectUpdateHandler2.commit start commit{flags=0,_version_=0,optimize=false,openSearcher=false,waitSearcher=true,expungeDeletes=false,softCommit=false}
[junit4:junit4]   2> 13435 T1021 C67 P40770 oasc.SolrDeletionPolicy.onCommit SolrDeletionPolicy.onCommit: commits:num=2
[junit4:junit4]   2> 		commit{dir=RateLimitedDirectoryWrapper(org.apache.lucene.store.NIOFSDirectory@/usr/home/hudson/hudson-slave/workspace/Lucene-Solr-Tests-4.x-Java6/solr/build/solr-core/test/J0/org.apache.solr.cloud.SyncSliceTest-1356477997819/jetty1/index lockFactory=org.apache.lucene.store.NativeFSLockFactory@65b1e8f4),segFN=segments_2,generation=2,filenames=[segments_2]
[junit4:junit4]   2> 		commit{dir=RateLimitedDirectoryWrapper(org.apache.lucene.store.NIOFSDirectory@/usr/home/hudson/hudson-slave/workspace/Lucene-Solr-Tests-4.x-Java6/solr/build/solr-core/test/J0/org.apache.solr.cloud.SyncSliceTest-1356477997819/jetty1/index lockFactory=org.apache.lucene.store.NativeFSLockFactory@65b1e8f4),segFN=segments_3,generation=3,filenames=[segments_3]
[junit4:junit4]   2> 13436 T1021 C67 P40770 oasc.SolrDeletionPolicy.updateCommits newest commit = 3[segments_3]
[junit4:junit4]   2> 13436 T1021 C67 P40770 oasc.CachingDirectoryFactory.close Releasing directory:/usr/home/hudson/hudson-slave/workspace/Lucene-Solr-Tests-4.x-Java6/solr/build/solr-core/test/J0/./org.apache.solr.cloud.SyncSliceTest-1356477997819/jetty1
[junit4:junit4]   2> 13437 T1021 C67 P40770 oasu.DirectUpdateHandler2.commit end_commit_flush
[junit4:junit4]   2> 13437 T1021 C67 P40770 /update {waitSearcher=true&openSearcher=false&commit=true&commit_end_point=true&wt=javabin&softCommit=false&version=2} {commit=} 0 7
[junit4:junit4]   2> 13438 T1059 C66 P40777 oash.ReplicationHandler.inform Commits will be reserved for  10000
[junit4:junit4]   2> 13439 T1059 C66 P40777 oash.SnapPuller.<init>  No value set for 'pollInterval'. Timer Task not started.
[junit4:junit4]   2> 13441 T1019 C67 P40770 REQ /replication {command=indexversion&wt=javabin&qt=/replication&version=2} status=0 QTime=0 
[junit4:junit4]   2> 13442 T1059 C66 P40777 oash.SnapPuller.fetchLatestIndex Master's generation: 3
[junit4:junit4]   2> 13442 T1059 C66 P40777 oash.SnapPuller.fetchLatestIndex Slave's generation: 1
[junit4:junit4]   2> 13442 T1059 C66 P40777 oash.SnapPuller.fetchLatestIndex Starting replication process
[junit4:junit4]   2> 13444 T1019 C67 P40770 oasc.CachingDirectoryFactory.close Releasing directory:/usr/home/hudson/hudson-slave/workspace/Lucene-Solr-Tests-4.x-Java6/solr/build/solr-core/test/J0/./org.apache.solr.cloud.SyncSliceTest-1356477997819/jetty1
[junit4:junit4]   2> 13444 T1019 C67 P40770 oasc.CachingDirectoryFactory.close Releasing directory:/usr/home/hudson/hudson-slave/workspace/Lucene-Solr-Tests-4.x-Java6/solr/build/solr-core/test/J0/./org.apache.solr.cloud.SyncSliceTest-1356477997819/jetty1/index
[junit4:junit4]   2> 13445 T1019 C67 P40770 REQ /replication {command=filelist&generation=3&wt=javabin&qt=/replication&version=2} status=0 QTime=1 
[junit4:junit4]   2> 13445 T1059 C66 P40777 oash.SnapPuller.fetchLatestIndex Number of files in latest index in master: 1
[junit4:junit4]   2> 13446 T1059 C66 P40777 oasc.CachingDirectoryFactory.get return new directory for /usr/home/hudson/hudson-slave/workspace/Lucene-Solr-Tests-4.x-Java6/solr/build/solr-core/test/J0/./org.apache.solr.cloud.SyncSliceTest-1356477997819/jetty3/index.20121225172651260 forceNew:false
[junit4:junit4]   2> 13447 T1059 C66 P40777 oasc.CachingDirectoryFactory.close Releasing directory:/usr/home/hudson/hudson-slave/workspace/Lucene-Solr-Tests-4.x-Java6/solr/build/solr-core/test/J0/./org.apache.solr.cloud.SyncSliceTest-1356477997819/jetty3
[junit4:junit4]   2> 13448 T1059 C66 P40777 oash.SnapPuller.fetchLatestIndex Starting download to RateLimitedDirectoryWrapper(org.apache.lucene.store.NIOFSDirectory@/usr/home/hudson/hudson-slave/workspace/Lucene-Solr-Tests-4.x-Java6/solr/build/solr-core/test/J0/org.apache.solr.cloud.SyncSliceTest-1356477997819/jetty3/index.20121225172651260 lockFactory=org.apache.lucene.store.NativeFSLockFactory@21714a9) fullCopy=true
[junit4:junit4]   2> 13451 T1019 C67 P40770 REQ /replication {file=segments_3&command=filecontent&checksum=true&generation=3&qt=/replication&wt=filestream} status=0 QTime=0 
[junit4:junit4]   2> 13452 T1059 C66 P40777 oasc.CachingDirectoryFactory.close Releasing directory:/usr/home/hudson/hudson-slave/workspace/Lucene-Solr-Tests-4.x-Java6/solr/build/solr-core/test/J0/./org.apache.solr.cloud.SyncSliceTest-1356477997819/jetty3/index
[junit4:junit4]   2> 13453 T1059 C66 P40777 oash.SnapPuller.fetchLatestIndex Total time taken for download : 0 secs
[junit4:junit4]   2> 13453 T1059 C66 P40777 oash.SnapPuller.modifyIndexProps New index installed. Updating index properties... index=index.20121225172651260
[junit4:junit4]   2> 13454 T1059 C66 P40777 oasc.CachingDirectoryFactory.close Releasing directory:/usr/home/hudson/hudson-slave/workspace/Lucene-Solr-Tests-4.x-Java6/solr/build/solr-core/test/J0/./org.apache.solr.cloud.SyncSliceTest-1356477997819/jetty3
[junit4:junit4]   2> 13455 T1059 C66 P40777 oasc.CachingDirectoryFactory.close Releasing directory:/usr/home/hudson/hudson-slave/workspace/Lucene-Solr-Tests-4.x-Java6/solr/build/solr-core/test/J0/./org.apache.solr.cloud.SyncSliceTest-1356477997819/jetty3
[junit4:junit4]   2> 13455 T1059 C66 P40777 oasc.SolrCore.getNewIndexDir New index directory detected: old=./org.apache.solr.cloud.SyncSliceTest-1356477997819/jetty3/index/ new=./org.apache.solr.cloud.SyncSliceTest-1356477997819/jetty3/index.20121225172651260
[junit4:junit4]   2> 13459 T1059 C66 P40777 oasc.SolrDeletionPolicy.onInit SolrDeletionPolicy.onInit: commits:num=1
[junit4:junit4]   2> 		commit{dir=RateLimitedDirectoryWrapper(org.apache.lucene.store.NIOFSDirectory@/usr/home/hudson/hudson-slave/workspace/Lucene-Solr-Tests-4.x-Java6/solr/build/solr-core/test/J0/org.apache.solr.cloud.SyncSliceTest-1356477997819/jetty3/index.20121225172651260 lockFactory=org.apache.lucene.store.NativeFSLockFactory@21714a9),segFN=segments_3,generation=3,filenames=[segments_3]
[junit4:junit4]   2> 13459 T1059 C66 P40777 oasc.SolrDeletionPolicy.updateCommits newest commit = 3[segments_3]
[junit4:junit4]   2> 13461 T1059 C66 P40777 oasc.CachingDirectoryFactory.close Releasing directory:/usr/home/hudson/hudson-slave/workspace/Lucene-Solr-Tests-4.x-Java6/solr/build/solr-core/test/J0/./org.apache.solr.cloud.SyncSliceTest-1356477997819/jetty3
[junit4:junit4]   2> 13461 T1059 C66 P40777 oasu.DefaultSolrCoreState.newIndexWriter Creating new IndexWriter...
[junit4:junit4]   2> 13461 T1059 C66 P40777 oasu.DefaultSolrCoreState.newIndexWriter Waiting until IndexWriter is unused... core=collection1
[junit4:junit4]   2> 13461 T1059 C66 P40777 oasu.DefaultSolrCoreState.newIndexWriter Rollback old IndexWriter... core=collection1
[junit4:junit4]   2> 13462 T1059 C66 P40777 oasc.CachingDirectoryFactory.close Releasing directory:/usr/home/hudson/hudson-slave/workspace/Lucene-Solr-Tests-4.x-Java6/solr/build/solr-core/test/J0/./org.apache.solr.cloud.SyncSliceTest-1356477997819/jetty3/index.20121225172651260
[junit4:junit4]   2> 13463 T1059 C66 P40777 oasc.CachingDirectoryFactory.close Releasing directory:/usr/home/hudson/hudson-slave/workspace/Lucene-Solr-Tests-4.x-Java6/solr/build/solr-core/test/J0/./org.apache.solr.cloud.SyncSliceTest-1356477997819/jetty3
[junit4:junit4]   2> 13466 T1059 C66 P40777 oasc.SolrDeletionPolicy.onInit SolrDeletionPolicy.onInit: commits:num=1
[junit4:junit4]   2> 		commit{dir=RateLimitedDirectoryWrapper(org.apache.lucene.store.NIOFSDirectory@/usr/home/hudson/hudson-slave/workspace/Lucene-Solr-Tests-4.x-Java6/solr/build/solr-core/test/J0/org.apache.solr.cloud.SyncSliceTest-1356477997819/jetty3/index.20121225172651260 lockFactory=org.apache.lucene.store.NativeFSLockFactory@21714a9),segFN=segments_3,generation=3,filenames=[segments_3]
[junit4:junit4]   2> 13466 T1059 C66 P40777 oasc.SolrDeletionPolicy.updateCommits newest commit = 3[segments_3]
[junit4:junit4]   2> 13467 T1059 C66 P40777 oasu.DefaultSolrCoreState.newIndexWriter New IndexWriter is ready to be used.
[junit4:junit4]   2> 13467 T1059 C66 P40777 oasc.CachingDirectoryFactory.close Releasing directory:/usr/home/hudson/hudson-slave/workspace/Lucene-Solr-Tests-4.x-Java6/solr/build/solr-core/test/J0/./org.apache.solr.cloud.SyncSliceTest-1356477997819/jetty3
[junit4:junit4]   2> 13467 T1059 C66 P40777 oass.SolrIndexSearcher.<init> Opening Searcher@68f35fa0 main
[junit4:junit4]   2> 13469 T1058 oasc.SolrCore.registerSearcher [collection1] Registered new searcher Searcher@68f35fa0 main{StandardDirectoryReader(segments_3:1:nrt)}
[junit4:junit4]   2> 13469 T1058 oasc.CachingDirectoryFactory.close Releasing directory:/usr/home/hudson/hudson-slave/workspace/Lucene-Solr-Tests-4.x-Java6/solr/build/solr-core/test/J0/./org.apache.solr.cloud.SyncSliceTest-1356477997819/jetty3/index
[junit4:junit4]   2> 13469 T1059 C66 P40777 oasu.DirectUpdateHandler2.commit start commit{flags=0,_version_=0,optimize=false,openSearcher=false,waitSearcher=false,expungeDeletes=false,softCommit=false}
[junit4:junit4]   2> 13471 T1059 C66 P40777 oasc.SolrDeletionPolicy.onCommit SolrDeletionPolicy.onCommit: commits:num=2
[junit4:junit4]   2> 		commit{dir=RateLimitedDirectoryWrapper(org.apache.lucene.store.NIOFSDirectory@/usr/home/hudson/hudson-slave/workspace/Lucene-Solr-Tests-4.x-Java6/solr/build/solr-core/test/J0/org.apache.solr.cloud.SyncSliceTest-1356477997819/jetty3/index.20121225172651260 lockFactory=org.apache.lucene.store.NativeFSLockFactory@21714a9),segFN=segments_3,generation=3,filenames=[segments_3]
[junit4:junit4]   2> 		commit{dir=RateLimitedDirectoryWrapper(org.apache.lucene.store.NIOFSDirectory@/usr/home/hudson/hudson-slave/workspace/Lucene-Solr-Tests-4.x-Java6/solr/build/solr-core/test/J0/org.apache.solr.cloud.SyncSliceTest-1356477997819/jetty3/index.20121225172651260 lockFactory=org.apache.lucene.store.NativeFSLockFactory@21714a9),segFN=segments_4,generation=4,filenames=[segments_4]
[junit4:junit4]   2> 13472 T1059 C66 P40777 oasc.SolrDeletionPolicy.updateCommits newest commit = 4[segments_4]
[junit4:junit4]   2> 13473 T1059 C66 P40777 oasc.CachingDirectoryFactory.close Releasing directory:/usr/home/hudson/hudson-slave/workspace/Lucene-Solr-Tests-4.x-Java6/solr/build/solr-core/test/J0/./org.apache.solr.cloud.SyncSliceTest-1356477997819/jetty3
[junit4:junit4]   2> 13473 T1059 C66 P40777 oasu.DirectUpdateHandler2.commit end_commit_flush
[junit4:junit4]   2> 13473 T1059 C66 P40777 oasc.CachingDirectoryFactory.close Releasing directory:/usr/home/hudson/hudson-slave/workspace/Lucene-Solr-Tests-4.x-Java6/solr/build/solr-core/test/J0/./org.apache.solr.cloud.SyncSliceTest-1356477997819/jetty3/index.20121225172651260
[junit4:junit4]   2> 13473 T1059 C66 P40777 oasc.CachingDirectoryFactory.close Releasing directory:/usr/home/hudson/hudson-slave/workspace/Lucene-Solr-Tests-4.x-Java6/solr/build/solr-core/test/J0/./org.apache.solr.cloud.SyncSliceTest-1356477997819/jetty3/index
[junit4:junit4]   2> 13474 T1059 C66 P40777 oasc.RecoveryStrategy.replay No replay needed. core=collection1
[junit4:junit4]   2> 13474 T1059 C66 P40777 oasc.RecoveryStrategy.doRecovery Replication Recovery was successful - registering as Active. core=collection1
[junit4:junit4]   2> 13474 T1059 C66 P40777 oasc.ZkController.publish publishing core=collection1 state=active
[junit4:junit4]   2> 13474 T1059 C66 P40777 oasc.ZkController.publish numShards not found on descriptor - reading it from system property
[junit4:junit4]   2> 13482 T1059 C66 P40777 oasc.RecoveryStrategy.doRecovery Finished recovery process. core=collection1
[junit4:junit4]   2> 13887 T1007 oascc.ZkStateReader.updateClusterState Updating cloud state from ZooKeeper... 
[junit4:junit4]   2> 13888 T1007 oasc.Overseer$ClusterStateUpdater.updateState Update state numShards=1 message={
[junit4:junit4]   2> 	  "operation":"state",
[junit4:junit4]   2> 	  "numShards":"1",
[junit4:junit4]   2> 	  "shard":"shard1",
[junit4:junit4]   2> 	  "roles":null,
[junit4:junit4]   2> 	  "state":"active",
[junit4:junit4]   2> 	  "core":"collection1",
[junit4:junit4]   2> 	  "collection":"collection1",
[junit4:junit4]   2> 	  "node_name":"127.0.0.1:40777_",
[junit4:junit4]   2> 	  "base_url":"http://127.0.0.1:40777"}
[junit4:junit4]   2> 13900 T1006 oascc.ZkStateReader$2.process A cluster state change: WatchedEvent state:SyncConnected type:NodeDataChanged path:/clusterstate.json, has occurred - updating... (live nodes size: 5)
[junit4:junit4]   2> 13899 T1025 oascc.ZkStateReader$2.process A cluster state change: WatchedEvent state:SyncConnected type:NodeDataChanged path:/clusterstate.json, has occurred - updating... (live nodes size: 5)
[junit4:junit4]   2> 13900 T1072 oascc.ZkStateReader$2.process A cluster state change: WatchedEvent state:SyncConnected type:NodeDataChanged path:/clusterstate.json, has occurred - updating... (live nodes size: 5)
[junit4:junit4]   2> 13900 T1056 oascc.ZkStateReader$2.process A cluster state change: WatchedEvent state:SyncConnected type:NodeDataChanged path:/clusterstate.json, has occurred - updating... (live nodes size: 5)
[junit4:junit4]   2> 13899 T1040 oascc.ZkStateReader$2.process A cluster state change: WatchedEvent state:SyncConnected type:NodeDataChanged path:/clusterstate.json, has occurred - updating... (live nodes size: 5)
[junit4:junit4]   2> 13899 T1012 oascc.ZkStateReader$2.process A cluster state change: WatchedEvent state:SyncConnected type:NodeDataChanged path:/clusterstate.json, has occurred - updating... (live nodes size: 5)
[junit4:junit4]   2> 13997 T984 oascc.ZkStateReader.updateClusterState Updating cloud state from ZooKeeper... 
[junit4:junit4]   2> 14999 T984 oascc.ZkStateReader.updateClusterState Updating cloud state from ZooKeeper... 
[junit4:junit4]   2>  C68_STATE=coll:collection1 core:collection1 props:{shard=shard1, roles=null, state=recovering, core=collection1, collection=collection1, node_name=127.0.0.1:40781_, base_url=http://127.0.0.1:40781}
[junit4:junit4]   2> 15996 T1077 C68 P40781 oasc.RecoveryStrategy.doRecovery Attempting to PeerSync from http://127.0.0.1:40770/collection1/ core=collection1 - recoveringAfterStartup=true
[junit4:junit4]   2> 15996 T1077 C68 P40781 oasu.PeerSync.sync PeerSync: core=collection1 url=http://127.0.0.1:40781 START replicas=[http://127.0.0.1:40770/collection1/] nUpdates=100
[junit4:junit4]   2> 15997 T1077 C68 P40781 oasu.PeerSync.sync WARNING no frame of reference to tell of we've missed updates
[junit4:junit4]   2> 15997 T1077 C68 P40781 oasc.RecoveryStrategy.doRecovery PeerSync Recovery was not successful - trying replication. core=collection1
[junit4:junit4]   2> 15997 T1077 C68 P40781 oasc.RecoveryStrategy.doRecovery Starting Replication Recovery. core=collection1
[junit4:junit4]   2> 15997 T1077 C68 P40781 oasc.RecoveryStrategy.doRecovery Begin buffering updates. core=collection1
[junit4:junit4]   2> 15997 T1077 C68 P40781 oasu.UpdateLog.bufferUpdates Starting to buffer updates. FSUpdateLog{state=ACTIVE, tlog=null}
[junit4:junit4]   2> 15997 T1077 C68 P40781 oasc.RecoveryStrategy.replicate Attempting to replicate from http://127.0.0.1:40770/collection1/. core=collection1
[junit4:junit4]   2> 15998 T1077 C68 P40781 oascsi.HttpClientUtil.createClient Creating new http client, config:maxConnections=128&maxConnectionsPerHost=32&followRedirects=false
[junit4:junit4]   2> 15999 T1017 C67 P40770 REQ /get {distrib=false&qt=/get&wt=javabin&version=2&getVersions=100} status=0 QTime=0 
[junit4:junit4]   2> 16001 T984 oascc.ZkStateReader.updateClusterState Updating cloud state from ZooKeeper... 
[junit4:junit4]   2> 16013 T1015 C67 P40770 oasu.DirectUpdateHandler2.commit start commit{flags=0,_version_=0,optimize=false,openSearcher=false,waitSearcher=true,expungeDeletes=false,softCommit=false}
[junit4:junit4]   2> 16041 T1015 C67 P40770 oasc.SolrDeletionPolicy.onCommit SolrDeletionPolicy.onCommit: commits:num=3
[junit4:junit4]   2> 		commit{dir=RateLimitedDirectoryWrapper(org.apache.lucene.store.NIOFSDirectory@/usr/home/hudson/hudson-slave/workspace/Lucene-Solr-Tests-4.x-Java6/solr/build/solr-core/test/J0/org.apache.solr.cloud.SyncSliceTest-1356477997819/jetty1/index lockFactory=org.apache.lucene.store.NativeFSLockFactory@65b1e8f4),segFN=segments_2,generation=2,filenames=[segments_2]
[junit4:junit4]   2> 		commit{dir=RateLimitedDirectoryWrapper(org.apache.lucene.store.NIOFSDirectory@/usr/home/hudson/hudson-slave/workspace/Lucene-Solr-Tests-4.x-Java6/solr/build/solr-core/test/J0/org.apache.solr.cloud.SyncSliceTest-1356477997819/jetty1/index lockFactory=org.apache.lucene.store.NativeFSLockFactory@65b1e8f4),segFN=segments_3,generation=3,filenames=[segments_3]
[junit4:junit4]   2> 		commit{dir=RateLimitedDirectoryWrapper(org.apache.lucene.store.NIOFSDirectory@/usr/home/hudson/hudson-slave/workspace/Lucene-Solr-Tests-4.x-Java6/solr/build/solr-core/test/J0/org.apache.solr.cloud.SyncSliceTest-1356477997819/jetty1/index lockFactory=org.apache.lucene.store.NativeFSLockFactory@65b1e8f4),segFN=segments_4,generation=4,filenames=[segments_4]
[junit4:junit4]   2> 16042 T1015 C67 P40770 oasc.SolrDeletionPolicy.updateCommits newest commit = 4[segments_4]
[junit4:junit4]   2> 16043 T1015 C67 P40770 oasc.CachingDirectoryFactory.close Releasing directory:/usr/home/hudson/hudson-slave/workspace/Lucene-Solr-Tests-4.x-Java6/solr/build/solr-core/test/J0/./org.apache.solr.cloud.SyncSliceTest-1356477997819/jetty1
[junit4:junit4]   2> 16043 T1015 C67 P40770 oasu.DirectUpdateHandler2.commit end_commit_flush
[junit4:junit4]   2> 16043 T1015 C67 P40770 /update {waitSearcher=true&openSearcher=false&commit=true&commit_end_point=true&wt=javabin&softCommit=false&version=2} {commit=} 0 30
[junit4:junit4]   2> 16045 T1077 C68 P40781 oash.ReplicationHandler.inform Commits will be reserved for  10000
[junit4:junit4]   2> 16045 T1077 C68 P40781 oash.SnapPuller.<init>  No value set for 'pollInterval'. Timer Task not started.
[junit4:junit4]   2> 16047 T1019 C67 P40770 REQ /replication {command=indexversion&wt=javabin&qt=/replication&version=2} status=0 QTime=0 
[junit4:junit4]   2> 16048 T1077 C68 P40781 oash.SnapPuller.fetchLatestIndex Master's generation: 4
[junit4:junit4]   2> 16048 T1077 C68 P40781 oash.SnapPuller.fetchLatestIndex Slave's generation: 1
[junit4:junit4]   2> 16048 T1077 C68 P40781 oash.SnapPuller.fetchLatestIndex Starting replication process
[junit4:junit4]   2> 16050 T1019 C67 P40770 oasc.CachingDirectoryFactory.close Releasing directory:/usr/home/hudson/hudson-slave/workspace/Lucene-Solr-Tests-4.x-Java6/solr/build/solr-core/test/J0/./org.apache.solr.cloud.SyncSliceTest-1356477997819/jetty1
[junit4:junit4]   2> 16051 T1019 C67 P40770 oasc.CachingDirectoryFactory.close Releasing directory:/usr/home/hudson/hudson-slave/workspace/Lucene-Solr-Tests-4.x-Java6/solr/build/solr-core/test/J0/./org.apache.solr.cloud.SyncSliceTest-1356477997819/jetty1/index
[junit4:junit4]   2> 16051 T1019 C67 P40770 REQ /replication {command=filelist&generation=4&wt=javabin&qt=/replication&version=2} status=0 QTime=1 
[junit4:junit4]   2> 16052 T1077 C68 P40781 oash.SnapPuller.fetchLatestIndex Number of files in latest index in master: 1
[junit4:junit4]   2> 16053 T1077 C68 P40781 oasc.CachingDirectoryFactory.get return new directory for /usr/home/hudson/hudson-slave/workspace/Lucene-Solr-Tests-4.x-Java6/solr/build/solr-core/test/J0/./org.apache.solr.cloud.SyncSliceTest-1356477997819/jetty4/index.20121225172653866 forceNew:false
[junit4:junit4]   2> 16053 T1077 C68 P40781 oasc.CachingDirectoryFactory.close Releasing directory:/usr/home/hudson/hudson-slave/workspace/Lucene-Solr-Tests-4.x-Java6/solr/build/solr-core/test/J0/./org.apache.solr.cloud.SyncSliceTest-1356477997819/jetty4
[junit4:junit4]   2> 16054 T1077 C68 P40781 oash.SnapPuller.fetchLatestIndex Starting download to RateLimitedDirectoryWrapper(org.apache.lucene.store.NIO

[...truncated too long message...]

/org.apache.solr.cloud.SyncSliceTest-1356477997819/jetty4/index lockFactory=org.apache.lucene.store.NativeFSLockFactory@2d6c8cdb)
[junit4:junit4]   2> 129888 T984 oasc.CachingDirectoryFactory.closeDirectory Closing directory:/usr/home/hudson/hudson-slave/workspace/Lucene-Solr-Tests-4.x-Java6/solr/build/solr-core/test/J0/./org.apache.solr.cloud.SyncSliceTest-1356477997819/jetty4/index.20121225172653866
[junit4:junit4]   2> 129888 T984 oash.SnapPuller$2.postClose removing old index directory RateLimitedDirectoryWrapper(org.apache.lucene.store.NIOFSDirectory@/usr/home/hudson/hudson-slave/workspace/Lucene-Solr-Tests-4.x-Java6/solr/build/solr-core/test/J0/org.apache.solr.cloud.SyncSliceTest-1356477997819/jetty4/index lockFactory=org.apache.lucene.store.NativeFSLockFactory@2d6c8cdb)
[junit4:junit4]   2> 129890 T984 oasc.CachingDirectoryFactory.close Closing directory when closing factory:/usr/home/hudson/hudson-slave/workspace/Lucene-Solr-Tests-4.x-Java6/solr/build/solr-core/test/J0/./org.apache.solr.cloud.SyncSliceTest-1356477997819/jetty4/index
[junit4:junit4]   2> 129890 T984 oasc.CachingDirectoryFactory.closeDirectory Closing directory:/usr/home/hudson/hudson-slave/workspace/Lucene-Solr-Tests-4.x-Java6/solr/build/solr-core/test/J0/./org.apache.solr.cloud.SyncSliceTest-1356477997819/jetty4/index
[junit4:junit4]   2> 129891 T984 oasc.CachingDirectoryFactory.close Closing directory when closing factory:/usr/home/hudson/hudson-slave/workspace/Lucene-Solr-Tests-4.x-Java6/solr/build/solr-core/test/J0/./org.apache.solr.cloud.SyncSliceTest-1356477997819/jetty4
[junit4:junit4]   2> 129891 T984 oasc.CachingDirectoryFactory.closeDirectory Closing directory:/usr/home/hudson/hudson-slave/workspace/Lucene-Solr-Tests-4.x-Java6/solr/build/solr-core/test/J0/./org.apache.solr.cloud.SyncSliceTest-1356477997819/jetty4
[junit4:junit4]   2> 130258 T1072 oaz.ClientCnxn$EventThread.run EventThread shut down
[junit4:junit4]   2> 130258 T984 oaz.ZooKeeper.close Session: 0x13bd463a300000c closed
[junit4:junit4]   2> 130260 T984 oejsh.ContextHandler.doStop stopped o.e.j.s.ServletContextHandler{/,null}
[junit4:junit4]   2> 130472 T984 oas.SolrTestCaseJ4.tearDown ###Ending testDistribSearch
[junit4:junit4]   1> client port:0.0.0.0/0.0.0.0:0
[junit4:junit4]   2> NOTE: reproduce with: ant test  -Dtestcase=SyncSliceTest -Dtests.method=testDistribSearch -Dtests.seed=225A79AD6860E61D -Dtests.multiplier=3 -Dtests.slow=true -Dtests.locale=zh -Dtests.timezone=US/Central -Dtests.file.encoding=US-ASCII
[junit4:junit4] FAILURE  131s J0 | SyncSliceTest.testDistribSearch <<<
[junit4:junit4]    > Throwable #1: java.lang.AssertionError: shard1 should have just been set up to be inconsistent - but it's still consistent
[junit4:junit4]    > 	at __randomizedtesting.SeedInfo.seed([225A79AD6860E61D:A3BCF7B51F3F8621]:0)
[junit4:junit4]    > 	at org.junit.Assert.fail(Assert.java:93)
[junit4:junit4]    > 	at org.junit.Assert.assertTrue(Assert.java:43)
[junit4:junit4]    > 	at org.junit.Assert.assertNotNull(Assert.java:526)
[junit4:junit4]    > 	at org.apache.solr.cloud.SyncSliceTest.doTest(SyncSliceTest.java:214)
[junit4:junit4]    > 	at org.apache.solr.BaseDistributedSearchTestCase.testDistribSearch(BaseDistributedSearchTestCase.java:794)
[junit4:junit4]    > 	at sun.reflect.NativeMethodAccessorImpl.invoke0(Native Method)
[junit4:junit4]    > 	at sun.reflect.NativeMethodAccessorImpl.invoke(NativeMethodAccessorImpl.java:57)
[junit4:junit4]    > 	at sun.reflect.DelegatingMethodAccessorImpl.invoke(DelegatingMethodAccessorImpl.java:43)
[junit4:junit4]    > 	at java.lang.reflect.Method.invoke(Method.java:616)
[junit4:junit4]    > 	at com.carrotsearch.randomizedtesting.RandomizedRunner.invoke(RandomizedRunner.java:1559)
[junit4:junit4]    > 	at com.carrotsearch.randomizedtesting.RandomizedRunner.access$600(RandomizedRunner.java:79)
[junit4:junit4]    > 	at com.carrotsearch.randomizedtesting.RandomizedRunner$6.evaluate(RandomizedRunner.java:737)
[junit4:junit4]    > 	at com.carrotsearch.randomizedtesting.RandomizedRunner$7.evaluate(RandomizedRunner.java:773)
[junit4:junit4]    > 	at com.carrotsearch.randomizedtesting.RandomizedRunner$8.evaluate(RandomizedRunner.java:787)
[junit4:junit4]    > 	at com.carrotsearch.randomizedtesting.rules.SystemPropertiesRestoreRule$1.evaluate(SystemPropertiesRestoreRule.java:53)
[junit4:junit4]    > 	at org.apache.lucene.util.TestRuleSetupTeardownChained$1.evaluate(TestRuleSetupTeardownChained.java:50)
[junit4:junit4]    > 	at org.apache.lucene.util.TestRuleFieldCacheSanity$1.evaluate(TestRuleFieldCacheSanity.java:51)
[junit4:junit4]    > 	at org.apache.lucene.util.AbstractBeforeAfterRule$1.evaluate(AbstractBeforeAfterRule.java:46)
[junit4:junit4]    > 	at com.carrotsearch.randomizedtesting.rules.SystemPropertiesInvariantRule$1.evaluate(SystemPropertiesInvariantRule.java:55)
[junit4:junit4]    > 	at org.apache.lucene.util.TestRuleThreadAndTestName$1.evaluate(TestRuleThreadAndTestName.java:49)
[junit4:junit4]    > 	at org.apache.lucene.util.TestRuleIgnoreAfterMaxFailures$1.evaluate(TestRuleIgnoreAfterMaxFailures.java:70)
[junit4:junit4]    > 	at org.apache.lucene.util.TestRuleMarkFailure$1.evaluate(TestRuleMarkFailure.java:48)
[junit4:junit4]    > 	at com.carrotsearch.randomizedtesting.rules.StatementAdapter.evaluate(StatementAdapter.java:36)
[junit4:junit4]    > 	at com.carrotsearch.randomizedtesting.ThreadLeakControl$StatementRunner.run(ThreadLeakControl.java:358)
[junit4:junit4]    > 	at com.carrotsearch.randomizedtesting.ThreadLeakControl.forkTimeoutingTask(ThreadLeakControl.java:782)
[junit4:junit4]    > 	at com.carrotsearch.randomizedtesting.ThreadLeakControl$3.evaluate(ThreadLeakControl.java:442)
[junit4:junit4]    > 	at com.carrotsearch.randomizedtesting.RandomizedRunner.runSingleTest(RandomizedRunner.java:746)
[junit4:junit4]    > 	at com.carrotsearch.randomizedtesting.RandomizedRunner$3.evaluate(RandomizedRunner.java:648)
[junit4:junit4]    > 	at com.carrotsearch.randomizedtesting.RandomizedRunner$4.evaluate(RandomizedRunner.java:682)
[junit4:junit4]    > 	at com.carrotsearch.randomizedtesting.RandomizedRunner$5.evaluate(RandomizedRunner.java:693)
[junit4:junit4]    > 	at com.carrotsearch.randomizedtesting.rules.StatementAdapter.evaluate(StatementAdapter.java:36)
[junit4:junit4]    > 	at com.carrotsearch.randomizedtesting.rules.SystemPropertiesRestoreRule$1.evaluate(SystemPropertiesRestoreRule.java:53)
[junit4:junit4]    > 	at org.apache.lucene.util.AbstractBeforeAfterRule$1.evaluate(AbstractBeforeAfterRule.java:46)
[junit4:junit4]    > 	at org.apache.lucene.util.TestRuleStoreClassName$1.evaluate(TestRuleStoreClassName.java:42)
[junit4:junit4]    > 	at com.carrotsearch.randomizedtesting.rules.SystemPropertiesInvariantRule$1.evaluate(SystemPropertiesInvariantRule.java:55)
[junit4:junit4]    > 	at com.carrotsearch.randomizedtesting.rules.NoShadowingOrOverridesOnMethodsRule$1.evaluate(NoShadowingOrOverridesOnMethodsRule.java:39)
[junit4:junit4]    > 	at com.carrotsearch.randomizedtesting.rules.NoShadowingOrOverridesOnMethodsRule$1.evaluate(NoShadowingOrOverridesOnMethodsRule.java:39)
[junit4:junit4]    > 	at com.carrotsearch.randomizedtesting.rules.StatementAdapter.evaluate(StatementAdapter.java:36)
[junit4:junit4]    > 	at org.apache.lucene.util.TestRuleAssertionsRequired$1.evaluate(TestRuleAssertionsRequired.java:43)
[junit4:junit4]    > 	at org.apache.lucene.util.TestRuleMarkFailure$1.evaluate(TestRuleMarkFailure.java:48)
[junit4:junit4]    > 	at org.apache.lucene.util.TestRuleIgnoreAfterMaxFailures$1.evaluate(TestRuleIgnoreAfterMaxFailures.java:70)
[junit4:junit4]    > 	at org.apache.lucene.util.TestRuleIgnoreTestSuites$1.evaluate(TestRuleIgnoreTestSuites.java:55)
[junit4:junit4]    > 	at com.carrotsearch.randomizedtesting.rules.StatementAdapter.evaluate(StatementAdapter.java:36)
[junit4:junit4]    > 	at com.carrotsearch.randomizedtesting.ThreadLeakControl$StatementRunner.run(ThreadLeakControl.java:358)
[junit4:junit4]    > 	at java.lang.Thread.run(Thread.java:679)
[junit4:junit4]   2> 130673 T984 oas.SolrTestCaseJ4.deleteCore ###deleteCore
[junit4:junit4]   2> NOTE: test params are: codec=Lucene3x, sim=RandomSimilarityProvider(queryNorm=false,coord=yes): {}, locale=zh, timezone=US/Central
[junit4:junit4]   2> NOTE: FreeBSD 9.0-RELEASE amd64/Sun Microsystems Inc. 1.6.0_32 (64-bit)/cpus=16,threads=2,free=142325032,total=293404672
[junit4:junit4]   2> NOTE: All tests run in this JVM: [TestFaceting, SolrCoreCheckLockOnStartupTest, TestFiltering, TestJmxMonitoredMap, TermsComponentTest, BasicDistributedZkTest, TestDefaultSimilarityFactory, TestIBSimilarityFactory, TestQueryTypes, LoggingHandlerTest, MBeansHandlerTest, BasicDistributedZk2Test, TestWordDelimiterFilterFactory, DateMathParserTest, HighlighterConfigTest, SyncSliceTest]
[junit4:junit4] Completed on J0 in 130.70s, 1 test, 1 failure <<< FAILURES!

[...truncated 349 lines...]
BUILD FAILED
/usr/home/hudson/hudson-slave/workspace/Lucene-Solr-Tests-4.x-Java6/build.xml:353: The following error occurred while executing this line:
/usr/home/hudson/hudson-slave/workspace/Lucene-Solr-Tests-4.x-Java6/build.xml:39: The following error occurred while executing this line:
/usr/home/hudson/hudson-slave/workspace/Lucene-Solr-Tests-4.x-Java6/solr/build.xml:178: The following error occurred while executing this line:
/usr/home/hudson/hudson-slave/workspace/Lucene-Solr-Tests-4.x-Java6/solr/common-build.xml:438: The following error occurred while executing this line:
/usr/home/hudson/hudson-slave/workspace/Lucene-Solr-Tests-4.x-Java6/lucene/common-build.xml:1176: The following error occurred while executing this line:
/usr/home/hudson/hudson-slave/workspace/Lucene-Solr-Tests-4.x-Java6/lucene/common-build.xml:841: There were test failures: 244 suites, 1012 tests, 1 failure, 21 ignored (3 assumptions)

Total time: 36 minutes 51 seconds
Build step 'Invoke Ant' marked build as failure
Archiving artifacts
Recording test results
Email was triggered for: Failure
Sending email for trigger: Failure



Mime
View raw message