lucene-dev mailing list archives

Site index · List index
Message view « Date » · « Thread »
Top « Date » · « Thread »
From Policeman Jenkins Server <jenk...@sd-datasolutions.de>
Subject [JENKINS] Lucene-Solr-trunk-Linux (64bit/jdk1.8.0-ea-b65) - Build # 3427 - Failure!
Date Wed, 26 Dec 2012 07:59:44 GMT
Build: http://jenkins.sd-datasolutions.de/job/Lucene-Solr-trunk-Linux/3427/
Java: 64bit/jdk1.8.0-ea-b65 -XX:+UseConcMarkSweepGC

2 tests failed.
FAILED:  junit.framework.TestSuite.org.apache.solr.client.solrj.impl.BasicHttpSolrServerTest

Error Message:
Suite timeout exceeded (>= 7200000 msec).

Stack Trace:
java.lang.Exception: Suite timeout exceeded (>= 7200000 msec).
	at __randomizedtesting.SeedInfo.seed([25BDD92298B3E87F]:0)


REGRESSION:  org.apache.solr.client.solrj.impl.BasicHttpSolrServerTest.testConnectionRefused

Error Message:
Test abandoned because suite timeout was reached.

Stack Trace:
java.lang.Exception: Test abandoned because suite timeout was reached.
	at __randomizedtesting.SeedInfo.seed([25BDD92298B3E87F]:0)




Build Log:
[...truncated 10021 lines...]
[junit4:junit4] Suite: org.apache.solr.client.solrj.impl.BasicHttpSolrServerTest
[junit4:junit4]   2> 0 T247 oas.SolrTestCaseJ4.initCore ####initCore
[junit4:junit4]   2> Creating dataDir: /mnt/ssd/jenkins/workspace/Lucene-Solr-trunk-Linux/solr/build/solr-solrj/test/J0/./solrtest-BasicHttpSolrServerTest-1356501538792
[junit4:junit4]   2> 1 T247 oas.SolrTestCaseJ4.initCore ####initCore end
[junit4:junit4]   2> 2 T247 oejs.Server.doStart jetty-8.1.8.v20121106
[junit4:junit4]   2> 3 T247 oejs.AbstractConnector.doStart Started SelectChannelConnector@127.0.0.1:56580
[junit4:junit4]   2> 4 T247 oasc.SolrResourceLoader.locateSolrHome JNDI not configured for solr (NoInitialContextEx)
[junit4:junit4]   2> 4 T247 oasc.SolrResourceLoader.locateSolrHome using system property solr.solr.home: /mnt/ssd/jenkins/workspace/Lucene-Solr-trunk-Linux/solr/example/solr
[junit4:junit4]   2> 5 T247 oasc.SolrResourceLoader.<init> new SolrResourceLoader for deduced Solr Home: '/mnt/ssd/jenkins/workspace/Lucene-Solr-trunk-Linux/solr/example/solr/'
[junit4:junit4]   2> 19 T247 oass.SolrDispatchFilter.init SolrDispatchFilter.init()
[junit4:junit4]   2> 19 T247 oasc.SolrResourceLoader.locateSolrHome JNDI not configured for solr (NoInitialContextEx)
[junit4:junit4]   2> 19 T247 oasc.SolrResourceLoader.locateSolrHome using system property solr.solr.home: /mnt/ssd/jenkins/workspace/Lucene-Solr-trunk-Linux/solr/example/solr
[junit4:junit4]   2> 20 T247 oasc.CoreContainer$Initializer.initialize looking for solr.xml: /mnt/ssd/jenkins/workspace/Lucene-Solr-trunk-Linux/solr/example/solr/solr.xml
[junit4:junit4]   2> 20 T247 oasc.CoreContainer.<init> New CoreContainer 2113093809
[junit4:junit4]   2> 20 T247 oasc.CoreContainer.load Loading CoreContainer using Solr Home: '/mnt/ssd/jenkins/workspace/Lucene-Solr-trunk-Linux/solr/example/solr/'
[junit4:junit4]   2> 20 T247 oasc.SolrResourceLoader.<init> new SolrResourceLoader for directory: '/mnt/ssd/jenkins/workspace/Lucene-Solr-trunk-Linux/solr/example/solr/'
[junit4:junit4]   2> 30 T247 oashc.HttpShardHandlerFactory.getParameter Setting socketTimeout to: 0
[junit4:junit4]   2> 31 T247 oashc.HttpShardHandlerFactory.getParameter Setting urlScheme to: http://
[junit4:junit4]   2> 31 T247 oashc.HttpShardHandlerFactory.getParameter Setting connTimeout to: 0
[junit4:junit4]   2> 31 T247 oashc.HttpShardHandlerFactory.getParameter Setting maxConnectionsPerHost to: 20
[junit4:junit4]   2> 31 T247 oashc.HttpShardHandlerFactory.getParameter Setting corePoolSize to: 0
[junit4:junit4]   2> 31 T247 oashc.HttpShardHandlerFactory.getParameter Setting maximumPoolSize to: 2147483647
[junit4:junit4]   2> 32 T247 oashc.HttpShardHandlerFactory.getParameter Setting maxThreadIdleTime to: 5
[junit4:junit4]   2> 32 T247 oashc.HttpShardHandlerFactory.getParameter Setting sizeOfQueue to: -1
[junit4:junit4]   2> 32 T247 oashc.HttpShardHandlerFactory.getParameter Setting fairnessPolicy to: false
[junit4:junit4]   2> 33 T247 oascsi.HttpClientUtil.createClient Creating new http client, config:maxConnectionsPerHost=20&maxConnections=10000&socketTimeout=0&connTimeout=0&retry=false
[junit4:junit4]   2> 38 T247 oasc.CoreContainer.load Registering Log Listener
[junit4:junit4]   2> 57 T257 oasc.CoreContainer.create Creating SolrCore 'collection1' using instanceDir: /mnt/ssd/jenkins/workspace/Lucene-Solr-trunk-Linux/solr/example/solr/collection1
[junit4:junit4]   2> 58 T257 oasc.SolrResourceLoader.<init> new SolrResourceLoader for directory: '/mnt/ssd/jenkins/workspace/Lucene-Solr-trunk-Linux/solr/example/solr/collection1/'
[junit4:junit4]   2> 70 T257 oasc.SolrConfig.initLibs Adding specified lib dirs to ClassLoader
[junit4:junit4]   2> 93 T257 oasc.SolrConfig.<init> Using Lucene MatchVersion: LUCENE_50
[junit4:junit4]   2> 141 T257 oasc.SolrConfig.<init> Loaded SolrConfig: solrconfig.xml
[junit4:junit4]   2> 141 T257 oass.IndexSchema.readSchema Reading Solr Schema
[junit4:junit4]   2> 146 T257 oass.IndexSchema.readSchema Schema name=example
[junit4:junit4]   2> 573 T257 oass.IndexSchema.readSchema unique key field: id
[junit4:junit4]   2> 581 T257 oass.FileExchangeRateProvider.reload Reloading exchange rates from file currency.xml
[junit4:junit4]   2> 585 T257 oass.FileExchangeRateProvider.reload Reloading exchange rates from file currency.xml
[junit4:junit4]   2> 599 T257 oasc.SolrCore.<init> [collection1] Opening new SolrCore at /mnt/ssd/jenkins/workspace/Lucene-Solr-trunk-Linux/solr/example/solr/collection1/, dataDir=/mnt/ssd/jenkins/workspace/Lucene-Solr-trunk-Linux/solr/build/solr-solrj/test/J0/solrtest-BasicHttpSolrServerTest-1356501538792/
[junit4:junit4]   2> 599 T257 oasc.JmxMonitoredMap.<init> JMX monitoring is enabled. Adding Solr mbeans to JMX Server: com.sun.jmx.mbeanserver.JmxMBeanServer@1437268e
[junit4:junit4]   2> 600 T257 oasc.SolrCore.initListeners [collection1] Added SolrEventListener for newSearcher: org.apache.solr.core.QuerySenderListener{queries=[]}
[junit4:junit4]   2> 600 T257 oasc.SolrCore.initListeners [collection1] Added SolrEventListener for firstSearcher: org.apache.solr.core.QuerySenderListener{queries=[{q=static firstSearcher warming in solrconfig.xml}]}
[junit4:junit4]   2> 600 T257 oasc.SolrCore.initDirectoryFactory org.apache.solr.core.MockDirectoryFactory
[junit4:junit4]   2> 601 T257 oasc.CachingDirectoryFactory.get return new directory for /mnt/ssd/jenkins/workspace/Lucene-Solr-trunk-Linux/solr/build/solr-solrj/test/J0/solrtest-BasicHttpSolrServerTest-1356501538792 forceNew:false
[junit4:junit4]   2> 601 T257 oasc.CachingDirectoryFactory.close Releasing directory:/mnt/ssd/jenkins/workspace/Lucene-Solr-trunk-Linux/solr/build/solr-solrj/test/J0/solrtest-BasicHttpSolrServerTest-1356501538792
[junit4:junit4]   2> 601 T257 oasc.SolrCore.getNewIndexDir New index directory detected: old=null new=/mnt/ssd/jenkins/workspace/Lucene-Solr-trunk-Linux/solr/build/solr-solrj/test/J0/solrtest-BasicHttpSolrServerTest-1356501538792/index/
[junit4:junit4]   2> 602 T257 oasc.SolrCore.initIndex WARNING [collection1] Solr index directory '/mnt/ssd/jenkins/workspace/Lucene-Solr-trunk-Linux/solr/build/solr-solrj/test/J0/solrtest-BasicHttpSolrServerTest-1356501538792/index' doesn't exist. Creating new index...
[junit4:junit4]   2> 602 T257 oasc.CachingDirectoryFactory.get return new directory for /mnt/ssd/jenkins/workspace/Lucene-Solr-trunk-Linux/solr/build/solr-solrj/test/J0/solrtest-BasicHttpSolrServerTest-1356501538792/index forceNew:false
[junit4:junit4]   2> 603 T257 oasc.SolrDeletionPolicy.onCommit SolrDeletionPolicy.onCommit: commits:num=1
[junit4:junit4]   2> 		commit{dir=MockDirWrapper(org.apache.lucene.store.RAMDirectory@1f42b9ae lockFactory=org.apache.lucene.store.NativeFSLockFactory@2772e1f7),segFN=segments_1,generation=1,filenames=[segments_1]
[junit4:junit4]   2> 604 T257 oasc.SolrDeletionPolicy.updateCommits newest commit = 1[segments_1]
[junit4:junit4]   2> 604 T257 oasc.CachingDirectoryFactory.close Releasing directory:/mnt/ssd/jenkins/workspace/Lucene-Solr-trunk-Linux/solr/build/solr-solrj/test/J0/solrtest-BasicHttpSolrServerTest-1356501538792/index
[junit4:junit4]   2> 604 T257 oasc.SolrCore.initWriters created json: solr.JSONResponseWriter
[junit4:junit4]   2> 604 T257 oasc.SolrCore.initWriters adding lazy queryResponseWriter: solr.VelocityResponseWriter
[junit4:junit4]   2> 604 T257 oasc.SolrCore.initWriters created velocity: solr.VelocityResponseWriter
[junit4:junit4]   2> 605 T257 oasc.SolrCore.initWriters created xslt: solr.XSLTResponseWriter
[junit4:junit4]   2> 605 T257 oasr.XSLTResponseWriter.init xsltCacheLifetimeSeconds=5
[junit4:junit4]   2> 606 T257 oasc.RequestHandlers.initHandlersFromConfig created /select: solr.SearchHandler
[junit4:junit4]   2> 607 T257 oasc.RequestHandlers.initHandlersFromConfig created /query: solr.SearchHandler
[junit4:junit4]   2> 607 T257 oasc.RequestHandlers.initHandlersFromConfig created /get: solr.RealTimeGetHandler
[junit4:junit4]   2> 608 T257 oasc.RequestHandlers.initHandlersFromConfig created /browse: solr.SearchHandler
[junit4:junit4]   2> 609 T257 oasc.RequestHandlers.initHandlersFromConfig created /update: solr.UpdateRequestHandler
[junit4:junit4]   2> 609 T257 oasc.RequestHandlers.initHandlersFromConfig created /update/json: solr.JsonUpdateRequestHandler
[junit4:junit4]   2> 610 T257 oasc.RequestHandlers.initHandlersFromConfig created /update/csv: solr.CSVRequestHandler
[junit4:junit4]   2> 610 T257 oasc.RequestHandlers.initHandlersFromConfig adding lazy requestHandler: solr.extraction.ExtractingRequestHandler
[junit4:junit4]   2> 610 T257 oasc.RequestHandlers.initHandlersFromConfig created /update/extract: solr.extraction.ExtractingRequestHandler
[junit4:junit4]   2> 610 T257 oasc.RequestHandlers.initHandlersFromConfig adding lazy requestHandler: solr.FieldAnalysisRequestHandler
[junit4:junit4]   2> 611 T257 oasc.RequestHandlers.initHandlersFromConfig created /analysis/field: solr.FieldAnalysisRequestHandler
[junit4:junit4]   2> 611 T257 oasc.RequestHandlers.initHandlersFromConfig adding lazy requestHandler: solr.DocumentAnalysisRequestHandler
[junit4:junit4]   2> 611 T257 oasc.RequestHandlers.initHandlersFromConfig created /analysis/document: solr.DocumentAnalysisRequestHandler
[junit4:junit4]   2> 611 T257 oasc.RequestHandlers.initHandlersFromConfig created /admin/: solr.admin.AdminHandlers
[junit4:junit4]   2> 612 T257 oasc.RequestHandlers.initHandlersFromConfig created /admin/ping: solr.PingRequestHandler
[junit4:junit4]   2> 612 T257 oasc.RequestHandlers.initHandlersFromConfig created /debug/dump: solr.DumpRequestHandler
[junit4:junit4]   2> 613 T257 oasc.RequestHandlers.initHandlersFromConfig created /replication: solr.ReplicationHandler
[junit4:junit4]   2> 613 T257 oasc.RequestHandlers.initHandlersFromConfig adding lazy requestHandler: solr.SearchHandler
[junit4:junit4]   2> 614 T257 oasc.RequestHandlers.initHandlersFromConfig created /spell: solr.SearchHandler
[junit4:junit4]   2> 614 T257 oasc.RequestHandlers.initHandlersFromConfig adding lazy requestHandler: solr.SearchHandler
[junit4:junit4]   2> 614 T257 oasc.RequestHandlers.initHandlersFromConfig created /tvrh: solr.SearchHandler
[junit4:junit4]   2> 614 T257 oasc.RequestHandlers.initHandlersFromConfig adding lazy requestHandler: solr.SearchHandler
[junit4:junit4]   2> 614 T257 oasc.RequestHandlers.initHandlersFromConfig created /terms: solr.SearchHandler
[junit4:junit4]   2> 614 T257 oasc.RequestHandlers.initHandlersFromConfig adding lazy requestHandler: solr.SearchHandler
[junit4:junit4]   2> 615 T257 oasc.RequestHandlers.initHandlersFromConfig created /elevate: solr.SearchHandler
[junit4:junit4]   2> 617 T257 oashl.XMLLoader.init xsltCacheLifetimeSeconds=60
[junit4:junit4]   2> 618 T257 oashl.XMLLoader.init xsltCacheLifetimeSeconds=60
[junit4:junit4]   2> 619 T257 oashl.XMLLoader.init xsltCacheLifetimeSeconds=60
[junit4:junit4]   2> 621 T257 oasc.CachingDirectoryFactory.close Releasing directory:/mnt/ssd/jenkins/workspace/Lucene-Solr-trunk-Linux/solr/build/solr-solrj/test/J0/solrtest-BasicHttpSolrServerTest-1356501538792
[junit4:junit4]   2> 622 T257 oass.SolrIndexSearcher.<init> Opening Searcher@71312a49 main
[junit4:junit4]   2> 622 T257 oasu.CommitTracker.<init> Hard AutoCommit: if uncommited for 15000ms; 
[junit4:junit4]   2> 622 T257 oasu.CommitTracker.<init> Soft AutoCommit: disabled
[junit4:junit4]   2> 623 T257 oashc.SpellCheckComponent.inform Initializing spell checkers
[junit4:junit4]   2> 623 T257 oass.DirectSolrSpellChecker.init init: {name=default,field=name,classname=solr.DirectSolrSpellChecker,distanceMeasure=internal,accuracy=0.5,maxEdits=2,minPrefix=1,maxInspections=5,minQueryLength=4,maxQueryFrequency=0.01}
[junit4:junit4]   2> 623 T257 oashc.SpellCheckComponent.inform No queryConverter defined, using default converter
[junit4:junit4]   2> 624 T257 oashc.QueryElevationComponent.inform Loading QueryElevation from: /mnt/ssd/jenkins/workspace/Lucene-Solr-trunk-Linux/solr/example/solr/collection1/conf/elevate.xml
[junit4:junit4]   2> 635 T257 oash.ReplicationHandler.inform Commits will be reserved for  10000
[junit4:junit4]   2> 635 T258 oasc.QuerySenderListener.newSearcher QuerySenderListener sending requests to Searcher@71312a49 main{StandardDirectoryReader(segments_1:1)}
[junit4:junit4]   2> ASYNC  NEW_CORE C21 name=collection1 org.apache.solr.core.SolrCore@20ea1c31
[junit4:junit4]   2> 638 T258 C21 REQ [collection1] webapp=null path=null params={distrib=false&event=firstSearcher&q=static+firstSearcher+warming+in+solrconfig.xml} hits=0 status=0 QTime=3 
[junit4:junit4]   2> 638 T258 oasc.QuerySenderListener.newSearcher QuerySenderListener done.
[junit4:junit4]   2> 638 T258 oashc.SpellCheckComponent$SpellCheckerListener.newSearcher Loading spell index for spellchecker: default
[junit4:junit4]   2> 638 T258 oashc.SpellCheckComponent$SpellCheckerListener.newSearcher Loading spell index for spellchecker: wordbreak
[junit4:junit4]   2> 640 T258 oasc.SolrCore.registerSearcher [collection1] Registered new searcher Searcher@71312a49 main{StandardDirectoryReader(segments_1:1)}
[junit4:junit4]   2> 640 T257 oasc.CachingDirectoryFactory.close Releasing directory:/mnt/ssd/jenkins/workspace/Lucene-Solr-trunk-Linux/solr/build/solr-solrj/test/J0/solrtest-BasicHttpSolrServerTest-1356501538792
[junit4:junit4]   2> 641 T257 oasc.CachingDirectoryFactory.close Releasing directory:/mnt/ssd/jenkins/workspace/Lucene-Solr-trunk-Linux/solr/build/solr-solrj/test/J0/solrtest-BasicHttpSolrServerTest-1356501538792/index
[junit4:junit4]   2> 642 T257 oasc.CoreContainer.registerCore registering core: collection1
[junit4:junit4]   2> 643 T247 oass.SolrDispatchFilter.init user.dir=/mnt/ssd/jenkins/workspace/Lucene-Solr-trunk-Linux/solr/build/solr-solrj/test/J0
[junit4:junit4]   2> 643 T247 oass.SolrDispatchFilter.init SolrDispatchFilter.init() done
[junit4:junit4]   2> 643 T247 oas.SolrJettyTestBase.createJetty Jetty Assigned Port#56580
[junit4:junit4]   2> 649 T247 oas.SolrTestCaseJ4.setUp ###Starting testDelete
[junit4:junit4]   2> 656 T247 oascsi.HttpClientUtil.createClient Creating new http client, config:maxConnections=128&maxConnectionsPerHost=32&followRedirects=false
[junit4:junit4]   2> 679 T247 oas.SolrTestCaseJ4.tearDown ###Ending testDelete
[junit4:junit4]   2> 683 T247 oas.SolrTestCaseJ4.setUp ###Starting testGetRawStream
[junit4:junit4]   2> 684 T247 oascsi.HttpClientUtil.createClient Creating new http client, config:
[junit4:junit4]   2> 687 T254 C21 REQ [collection1] webapp=/solr path=/select params={} hits=0 status=0 QTime=0 
[junit4:junit4]   2> 688 T247 oas.SolrTestCaseJ4.tearDown ###Ending testGetRawStream
[junit4:junit4]   2> 692 T247 oas.SolrTestCaseJ4.setUp ###Starting testTimeout
[junit4:junit4]   2> 692 T247 oascsi.HttpClientUtil.createClient Creating new http client, config:maxConnections=128&maxConnectionsPerHost=32&followRedirects=false
[junit4:junit4]   2> 2697 T247 oas.SolrTestCaseJ4.tearDown ###Ending testTimeout
[junit4:junit4]   2> 2706 T247 oas.SolrTestCaseJ4.setUp ###Starting testCompression
[junit4:junit4]   2> 2707 T247 oascsi.HttpClientUtil.createClient Creating new http client, config:maxConnections=128&maxConnectionsPerHost=32&followRedirects=false
[junit4:junit4]   2> 2742 T247 oascsi.HttpClientUtil.createClient Creating new http client, config:
[junit4:junit4]   2> 2747 T254 C21 REQ [collection1] webapp=/solr path=/select params={q=foo&wt=xml} hits=0 status=0 QTime=1 
[junit4:junit4]   2> 2753 T247 oascsi.HttpClientUtil.createClient Creating new http client, config:maxConnections=128&maxConnectionsPerHost=32&followRedirects=false
[junit4:junit4]   2> 2759 T255 C21 REQ [collection1] webapp=/solr path=/select params={version=2&q=foo&wt=javabin} hits=0 status=0 QTime=0 
[junit4:junit4]   2> 2763 T247 oas.SolrTestCaseJ4.tearDown ###Ending testCompression
[junit4:junit4]   2> 2773 T247 oas.SolrTestCaseJ4.setUp ###Starting testUpdate
[junit4:junit4]   2> 2773 T247 oascsi.HttpClientUtil.createClient Creating new http client, config:maxConnections=128&maxConnectionsPerHost=32&followRedirects=false
[junit4:junit4]   2> 2786 T247 oas.SolrTestCaseJ4.tearDown ###Ending testUpdate
[junit4:junit4]   2> 2791 T247 oas.SolrTestCaseJ4.setUp ###Starting testQuery
[junit4:junit4]   2> 2794 T247 oascsi.HttpClientUtil.createClient Creating new http client, config:maxConnections=128&maxConnectionsPerHost=32&followRedirects=false
[junit4:junit4]   2> 2809 T247 oas.SolrTestCaseJ4.tearDown ###Ending testQuery
[junit4:junit4]   2> 2826 T247 oas.SolrTestCaseJ4.setUp ###Starting testSetParametersExternalClient
[junit4:junit4]   2> 2826 T247 oascsi.HttpClientUtil.createClient Creating new http client, config:
[junit4:junit4]   2> 2829 T247 oas.SolrTestCaseJ4.tearDown ###Ending testSetParametersExternalClient
[junit4:junit4]   2> 2840 T247 oas.SolrTestCaseJ4.setUp ###Starting testRedirect
[junit4:junit4]   2> 2841 T247 oascsi.HttpClientUtil.createClient Creating new http client, config:maxConnections=128&maxConnectionsPerHost=32&followRedirects=false
[junit4:junit4]   2> 2855 T253 C21 REQ [collection1] webapp=/solr path=/select params={version=2&q=*:*&wt=javabin} hits=0 status=0 QTime=1 
[junit4:junit4]   2> 2856 T247 oas.SolrTestCaseJ4.tearDown ###Ending testRedirect
[junit4:junit4]   2> 2865 T247 oas.SolrTestCaseJ4.setUp ###Starting testConnectionRefused
[junit4:junit4]   2> 2870 T247 oascsi.HttpClientUtil.createClient Creating new http client, config:maxConnections=128&maxConnectionsPerHost=32&followRedirects=false
[junit4:junit4]   2> 7200035 T246 ccr.ThreadLeakControl$2.evaluate WARNING Suite execution timed out: org.apache.solr.client.solrj.impl.BasicHttpSolrServerTest
[junit4:junit4]   2> 	==== jstack at approximately timeout time ====
[junit4:junit4]   2> 	"searcherExecutor-172-thread-1" ID=258 WAITING on java.util.concurrent.locks.AbstractQueuedSynchronizer$ConditionObject@350c5389
[junit4:junit4]   2> 		at sun.misc.Unsafe.park(Native Method)
[junit4:junit4]   2> 		- waiting on java.util.concurrent.locks.AbstractQueuedSynchronizer$ConditionObject@350c5389
[junit4:junit4]   2> 		at java.util.concurrent.locks.LockSupport.park(LockSupport.java:186)
[junit4:junit4]   2> 		at java.util.concurrent.locks.AbstractQueuedSynchronizer$ConditionObject.await(AbstractQueuedSynchronizer.java:2038)
[junit4:junit4]   2> 		at java.util.concurrent.LinkedBlockingQueue.take(LinkedBlockingQueue.java:439)
[junit4:junit4]   2> 		at java.util.concurrent.ThreadPoolExecutor.getTask(ThreadPoolExecutor.java:1045)
[junit4:junit4]   2> 		at java.util.concurrent.ThreadPoolExecutor.runWorker(ThreadPoolExecutor.java:1103)
[junit4:junit4]   2> 		at java.util.concurrent.ThreadPoolExecutor$Worker.run(ThreadPoolExecutor.java:603)
[junit4:junit4]   2> 		at java.lang.Thread.run(Thread.java:722)
[junit4:junit4]   2> 	
[junit4:junit4]   2> 	"qtp2087031116-256" ID=256 TIMED_WAITING on java.util.concurrent.locks.AbstractQueuedSynchronizer$ConditionObject@3c406294
[junit4:junit4]   2> 		at sun.misc.Unsafe.park(Native Method)
[junit4:junit4]   2> 		- timed waiting on java.util.concurrent.locks.AbstractQueuedSynchronizer$ConditionObject@3c406294
[junit4:junit4]   2> 		at java.util.concurrent.locks.LockSupport.parkNanos(LockSupport.java:226)
[junit4:junit4]   2> 		at java.util.concurrent.locks.AbstractQueuedSynchronizer$ConditionObject.awaitNanos(AbstractQueuedSynchronizer.java:2077)
[junit4:junit4]   2> 		at org.eclipse.jetty.util.BlockingArrayQueue.poll(BlockingArrayQueue.java:342)
[junit4:junit4]   2> 		at org.eclipse.jetty.util.thread.QueuedThreadPool.idleJobPoll(QueuedThreadPool.java:526)
[junit4:junit4]   2> 		at org.eclipse.jetty.util.thread.QueuedThreadPool.access$600(QueuedThreadPool.java:44)
[junit4:junit4]   2> 		at org.eclipse.jetty.util.thread.QueuedThreadPool$3.run(QueuedThreadPool.java:572)
[junit4:junit4]   2> 		at java.lang.Thread.run(Thread.java:722)
[junit4:junit4]   2> 	
[junit4:junit4]   2> 	"qtp2087031116-255" ID=255 TIMED_WAITING on java.util.concurrent.locks.AbstractQueuedSynchronizer$ConditionObject@3c406294
[junit4:junit4]   2> 		at sun.misc.Unsafe.park(Native Method)
[junit4:junit4]   2> 		- timed waiting on java.util.concurrent.locks.AbstractQueuedSynchronizer$ConditionObject@3c406294
[junit4:junit4]   2> 		at java.util.concurrent.locks.LockSupport.parkNanos(LockSupport.java:226)
[junit4:junit4]   2> 		at java.util.concurrent.locks.AbstractQueuedSynchronizer$ConditionObject.awaitNanos(AbstractQueuedSynchronizer.java:2077)
[junit4:junit4]   2> 		at org.eclipse.jetty.util.BlockingArrayQueue.poll(BlockingArrayQueue.java:342)
[junit4:junit4]   2> 		at org.eclipse.jetty.util.thread.QueuedThreadPool.idleJobPoll(QueuedThreadPool.java:526)
[junit4:junit4]   2> 		at org.eclipse.jetty.util.thread.QueuedThreadPool.access$600(QueuedThreadPool.java:44)
[junit4:junit4]   2> 		at org.eclipse.jetty.util.thread.QueuedThreadPool$3.run(QueuedThreadPool.java:572)
[junit4:junit4]   2> 		at java.lang.Thread.run(Thread.java:722)
[junit4:junit4]   2> 	
[junit4:junit4]   2> 	"qtp2087031116-254" ID=254 TIMED_WAITING on java.util.concurrent.locks.AbstractQueuedSynchronizer$ConditionObject@3c406294
[junit4:junit4]   2> 		at sun.misc.Unsafe.park(Native Method)
[junit4:junit4]   2> 		- timed waiting on java.util.concurrent.locks.AbstractQueuedSynchronizer$ConditionObject@3c406294
[junit4:junit4]   2> 		at java.util.concurrent.locks.LockSupport.parkNanos(LockSupport.java:226)
[junit4:junit4]   2> 		at java.util.concurrent.locks.AbstractQueuedSynchronizer$ConditionObject.awaitNanos(AbstractQueuedSynchronizer.java:2077)
[junit4:junit4]   2> 		at org.eclipse.jetty.util.BlockingArrayQueue.poll(BlockingArrayQueue.java:342)
[junit4:junit4]   2> 		at org.eclipse.jetty.util.thread.QueuedThreadPool.idleJobPoll(QueuedThreadPool.java:526)
[junit4:junit4]   2> 		at org.eclipse.jetty.util.thread.QueuedThreadPool.access$600(QueuedThreadPool.java:44)
[junit4:junit4]   2> 		at org.eclipse.jetty.util.thread.QueuedThreadPool$3.run(QueuedThreadPool.java:572)
[junit4:junit4]   2> 		at java.lang.Thread.run(Thread.java:722)
[junit4:junit4]   2> 	
[junit4:junit4]   2> 	"qtp2087031116-253" ID=253 TIMED_WAITING on java.util.concurrent.locks.AbstractQueuedSynchronizer$ConditionObject@3c406294
[junit4:junit4]   2> 		at sun.misc.Unsafe.park(Native Method)
[junit4:junit4]   2> 		- timed waiting on java.util.concurrent.locks.AbstractQueuedSynchronizer$ConditionObject@3c406294
[junit4:junit4]   2> 		at java.util.concurrent.locks.LockSupport.parkNanos(LockSupport.java:226)
[junit4:junit4]   2> 		at java.util.concurrent.locks.AbstractQueuedSynchronizer$ConditionObject.awaitNanos(AbstractQueuedSynchronizer.java:2077)
[junit4:junit4]   2> 		at org.eclipse.jetty.util.BlockingArrayQueue.poll(BlockingArrayQueue.java:342)
[junit4:junit4]   2> 		at org.eclipse.jetty.util.thread.QueuedThreadPool.idleJobPoll(QueuedThreadPool.java:526)
[junit4:junit4]   2> 		at org.eclipse.jetty.util.thread.QueuedThreadPool.access$600(QueuedThreadPool.java:44)
[junit4:junit4]   2> 		at org.eclipse.jetty.util.thread.QueuedThreadPool$3.run(QueuedThreadPool.java:572)
[junit4:junit4]   2> 		at java.lang.Thread.run(Thread.java:722)
[junit4:junit4]   2> 	
[junit4:junit4]   2> 	"qtp2087031116-252 Acceptor1 SelectChannelConnector@127.0.0.1:56580" ID=252 BLOCKED on java.lang.Object@27080173 owned by "qtp2087031116-251 Acceptor0 SelectChannelConnector@127.0.0.1:56580" ID=251
[junit4:junit4]   2> 		at sun.nio.ch.ServerSocketChannelImpl.accept(ServerSocketChannelImpl.java:210)
[junit4:junit4]   2> 		- blocked on java.lang.Object@27080173
[junit4:junit4]   2> 		at org.eclipse.jetty.server.nio.SelectChannelConnector.accept(SelectChannelConnector.java:109)
[junit4:junit4]   2> 		at org.eclipse.jetty.server.AbstractConnector$Acceptor.run(AbstractConnector.java:938)
[junit4:junit4]   2> 		at org.eclipse.jetty.util.thread.QueuedThreadPool.runJob(QueuedThreadPool.java:608)
[junit4:junit4]   2> 		at org.eclipse.jetty.util.thread.QueuedThreadPool$3.run(QueuedThreadPool.java:543)
[junit4:junit4]   2> 		at java.lang.Thread.run(Thread.java:722)
[junit4:junit4]   2> 	
[junit4:junit4]   2> 	"qtp2087031116-251 Acceptor0 SelectChannelConnector@127.0.0.1:56580" ID=251 RUNNABLE (in native code)
[junit4:junit4]   2> 		at sun.nio.ch.ServerSocketChannelImpl.accept0(Native Method)
[junit4:junit4]   2> 		at sun.nio.ch.ServerSocketChannelImpl.accept(ServerSocketChannelImpl.java:226)
[junit4:junit4]   2> 		- locked java.lang.Object@27080173
[junit4:junit4]   2> 		at org.eclipse.jetty.server.nio.SelectChannelConnector.accept(SelectChannelConnector.java:109)
[junit4:junit4]   2> 		at org.eclipse.jetty.server.AbstractConnector$Acceptor.run(AbstractConnector.java:938)
[junit4:junit4]   2> 		at org.eclipse.jetty.util.thread.QueuedThreadPool.runJob(QueuedThreadPool.java:608)
[junit4:junit4]   2> 		at org.eclipse.jetty.util.thread.QueuedThreadPool$3.run(QueuedThreadPool.java:543)
[junit4:junit4]   2> 		at java.lang.Thread.run(Thread.java:722)
[junit4:junit4]   2> 	
[junit4:junit4]   2> 	"qtp2087031116-250 Selector1" ID=250 RUNNABLE (in native code)
[junit4:junit4]   2> 		at sun.nio.ch.EPollArrayWrapper.epollWait(Native Method)
[junit4:junit4]   2> 		at sun.nio.ch.EPollArrayWrapper.poll(EPollArrayWrapper.java:228)
[junit4:junit4]   2> 		at sun.nio.ch.EPollSelectorImpl.doSelect(EPollSelectorImpl.java:81)
[junit4:junit4]   2> 		at sun.nio.ch.SelectorImpl.lockAndDoSelect(SelectorImpl.java:86)
[junit4:junit4]   2> 		- locked sun.nio.ch.Util$2@7a21becc
[junit4:junit4]   2> 		- locked java.util.Collections$UnmodifiableSet@6d97768d
[junit4:junit4]   2> 		- locked sun.nio.ch.EPollSelectorImpl@74bae73f
[junit4:junit4]   2> 		at sun.nio.ch.SelectorImpl.select(SelectorImpl.java:97)
[junit4:junit4]   2> 		at org.eclipse.jetty.io.nio.SelectorManager$SelectSet.doSelect(SelectorManager.java:569)
[junit4:junit4]   2> 		at org.eclipse.jetty.io.nio.SelectorManager$1.run(SelectorManager.java:290)
[junit4:junit4]   2> 		at org.eclipse.jetty.util.thread.QueuedThreadPool.runJob(QueuedThreadPool.java:608)
[junit4:junit4]   2> 		at org.eclipse.jetty.util.thread.QueuedThreadPool$3.run(QueuedThreadPool.java:543)
[junit4:junit4]   2> 		at java.lang.Thread.run(Thread.java:722)
[junit4:junit4]   2> 	
[junit4:junit4]   2> 	"qtp2087031116-249 Selector0" ID=249 RUNNABLE (in native code)
[junit4:junit4]   2> 		at sun.nio.ch.EPollArrayWrapper.epollWait(Native Method)
[junit4:junit4]   2> 		at sun.nio.ch.EPollArrayWrapper.poll(EPollArrayWrapper.java:228)
[junit4:junit4]   2> 		at sun.nio.ch.EPollSelectorImpl.doSelect(EPollSelectorImpl.java:81)
[junit4:junit4]   2> 		at sun.nio.ch.SelectorImpl.lockAndDoSelect(SelectorImpl.java:86)
[junit4:junit4]   2> 		- locked sun.nio.ch.Util$2@a5cb372
[junit4:junit4]   2> 		- locked java.util.Collections$UnmodifiableSet@6495b081
[junit4:junit4]   2> 		- locked sun.nio.ch.EPollSelectorImpl@43f97215
[junit4:junit4]   2> 		at sun.nio.ch.SelectorImpl.select(SelectorImpl.java:97)
[junit4:junit4]   2> 		at org.eclipse.jetty.io.nio.SelectorManager$SelectSet.doSelect(SelectorManager.java:569)
[junit4:junit4]   2> 		at org.eclipse.jetty.io.nio.SelectorManager$1.run(SelectorManager.java:290)
[junit4:junit4]   2> 		at org.eclipse.jetty.util.thread.QueuedThreadPool.runJob(QueuedThreadPool.java:608)
[junit4:junit4]   2> 		at org.eclipse.jetty.util.thread.QueuedThreadPool$3.run(QueuedThreadPool.java:543)
[junit4:junit4]   2> 		at java.lang.Thread.run(Thread.java:722)
[junit4:junit4]   2> 	
[junit4:junit4]   2> 	"HashSessionScavenger-14" ID=248 TIMED_WAITING on java.util.TaskQueue@2db0e390
[junit4:junit4]   2> 		at java.lang.Object.wait(Native Method)
[junit4:junit4]   2> 		- timed waiting on java.util.TaskQueue@2db0e390
[junit4:junit4]   2> 		at java.util.TimerThread.mainLoop(Timer.java:552)
[junit4:junit4]   2> 		at java.util.TimerThread.run(Timer.java:505)
[junit4:junit4]   2> 	
[junit4:junit4]   2> 	"TEST-BasicHttpSolrServerTest.testConnectionRefused-seed#[25BDD92298B3E87F]" ID=247 RUNNABLE (in native code)
[junit4:junit4]   2> 		at java.net.SocketInputStream.socketRead0(Native Method)
[junit4:junit4]   2> 		at java.net.SocketInputStream.read(SocketInputStream.java:150)
[junit4:junit4]   2> 		at java.net.SocketInputStream.read(SocketInputStream.java:121)
[junit4:junit4]   2> 		at org.apache.http.impl.io.AbstractSessionInputBuffer.fillBuffer(AbstractSessionInputBuffer.java:149)
[junit4:junit4]   2> 		at org.apache.http.impl.io.SocketInputBuffer.fillBuffer(SocketInputBuffer.java:111)
[junit4:junit4]   2> 		at org.apache.http.impl.io.AbstractSessionInputBuffer.readLine(AbstractSessionInputBuffer.java:264)
[junit4:junit4]   2> 		at org.apache.http.impl.conn.DefaultResponseParser.parseHead(DefaultResponseParser.java:98)
[junit4:junit4]   2> 		at org.apache.http.impl.io.AbstractMessageParser.parse(AbstractMessageParser.java:252)
[junit4:junit4]   2> 		at org.apache.http.impl.AbstractHttpClientConnection.receiveResponseHeader(AbstractHttpClientConnection.java:282)
[junit4:junit4]   2> 		at org.apache.http.impl.conn.DefaultClientConnection.receiveResponseHeader(DefaultClientConnection.java:247)
[junit4:junit4]   2> 		at org.apache.http.impl.conn.AbstractClientConnAdapter.receiveResponseHeader(AbstractClientConnAdapter.java:216)
[junit4:junit4]   2> 		at org.apache.http.protocol.HttpRequestExecutor.doReceiveResponse(HttpRequestExecutor.java:298)
[junit4:junit4]   2> 		at org.apache.http.protocol.HttpRequestExecutor.execute(HttpRequestExecutor.java:125)
[junit4:junit4]   2> 		at org.apache.http.impl.client.DefaultRequestDirector.tryExecute(DefaultRequestDirector.java:647)
[junit4:junit4]   2> 		at org.apache.http.impl.client.DefaultRequestDirector.execute(DefaultRequestDirector.java:464)
[junit4:junit4]   2> 		at org.apache.http.impl.client.AbstractHttpClient.execute(AbstractHttpClient.java:820)
[junit4:junit4]   2> 		at org.apache.http.impl.client.AbstractHttpClient.execute(AbstractHttpClient.java:754)
[junit4:junit4]   2> 		at org.apache.http.impl.client.AbstractHttpClient.execute(AbstractHttpClient.java:732)
[junit4:junit4]   2> 		at org.apache.solr.client.solrj.impl.HttpSolrServer.request(HttpSolrServer.java:352)
[junit4:junit4]   2> 		at org.apache.solr.client.solrj.impl.HttpSolrServer.request(HttpSolrServer.java:181)
[junit4:junit4]   2> 		at org.apache.solr.client.solrj.request.QueryRequest.process(QueryRequest.java:90)
[junit4:junit4]   2> 		at org.apache.solr.client.solrj.SolrServer.query(SolrServer.java:301)
[junit4:junit4]   2> 		at org.apache.solr.client.solrj.impl.BasicHttpSolrServerTest.testConnectionRefused(BasicHttpSolrServerTest.java:135)
[junit4:junit4]   2> 		at sun.reflect.NativeMethodAccessorImpl.invoke0(Native Method)
[junit4:junit4]   2> 		at sun.reflect.NativeMethodAccessorImpl.invoke(NativeMethodAccessorImpl.java:57)
[junit4:junit4]   2> 		at sun.reflect.DelegatingMethodAccessorImpl.invoke(DelegatingMethodAccessorImpl.java:43)
[junit4:junit4]   2> 		at java.lang.reflect.Method.invoke(Method.java:474)
[junit4:junit4]   2> 		at com.carrotsearch.randomizedtesting.RandomizedRunner.invoke(RandomizedRunner.java:1559)
[junit4:junit4]   2> 		at com.carrotsearch.randomizedtesting.RandomizedRunner.access$600(RandomizedRunner.java:79)
[junit4:junit4]   2> 		at com.carrotsearch.randomizedtesting.RandomizedRunner$6.evaluate(RandomizedRunner.java:737)
[junit4:junit4]   2> 		at com.carrotsearch.randomizedtesting.RandomizedRunner$7.evaluate(RandomizedRunner.java:773)
[junit4:junit4]   2> 		at com.carrotsearch.randomizedtesting.RandomizedRunner$8.evaluate(RandomizedRunner.java:787)
[junit4:junit4]   2> 		at com.carrotsearch.randomizedtesting.rules.SystemPropertiesRestoreRule$1.evaluate(SystemPropertiesRestoreRule.java:53)
[junit4:junit4]   2> 		at org.apache.lucene.util.TestRuleSetupTeardownChained$1.evaluate(TestRuleSetupTeardownChained.java:50)
[junit4:junit4]   2> 		at org.apache.lucene.util.TestRuleFieldCacheSanity$1.evaluate(TestRuleFieldCacheSanity.java:51)
[junit4:junit4]   2> 		at org.apache.lucene.util.AbstractBeforeAfterRule$1.evaluate(AbstractBeforeAfterRule.java:46)
[junit4:junit4]   2> 		at com.carrotsearch.randomizedtesting.rules.SystemPropertiesInvariantRule$1.evaluate(SystemPropertiesInvariantRule.java:55)
[junit4:junit4]   2> 		at org.apache.lucene.util.TestRuleThreadAndTestName$1.evaluate(TestRuleThreadAndTestName.java:49)
[junit4:junit4]   2> 		at org.apache.lucene.util.TestRuleIgnoreAfterMaxFailures$1.evaluate(TestRuleIgnoreAfterMaxFailures.java:70)
[junit4:junit4]   2> 		at org.apache.lucene.util.TestRuleMarkFailure$1.evaluate(TestRuleMarkFailure.java:48)
[junit4:junit4]   2> 		at com.carrotsearch.randomizedtesting.rules.StatementAdapter.evaluate(StatementAdapter.java:36)
[junit4:junit4]   2> 		at com.carrotsearch.randomizedtesting.ThreadLeakControl$StatementRunner.run(ThreadLeakControl.java:358)
[junit4:junit4]   2> 		at com.carrotsearch.randomizedtesting.ThreadLeakControl.forkTimeoutingTask(ThreadLeakControl.java:782)
[junit4:junit4]   2> 		at com.carrotsearch.randomizedtesting.ThreadLeakControl$3.evaluate(ThreadLeakControl.java:442)
[junit4:junit4]   2> 		at com.carrotsearch.randomizedtesting.RandomizedRunner.runSingleTest(RandomizedRunner.java:746)
[junit4:junit4]   2> 		at com.carrotsearch.randomizedtesting.RandomizedRunner$3.evaluate(RandomizedRunner.java:648)
[junit4:junit4]   2> 		at com.carrotsearch.randomizedtesting.RandomizedRunner$4.evaluate(RandomizedRunner.java:682)
[junit4:junit4]   2> 		at com.carrotsearch.randomizedtesting.RandomizedRunner$5.evaluate(RandomizedRunner.java:693)
[junit4:junit4]   2> 		at com.carrotsearch.randomizedtesting.rules.StatementAdapter.evaluate(StatementAdapter.java:36)
[junit4:junit4]   2> 		at com.carrotsearch.randomizedtesting.rules.SystemPropertiesRestoreRule$1.evaluate(SystemPropertiesRestoreRule.java:53)
[junit4:junit4]   2> 		at org.apache.lucene.util.AbstractBeforeAfterRule$1.evaluate(AbstractBeforeAfterRule.java:46)
[junit4:junit4]   2> 		at org.apache.lucene.util.TestRuleStoreClassName$1.evaluate(TestRuleStoreClassName.java:42)
[junit4:junit4]   2> 		at com.carrotsearch.randomizedtesting.rules.SystemPropertiesInvariantRule$1.evaluate(SystemPropertiesInvariantRule.java:55)
[junit4:junit4]   2> 		at com.carrotsearch.randomizedtesting.rules.NoShadowingOrOverridesOnMethodsRule$1.evaluate(NoShadowingOrOverridesOnMethodsRule.java:39)
[junit4:junit4]   2> 		at com.carrotsearch.randomizedtesting.rules.NoShadowingOrOverridesOnMethodsRule$1.evaluate(NoShadowingOrOverridesOnMethodsRule.java:39)
[junit4:junit4]   2> 		at com.carrotsearch.randomizedtesting.rules.StatementAdapter.evaluate(StatementAdapter.java:36)
[junit4:junit4]   2> 		at org.apache.lucene.util.TestRuleAssertionsRequired$1.evaluate(TestRuleAssertionsRequired.java:43)
[junit4:junit4]   2> 		at org.apache.lucene.util.TestRuleMarkFailure$1.evaluate(TestRuleMarkFailure.java:48)
[junit4:junit4]   2> 		at org.apache.lucene.util.TestRuleIgnoreAfterMaxFailures$1.evaluate(TestRuleIgnoreAfterMaxFailures.java:70)
[junit4:junit4]   2> 		at org.apache.lucene.util.TestRuleIgnoreTestSuites$1.evaluate(TestRuleIgnoreTestSuites.java:55)
[junit4:junit4]   2> 		at com.carrotsearch.randomizedtesting.rules.StatementAdapter.evaluate(StatementAdapter.java:36)
[junit4:junit4]   2> 		at com.carrotsearch.randomizedtesting.ThreadLeakControl$StatementRunner.run(ThreadLeakControl.java:358)
[junit4:junit4]   2> 		at java.lang.Thread.run(Thread.java:722)
[junit4:junit4]   2> 	
[junit4:junit4]   2> 	"SUITE-BasicHttpSolrServerTest-seed#[25BDD92298B3E87F]" ID=246 RUNNABLE
[junit4:junit4]   2> 		at sun.management.ThreadImpl.dumpThreads0(Native Method)
[junit4:junit4]   2> 		at sun.management.ThreadImpl.dumpAllThreads(ThreadImpl.java:446)
[junit4:junit4]   2> 		at com.carrotsearch.randomizedtesting.ThreadLeakControl.formatThreadStacksFull(ThreadLeakControl.java:655)
[junit4:junit4]   2> 		at com.carrotsearch.randomizedtesting.ThreadLeakControl.access$800(ThreadLeakControl.java:60)
[junit4:junit4]   2> 		at com.carrotsearch.randomizedtesting.ThreadLeakControl$2.evaluate(ThreadLeakControl.java:396)
[junit4:junit4]   2> 		- locked java.lang.Object@382c1a5f
[junit4:junit4]   2> 		at com.carrotsearch.randomizedtesting.RandomizedRunner.runSuite(RandomizedRunner.java:556)
[junit4:junit4]   2> 		at com.carrotsearch.randomizedtesting.RandomizedRunner.access$200(RandomizedRunner.java:79)
[junit4:junit4]   2> 		at com.carrotsearch.randomizedtesting.RandomizedRunner$1.run(RandomizedRunner.java:492)
[junit4:junit4]   2> 	
[junit4:junit4]   2> 	"aliveCheckExecutor-1-thread-1" ID=114 TIMED_WAITING on java.util.concurrent.locks.AbstractQueuedSynchronizer$ConditionObject@57776fc8
[junit4:junit4]   2> 		at sun.misc.Unsafe.park(Native Method)
[junit4:junit4]   2> 		- timed waiting on java.util.concurrent.locks.AbstractQueuedSynchronizer$ConditionObject@57776fc8
[junit4:junit4]   2> 		at java.util.concurrent.locks.LockSupport.parkNanos(LockSupport.java:226)
[junit4:junit4]   2> 		at java.util.concurrent.locks.AbstractQueuedSynchronizer$ConditionObject.awaitNanos(AbstractQueuedSynchronizer.java:2077)
[junit4:junit4]   2> 		at java.util.concurrent.ScheduledThreadPoolExecutor$DelayedWorkQueue.take(ScheduledThreadPoolExecutor.java:1090)
[junit4:junit4]   2> 		at java.util.concurrent.ScheduledThreadPoolExecutor$DelayedWorkQueue.take(ScheduledThreadPoolExecutor.java:807)
[junit4:junit4]   2> 		at java.util.concurrent.ThreadPoolExecutor.getTask(ThreadPoolExecutor.java:1045)
[junit4:junit4]   2> 		at java.util.concurrent.ThreadPoolExecutor.runWorker(ThreadPoolExecutor.java:1103)
[junit4:junit4]   2> 		at java.util.concurrent.ThreadPoolExecutor$Worker.run(ThreadPoolExecutor.java:603)
[junit4:junit4]   2> 		at java.lang.Thread.run(Thread.java:722)
[junit4:junit4]   2> 	
[junit4:junit4]   2> 	"metrics-meter-tick-thread-2" ID=26 TIMED_WAITING on java.util.concurrent.locks.AbstractQueuedSynchronizer$ConditionObject@624be054
[junit4:junit4]   2> 		at sun.misc.Unsafe.park(Native Method)
[junit4:junit4]   2> 		- timed waiting on java.util.concurrent.locks.AbstractQueuedSynchronizer$ConditionObject@624be054
[junit4:junit4]   2> 		at java.util.concurrent.locks.LockSupport.parkNanos(LockSupport.java:226)
[junit4:junit4]   2> 		at java.util.concurrent.locks.AbstractQueuedSynchronizer$ConditionObject.awaitNanos(AbstractQueuedSynchronizer.java:2077)
[junit4:junit4]   2> 		at java.util.concurrent.ScheduledThreadPoolExecutor$DelayedWorkQueue.take(ScheduledThreadPoolExecutor.java:1090)
[junit4:junit4]   2> 		at java.util.concurrent.ScheduledThreadPoolExecutor$DelayedWorkQueue.take(ScheduledThreadPoolExecutor.java:807)
[junit4:junit4]   2> 		at java.util.concurrent.ThreadPoolExecutor.getTask(ThreadPoolExecutor.java:1045)
[junit4:junit4]   2> 		at java.util.concurrent.ThreadPoolExecutor.runWorker(ThreadPoolExecutor.java:1103)
[junit4:junit4]   2> 		at java.util.concurrent.ThreadPoolExecutor$Worker.run(ThreadPoolExecutor.java:603)
[junit4:junit4]   2> 		at java.lang.Thread.run(Thread.java:722)
[junit4:junit4]   2> 	
[junit4:junit4]   2> 	"metrics-meter-tick-thread-1" ID=25 WAITING on java.util.concurrent.locks.AbstractQueuedSynchronizer$ConditionObject@624be054
[junit4:junit4]   2> 		at sun.misc.Unsafe.park(Native Method)
[junit4:junit4]   2> 		- waiting on java.util.concurrent.locks.AbstractQueuedSynchronizer$ConditionObject@624be054
[junit4:junit4]   2> 		at java.util.concurrent.locks.LockSupport.park(LockSupport.java:186)
[junit4:junit4]   2> 		at java.util.concurrent.locks.AbstractQueuedSynchronizer$ConditionObject.await(AbstractQueuedSynchronizer.java:2038)
[junit4:junit4]   2> 		at java.util.concurrent.ScheduledThreadPoolExecutor$DelayedWorkQueue.take(ScheduledThreadPoolExecutor.java:1085)
[junit4:junit4]   2> 		at java.util.concurrent.ScheduledThreadPoolExecutor$DelayedWorkQueue.take(ScheduledThreadPoolExecutor.java:807)
[junit4:junit4]   2> 		at java.util.concurrent.ThreadPoolExecutor.getTask(ThreadPoolExecutor.java:1045)
[junit4:junit4]   2> 		at java.util.concurrent.ThreadPoolExecutor.runWorker(ThreadPoolExecutor.java:1103)
[junit4:junit4]   2> 		at java.util.concurrent.ThreadPoolExecutor$Worker.run(ThreadPoolExecutor.java:603)
[junit4:junit4]   2> 		at java.lang.Thread.run(Thread.java:722)
[junit4:junit4]   2> 	
[junit4:junit4]   2> 	"Signal Dispatcher" ID=5 RUNNABLE
[junit4:junit4]   2> 	
[junit4:junit4]   2> 	"Finalizer" ID=3 WAITING on java.lang.ref.ReferenceQueue$Lock@6374dd36
[junit4:junit4]   2> 		at java.lang.Object.wait(Native Method)
[junit4:junit4]   2> 		- waiting on java.lang.ref.ReferenceQueue$Lock@6374dd36
[junit4:junit4]   2> 		at java.lang.ref.ReferenceQueue.remove(ReferenceQueue.java:135)
[junit4:junit4]   2> 		at java.lang.ref.ReferenceQueue.remove(ReferenceQueue.java:151)
[junit4:junit4]   2> 		at java.lang.ref.Finalizer$FinalizerThread.run(Finalizer.java:177)
[junit4:junit4]   2> 	
[junit4:junit4]   2> 	"Reference Handler" ID=2 WAITING on java.lang.ref.Reference$Lock@d67373d
[junit4:junit4]   2> 		at java.lang.Object.wait(Native Method)
[junit4:junit4]   2> 		- waiting on java.lang.ref.Reference$Lock@d67373d
[junit4:junit4]   2> 		at java.lang.Object.wait(Object.java:502)
[junit4:junit4]   2> 		at java.lang.ref.Reference$ReferenceHandler.run(Reference.java:142)
[junit4:junit4]   2> 	
[junit4:junit4]   2> 	"main" ID=1 WAITING on com.carrotsearch.randomizedtesting.RandomizedRunner$1@4a23aa9c
[junit4:junit4]   2> 		at java.lang.Object.wait(Native Method)
[junit4:junit4]   2> 		- waiting on com.carrotsearch.randomizedtesting.RandomizedRunner$1@4a23aa9c
[junit4:junit4]   2> 		at java.lang.Thread.join(Thread.java:1261)
[junit4:junit4]   2> 		at java.lang.Thread.join(Thread.java:1335)
[junit4:junit4]   2> 		at com.carrotsearch.randomizedtesting.RandomizedRunner.runSuite(RandomizedRunner.java:502)
[junit4:junit4]   2> 		at com.carrotsearch.randomizedtesting.RandomizedRunner.run(RandomizedRunner.java:399)
[junit4:junit4]   2> 		at com.carrotsearch.ant.tasks.junit4.slave.SlaveMain.execute(SlaveMain.java:161)
[junit4:junit4]   2> 		at com.carrotsearch.ant.tasks.junit4.slave.SlaveMain.main(SlaveMain.java:255)
[junit4:junit4]   2> 		at com.carrotsearch.ant.tasks.junit4.slave.SlaveMainSafe.main(SlaveMainSafe.java:12)
[junit4:junit4]   2> 	
[junit4:junit4]   2> 	^^==============================================
[junit4:junit4]   2> 	
[junit4:junit4]   2> NOTE: reproduce with: ant test  -Dtestcase=BasicHttpSolrServerTest -Dtests.method=testConnectionRefused -Dtests.seed=25BDD92298B3E87F -Dtests.multiplier=3 -Dtests.slow=true -Dtests.locale=en -Dtests.timezone=Asia/Bishkek -Dtests.file.encoding=US-ASCII
[junit4:junit4] ERROR   7197s J0 | BasicHttpSolrServerTest.testConnectionRefused <<<
[junit4:junit4]    > Throwable #1: java.lang.Exception: Test abandoned because suite timeout was reached.
[junit4:junit4]    > 	at __randomizedtesting.SeedInfo.seed([25BDD92298B3E87F]:0)
[junit4:junit4]   2> 7200086 T246 ccr.ThreadLeakControl.checkThreadLeaks WARNING Will linger awaiting termination of 11 leaked thread(s).
[junit4:junit4]   2> 7220122 T246 ccr.ThreadLeakControl.checkThreadLeaks SEVERE 11 threads leaked from SUITE scope at org.apache.solr.client.solrj.impl.BasicHttpSolrServerTest: 
[junit4:junit4]   2> 	   1) Thread[id=253, name=qtp2087031116-253, state=TIMED_WAITING, group=TGRP-BasicHttpSolrServerTest]
[junit4:junit4]   2> 	        at sun.misc.Unsafe.park(Native Method)
[junit4:junit4]   2> 	        at java.util.concurrent.locks.LockSupport.parkNanos(LockSupport.java:226)
[junit4:junit4]   2> 	        at java.util.concurrent.locks.AbstractQueuedSynchronizer$ConditionObject.awaitNanos(AbstractQueuedSynchronizer.java:2077)
[junit4:junit4]   2> 	        at org.eclipse.jetty.util.BlockingArrayQueue.poll(BlockingArrayQueue.java:342)
[junit4:junit4]   2> 	        at org.eclipse.jetty.util.thread.QueuedThreadPool.idleJobPoll(QueuedThreadPool.java:526)
[junit4:junit4]   2> 	        at org.eclipse.jetty.util.thread.QueuedThreadPool.access$600(QueuedThreadPool.java:44)
[junit4:junit4]   2> 	        at org.eclipse.jetty.util.thread.QueuedThreadPool$3.run(QueuedThreadPool.java:572)
[junit4:junit4]   2> 	        at java.lang.Thread.run(Thread.java:722)
[junit4:junit4]   2> 	   2) Thread[id=256, name=qtp2087031116-256, state=TIMED_WAITING, group=TGRP-BasicHttpSolrServerTest]
[junit4:junit4]   2> 	        at sun.misc.Unsafe.park(Native Method)
[junit4:junit4]   2> 	        at java.util.concurrent.locks.LockSupport.parkNanos(LockSupport.java:226)
[junit4:junit4]   2> 	        at java.util.concurrent.locks.AbstractQueuedSynchronizer$ConditionObject.awaitNanos(AbstractQueuedSynchronizer.java:2077)
[junit4:junit4]   2> 	        at org.eclipse.jetty.util.BlockingArrayQueue.poll(BlockingArrayQueue.java:342)
[junit4:junit4]   2> 	        at org.eclipse.jetty.util.thread.QueuedThreadPool.idleJobPoll(QueuedThreadPool.java:526)
[junit4:junit4]   2> 	        at org.eclipse.jetty.util.thread.QueuedThreadPool.access$600(QueuedThreadPool.java:44)
[junit4:junit4]   2> 	        at org.eclipse.jetty.util.thread.QueuedThreadPool$3.run(QueuedThreadPool.java:572)
[junit4:junit4]   2> 	        at java.lang.Thread.run(Thread.java:722)
[junit4:junit4]   2> 	   3) Thread[id=254, name=qtp2087031116-254, state=TIMED_WAITING, group=TGRP-BasicHttpSolrServerTest]
[junit4:junit4]   2> 	        at sun.misc.Unsafe.park(Native Method)
[junit4:junit4]   2> 	        at java.util.concurrent.locks.LockSupport.parkNanos(LockSupport.java:226)
[junit4:junit4]   2> 	        at java.util.concurrent.locks.AbstractQueuedSynchronizer$ConditionObject.awaitNanos(AbstractQueuedSynchronizer.java:2077)
[junit4:junit4]   2> 	        at org.eclipse.jetty.util.BlockingArrayQueue.poll(BlockingArrayQueue.java:342)
[junit4:junit4]   2> 	        at org.eclipse.jetty.util.thread.QueuedThreadPool.idleJobPoll(QueuedThreadPool.java:526)
[junit4:junit4]   2> 	        at org.eclipse.jetty.util.thread.QueuedThreadPool.access$600(QueuedThreadPool.java:44)
[junit4:junit4]   2> 	        at org.eclipse.jetty.util.thread.QueuedThreadPool$3.run(QueuedThreadPool.java:572)
[junit4:junit4]   2> 	        at java.lang.Thread.run(Thread.java:722)
[junit4:junit4]   2> 	   4) Thread[id=250, name=qtp2087031116-250 Selector1, state=RUNNABLE, group=TGRP-BasicHttpSolrServerTest]
[junit4:junit4]   2> 	        at sun.nio.ch.EPollArrayWrapper.epollWait(Native Method)
[junit4:junit4]   2> 	        at sun.nio.ch.EPollArrayWrapper.poll(EPollArrayWrapper.java:228)
[junit4:junit4]   2> 	        at sun.nio.ch.EPollSelectorImpl.doSelect(EPollSelectorImpl.java:81)
[junit4:junit4]   2> 	        at sun.nio.ch.SelectorImpl.lockAndDoSelect(SelectorImpl.java:86)
[junit4:junit4]   2> 	        at sun.nio.ch.SelectorImpl.select(SelectorImpl.java:97)
[junit4:junit4]   2> 	        at org.eclipse.jetty.io.nio.SelectorManager$SelectSet.doSelect(SelectorManager.java:569)
[junit4:junit4]   2> 	        at org.eclipse.jetty.io.nio.SelectorManager$1.run(SelectorManager.java:290)
[junit4:junit4]   2> 	        at org.eclipse.jetty.util.thread.QueuedThreadPool.runJob(QueuedThreadPool.java:608)
[junit4:junit4]   2> 	        at org.eclipse.jetty.util.thread.QueuedThreadPool$3.run(QueuedThreadPool.java:543)
[junit4:junit4]   2> 	        at java.lang.Thread.run(Thread.java:722)
[junit4:junit4]   2> 	   5) Thread[id=251, name=qtp2087031116-251 Acceptor0 SelectChannelConnector@127.0.0.1:56580, state=RUNNABLE, group=TGRP-BasicHttpSolrServerTest]
[junit4:junit4]   2> 	        at sun.nio.ch.ServerSocketChannelImpl.accept0(Native Method)
[junit4:junit4]   2> 	        at sun.nio.ch.ServerSocketChannelImpl.accept(ServerSocketChannelImpl.java:226)
[junit4:junit4]   2> 	        at org.eclipse.jetty.server.nio.SelectChannelConnector.accept(SelectChannelConnector.java:109)
[junit4:junit4]   2> 	        at org.eclipse.jetty.server.AbstractConnector$Acceptor.run(AbstractConnector.java:938)
[junit4:junit4]   2> 	        at org.eclipse.jetty.util.thread.QueuedThreadPool.runJob(QueuedThreadPool.java:608)
[junit4:junit4]   2> 	        at org.eclipse.jetty.util.thread.QueuedThreadPool$3.run(QueuedThreadPool.java:543)
[junit4:junit4]   2> 	        at java.lang.Thread.run(Thread.java:722)
[junit4:junit4]   2> 	   6) Thread[id=252, name=qtp2087031116-252 Acceptor1 SelectChannelConnector@127.0.0.1:56580, state=BLOCKED, group=TGRP-BasicHttpSolrServerTest]
[junit4:junit4]   2> 	        at sun.nio.ch.ServerSocketChannelImpl.accept(ServerSocketChannelImpl.java:210)
[junit4:junit4]   2> 	        at org.eclipse.jetty.server.nio.SelectChannelConnector.accept(SelectChannelConnector.java:109)
[junit4:junit4]   2> 	        at org.eclipse.jetty.server.AbstractConnector$Acceptor.run(AbstractConnector.java:938)
[junit4:junit4]   2> 	        at org.eclipse.jetty.util.thread.QueuedThreadPool.runJob(QueuedThreadPool.java:608)
[junit4:junit4]   2> 	        at org.eclipse.jetty.util.thread.QueuedThreadPool$3.run(QueuedThreadPool.java:543)
[junit4:junit4]   2> 	        at java.lang.Thread.run(Thread.java:722)
[junit4:junit4]   2> 	   7) Thread[id=249, name=qtp2087031116-249 Selector0, state=RUNNABLE, group=TGRP-BasicHttpSolrServerTest]
[junit4:junit4]   2> 	        at sun.nio.ch.EPollArrayWrapper.epollWait(Native Method)
[junit4:junit4]   2> 	        at sun.nio.ch.EPollArrayWrapper.poll(EPollArrayWrapper.java:228)
[junit4:junit4]   2> 	        at sun.nio.ch.EPollSelectorImpl.doSelect(EPollSelectorImpl.java:81)
[junit4:junit4]   2> 	        at sun.nio.ch.SelectorImpl.lockAndDoSelect(SelectorImpl.java:86)
[junit4:junit4]   2> 	        at sun.nio.ch.SelectorImpl.select(SelectorImpl.java:97)
[junit4:junit4]   2> 	        at org.eclipse.jetty.io.nio.SelectorManager$SelectSet.doSelect(SelectorManager.java:569)
[junit4:junit4]   2> 	        at org.eclipse.jetty.io.nio.SelectorManager$1.run(SelectorManager.java:290)
[junit4:junit4]   2> 	        at org.eclipse.jetty.util.thread.QueuedThreadPool.runJob(QueuedThreadPool.java:608)
[junit4:junit4]   2> 	        at org.eclipse.jetty.util.thread.QueuedThreadPool$3.run(QueuedThreadPool.java:543)
[junit4:junit4]   2> 	        at java.lang.Thread.run(Thread.java:722)
[junit4:junit4]   2> 	   8) Thread[id=248, name=HashSessionScavenger-14, state=TIMED_WAITING, group=TGRP-BasicHttpSolrServerTest]
[junit4:junit4]   2> 	        at java.lang.Object.wait(Native Method)
[junit4:junit4]   2> 	        at java.util.TimerThread.mainLoop(Timer.java:552)
[junit4:junit4]   2> 	        at java.util.TimerThread.run(Timer.java:505)
[junit4:junit4]   2> 	   9) Thread[id=258, name=searcherExecutor-172-thread-1, state=WAITING, group=TGRP-BasicHttpSolrServerTest]
[junit4:junit4]   2> 	        at sun.misc.Unsafe.park(Native Method)
[junit4:junit4]   2> 	        at java.util.concurrent.locks.LockSupport.park(LockSupport.java:186)
[junit4:junit4]   2> 	        at java.util.concurrent.locks.AbstractQueuedSynchronizer$ConditionObject.await(AbstractQueuedSynchronizer.java:2038)
[junit4:junit4]   2> 	        at java.util.concurrent.LinkedBlockingQueue.take(LinkedBlockingQueue.java:439)
[junit4:junit4]   2> 	        at java.util.concurrent.ThreadPoolExecutor.getTask(ThreadPoolExecutor.java:1045)
[junit4:junit4]   2> 	        at java.util.concurrent.ThreadPoolExecutor.runWorker(ThreadPoolExecutor.java:1103)
[junit4:junit4]   2> 	        at java.util.concurrent.ThreadPoolExecutor$Worker.run(ThreadPoolExecutor.java:603)
[junit4:junit4]   2> 	        at java.lang.Thread.run(Thread.java:722)
[junit4:junit4]   2> 	  10) Thread[id=247, name=TEST-BasicHttpSolrServerTest.testConnectionRefused-seed#[25BDD92298B3E87F], state=RUNNABLE, group=TGRP-BasicHttpSolrServerTest]
[junit4:junit4]   2> 	        at java.net.SocketInputStream.socketRead0(Native Method)
[junit4:junit4]   2> 	        at java.net.SocketInputStream.read(SocketInputStream.java:150)
[junit4:junit4]   2> 	        at java.net.SocketInputStream.read(SocketInputStream.java:121)
[junit4:junit4]   2> 	        at org.apache.http.impl.io.AbstractSessionInputBuffer.fillBuffer(AbstractSessionInputBuffer.java:149)
[junit4:junit4]   2> 	        at org.apache.http.impl.io.SocketInputBuffer.fillBuffer(SocketInputBuffer.java:111)
[junit4:junit4]   2> 	        at org.apache.http.impl.io.AbstractSessionInputBuffer.readLine(AbstractSessionInputBuffer.java:264)
[junit4:junit4]   2> 	        at org.apache.http.impl.conn.DefaultResponseParser.parseHead(DefaultResponseParser.java:98)
[junit4:junit4]   2> 	        at org.apache.http.impl.io.AbstractMessageParser.parse(AbstractMessageParser.java:252)
[junit4:junit4]   2> 	        at org.apache.http.impl.AbstractHttpClientConnection.receiveResponseHeader(AbstractHttpClientConnection.java:282)
[junit4:junit4]   2> 	        at org.apache.http.impl.conn.DefaultClientConnection.receiveResponseHeader(DefaultClientConnection.java:247)
[junit4:junit4]   2> 	        at org.apache.http.impl.conn.AbstractClientConnAdapter.receiveResponseHeader(AbstractClientConnAdapter.java:216)
[junit4:junit4]   2> 	        at org.apache.http.protocol.HttpRequestExecutor.doReceiveResponse(HttpRequestExecutor.java:298)
[junit4:junit4]   2> 	        at org.apache.http.protocol.HttpRequestExecutor.execute(HttpRequestExecutor.java:125)
[junit4:junit4]   2> 	        at org.apache.http.impl.client.DefaultRequestDirector.tryExecute(DefaultRequestDirector.java:647)
[junit4:junit4]   2> 	        at org.apache.http.impl.client.DefaultRequestDirector.execute(DefaultRequestDirector.java:464)
[junit4:junit4]   2> 	        at org.apache.http.impl.client.AbstractHttpClient.execute(AbstractHttpClient.java:820)
[junit4:junit4]   2> 	        at org.apache.http.impl.client.AbstractHttpClient.execute(AbstractHttpClient.java:754)
[junit4:junit4]   2> 	        at org.apache.http.impl.client.AbstractHttpClient.execute(AbstractHttpClient.java:732)
[junit4:junit4]   2> 	        at org.apache.solr.client.solrj.impl.HttpSolrServer.request(HttpSolrServer.java:352)
[junit4:junit4]   2> 	        at org.apache.solr.client.solrj.impl.HttpSolrServer.request(HttpSolrServer.java:181)
[junit4:junit4]   2> 	        at org.apache.solr.client.solrj.request.QueryRequest.process(QueryRequest.java:90)
[junit4:junit4]   2> 	        at org.apache.solr.client.solrj.SolrServer.query(SolrServer.java:301)
[junit4:junit4]   2> 	        at org.apache.solr.client.solrj.impl.BasicHttpSolrServerTest.testConnectionRefused(BasicHttpSolrServerTest.java:135)
[junit4:junit4]   2> 	        at sun.reflect.NativeMethodAccessorImpl.invoke0(Native Method)
[junit4:junit4]   2> 	        at sun.reflect.NativeMethodAccessorImpl.invoke(NativeMethodAccessorImpl.java:57)
[junit4:junit4]   2> 	        at sun.reflect.DelegatingMethodAccessorImpl.invoke(DelegatingMethodAccessorImpl.java:43)
[junit4:junit4]   2> 	        at java.lang.reflect.Method.invoke(Method.java:474)
[junit4:junit4]   2> 	        at com.carrotsearch.randomizedtesting.RandomizedRunner.invoke(RandomizedRunner.java:1559)
[junit4:junit4]   2> 	        at com.carrotsearch.randomizedtesting.RandomizedRunner.access$600(RandomizedRunner.java:79)
[junit4:junit4]   2> 	        at com.carrotsearch.randomizedtesting.RandomizedRunner$6.evaluate(RandomizedRunner.java:737)
[junit4:junit4]   2> 	        at com.carrotsearch.randomizedtesting.RandomizedRunner$7.evaluate(RandomizedRunner.java:773)
[junit4:junit4]   2> 	        at com.carrotsearch.randomizedtesting.RandomizedRunner$8.evaluate(RandomizedRunner.java:787)
[junit4:junit4]   2> 	        at com.carrotsearch.randomizedtesting.rules.SystemPropertiesRestoreRule$1.evaluate(SystemPropertiesRestoreRule.java:53)
[junit4:junit4]   2> 	        at org.apache.lucene.util.TestRuleSetupTeardownChained$1.evaluate(TestRuleSetupTeardownChained.java:50)
[junit4:junit4]   2> 	        at org.apache.lucene.util.TestRuleFieldCacheSanity$1.evaluate(TestRuleFieldCacheSanity.java:51)
[junit4:junit4]   2> 	        at org.apache.lucene.util.AbstractBeforeAfterRule$1.evaluate(AbstractBeforeAfterRule.java:46)
[junit4:junit4]   2> 	        at com.carrotsearch.randomizedtesting.rules.SystemPropertiesInvariantRule$1.evaluate(SystemPropertiesInvariantRule.java:55)
[junit4:junit4]   2> 	        at org.apache.lucene.util.TestRuleThreadAndTestName$1.evaluate(TestRuleThreadAndTestName.java:49)
[junit4:junit4]   2> 	        at org.apache.lucene.util.TestRuleIgnoreAfterMaxFailures$1.evaluate(TestRuleIgnoreAfterMaxFailures.java:70)
[junit4:junit4]   2> 	        at org.apache.lucene.util.TestRuleMarkFailure$1.evaluate(TestRuleMarkFailure.java:48)
[junit4:junit4]   2> 	        at com.carrotsearch.randomizedtesting.rules.StatementAdapter.evaluate(StatementAdapter.java:36)
[junit4:junit4]   2> 	        at com.carrotsearch.randomizedtesting.ThreadLeakControl$StatementRunner.run(ThreadLeakControl.java:358)
[junit4:junit4]   2> 	        at com.carrotsearch.randomizedtesting.ThreadLeakControl.forkTimeoutingTask(ThreadLeakControl.java:782)
[junit4:junit4]   2> 	        at com.carrotsearch.randomizedtesting.ThreadLeakControl$3.evaluate(ThreadLeakControl.java:442)
[junit4:junit4]   2> 	        at com.carrotsearch.randomizedtesting.RandomizedRunner.runSingleTest(RandomizedRunner.java:746)
[junit4:junit4]   2> 	        at com.carrotsearch.randomizedtesting.RandomizedRunner$3.evaluate(RandomizedRunner.java:648)
[junit4:junit4]   2> 	        at com.carrotsearch.randomizedtesting.RandomizedRunner$4.evaluate(RandomizedRunner.java:682)
[junit4:junit4]   2> 	        at com.carrotsearch.randomizedtesting.RandomizedRunner$5.evaluate(RandomizedRunner.java:693)
[junit4:junit4]   2> 	        at com.carrotsearch.randomizedtesting.rules.StatementAdapter.evaluate(StatementAdapter.java:36)
[junit4:junit4]   2> 	        at com.carrotsearch.randomizedtesting.rules.SystemPropertiesRestoreRule$1.evaluate(SystemPropertiesRestoreRule.java:53)
[junit4:junit4]   2> 	        at org.apache.lucene.util.AbstractBeforeAfterRule$1.evaluate(AbstractBeforeAfterRule.java:46)
[junit4:junit4]   2> 	        at org.apache.lucene.util.TestRuleStoreClassName$1.evaluate(TestRuleStoreClassName.java:42)
[junit4:junit4]   2> 	        at com.carrotsearch.randomizedtesting.rules.SystemPropertiesInvariantRule$1.evaluate(SystemPropertiesInvariantRule.java:55)
[junit4:junit4]   2> 	        at com.carrotsearch.randomizedtesting.rules.NoShadowingOrOverridesOnMethodsRule$1.evaluate(NoShadowingOrOverridesOnMethodsRule.java:39)
[junit4:junit4]   2> 	        at com.carrotsearch.randomizedtesting.rules.NoShadowingOrOverridesOnMethodsRule$1.evaluate(NoShadowingOrOverridesOnMethodsRule.java:39)
[junit4:junit4]   2> 	        at com.carrotsearch.randomizedtesting.rules.StatementAdapter.evaluate(StatementAdapter.java:36)
[junit4:junit4]   2> 	        at org.apache.lucene.util.TestRuleAssertionsRequired$1.evaluate(TestRuleAssertionsRequired.java:43)
[junit4:junit4]   2> 	        at org.apache.lucene.util.TestRuleMarkFailure$1.evaluate(TestRuleMarkFailure.java:48)
[junit4:junit4]   2> 	        at org.apache.lucene.util.TestRuleIgnoreAfterMaxFailures$1.evaluate(TestRuleIgnoreAfterMaxFailures.java:70)
[junit4:junit4]   2> 	        at org.apache.lucene.util.TestRuleIgnoreTestSuites$1.evaluate(TestRuleIgnoreTestSuites.java:55)
[junit4:junit4]   2> 	        at com.carrotsearch.randomizedtesting.rules.StatementAdapter.evaluate(StatementAdapter.java:36)
[junit4:junit4]   2> 	        at com.carrotsearch.randomizedtesting.ThreadLeakControl$StatementRunner.run(ThreadLeakControl.java:358)
[junit4:junit4]   2> 	        at java.lang.Thread.run(Thread.java:722)
[junit4:junit4]   2> 	  11) Thread[id=255, name=qtp2087031116-255, state=TIMED_WAITING, group=TGRP-BasicHttpSolrServerTest]
[junit4:junit4]   2> 	        at sun.misc.Unsafe.park(Native Method)
[junit4:junit4]   2> 	        at java.util.concurrent.locks.LockSupport.parkNanos(LockSupport.java:226)
[junit4:junit4]   2> 	        at java.util.concurrent.locks.AbstractQueuedSynchronizer$ConditionObject.awaitNanos(AbstractQueuedSynchronizer.java:2077)
[junit4:junit4]   2> 	        at org.eclipse.jetty.util.BlockingArrayQueue.poll(BlockingArrayQueue.java:342)
[junit4:junit4]   2> 	        at org.eclipse.jetty.util.thread.QueuedThreadPool.idleJobPoll(QueuedThreadPool.java:526)
[junit4:junit4]   2> 	        at org.eclipse.jetty.util.thread.QueuedThreadPool.access$600(QueuedThreadPool.java:44)
[junit4:junit4]   2> 	        at org.eclipse.jetty.util.thread.QueuedThreadPool$3.run(QueuedThreadPool.java:572)
[junit4:junit4]   2> 	        at java.lang.Thread.run(Thread.java:722)
[junit4:junit4]   2> 7220127 T246 ccr.ThreadLeakControl.tryToInterruptAll Starting to interrupt leaked threads:
[junit4:junit4]   2> 	   1) Thread[id=253, name=qtp2087031116-253, state=TIMED_WAITING, group=TGRP-BasicHttpSolrServerTest]
[junit4:junit4]   2> 	   2) Thread[id=256, name=qtp2087031116-256, state=TIMED_WAITING, group=TGRP-BasicHttpSolrServerTest]
[junit4:junit4]   2> 	   3) Thread[id=254, name=qtp2087031116-254, state=TIMED_WAITING, group=TGRP-BasicHttpSolrServerTest]
[junit4:junit4]   2> 	   4) Thread[id=250, name=qtp2087031116-250 Selector1, state=RUNNABLE, group=TGRP-BasicHttpSolrServerTest]
[junit4:junit4]   2> 	   5) Thread[id=251, name=qtp2087031116-251 Acceptor0 SelectChannelConnector@127.0.0.1:56580, state=RUNNABLE, group=TGRP-BasicHttpSolrServerTest]
[junit4:junit4]   2> 	   6) Thread[id=252, name=qtp2087031116-252 Acceptor1 SelectChannelConnector@127.0.0.1:56580, state=BLOCKED, group=TGRP-BasicHttpSolrServerTest]
[junit4:junit4]   2> 	   7) Thread[id=249, name=qtp2087031116-249 Selector0, state=RUNNABLE, group=TGRP-BasicHttpSolrServerTest]
[junit4:junit4]   2> 	   8) Thread[id=248, name=HashSessionScavenger-14, state=TIMED_WAITING, group=TGRP-BasicHttpSolrServerTest]
[junit4:junit4]   2> 	   9) Thread[id=258, name=searcherExecutor-172-thread-1, state=WAITING, group=TGRP-BasicHttpSolrServerTest]
[junit4:junit4]   2> 	  10) Thread[id=247, name=TEST-BasicHttpSolrServerTest.testConnectionRefused-seed#[25BDD92298B3E87F], state=RUNNABLE, group=TGRP-BasicHttpSolrServerTest]
[junit4:junit4]   2> 	  11) Thread[id=255, name=qtp2087031116-255, state=TIMED_WAITING, group=TGRP-BasicHttpSolrServerTest]
[junit4:junit4]   2> 7220412 T250 oejin.SelectorManager$SelectSet.doSelect WARNING Selector org.eclipse.jetty.io.nio.SelectorManager$SelectSet@4fe43ea0 keys=0 selected=0 is too busy, pausing!
[junit4:junit4]   2> 7220436 T249 oejin.SelectorManager$SelectSet.doSelect WARNING Selector org.eclipse.jetty.io.nio.SelectorManager$SelectSet@11cba35a keys=0 selected=0 is too busy, pausing!
[junit4:junit4]   2> 7223169 T246 ccr.ThreadLeakControl.tryToInterruptAll SEVERE There are still zombie threads that couldn't be terminated:
[junit4:junit4]   2> 	   1) Thread[id=258, name=searcherExecutor-172-thread-1, state=WAITING, group=TGRP-BasicHttpSolrServerTest]
[junit4:junit4]   2> 	        at sun.misc.Unsafe.park(Native Method)
[junit4:junit4]   2> 	        at java.util.concurrent.locks.LockSupport.park(LockSupport.java:186)
[junit4:junit4]   2> 	        at java.util.concurrent.locks.AbstractQueuedSynchronizer$ConditionObject.await(AbstractQueuedSynchronizer.java:2038)
[junit4:junit4]   2> 	        at java.util.concurrent.LinkedBlockingQueue.take(LinkedBlockingQueue.java:439)
[junit4:junit4]   2> 	        at java.util.concurrent.ThreadPoolExecutor.getTask(ThreadPoolExecutor.java:1045)
[junit4:junit4]   2> 	        at java.util.concurrent.ThreadPoolExecutor.runWorker(ThreadPoolExecutor.java:1103)
[junit4:junit4]   2> 	        at java.util.concurrent.ThreadPoolExecutor$Worker.run(ThreadPoolExecutor.java:603)
[junit4:junit4]   2> 	        at java.lang.Thread.run(Thread.java:722)
[junit4:junit4]   2> 	   2) Thread[id=247, name=TEST-BasicHttpSolrServerTest.testConnectionRefused-seed#[25BDD92298B3E87F], state=RUNNABLE, group=TGRP-BasicHttpSolrServerTest]
[junit4:junit4]   2> 	        at java.net.SocketInputStream.socketRead0(Native Method)
[junit4:junit4]   2> 	        at java.net.SocketInputStream.read(SocketInputStream.java:150)
[junit4:junit4]   2> 	        at java.net.SocketInputStream.read(SocketInputStream.java:121)
[junit4:junit4]   2> 	        at org.apache.http.impl.io.AbstractSessionInputBuffer.fillBuffer(AbstractSessionInputBuffer.java:149)
[junit4:junit4]   2> 	        at org.apache.http.impl.io.SocketInputBuffer.fillBuffer(SocketInputBuffer.java:111)
[junit4:junit4]   2> 	        at org.apache.http.impl.io.AbstractSessionInputBuffer.readLine(AbstractSessionInputBuffer.java:264)
[junit4:junit4]   2> 	        at org.apache.http.impl.conn.DefaultResponseParser.parseHead(DefaultResponseParser.java:98)
[junit4:junit4]   2> 	        at org.apache.http.impl.io.AbstractMessageParser.parse(AbstractMessageParser.java:252)
[junit4:junit4]   2> 	        at org.apache.http.impl.AbstractHttpClientConnection.receiveResponseHeader(AbstractHttpClientConnection.java:282)
[junit4:junit4]   2> 	        at org.apache.http.impl.conn.DefaultClientConnection.receiveResponseHeader(DefaultClientConnection.java:247)
[junit4:junit4]   2> 	        at org.apache.http.impl.conn.AbstractClientConnAdapter.receiveResponseHeader(AbstractClientConnAdapter.java:216)
[junit4:junit4]   2> 	        at org.apache.http.protocol.HttpRequestExecutor.doReceiveResponse(HttpRequestExecutor.java:298)
[junit4:junit4]   2> 	        at org.apache.http.protocol.HttpRequestExecutor.execute(HttpRequestExecutor.java:125)
[junit4:junit4]   2> 	        at org.apache.http.impl.client.DefaultRequestDirector.tryExecute(DefaultRequestDirector.java:647)
[junit4:junit4]   2> 	        at org.apache.http.impl.client.DefaultRequestDirector.execute(DefaultRequestDirector.java:464)
[junit4:junit4]   2> 	        at org.apache.http.impl.client.AbstractHttpClient.execute(AbstractHttpClient.java:820)
[junit4:junit4]   2> 	        at org.apache.http.impl.client.AbstractHttpClient.execute(AbstractHttpClient.java:754)
[junit4:junit4]   2> 	        at org.apache.http.impl.client.AbstractHttpClient.execute(AbstractHttpClient.java:732)
[junit4:junit4]   2> 	        at org.apache.solr.client.solrj.impl.HttpSolrServer.request(HttpSolrServer.java:352)
[junit4:junit4]   2> 	        at org.apache.solr.client.solrj.impl.HttpSolrServer.request(HttpSolrServer.java:181)
[junit4:junit4]   2> 	        at org.apache.solr.client.solrj.request.QueryRequest.process(QueryRequest.java:90)
[junit4:junit4]   2> 	        at org.apache.solr.client.solrj.SolrServer.query(SolrServer.java:301)
[junit4:junit4]   2> 	        at org.apache.solr.client.solrj.impl.BasicHttpSolrServerTest.testConnectionRefused(BasicHttpSolrServerTest.java:135)
[junit4:junit4]   2> 	        at sun.reflect.NativeMethodAccessorImpl.invoke0(Native Method)
[junit4:junit4]   2> 	        at sun.reflect.NativeMethodAccessorImpl.invoke(NativeMethodAccessorImpl.java:57)
[junit4:junit4]   2> 	        at sun.reflect.DelegatingMethodAccessorImpl.invoke(DelegatingMethodAccessorImpl.java:43)
[junit4:junit4]   2> 	        at java.lang.reflect.Method.invoke(Method.java:474)
[junit4:junit4]   2> 	        at com.carrotsearch.randomizedtesting.RandomizedRunner.invoke(RandomizedRunner.java:1559)
[junit4:junit4]   2> 	        at com.carrotsearch.randomizedtesting.RandomizedRunner.access$600(RandomizedRunner.java:79)
[junit4:junit4]   2> 	        at com.carrotsearch.randomizedtesting.RandomizedRunner$6.evaluate(RandomizedRunner.java:737)
[junit4:junit4]   2> 	        at com.carrotsearch.randomizedtesting.RandomizedRunner$7.evaluate(RandomizedRunner.java:773)
[junit4:junit4]   2> 	        at com.carrotsearch.randomizedtesting.RandomizedRunner$8.evaluate(RandomizedRunner.java:787)
[junit4:junit4]   2> 	        at com.carrotsearch.randomizedtesting.rules.SystemPropertiesRestoreRule$1.evaluate(SystemPropertiesRestoreRule.java:53)
[junit4:junit4]   2> 	        at org.apache.lucene.util.TestRuleSetupTeardownChained$1.evaluate(TestRuleSetupTeardownChained.java:50)
[junit4:junit4]   2> 	        at org.apache.lucene.util.TestRuleFieldCacheSanity$1.evaluate(TestRuleFieldCacheSanity.java:51)
[junit4:junit4]   2> 	        at org.apache.lucene.util.AbstractBeforeAfterRule$1.evaluate(AbstractBeforeAfterRule.java:46)
[junit4:junit4]   2> 	        at com.carrotsearch.randomizedtesting.rules.SystemPropertiesInvariantRule$1.evaluate(SystemPropertiesInvariantRule.java:55)
[junit4:junit4]   2> 	        at org.apache.lucene.util.TestRuleThreadAndTestName$1.evaluate(TestRuleThreadAndTestName.java:49)
[junit4:junit4]   2> 	        at org.apache.lucene.util.TestRuleIgnoreAfterMaxFailures$1.evaluate(TestRuleIgnoreAfterMaxFailures.java:70)
[junit4:junit4]   2> 	        at org.apache.lucene.util.TestRuleMarkFailure$1.evaluate(TestRuleMarkFailure.java:48)
[junit4:junit4]   2> 	        at com.carrotsearch.randomizedtesting.rules.StatementAdapter.evaluate(StatementAdapter.java:36)
[junit4:junit4]   2> 	        at com.carrotsearch.randomizedtesting.ThreadLeakControl$StatementRunner.run(ThreadLeakControl.java:358)
[junit4:junit4]   2> 	        at com.carrotsearch.randomizedtesting.ThreadLeakControl.forkTimeoutingTask(ThreadLeakControl.java:782)
[junit4:junit4]   2> 	        at com.carrotsearch.randomizedtesting.ThreadLeakControl$3.evaluate(ThreadLeakControl.java:442)
[junit4:junit4]   2> 	        at com.carrotsearch.randomizedtesting.RandomizedRunner.runSingleTest(RandomizedRunner.java:746)
[junit4:junit4]   2> 	        at com.carrotsearch.randomizedtesting.RandomizedRunner$3.evaluate(RandomizedRunner.java:648)
[junit4:junit4]   2> 	        at com.carrotsearch.randomizedtesting.RandomizedRunner$4.evaluate(RandomizedRunner.java:682)
[junit4:junit4]   2> 	        at com.carrotsearch.randomizedtesting.RandomizedRunner$5.evaluate(RandomizedRunner.java:693)
[junit4:junit4]   2> 	        at com.carrotsearch.randomizedtesting.rules.StatementAdapter.evaluate(StatementAdapter.java:36)
[junit4:junit4]   2> 	        at com.carrotsearch.randomizedtesting.rules.SystemPropertiesRestoreRule$1.evaluate(SystemPropertiesRestoreRule.java:53)
[junit4:junit4]   2> 	        at org.apache.lucene.util.AbstractBeforeAfterRule$1.evaluate(AbstractBeforeAfterRule.java:46)
[junit4:junit4]   2> 	        at org.apache.lucene.util.TestRuleStoreClassName$1.evaluate(TestRuleStoreClassName.java:42)
[junit4:junit4]   2> 	        at com.carrotsearch.randomizedtesting.rules.SystemPropertiesInvariantRule$1.evaluate(SystemPropertiesInvariantRule.java:55)
[junit4:junit4]   2> 	        at com.carrotsearch.randomizedtesting.rules.NoShadowingOrOverridesOnMethodsRule$1.evaluate(NoShadowingOrOverridesOnMethodsRule.java:39)
[junit4:junit4]   2> 	        at com.carrotsearch.randomizedtesting.rules.NoShadowingOrOverridesOnMethodsRule$1.evaluate(NoShadowingOrOverridesOnMethodsRule.java:39)
[junit4:junit4]   2> 	        at com.carrotsearch.randomizedtesting.rules.StatementAdapter.evaluate(StatementAdapter.java:36)
[junit4:junit4]   2> 	        at org.apache.lucene.util.TestRuleAssertionsRequired$1.evaluate(TestRuleAssertionsRequired.java:43)
[junit4:junit4]   2> 	        at org.apache.lucene.util.TestRuleMarkFailure$1.evaluate(TestRuleMarkFailure.java:48)
[junit4:junit4]   2> 	        at org.apache.lucene.util.TestRuleIgnoreAfterMaxFailures$1.evaluate(TestRuleIgnoreAfterMaxFailures.java:70)
[junit4:junit4]   2> 	        at org.apache.lucene.util.TestRuleIgnoreTestSuites$1.evaluate(TestRuleIgnoreTestSuites.java:55)
[junit4:junit4]   2> 	        at com.carrotsearch.randomizedtesting.rules.StatementAdapter.evaluate(StatementAdapter.java:36)
[junit4:junit4]   2> 	        at com.carrotsearch.randomizedtesting.ThreadLeakControl$StatementRunner.run(ThreadLeakControl.java:358)
[junit4:junit4]   2> 	        at java.lang.Thread.run(Thread.java:722)
[junit4:junit4]   2> 	   3) Thread[id=250, name=qtp2087031116-250 Selector1, state=RUNNABLE, group=TGRP-BasicHttpSolrServerTest]
[junit4:junit4]   2> 	        at sun.nio.ch.EPollArrayWrapper.epollWait(Native Method)
[junit4:junit4]   2> 	        at sun.nio.ch.EPollArrayWrapper.poll(EPollArrayWrapper.java:228)
[junit4:junit4]   2> 	        at sun.nio.ch.EPollSelectorImpl.doSelect(EPollSelectorImpl.java:81)
[junit4:junit4]   2> 	        at sun.nio.ch.SelectorImpl.lockAndDoSelect(SelectorImpl.java:86)
[junit4:junit4]   2> 	        at sun.nio.ch.SelectorImpl.select(SelectorImpl.java:97)
[junit4:junit4]   2> 	        at org.eclipse.jetty.io.nio.SelectorManager$SelectSet.doSelect(SelectorManager.java:569)
[junit4:junit4]   2> 	        at org.eclipse.jetty.io.nio.SelectorManager$1.run(SelectorManager.java:290)
[junit4:junit4]   2> 	        at org.eclipse.jetty.util.thread.QueuedThreadPool.runJob(QueuedThreadPool.java:608)
[junit4:junit4]   2> 	        at org.eclipse.jetty.util.thread.QueuedThreadPool$3.run(QueuedThreadPool.java:543)
[junit4:junit4]   2> 	        at java.lang.Thread.run(Thread.java:722)
[junit4:junit4]   2> 	   4) Thread[id=251, name=qtp2087031116-251 Acceptor0 SelectChannelConnector@127.0.0.1:56580, state=RUNNABLE, group=TGRP-BasicHttpSolrServerTest]
[junit4:junit4]   2> 	        at org.eclipse.jetty.server.nio.SelectChannelConnector.getConnection(SelectChannelConnector.java:160)
[junit4:junit4]   2> 	        at org.eclipse.jetty.server.AbstractConnector$Acceptor.run(AbstractConnector.java:934)
[junit4:junit4]   2> 	        at org.eclipse.jetty.util.thread.QueuedThreadPool.runJob(QueuedThreadPool.java:608)
[junit4:junit4]   2> 	        at org.eclipse.jetty.util.thread.QueuedThreadPool$3.run(QueuedThreadPool.java:543)
[junit4:junit4]   2> 	        at java.lang.Thread.run(Thread.java:722)
[junit4:junit4]   2> 	   5) Thread[id=252, name=qtp2087031116-252 Acceptor1 SelectChannelConnector@127.0.0.1:56580, state=RUNNABLE, group=TGRP-BasicHttpSolrServerTest]
[junit4:junit4]   2> 	        at org.eclipse.jetty.server.nio.SelectChannelConnector.getConnection(SelectChannelConnector.java:160)
[junit4:junit4]   2> 	        at org.eclipse.jetty.server.AbstractConnector$Acceptor.run(AbstractConnector.java:934)
[junit4:junit4]   2> 	        at org.eclipse.jetty.util.thread.QueuedThreadPool.runJob(QueuedThreadPool.java:608)
[junit4:junit4]   2> 	        at org.eclipse.jetty.util.thread.QueuedThreadPool$3.run(QueuedThreadPool.java:543)
[junit4:junit4]   2> 	        at java.lang.Thread.run(Thread.java:722)
[junit4:junit4]   2> 	   6) Thread[id=249, name=qtp2087031116-249 Selector0, state=RUNNABLE, group=TGRP-BasicHttpSolrServerTest]
[junit4:junit4]   2> 	        at sun.nio.ch.EPollArrayWrapper.epollWait(Native Method)
[junit4:junit4]   2> 	        at sun.nio.ch.EPollArrayWrapper.poll(EPollArrayWrapper.java:228)
[junit4:junit4]   2> 	        at sun.nio.ch.EPollSelectorImpl.doSelect(EPollSelectorImpl.java:81)
[junit4:junit4]   2> 	        at sun.nio.ch.SelectorImpl.lockAndDoSelect(SelectorImpl.java:86)
[junit4:junit4]   2> 	        at sun.nio.ch.SelectorImpl.select(SelectorImpl.java:97)
[junit4:junit4]   2> 	        at org.eclipse.jetty.io.nio.SelectorManager$SelectSet.doSelect(SelectorManager.java:569)
[junit4:junit4]   2> 	        at org.eclipse.jetty.io.nio.SelectorManager$1.run(SelectorManager.java:290)
[junit4:junit4]   2> 	        at org.eclipse.jetty.util.thread.QueuedThreadPool.runJob(QueuedThreadPool.java:608)
[junit4:junit4]   2> 	        at org.eclipse.jetty.util.thread.QueuedThreadPool$3.run(QueuedThreadPool.java:543)
[junit4:junit4]   2> 	        at java.lang.Thread.run(Thread.java:722)
[junit4:junit4]   2> 	   7) Thread[id=248, name=HashSessionScavenger-14, state=TIMED_WAITING, group=TGRP-BasicHttpSolrServerTest]
[junit4:junit4]   2> 	        at java.lang.Object.wait(Native Method)
[junit4:junit4]   2> 	        at java.util.TimerThread.mainLoop(Timer.java:552)
[junit4:junit4]   2> 	        at java.util.TimerThread.run(Timer.java:505)
[junit4:junit4]   2> NOTE: test params are: codec=FastCompressingStoredFields(storedFieldsFormat=CompressingStoredFieldsFormat(compressionMode=FAST, chunkSize=376)), sim=RandomSimilarityProvider(queryNorm=false,coord=no): {}, locale=en, timezone=Asia/Bishkek
[junit4:junit4]   2> NOTE: Linux 3.2.0-35-generic amd64/Oracle Corporation 1.8.0-ea (64-bit)/cpus=8,threads=9,free=92679240,total=126418944
[junit4:junit4]   2> NOTE: All tests run in this JVM: [LargeVolumeBinaryJettyTest, TermsResponseTest, SolrDocumentTest, TestEmbeddedSolrServer, TestHash, ClientUtilsTest, SolrExampleEmbeddedTest, TestDocumentObjectBinder, TestCoreAdmin, TestLBHttpSolrServer, SolrQueryTest, DocumentAnalysisResponseTest, SolrExampleXMLTest, MergeIndexesEmbeddedTest, BasicHttpSolrServerTest]
[junit4:junit4]   2> NOTE: reproduce with: ant test  -Dtestcase=BasicHttpSolrServerTest -Dtests.seed=25BDD92298B3E87F -Dtests.multiplier=3 -Dtests.slow=true -Dtests.locale=en -Dtests.timezone=Asia/Bishkek -Dtests.file.encoding=US-ASCII
[junit4:junit4] ERROR   0.00s J0 | BasicHttpSolrServerTest (suite) <<<
[junit4:junit4]    > Throwable #1: java.lang.Exception: Suite timeout exceeded (>= 7200000 msec).
[junit4:junit4]    > 	at __randomizedtesting.SeedInfo.seed([25BDD92298B3E87F]:0)
[junit4:junit4] Completed on J0 in 7223.21s, 9 tests, 2 errors <<< FAILURES!

[...truncated 11 lines...]
BUILD FAILED
/mnt/ssd/jenkins/workspace/Lucene-Solr-trunk-Linux/build.xml:353: The following error occurred while executing this line:
/mnt/ssd/jenkins/workspace/Lucene-Solr-trunk-Linux/build.xml:39: The following error occurred while executing this line:
/mnt/ssd/jenkins/workspace/Lucene-Solr-trunk-Linux/solr/build.xml:185: The following error occurred while executing this line:
/mnt/ssd/jenkins/workspace/Lucene-Solr-trunk-Linux/solr/common-build.xml:438: The following error occurred while executing this line:
/mnt/ssd/jenkins/workspace/Lucene-Solr-trunk-Linux/lucene/common-build.xml:1176: The following error occurred while executing this line:
/mnt/ssd/jenkins/workspace/Lucene-Solr-trunk-Linux/lucene/common-build.xml:841: There were test failures: 45 suites, 253 tests, 1 suite-level error, 1 error

Total time: 147 minutes 29 seconds
Build step 'Invoke Ant' marked build as failure
Archiving artifacts
Recording test results
Description set: Java: 64bit/jdk1.8.0-ea-b65 -XX:+UseConcMarkSweepGC
Email was triggered for: Failure
Sending email for trigger: Failure



Mime
View raw message