lucene-dev mailing list archives

Site index · List index
Message view « Date » · « Thread »
Top « Date » · « Thread »
From Apache Jenkins Server <jenk...@builds.apache.org>
Subject [JENKINS] Lucene-Solr-SmokeRelease-4.3 - Build # 47 - Failure
Date Wed, 03 Jul 2013 08:57:35 GMT
Build: https://builds.apache.org/job/Lucene-Solr-SmokeRelease-4.3/47/

No tests ran.

Build Log:
[...truncated 32712 lines...]
prepare-release-no-sign:
    [mkdir] Created dir: /usr/home/hudson/hudson-slave/workspace/Lucene-Solr-SmokeRelease-4.3/lucene/build/fakeRelease
     [copy] Copying 401 files to /usr/home/hudson/hudson-slave/workspace/Lucene-Solr-SmokeRelease-4.3/lucene/build/fakeRelease/lucene
     [copy] Copying 194 files to /usr/home/hudson/hudson-slave/workspace/Lucene-Solr-SmokeRelease-4.3/lucene/build/fakeRelease/solr
     [exec] JAVA6_HOME is /home/hudson/tools/java/latest1.6
     [exec] JAVA7_HOME is /home/hudson/tools/java/latest1.7
     [exec] NOTE: output encoding is US-ASCII
     [exec] 
     [exec] Load release URL "file:/usr/home/hudson/hudson-slave/workspace/Lucene-Solr-SmokeRelease-4.3/lucene/build/fakeRelease/"...
     [exec] 
     [exec] Test Lucene...
     [exec]   test basics...
     [exec]   get KEYS
     [exec]     0.1 MB
     [exec]   check changes HTML...
     [exec]   download lucene-4.3.1-src.tgz...
     [exec]     26.8 MB
     [exec]     verify md5/sha1 digests
     [exec]   download lucene-4.3.1.tgz...
     [exec]     48.4 MB
     [exec]     verify md5/sha1 digests
     [exec]   download lucene-4.3.1.zip...
     [exec]     58.2 MB
     [exec]     verify md5/sha1 digests
     [exec]   unpack lucene-4.3.1.tgz...
     [exec]     verify JAR/WAR metadata...
     [exec]     test demo with 1.6...
     [exec]       got 5538 hits for query "lucene"
     [exec]     test demo with 1.7...
     [exec]       got 5538 hits for query "lucene"
     [exec]     check Lucene's javadoc JAR
     [exec]   unpack lucene-4.3.1.zip...
     [exec]     verify JAR/WAR metadata...
     [exec]     test demo with 1.6...
     [exec]       got 5538 hits for query "lucene"
     [exec]     test demo with 1.7...
     [exec]       got 5538 hits for query "lucene"
     [exec]     check Lucene's javadoc JAR
     [exec]   unpack lucene-4.3.1-src.tgz...
     [exec]     make sure no JARs/WARs in src dist...
     [exec]     run "ant validate"
     [exec]     run tests w/ Java 6...
     [exec]     test demo with 1.6...
     [exec]       got 224 hits for query "lucene"
     [exec]     generate javadocs w/ Java 6...
     [exec]     run tests w/ Java 7...
     [exec] 
     [exec] command "export JAVA_HOME="/home/hudson/tools/java/latest1.7" PATH="/home/hudson/tools/java/latest1.7/bin:$PATH" JAVACMD="/home/hudson/tools/java/latest1.7/bin/java"; ant clean test" failed:
     [exec] Buildfile: /usr/home/hudson/hudson-slave/workspace/Lucene-Solr-SmokeRelease-4.3/lucene/build/fakeReleaseTmp/unpack/lucene-4.3.1/build.xml
     [exec] 
     [exec] clean:
     [exec]    [delete] Deleting directory /usr/home/hudson/hudson-slave/workspace/Lucene-Solr-SmokeRelease-4.3/lucene/build/fakeReleaseTmp/unpack/lucene-4.3.1/build
     [exec] 
     [exec] -clover.load:
     [exec] 
     [exec] test-core:
     [exec] 
     [exec] -clover.disable:
     [exec] 
     [exec] -clover.load:
     [exec] 
     [exec] -clover.classpath:
     [exec] 
     [exec] -clover.setup:
     [exec] 
     [exec] clover:
     [exec] 
     [exec] ivy-availability-check:
     [exec] 
     [exec] ivy-fail:
     [exec] 
     [exec] ivy-configure:
     [exec] [ivy:configure] :: Apache Ivy 2.3.0 - 20130110142753 :: http://ant.apache.org/ivy/ ::
     [exec] [ivy:configure] :: loading settings :: file = /usr/home/hudson/hudson-slave/workspace/Lucene-Solr-SmokeRelease-4.3/lucene/build/fakeReleaseTmp/unpack/lucene-4.3.1/ivy-settings.xml
     [exec] 
     [exec] resolve:
     [exec] 
     [exec] init:
     [exec] 
     [exec] compile-core:
     [exec]     [mkdir] Created dir: /usr/home/hudson/hudson-slave/workspace/Lucene-Solr-SmokeRelease-4.3/lucene/build/fakeReleaseTmp/unpack/lucene-4.3.1/build/core/classes/java
     [exec]     [javac] Compiling 669 source files to /usr/home/hudson/hudson-slave/workspace/Lucene-Solr-SmokeRelease-4.3/lucene/build/fakeReleaseTmp/unpack/lucene-4.3.1/build/core/classes/java
     [exec]     [javac] Note: Some input files use or override a deprecated API.
     [exec]     [javac] Note: Recompile with -Xlint:deprecation for details.
     [exec]      [copy] Copying 3 files to /usr/home/hudson/hudson-slave/workspace/Lucene-Solr-SmokeRelease-4.3/lucene/build/fakeReleaseTmp/unpack/lucene-4.3.1/build/core/classes/java
     [exec] 
     [exec] compile-test-framework:
     [exec] 
     [exec] ivy-availability-check:
     [exec] 
     [exec] ivy-fail:
     [exec] 
     [exec] ivy-configure:
     [exec] [ivy:configure] :: loading settings :: file = /usr/home/hudson/hudson-slave/workspace/Lucene-Solr-SmokeRelease-4.3/lucene/build/fakeReleaseTmp/unpack/lucene-4.3.1/ivy-settings.xml
     [exec] 
     [exec] resolve:
     [exec] 
     [exec] init:
     [exec] 
     [exec] compile-lucene-core:
     [exec] 
     [exec] ivy-availability-check:
     [exec] 
     [exec] ivy-fail:
     [exec] 
     [exec] ivy-configure:
     [exec] [ivy:configure] :: loading settings :: file = /usr/home/hudson/hudson-slave/workspace/Lucene-Solr-SmokeRelease-4.3/lucene/build/fakeReleaseTmp/unpack/lucene-4.3.1/ivy-settings.xml
     [exec] 
     [exec] resolve:
     [exec] 
     [exec] init:
     [exec] 
     [exec] -clover.disable:
     [exec] 
     [exec] -clover.load:
     [exec] 
     [exec] -clover.classpath:
     [exec] 
     [exec] -clover.setup:
     [exec] 
     [exec] clover:
     [exec] 
     [exec] compile-core:
     [exec] 
     [exec] compile-codecs:
     [exec]      [echo] Building codecs...
     [exec] 
     [exec] ivy-availability-check:
     [exec]      [echo] Building codecs...
     [exec] 
     [exec] ivy-fail:
     [exec] 
     [exec] ivy-configure:
     [exec] [ivy:configure] :: loading settings :: file = /usr/home/hudson/hudson-slave/workspace/Lucene-Solr-SmokeRelease-4.3/lucene/build/fakeReleaseTmp/unpack/lucene-4.3.1/ivy-settings.xml
     [exec] 
     [exec] resolve:
     [exec] 
     [exec] common.init:
     [exec] 
     [exec] compile-lucene-core:
     [exec] 
     [exec] init:
     [exec] 
     [exec] -clover.disable:
     [exec] 
     [exec] -clover.load:
     [exec] 
     [exec] -clover.classpath:
     [exec] 
     [exec] -clover.setup:
     [exec] 
     [exec] clover:
     [exec] 
     [exec] compile-core:
     [exec]     [mkdir] Created dir: /usr/home/hudson/hudson-slave/workspace/Lucene-Solr-SmokeRelease-4.3/lucene/build/fakeReleaseTmp/unpack/lucene-4.3.1/build/codecs/classes/java
     [exec]     [javac] Compiling 59 source files to /usr/home/hudson/hudson-slave/workspace/Lucene-Solr-SmokeRelease-4.3/lucene/build/fakeReleaseTmp/unpack/lucene-4.3.1/build/codecs/classes/java
     [exec]     [javac] Note: Some input files use or override a deprecated API.
     [exec]     [javac] Note: Recompile with -Xlint:deprecation for details.
     [exec]      [copy] Copying 3 files to /usr/home/hudson/hudson-slave/workspace/Lucene-Solr-SmokeRelease-4.3/lucene/build/fakeReleaseTmp/unpack/lucene-4.3.1/build/codecs/classes/java
     [exec] 
     [exec] -clover.disable:
     [exec] 
     [exec] -clover.load:
     [exec] 
     [exec] -clover.classpath:
     [exec] 
     [exec] -clover.setup:
     [exec] 
     [exec] clover:
     [exec] 
     [exec] common.compile-core:
     [exec]     [mkdir] Created dir: /usr/home/hudson/hudson-slave/workspace/Lucene-Solr-SmokeRelease-4.3/lucene/build/fakeReleaseTmp/unpack/lucene-4.3.1/build/test-framework/classes/java
     [exec]     [javac] Compiling 133 source files to /usr/home/hudson/hudson-slave/workspace/Lucene-Solr-SmokeRelease-4.3/lucene/build/fakeReleaseTmp/unpack/lucene-4.3.1/build/test-framework/classes/java
     [exec]     [javac] Note: Some input files use or override a deprecated API.
     [exec]     [javac] Note: Recompile with -Xlint:deprecation for details.
     [exec]      [copy] Copying 4 files to /usr/home/hudson/hudson-slave/workspace/Lucene-Solr-SmokeRelease-4.3/lucene/build/fakeReleaseTmp/unpack/lucene-4.3.1/build/test-framework/classes/java
     [exec] 
     [exec] compile-core:
     [exec] 
     [exec] compile-test:
     [exec]     [mkdir] Created dir: /usr/home/hudson/hudson-slave/workspace/Lucene-Solr-SmokeRelease-4.3/lucene/build/fakeReleaseTmp/unpack/lucene-4.3.1/build/core/classes/test
     [exec]     [javac] Compiling 375 source files to /usr/home/hudson/hudson-slave/workspace/Lucene-Solr-SmokeRelease-4.3/lucene/build/fakeReleaseTmp/unpack/lucene-4.3.1/build/core/classes/test
     [exec]     [javac] Note: Some input files use or override a deprecated API.
     [exec]     [javac] Note: Recompile with -Xlint:deprecation for details.
     [exec]      [copy] Copying 38 files to /usr/home/hudson/hudson-slave/workspace/Lucene-Solr-SmokeRelease-4.3/lucene/build/fakeReleaseTmp/unpack/lucene-4.3.1/build/core/classes/test
     [exec] 
     [exec] install-junit4-taskdef:
     [exec] 
     [exec] validate:
     [exec] 
     [exec] test:
     [exec]     [mkdir] Created dir: /usr/home/hudson/hudson-slave/workspace/Lucene-Solr-SmokeRelease-4.3/lucene/build/fakeReleaseTmp/unpack/lucene-4.3.1/build/core/test
     [exec]     [mkdir] Created dir: /usr/home/hudson/hudson-slave/workspace/Lucene-Solr-SmokeRelease-4.3/lucene/build/fakeReleaseTmp/unpack/lucene-4.3.1/build/core/test/temp
     [exec] [junit4:junit4] <JUnit4> says ?????! Master seed: E28CC16991FC7B8
     [exec] [junit4:junit4] Your default console's encoding may not display certain unicode glyphs: US-ASCII
     [exec] [junit4:junit4] Executing 361 suites with 4 JVMs.
     [exec] [junit4:junit4] 
     [exec] [junit4:junit4] Started J0 PID(18049@lucene.zones.apache.org).
     [exec] [junit4:junit4] Started J1 PID(18050@lucene.zones.apache.org).
     [exec] [junit4:junit4] Started J2 PID(18051@lucene.zones.apache.org).
     [exec] [junit4:junit4] Started J3 PID(18052@lucene.zones.apache.org).
     [exec] [junit4:junit4] Suite: org.apache.lucene.index.TestDocumentsWriterStallControl
     [exec] [junit4:junit4] Completed on J2 in 2.07s, 3 tests
     [exec] [junit4:junit4] 
     [exec] [junit4:junit4] Suite: org.apache.lucene.index.TestIndexWriterLockRelease
     [exec] [junit4:junit4] Completed on J0 in 2.19s, 1 test
     [exec] [junit4:junit4] 
     [exec] [junit4:junit4] Suite: org.apache.lucene.index.TestNoMergePolicy
     [exec] [junit4:junit4] Completed on J2 in 0.33s, 4 tests
     [exec] [junit4:junit4] 
     [exec] [junit4:junit4] Suite: org.apache.lucene.index.TestIndexInput
     [exec] [junit4:junit4] Completed on J3 in 2.65s, 3 tests
     [exec] [junit4:junit4] 
     [exec] [junit4:junit4] Suite: org.apache.lucene.util.junitcompat.TestSystemPropertiesInvariantRule
     [exec] [junit4:junit4] Completed on J0 in 0.58s, 5 tests
     [exec] [junit4:junit4] 
     [exec] [junit4:junit4] Suite: org.apache.lucene.util.automaton.TestLevenshteinAutomata
     [exec] [junit4:junit4] Completed on J0 in 1.24s, 4 tests
     [exec] [junit4:junit4] 
     [exec] [junit4:junit4] Suite: org.apache.lucene.index.TestNRTReaderWithThreads
     [exec] [junit4:junit4] Completed on J3 in 1.82s, 1 test
     [exec] [junit4:junit4] 
     [exec] [junit4:junit4] Suite: org.apache.lucene.search.TestSearchWithThreads
     [exec] [junit4:junit4] Completed on J2 in 4.45s, 1 test
     [exec] [junit4:junit4] 
     [exec] [junit4:junit4] Suite: org.apache.lucene.index.Test4GBStoredFields
     [exec] [junit4:junit4] IGNOR/A 0.21s J2 | Test4GBStoredFields.test
     [exec] [junit4:junit4]    > Assumption #1: 'nightly' test group is disabled (@Nightly)
     [exec] [junit4:junit4] Completed on J2 in 0.25s, 1 test, 1 skipped
     [exec] [junit4:junit4] 
     [exec] [junit4:junit4] Suite: org.apache.lucene.index.TestTransactionRollback
     [exec] [junit4:junit4] Completed on J2 in 0.90s, 2 tests
     [exec] [junit4:junit4] 
     [exec] [junit4:junit4] Suite: org.apache.lucene.index.TestPayloads
     [exec] [junit4:junit4] Completed on J2 in 0.59s, 7 tests
     [exec] [junit4:junit4] 
     [exec] [junit4:junit4] Suite: org.apache.lucene.index.TestDocValuesFormat
     [exec] [junit4:junit4] IGNOR/A 0.19s J1 | TestDocValuesFormat.testSortedSetOneValue
     [exec] [junit4:junit4]    > Assumption #1: Codec does not support SORTED_SET
     [exec] [junit4:junit4] IGNOR/A 0.02s J1 | TestDocValuesFormat.testSortedSetThreeValuesTwoDocs
     [exec] [junit4:junit4]    > Assumption #1: Codec does not support SORTED_SET
     [exec] [junit4:junit4] IGNOR/A 0.02s J1 | TestDocValuesFormat.testSortedSetTwoFields
     [exec] [junit4:junit4]    > Assumption #1: Codec does not support SORTED_SET
     [exec] [junit4:junit4] IGNOR/A 0.02s J1 | TestDocValuesFormat.testSortedSetFixedLengthVsUninvertedField
     [exec] [junit4:junit4]    > Assumption #1: Codec does not support SORTED_SET
     [exec] [junit4:junit4] IGNOR/A 0.02s J1 | TestDocValuesFormat.testSortedSetTwoDocumentsLastMissingMerge
     [exec] [junit4:junit4]    > Assumption #1: Codec does not support SORTED_SET
     [exec] [junit4:junit4] IGNOR/A 0.02s J1 | TestDocValuesFormat.testSortedSetTwoDocumentsFirstMissingMerge
     [exec] [junit4:junit4]    > Assumption #1: Codec does not support SORTED_SET
     [exec] [junit4:junit4] IGNOR/A 0.02s J1 | TestDocValuesFormat.testSortedSetVariableLengthVsStoredFields
     [exec] [junit4:junit4]    > Assumption #1: Codec does not support SORTED_SET
     [exec] [junit4:junit4] IGNOR/A 0.11s J1 | TestDocValuesFormat.testSortedSetTwoValues
     [exec] [junit4:junit4]    > Assumption #1: Codec does not support SORTED_SET
     [exec] [junit4:junit4] IGNOR/A 0.01s J1 | TestDocValuesFormat.testSortedSetFixedLengthVsStoredFields
     [exec] [junit4:junit4]    > Assumption #1: Codec does not support SORTED_SET
     [exec] [junit4:junit4] IGNOR/A 0.01s J1 | TestDocValuesFormat.testSortedSetTwoDocumentsMerged
     [exec] [junit4:junit4]    > Assumption #1: Codec does not support SORTED_SET
     [exec] [junit4:junit4] IGNOR/A 0.01s J1 | TestDocValuesFormat.testSortedSetTwoDocumentsFirstMissing
     [exec] [junit4:junit4]    > Assumption #1: Codec does not support SORTED_SET
     [exec] [junit4:junit4] IGNOR/A 0.02s J1 | TestDocValuesFormat.testSortedSetTwoDocumentsLastMissing
     [exec] [junit4:junit4]    > Assumption #1: Codec does not support SORTED_SET
     [exec] [junit4:junit4] IGNOR/A 0.01s J1 | TestDocValuesFormat.testSortedSetTwoValuesUnordered
     [exec] [junit4:junit4]    > Assumption #1: Codec does not support SORTED_SET
     [exec] [junit4:junit4] IGNOR/A 0.01s J1 | TestDocValuesFormat.testSortedSetVariableLengthVsUninvertedField
     [exec] [junit4:junit4]    > Assumption #1: Codec does not support SORTED_SET
     [exec] [junit4:junit4] IGNOR/A 0.01s J1 | TestDocValuesFormat.testSortedSetMergeAwayAllValues
     [exec] [junit4:junit4]    > Assumption #1: Codec does not support SORTED_SET
     [exec] [junit4:junit4] IGNOR/A 0.01s J1 | TestDocValuesFormat.testSortedSetTermsEnum
     [exec] [junit4:junit4]    > Assumption #1: Codec does not support SORTED_SET
     [exec] [junit4:junit4] Completed on J1 in 8.75s, 54 tests, 16 skipped
     [exec] [junit4:junit4] 
     [exec] [junit4:junit4] Suite: org.apache.lucene.index.TestIndexWriterConfig
     [exec] [junit4:junit4] Completed on J1 in 0.17s, 9 tests
     [exec] [junit4:junit4] 
     [exec] [junit4:junit4] Suite: org.apache.lucene.search.TestSortRandom
     [exec] [junit4:junit4] Completed on J1 in 0.55s, 1 test
     [exec] [junit4:junit4] 
     [exec] [junit4:junit4] Suite: org.apache.lucene.search.spans.TestBasics
     [exec] [junit4:junit4] Completed on J3 in 6.43s, 24 tests
     [exec] [junit4:junit4] 
     [exec] [junit4:junit4] Suite: org.apache.lucene.index.TestAllFilesHaveCodecHeader
     [exec] [junit4:junit4] Completed on J3 in 0.22s, 1 test
     [exec] [junit4:junit4] 
     [exec] [junit4:junit4] Suite: org.apache.lucene.search.TestCachingWrapperFilter
     [exec] [junit4:junit4] Completed on J3 in 0.44s, 5 tests
     [exec] [junit4:junit4] 
     [exec] [junit4:junit4] Suite: org.apache.lucene.search.TestMinShouldMatch2
     [exec] [junit4:junit4] Completed on J2 in 3.22s, 6 tests
     [exec] [junit4:junit4] 
     [exec] [junit4:junit4] Suite: org.apache.lucene.index.TestOmitTf
     [exec] [junit4:junit4] Completed on J3 in 0.58s, 6 tests
     [exec] [junit4:junit4] 
     [exec] [junit4:junit4] Suite: org.apache.lucene.search.TestMultiTermConstantScore
     [exec] [junit4:junit4] Completed on J3 in 0.64s, 7 tests
     [exec] [junit4:junit4] 
     [exec] [junit4:junit4] Suite: org.apache.lucene.index.TestConcurrentMergeScheduler
     [exec] [junit4:junit4] Completed on J3 in 2.93s, 6 tests
     [exec] [junit4:junit4] 
     [exec] [junit4:junit4] Suite: org.apache.lucene.util.junitcompat.TestFailIfDirectoryNotClosed
     [exec] [junit4:junit4] Completed on J3 in 0.10s, 1 test
     [exec] [junit4:junit4] 
     [exec] [junit4:junit4] Suite: org.apache.lucene.index.TestAddIndexes
     [exec] [junit4:junit4] Completed on J1 in 6.91s, 20 tests
     [exec] [junit4:junit4] 
     [exec] [junit4:junit4] Suite: org.apache.lucene.index.TestSumDocFreq
     [exec] [junit4:junit4] Completed on J1 in 0.23s, 1 test
     [exec] [junit4:junit4] 
     [exec] [junit4:junit4] Suite: org.apache.lucene.index.TestTermVectorsWriter
     [exec] [junit4:junit4] Completed on J3 in 0.74s, 13 tests
     [exec] [junit4:junit4] 
     [exec] [junit4:junit4] Suite: org.apache.lucene.search.TestNumericRangeQuery64
     [exec] [junit4:junit4] Completed on J0 in 12.99s, 34 tests
     [exec] [junit4:junit4] 
     [exec] [junit4:junit4] Suite: org.apache.lucene.index.TestIntBlockPool
     [exec] [junit4:junit4] Completed on J1 in 0.53s, 2 tests
     [exec] [junit4:junit4] 
     [exec] [junit4:junit4] Suite: org.apache.lucene.index.TestDoc
     [exec] [junit4:junit4] Completed on J0 in 1.14s, 1 test
     [exec] [junit4:junit4] 
     [exec] [junit4:junit4] Suite: org.apache.lucene.index.TestIndexableField
     [exec] [junit4:junit4] Completed on J0 in 0.50s, 1 test
     [exec] [junit4:junit4] 
     [exec] [junit4:junit4] Suite: org.apache.lucene.search.TestBooleanScorer
     [exec] [junit4:junit4] Completed on J0 in 0.09s, 3 tests
     [exec] [junit4:junit4] 
     [exec] [junit4:junit4] Suite: org.apache.lucene.search.TestMultiValuedNumericRangeQuery
     [exec] [junit4:junit4] Completed on J1 in 2.03s, 1 test
     [exec] [junit4:junit4] 
     [exec] [junit4:junit4] Suite: org.apache.lucene.codecs.perfield.TestPerFieldPostingsFormat
     [exec] [junit4:junit4] Completed on J0 in 1.50s, 7 tests
     [exec] [junit4:junit4] 
     [exec] [junit4:junit4] Suite: org.apache.lucene.codecs.lucene40.TestLucene40DocValuesFormat
     [exec] [junit4:junit4] IGNOR/A 0.18s J3 | TestLucene40DocValuesFormat.testSortedSetOneValue
     [exec] [junit4:junit4]    > Assumption #1: Codec does not support SORTED_SET
     [exec] [junit4:junit4] IGNOR/A 0.01s J3 | TestLucene40DocValuesFormat.testSortedSetThreeValuesTwoDocs
     [exec] [junit4:junit4]    > Assumption #1: Codec does not support SORTED_SET
     [exec] [junit4:junit4] IGNOR/A 0.01s J3 | TestLucene40DocValuesFormat.testSortedSetTwoFields
     [exec] [junit4:junit4]    > Assumption #1: Codec does not support SORTED_SET
     [exec] [junit4:junit4] IGNOR/A 0.01s J3 | TestLucene40DocValuesFormat.testSortedSetFixedLengthVsUninvertedField
     [exec] [junit4:junit4]    > Assumption #1: Codec does not support SORTED_SET
     [exec] [junit4:junit4] IGNOR/A 0.01s J3 | TestLucene40DocValuesFormat.testSortedSetTwoDocumentsLastMissingMerge
     [exec] [junit4:junit4]    > Assumption #1: Codec does not support SORTED_SET
     [exec] [junit4:junit4] IGNOR/A 0.02s J3 | TestLucene40DocValuesFormat.testSortedSetTwoDocumentsFirstMissingMerge
     [exec] [junit4:junit4]    > Assumption #1: Codec does not support SORTED_SET
     [exec] [junit4:junit4] IGNOR/A 0.01s J3 | TestLucene40DocValuesFormat.testSortedSetVariableLengthVsStoredFields
     [exec] [junit4:junit4]    > Assumption #1: Codec does not support SORTED_SET
     [exec] [junit4:junit4] IGNOR/A 0.01s J3 | TestLucene40DocValuesFormat.testSortedSetTwoValues
     [exec] [junit4:junit4]    > Assumption #1: Codec does not support SORTED_SET
     [exec] [junit4:junit4] IGNOR/A 0.01s J3 | TestLucene40DocValuesFormat.testSortedSetFixedLengthVsStoredFields
     [exec] [junit4:junit4]    > Assumption #1: Codec does not support SORTED_SET
     [exec] [junit4:junit4] IGNOR/A 0.01s J3 | TestLucene40DocValuesFormat.testSortedSetTwoDocumentsMerged
     [exec] [junit4:junit4]    > Assumption #1: Codec does not support SORTED_SET
     [exec] [junit4:junit4] IGNOR/A 0.01s J3 | TestLucene40DocValuesFormat.testSortedSetTwoDocumentsFirstMissing
     [exec] [junit4:junit4]    > Assumption #1: Codec does not support SORTED_SET
     [exec] [junit4:junit4] IGNOR/A 0.01s J3 | TestLucene40DocValuesFormat.testSortedSetTwoDocumentsLastMissing
     [exec] [junit4:junit4]    > Assumption #1: Codec does not support SORTED_SET
     [exec] [junit4:junit4] IGNOR/A 0.01s J3 | TestLucene40DocValuesFormat.testSortedSetTwoValuesUnordered
     [exec] [junit4:junit4]    > Assumption #1: Codec does not support SORTED_SET
     [exec] [junit4:junit4] IGNOR/A 0.01s J3 | TestLucene40DocValuesFormat.testSortedSetVariableLengthVsUninvertedField
     [exec] [junit4:junit4]    > Assumption #1: Codec does not support SORTED_SET
     [exec] [junit4:junit4] IGNOR/A 0.01s J3 | TestLucene40DocValuesFormat.testSortedSetMergeAwayAllValues
     [exec] [junit4:junit4]    > Assumption #1: Codec does not support SORTED_SET
     [exec] [junit4:junit4] IGNOR/A 0.01s J3 | TestLucene40DocValuesFormat.testSortedSetTermsEnum
     [exec] [junit4:junit4]    > Assumption #1: Codec does not support SORTED_SET
     [exec] [junit4:junit4] Completed on J3 in 3.55s, 54 tests, 16 skipped
     [exec] [junit4:junit4] 
     [exec] [junit4:junit4] Suite: org.apache.lucene.search.TestFieldCache
     [exec] [junit4:junit4] Completed on J3 in 3.06s, 8 tests
     [exec] [junit4:junit4] 
     [exec] [junit4:junit4] Suite: org.apache.lucene.index.TestAtomicUpdate
     [exec] [junit4:junit4] Completed on J1 in 4.79s, 1 test
     [exec] [junit4:junit4] 
     [exec] [junit4:junit4] Suite: org.apache.lucene.util.TestVirtualMethod
     [exec] [junit4:junit4] Completed on J1 in 0.04s, 2 tests
     [exec] [junit4:junit4] 
     [exec] [junit4:junit4] Suite: org.apache.lucene.index.TestSizeBoundedForceMerge
     [exec] [junit4:junit4] Completed on J1 in 0.16s, 11 tests
     [exec] [junit4:junit4] 
     [exec] [junit4:junit4] Suite: org.apache.lucene.codecs.lucene3x.TestImpersonation
     [exec] [junit4:junit4] Completed on J1 in 0.02s, 1 test
     [exec] [junit4:junit4] 
     [exec] [junit4:junit4] Suite: org.apache.lucene.util.automaton.TestBasicOperations
     [exec] [junit4:junit4] Completed on J3 in 1.16s, 8 tests
     [exec] [junit4:junit4] 
     [exec] [junit4:junit4] Suite: org.apache.lucene.index.TestBackwardsCompatibility3x
     [exec] [junit4:junit4] Completed on J2 in 13.32s, 16 tests
     [exec] [junit4:junit4] 
     [exec] [junit4:junit4] Suite: org.apache.lucene.util.TestRollingBuffer
     [exec] [junit4:junit4] Completed on J2 in 0.14s, 1 test
     [exec] [junit4:junit4] 
     [exec] [junit4:junit4] Suite: org.apache.lucene.index.TestTermdocPerf
     [exec] [junit4:junit4] Completed on J2 in 0.02s, 1 test
     [exec] [junit4:junit4] 
     [exec] [junit4:junit4] Suite: org.apache.lucene.index.TestNeverDelete
     [exec] [junit4:junit4] Completed on J3 in 1.47s, 1 test
     [exec] [junit4:junit4] 
     [exec] [junit4:junit4] Suite: org.apache.lucene.util.TestSentinelIntSet
     [exec] [junit4:junit4] Completed on J3 in 0.24s, 2 tests
     [exec] [junit4:junit4] 
     [exec] [junit4:junit4] Suite: org.apache.lucene.util.TestCloseableThreadLocal
     [exec] [junit4:junit4] Completed on J3 in 0.04s, 3 tests
     [exec] [junit4:junit4] 
     [exec] [junit4:junit4] Suite: org.apache.lucene.index.TestPayloadsOnVectors
     [exec] [junit4:junit4] Completed on J3 in 0.25s, 3 tests
     [exec] [junit4:junit4] 
     [exec] [junit4:junit4] Suite: org.apache.lucene.search.TestComplexExplanations
     [exec] [junit4:junit4] Completed on J1 in 2.90s, 22 tests
     [exec] [junit4:junit4] 
     [exec] [junit4:junit4] Suite: org.apache.lucene.index.TestIndexWriterDelete
     [exec] [junit4:junit4] IGNOR/A 0.24s J0 | TestIndexWriterDelete.testApplyDeletesOnFlush
     [exec] [junit4:junit4]    > Assumption #1: 'nightly' test group is disabled (@Nightly)
     [exec] [junit4:junit4] Completed on J0 in 9.03s, 22 tests, 1 skipped
     [exec] [junit4:junit4] 
     [exec] [junit4:junit4] Suite: org.apache.lucene.analysis.TestLookaheadTokenFilter
     [exec] [junit4:junit4] Completed on J2 in 4.65s, 2 tests
     [exec] [junit4:junit4] 
     [exec] [junit4:junit4] Suite: org.apache.lucene.search.TestDateSort
     [exec] [junit4:junit4] Completed on J2 in 0.11s, 1 test
     [exec] [junit4:junit4] 
     [exec] [junit4:junit4] Suite: org.apache.lucene.util.TestMaxFailuresRule
     [exec] [junit4:junit4] Completed on J0 in 1.11s, 1 test
     [exec] [junit4:junit4] 
     [exec] [junit4:junit4] Suite: org.apache.lucene.util.TestOpenBitSet
     [exec] [junit4:junit4] Completed on J1 in 3.61s, 4 tests
     [exec] [junit4:junit4] 
     [exec] [junit4:junit4] Suite: org.apache.lucene.util.automaton.TestDeterminism
     [exec] [junit4:junit4] Completed on J0 in 0.51s, 2 tests
     [exec] [junit4:junit4] 
     [exec] [junit4:junit4] Suite: org.apache.lucene.util.TestDoubleBarrelLRUCache
     [exec] [junit4:junit4] Completed on J2 in 1.03s, 2 tests
     [exec] [junit4:junit4] 
     [exec] [junit4:junit4] Suite: org.apache.lucene.index.TestParallelAtomicReader
     [exec] [junit4:junit4] Completed on J2 in 0.35s, 7 tests
     [exec] [junit4:junit4] 
     [exec] [junit4:junit4] Suite: org.apache.lucene.store.TestRateLimiter
     [exec] [junit4:junit4] Completed on J2 in 1.22s, 1 test
     [exec] [junit4:junit4] 
     [exec] [junit4:junit4] Suite: org.apache.lucene.search.spans.TestSpanFirstQuery
     [exec] [junit4:junit4] Completed on J2 in 0.06s, 1 test
     [exec] [junit4:junit4] 
     [exec] [junit4:junit4] Suite: org.apache.lucene.index.TestTermVectorsFormat
     [exec] [junit4:junit4] Completed on J3 in 6.15s, 7 tests
     [exec] [junit4:junit4] 
     [exec] [junit4:junit4] Suite: org.apache.lucene.search.TestTotalHitCountCollector
     [exec] [junit4:junit4] Completed on J3 in 0.02s, 1 test
     [exec] [junit4:junit4] 
     [exec] [junit4:junit4] Suite: org.apache.lucene.index.TestParallelTermEnum
     [exec] [junit4:junit4] Completed on J3 in 0.08s, 1 test
     [exec] [junit4:junit4] 
     [exec] [junit4:junit4] Suite: org.apache.lucene.index.TestReaderClosed
     [exec] [junit4:junit4] Completed on J2 in 0.10s, 2 tests
     [exec] [junit4:junit4] 
     [exec] [junit4:junit4] Suite: org.apache.lucene.index.TestTerm
     [exec] [junit4:junit4] Completed on J2 in 0.02s, 1 test
     [exec] [junit4:junit4] 
     [exec] [junit4:junit4] Suite: org.apache.lucene.search.TestMatchAllDocsQuery
     [exec] [junit4:junit4] Completed on J3 in 0.09s, 2 tests
     [exec] [junit4:junit4] 
     [exec] [junit4:junit4] Suite: org.apache.lucene.util.junitcompat.TestLeaveFilesIfTestFails
     [exec] [junit4:junit4] Completed on J3 in 0.03s, 1 test
     [exec] [junit4:junit4] 
     [exec] [junit4:junit4] Suite: org.apache.lucene.codecs.lucene40.TestReuseDocsEnum
     [exec] [junit4:junit4] Completed on J3 in 1.24s, 3 tests
     [exec] [junit4:junit4] 
     [exec] [junit4:junit4] Suite: org.apache.lucene.store.TestNRTCachingDirectory
     [exec] [junit4:junit4] Completed on J0 in 3.99s, 5 tests
     [exec] [junit4:junit4] 
     [exec] [junit4:junit4] Suite: org.apache.lucene.search.TestScorerPerf
     [exec] [junit4:junit4] Completed on J2 in 3.75s, 1 test
     [exec] [junit4:junit4] 
     [exec] [junit4:junit4] Suite: org.apache.lucene.index.TestIndexWriterReader
     [exec] [junit4:junit4] Completed on J1 in 6.85s, 20 tests
     [exec] [junit4:junit4] 
     [exec] [junit4:junit4] Suite: org.apache.lucene.search.TestTopDocsMerge
     [exec] [junit4:junit4] Completed on J0 in 4.15s, 1 test
     [exec] [junit4:junit4] 
     [exec] [junit4:junit4] Suite: org.apache.lucene.codecs.perfield.TestPerFieldDocValuesFormat
     [exec] [junit4:junit4] Completed on J3 in 5.25s, 55 tests
     [exec] [junit4:junit4] 
     [exec] [junit4:junit4] Suite: org.apache.lucene.index.TestPersistentSnapshotDeletionPolicy
     [exec] [junit4:junit4] Completed on J2 in 2.82s, 14 tests
     [exec] [junit4:junit4] 
     [exec] [junit4:junit4] Suite: org.apache.lucene.util.TestArrayUtil
     [exec] [junit4:junit4] Completed on J1 in 2.56s, 14 tests
     [exec] [junit4:junit4] 
     [exec] [junit4:junit4] Suite: org.apache.lucene.search.spans.TestSpansAdvanced
     [exec] [junit4:junit4] Completed on J1 in 0.08s, 1 test
     [exec] [junit4:junit4] 
     [exec] [junit4:junit4] Suite: org.apache.lucene.search.TestFuzzyQuery
     [exec] [junit4:junit4] Completed on J2 in 0.68s, 6 tests
     [exec] [junit4:junit4] 
     [exec] [junit4:junit4] Suite: org.apache.lucene.util.junitcompat.TestBeforeAfterOverrides
     [exec] [junit4:junit4] Completed on J2 in 0.13s, 2 tests
     [exec] [junit4:junit4] 
     [exec] [junit4:junit4] Suite: org.apache.lucene.search.TestMultiThreadTermVectors
     [exec] [junit4:junit4] Completed on J3 in 2.42s, 1 test
     [exec] [junit4:junit4] 
     [exec] [junit4:junit4] Suite: org.apache.lucene.document.TestDocument
     [exec] [junit4:junit4] Completed on J3 in 0.17s, 10 tests
     [exec] [junit4:junit4] 
     [exec] [junit4:junit4] Suite: org.apache.lucene.util.TestVersion
     [exec] [junit4:junit4] Completed on J3 in 0.02s, 3 tests
     [exec] [junit4:junit4] 
     [exec] [junit4:junit4] Suite: org.apache.lucene.analysis.TestMockAnalyzer
     [exec] [junit4:junit4] Completed on J2 in 1.81s, 9 tests
     [exec] [junit4:junit4] 
     [exec] [junit4:junit4] Suite: org.apache.lucene.codecs.lucene3x.TestSurrogates
     [exec] [junit4:junit4] Completed on J2 in 0.78s, 1 test
     [exec] [junit4:junit4] 
     [exec] [junit4:junit4] Suite: org.apache.lucene.search.TestNot
     [exec] [junit4:junit4] Completed on J2 in 0.03s, 1 test
     [exec] [junit4:junit4] 
     [exec] [junit4:junit4] Suite: org.apache.lucene.codecs.lucene40.TestLucene40PostingsFormat
     [exec] [junit4:junit4] Completed on J2 in 3.25s, 7 tests
     [exec] [junit4:junit4] 
     [exec] [junit4:junit4] Suite: org.apache.lucene.util.TestByteBlockPool
     [exec] [junit4:junit4] Completed on J2 in 0.02s, 1 test
     [exec] [junit4:junit4] 
     [exec] [junit4:junit4] Suite: org.apache.lucene.util.junitcompat.TestSeedFromUncaught
     [exec] [junit4:junit4] Completed on J2 in 0.07s, 1 test
     [exec] [junit4:junit4] 
     [exec] [junit4:junit4] Suite: org.apache.lucene.index.TestNRTThreads
     [exec] [junit4:junit4] Completed on J1 in 6.08s, 1 test
     [exec] [junit4:junit4] 
     [exec] [junit4:junit4] Suite: org.apache.lucene.index.TestSegmentMerger
     [exec] [junit4:junit4] Completed on J1 in 0.59s, 3 tests
     [exec] [junit4:junit4] 
     [exec] [junit4:junit4] Suite: org.apache.lucene.search.TestSearcherManager
     [exec] [junit4:junit4] Completed on J0 in 8.71s, 7 tests
     [exec] [junit4:junit4] 
     [exec] [junit4:junit4] Suite: org.apache.lucene.TestWorstCaseTestBehavior
     [exec] [junit4:junit4] Completed on J0 in 0.02s, 6 tests, 6 skipped
     [exec] [junit4:junit4] 
     [exec] [junit4:junit4] Suite: org.apache.lucene.index.TestDocumentWriter
     [exec] [junit4:junit4] Completed on J2 in 1.37s, 7 tests
     [exec] [junit4:junit4] 
     [exec] [junit4:junit4] Suite: org.apache.lucene.util.TestSmallFloat
     [exec] [junit4:junit4] Completed on J0 in 0.23s, 2 tests
     [exec] [junit4:junit4] 
     [exec] [junit4:junit4] Suite: org.apache.lucene.TestSearch
     [exec] [junit4:junit4] Completed on J0 in 0.10s, 2 tests
     [exec] [junit4:junit4] 
     [exec] [junit4:junit4] Suite: org.apache.lucene.search.TestConstantScoreQuery
     [exec] [junit4:junit4] Completed on J2 in 0.07s, 3 tests
     [exec] [junit4:junit4] 
     [exec] [junit4:junit4] Suite: org.apache.lucene.index.TestTryDelete
     [exec] [junit4:junit4] Completed on J0 in 0.03s, 3 tests
     [exec] [junit4:junit4] 
     [exec] [junit4:junit4] Suite: org.apache.lucene.search.TestSimpleExplanations
     [exec] [junit4:junit4] Completed on J1 in 1.29s, 69 tests
     [exec] [junit4:junit4] 
     [exec] [junit4:junit4] Suite: org.apache.lucene.index.TestMaxTermFrequency
     [exec] [junit4:junit4] Completed on J1 in 0.27s, 1 test
     [exec] [junit4:junit4] 
     [exec] [junit4:junit4] Suite: org.apache.lucene.util.packed.TestPackedInts
     [exec] [junit4:junit4] IGNOR/A 0.01s J3 | TestPackedInts.testBlockReaderOverflow
     [exec] [junit4:junit4]    > Assumption #1: 'nightly' test group is disabled (@Nightly)
     [exec] [junit4:junit4] Completed on J3 in 6.70s, 23 tests, 2 skipped
     [exec] [junit4:junit4] 
     [exec] [junit4:junit4] Suite: org.apache.lucene.index.TestFieldsReader
     [exec] [junit4:junit4] Completed on J3 in 0.71s, 2 tests
     [exec] [junit4:junit4] 
     [exec] [junit4:junit4] Suite: org.apache.lucene.search.TestElevationComparator
     [exec] [junit4:junit4] Completed on J3 in 0.21s, 1 test
     [exec] [junit4:junit4] 
     [exec] [junit4:junit4] Suite: org.apache.lucene.search.TestLiveFieldValues
     [exec] [junit4:junit4] Completed on J1 in 1.56s, 1 test
     [exec] [junit4:junit4] 
     [exec] [junit4:junit4] Suite: org.apache.lucene.util.junitcompat.TestJUnitRuleOrder
     [exec] [junit4:junit4] Completed on J1 in 0.13s, 1 test
     [exec] [junit4:junit4] 
     [exec] [junit4:junit4] Suite: org.apache.lucene.index.Test2BDocs
     [exec] [junit4:junit4] Completed on J3 in 0.73s, 2 tests
     [exec] [junit4:junit4] 
     [exec] [junit4:junit4] Suite: org.apache.lucene.search.spans.TestSpanExplanationsOfNonMatches
     [exec] [junit4:junit4] Completed on J3 in 0.15s, 31 tests
     [exec] [junit4:junit4] 
     [exec] [junit4:junit4] Suite: org.apache.lucene.codecs.lucene3x.TestLucene3xPostingsFormat
     [exec] [junit4:junit4] Completed on J1 in 1.10s, 7 tests
     [exec] [junit4:junit4] 
     [exec] [junit4:junit4] Suite: org.apache.lucene.codecs.lucene41.TestBlockPostingsFormat2
     [exec] [junit4:junit4] Completed on J2 in 4.20s, 4 tests
     [exec] [junit4:junit4] 
     [exec] [junit4:junit4] Suite: org.apache.lucene.codecs.lucene41.TestLucene41StoredFieldsFormat
     [exec] [junit4:junit4] IGNOR/A 0.00s J3 | TestLucene41StoredFieldsFormat.testBigDocuments
     [exec] [junit4:junit4]    > Assumption #1: 'nightly' test group is disabled (@Nightly)
     [exec] [junit4:junit4] Completed on J3 in 1.51s, 10 tests, 1 skipped
     [exec] [junit4:junit4] 
     [exec] [junit4:junit4] Suite: org.apache.lucene.search.TestSimpleSearchEquivalence
     [exec] [junit4:junit4] Completed on J2 in 0.54s, 12 tests
     [exec] [junit4:junit4] 
     [exec] [junit4:junit4] Suite: org.apache.lucene.store.TestRAMDirectory
     [exec] [junit4:junit4] Completed on J3 in 0.87s, 4 tests
     [exec] [junit4:junit4] 
     [exec] [junit4:junit4] Suite: org.apache.lucene.search.TestRegexpQuery
     [exec] [junit4:junit4] Completed on J3 in 0.14s, 7 tests
     [exec] [junit4:junit4] 
     [exec] [junit4:junit4] Suite: org.apache.lucene.document.TestField
     [exec] [junit4:junit4] Completed on J3 in 0.15s, 19 tests
     [exec] [junit4:junit4] 
     [exec] [junit4:junit4] Suite: org.apache.lucene.util.junitcompat.TestFailOnFieldCacheInsanity
     [exec] [junit4:junit4] Completed on J3 in 0.03s, 1 test
     [exec] [junit4:junit4] 
     [exec] [junit4:junit4] Suite: org.apache.lucene.index.TestIndexWriterOnDiskFull
     [exec] [junit4:junit4] IGNOR/A 0.01s J3 | TestIndexWriterOnDiskFull.testAddIndexOnDiskFull
     [exec] [junit4:junit4]    > Assumption #1: This test cannot run with Memory codec
     [exec] [junit4:junit4] Completed on J3 in 0.26s, 4 tests, 1 skipped
     [exec] [junit4:junit4] 
     [exec] [junit4:junit4] Suite: org.apache.lucene.util.TestIOUtils
     [exec] [junit4:junit4] Completed on J3 in 0.02s, 1 test
     [exec] [junit4:junit4] 
     [exec] [junit4:junit4] Suite: org.apache.lucene.util.TestFixedBitSet
     [exec] [junit4:junit4] Completed on J3 in 1.30s, 6 tests
     [exec] [junit4:junit4] 
     [exec] [junit4:junit4] Suite: org.apache.lucene.analysis.tokenattributes.TestSimpleAttributeImpl
     [exec] [junit4:junit4] Completed on J3 in 0.02s, 1 test
     [exec] [junit4:junit4] 
     [exec] [junit4:junit4] Suite: org.apache.lucene.search.TestNGramPhraseQuery
     [exec] [junit4:junit4] Completed on J3 in 0.01s, 1 test
     [exec] [junit4:junit4] 
     [exec] [junit4:junit4] Suite: org.apache.lucene.codecs.compressing.TestHighCompressionMode
     [exec] [junit4:junit4] Completed on J2 in 2.94s, 5 tests
     [exec] [junit4:junit4] 
     [exec] [junit4:junit4] Suite: org.apache.lucene.search.payloads.TestPayloadNearQuery
     [exec] [junit4:junit4] Completed on J2 in 0.33s, 7 tests
     [exec] [junit4:junit4] 
     [exec] [junit4:junit4] Suite: org.apache.lucene.search.TestFieldCacheRewriteMethod
     [exec] [junit4:junit4] Completed on J3 in 1.09s, 2 tests
     [exec] [junit4:junit4] 
     [exec] [junit4:junit4] Suite: org.apache.lucene.search.TestPrefixRandom
     [exec] [junit4:junit4] Completed on J2 in 0.46s, 1 test
     [exec] [junit4:junit4] 
     [exec] [junit4:junit4] Suite: org.apache.lucene.index.TestMultiFields
     [exec] [junit4:junit4] Completed on J3 in 0.26s, 3 tests
     [exec] [junit4:junit4] 
     [exec] [junit4:junit4] Suite: org.apache.lucene.index.TestBackwardsCompatibility
     [exec] [junit4:junit4] Completed on J0 in 9.11s, 14 tests
     [exec] [junit4:junit4] 
     [exec] [junit4:junit4] Suite: org.apache.lucene.index.Test2BBinaryDocValues
     [exec] [junit4:junit4] Completed on J0 in 0.00s, 0 tests
     [exec] [junit4:junit4] 
     [exec] [junit4:junit4] Suite: org.apache.lucene.search.spans.TestSpans
     [exec] [junit4:junit4] Completed on J3 in 0.82s, 25 tests
     [exec] [junit4:junit4] 
     [exec] [junit4:junit4] Suite: org.apache.lucene.codecs.lucene40.TestLucene40StoredFieldsFormat
     [exec] [junit4:junit4] IGNOR/A 0.00s J2 | TestLucene40StoredFieldsFormat.testBigDocuments
     [exec] [junit4:junit4]    > Assumption #1: 'nightly' test group is disabled (@Nightly)
     [exec] [junit4:junit4] Completed on J2 in 1.69s, 10 tests, 1 skipped
     [exec] [junit4:junit4] 
     [exec] [junit4:junit4] Suite: org.apache.lucene.util.automaton.TestCompiledAutomaton
     [exec] [junit4:junit4] Completed on J2 in 0.31s, 2 tests
     [exec] [junit4:junit4] 
     [exec] [junit4:junit4] Suite: org.apache.lucene.index.TestPostingsOffsets
     [exec] [junit4:junit4] Completed on J0 in 1.31s, 11 tests
     [exec] [junit4:junit4] 
     [exec] [junit4:junit4] Suite: org.apache.lucene.analysis.tokenattributes.TestCharTermAttributeImpl
     [exec] [junit4:junit4] Completed on J0 in 0.81s, 12 tests
     [exec] [junit4:junit4] 
     [exec] [junit4:junit4] Suite: org.apache.lucene.util.junitcompat.TestFailIfUnreferencedFiles
     [exec] [junit4:junit4] Completed on J0 in 0.02s, 1 test
     [exec] [junit4:junit4] 
     [exec] [junit4:junit4] Suite: org.apache.lucene.codecs.lucene41.TestBlockPostingsFormat3
     [exec] [junit4:junit4] Completed on J1 in 10.05s, 1 test
     [exec] [junit4:junit4] 
     [exec] [junit4:junit4] Suite: org.apache.lucene.util.fst.TestBytesStore
     [exec] [junit4:junit4] Completed on J3 in 4.65s, 1 test
     [exec] [junit4:junit4] 
     [exec] [junit4:junit4] Suite: org.apache.lucene.search.TestNumericRangeQuery32
     [exec] [junit4:junit4] Completed on J0 in 5.34s, 27 tests
     [exec] [junit4:junit4] 
     [exec] [junit4:junit4] Suite: org.apache.lucene.index.TestCompoundFile
     [exec] [junit4:junit4] Completed on J0 in 2.01s, 18 tests
     [exec] [junit4:junit4] 
     [exec] [junit4:junit4] Suite: org.apache.lucene.search.TestNRTManager
     [exec] [junit4:junit4] Completed on J1 in 5.28s, 4 tests
     [exec] [junit4:junit4] 
     [exec] [junit4:junit4] Suite: org.apache.lucene.util.TestRecyclingByteBlockAllocator
     [exec] [junit4:junit4] Completed on J0 in 0.03s, 3 tests
     [exec] [junit4:junit4] 
     [exec] [junit4:junit4] Suite: org.apache.lucene.index.TestIndexWriterOnJRECrash
     [exec] [junit4:junit4] IGNOR/A 0.01s J0 | TestIndexWriterOnJRECrash.testNRTThreads
     [exec] [junit4:junit4]    > Assumption #1: 'nightly' test group is disabled (@Nightly)
     [exec] [junit4:junit4] Completed on J0 in 0.02s, 1 test, 1 skipped
     [exec] [junit4:junit4] 
     [exec] [junit4:junit4] Suite: org.apache.lucene.codecs.perfield.TestPerFieldPostingsFormat2
     [exec] [junit4:junit4] Completed on J1 in 0.95s, 5 tests
     [exec] [junit4:junit4] 
     [exec] [junit4:junit4] Suite: org.apache.lucene.util.TestFilterIterator
     [exec] [junit4:junit4] Completed on J1 in 0.08s, 8 tests
     [exec] [junit4:junit4] 
     [exec] [junit4:junit4] Suite: org.apache.lucene.util.junitcompat.TestSetupTeardownChaining
     [exec] [junit4:junit4] Completed on J1 in 0.07s, 2 tests
     [exec] [junit4:junit4] 
     [exec] [junit4:junit4] Suite: org.apache.lucene.index.TestDocTermOrds
     [exec] [junit4:junit4] Completed on J1 in 0.23s, 5 tests
     [exec] [junit4:junit4] 
     [exec] [junit4:junit4] Suite: org.apache.lucene.search.TestBooleanMinShouldMatch
     [exec] [junit4:junit4] Completed on J0 in 1.86s, 17 tests
     [exec] [junit4:junit4] 
     [exec] [junit4:junit4] Suite: org.apache.lucene.search.TestBooleanQuery
     [exec] [junit4:junit4] Completed on J1 in 0.34s, 6 tests
     [exec] [junit4:junit4] 
     [exec] [junit4:junit4] Suite: org.apache.lucene.index.Test2BSortedDocValues
     [exec] [junit4:junit4] Completed on J1 in 0.01s, 0 tests
     [exec] [junit4:junit4] 
     [exec] [junit4:junit4] Suite: org.apache.lucene.search.TestSubScorerFreqs
     [exec] [junit4:junit4] Completed on J1 in 0.04s, 3 tests
     [exec] [junit4:junit4] 
     [exec] [junit4:junit4] Suite: org.apache.lucene.analysis.TestGraphTokenizers
     [exec] [junit4:junit4] Completed on J3 in 7.12s, 21 tests
     [exec] [junit4:junit4] 
     [exec] [junit4:junit4] Suite: org.apache.lucene.codecs.lucene40.TestBitVector
     [exec] [junit4:junit4] Completed on J1 in 1.19s, 9 tests
     [exec] [junit4:junit4] 
     [exec] [junit4:junit4] Suite: org.apache.lucene.search.spans.TestFieldMaskingSpanQuery
     [exec] [junit4:junit4] IGNOR/A 0.01s J1 | TestFieldMaskingSpanQuery.testSpans2
     [exec] [junit4:junit4]    > Assumption #1: Broken scoring: LUCENE-3723
     [exec] [junit4:junit4] IGNOR/A 0.01s J1 | TestFieldMaskingSpanQuery.testSimple2
     [exec] [junit4:junit4]    > Assumption #1: Broken scoring: LUCENE-3723
     [exec] [junit4:junit4] Completed on J1 in 0.41s, 11 tests, 2 skipped
     [exec] [junit4:junit4] 
     [exec] [junit4:junit4] Suite: org.apache.lucene.search.TestPositionIncrement
     [exec] [junit4:junit4] Completed on J1 in 0.05s, 2 tests
     [exec] [junit4:junit4] 
     [exec] [junit4:junit4] Suite: org.apache.lucene.document.TestBinaryDocument
     [exec] [junit4:junit4] Completed on J1 in 0.09s, 2 tests
     [exec] [junit4:junit4] 
     [exec] [junit4:junit4] Suite: org.apache.lucene.util.junitcompat.TestExceptionInBeforeClassHooks
     [exec] [junit4:junit4] Completed on J1 in 0.18s, 3 tests
     [exec] [junit4:junit4] 
     [exec] [junit4:junit4] Suite: org.apache.lucene.index.TestTieredMergePolicy
     [exec] [junit4:junit4] Completed on J0 in 1.87s, 4 tests
     [exec] [junit4:junit4] 
     [exec] [junit4:junit4] Suite: org.apache.lucene.search.TestBooleanQueryVisitSubscorers
     [exec] [junit4:junit4] Completed on J0 in 0.05s, 3 tests
     [exec] [junit4:junit4] 
     [exec] [junit4:junit4] Suite: org.apache.lucene.index.TestDocumentsWriterDeleteQueue
     [exec] [junit4:junit4] Completed on J1 in 0.28s, 5 tests
     [exec] [junit4:junit4] 
     [exec] [junit4:junit4] Suite: org.apache.lucene.search.TestWildcard
     [exec] [junit4:junit4] Completed on J0 in 0.37s, 8 tests
     [exec] [junit4:junit4] 
     [exec] [junit4:junit4] Suite: org.apache.lucene.index.TestIndexWriter
     [exec] [junit4:junit4] Completed on J2 in 13.43s, 53 tests
     [exec] [junit4:junit4] 
     [exec] [junit4:junit4] Suite: org.apache.lucene.store.TestLock
     [exec] [junit4:junit4] Completed on J2 in 0.03s, 1 test
     [exec] [junit4:junit4] 
     [exec] [junit4:junit4] Suite: org.apache.lucene.store.TestHugeRamFile
     [exec] [junit4:junit4] Completed on J1 in 1.18s, 1 test
     [exec] [junit4:junit4] 
     [exec] [junit4:junit4] Suite: org.apache.lucene.search.spans.TestSpanSearchEquivalence
     [exec] [junit4:junit4] Completed on J2 in 0.30s, 8 tests
     [exec] [junit4:junit4] 
     [exec] [junit4:junit4] Suite: org.apache.lucene.search.TestBoolean2
     [exec] [junit4:junit4] Completed on J3 in 2.50s, 11 tests
     [exec] [junit4:junit4] 
     [exec] [junit4:junit4] Suite: org.apache.lucene.TestSearchForDuplicates
     [exec] [junit4:junit4] Completed on J2 in 0.15s, 1 test
     [exec] [junit4:junit4] 
     [exec] [junit4:junit4] Suite: org.apache.lucene.index.TestSnapshotDeletionPolicy
     [exec] [junit4:junit4] Completed on J0 in 1.46s, 8 tests
     [exec] [junit4:junit4] 
     [exec] [junit4:junit4] Suite: org.apache.lucene.store.TestCopyBytes
     [exec] [junit4:junit4] Completed on J1 in 0.60s, 2 tests
     [exec] [junit4:junit4] 
     [exec] [junit4:junit4] Suite: org.apache.lucene.util.TestBytesRefHash
     [exec] [junit4:junit4] Completed on J0 in 0.65s, 8 tests
     [exec] [junit4:junit4] 
     [exec] [junit4:junit4] Suite: org.apache.lucene.TestMergeSchedulerExternal
     [exec] [junit4:junit4] Completed on J1 in 0.79s, 2 tests
     [exec] [junit4:junit4] 
     [exec] [junit4:junit4] Suite: org.apache.lucene.search.TestPhrasePrefixQuery
     [exec] [junit4:junit4] Completed on J1 in 0.02s, 1 test
     [exec] [junit4:junit4] 
     [exec] [junit4:junit4] Suite: org.apache.lucene.search.TestConjunctions
     [exec] [junit4:junit4] Completed on J1 in 0.03s, 1 test
     [exec] [junit4:junit4] 
     [exec] [junit4:junit4] Suite: org.apache.lucene.index.TestIndexFileDeleter
     [exec] [junit4:junit4] Completed on J1 in 0.13s, 1 test
     [exec] [junit4:junit4] 
     [exec] [junit4:junit4] Suite: org.apache.lucene.search.TestTopScoreDocCollector
     [exec] [junit4:junit4] Completed on J1 in 0.02s, 1 test
     [exec] [junit4:junit4] 
     [exec] [junit4:junit4] Suite: org.apache.lucene.search.TestPhraseQuery
     [exec] [junit4:junit4] Completed on J2 in 1.49s, 17 tests
     [exec] [junit4:junit4] 
     [exec] [junit4:junit4] Suite: org.apache.lucene.search.TestDisjunctionMaxQuery
     [exec] [junit4:junit4] Completed on J2 in 1.56s, 11 tests
     [exec] [junit4:junit4] 
     [exec] [junit4:junit4] Suite: org.apache.lucene.index.TestNoDeletionPolicy
     [exec] [junit4:junit4] Completed on J2 in 0.31s, 4 tests
     [exec] [junit4:junit4] 
     [exec] [junit4:junit4] Suite: org.apache.lucene.search.TestTermRangeFilter
     [exec] [junit4:junit4] Completed on J2 in 0.32s, 3 tests
     [exec] [junit4:junit4] 
     [exec] [junit4:junit4] Suite: org.apache.lucene.codecs.lucene3x.TestLucene3xStoredFieldsFormat
     [exec] [junit4:junit4] IGNOR/A 0.01s J1 | TestLucene3xStoredFieldsFormat.testWriteReadMerge
     [exec] [junit4:junit4]    > Assumption #1: impersonation isnt good enough
     [exec] [junit4:junit4] IGNOR/A 0.01s J1 | TestLucene3xStoredFieldsFormat.testBigDocuments
     [exec] [junit4:junit4]    > Assumption #1: 'nightly' test group is disabled (@Nightly)
     [exec] [junit4:junit4] Completed on J1 in 3.44s, 10 tests, 2 skipped
     [exec] [junit4:junit4] 
     [exec] [junit4:junit4] Suite: org.apache.lucene.search.TestTimeLimitingCollector
     [exec] [junit4:junit4] Completed on J2 in 2.13s, 6 tests
     [exec] [junit4:junit4] 
     [exec] [junit4:junit4] Suite: org.apache.lucene.store.TestMultiMMap
     [exec] [junit4:junit4] Completed on J3 in 7.26s, 11 tests
     [exec] [junit4:junit4] 
     [exec] [junit4:junit4] Suite: org.apache.lucene.util.fst.TestFSTs
     [exec] [junit4:junit4] IGNOR/A 0.00s J0 | TestFSTs.testBigSet
     [exec] [junit4:junit4]    > Assumption #1: 'nightly' test group is disabled (@Nightly)
     [exec] [junit4:junit4] Completed on J0 in 7.46s, 18 tests, 1 skipped
     [exec] [junit4:junit4] 
     [exec] [junit4:junit4] Suite: org.apache.lucene.search.TestCustomSearcherSort
     [exec] [junit4:junit4] Completed on J0 in 0.55s, 2 tests
     [exec] [junit4:junit4] 
     [exec] [junit4:junit4] Suite: org.apache.lucene.search.TestMultiPhraseQuery
     [exec] [junit4:junit4] Completed on J0 in 0.35s, 16 tests, 1 skipped
     [exec] [junit4:junit4] 
     [exec] [junit4:junit4] Suite: org.apache.lucene.search.TestAutomatonQuery
     [exec] [junit4:junit4] Completed on J0 in 0.26s, 6 tests
     [exec] [junit4:junit4] 
     [exec] [junit4:junit4] Suite: org.apache.lucene.search.TestSimilarity
     [exec] [junit4:junit4] Completed on J0 in 0.02s, 1 test
     [exec] [junit4:junit4] 
     [exec] [junit4:junit4] Suite: org.apache.lucene.index.TestMultiLevelSkipList
     [exec] [junit4:junit4] Completed on J0 in 0.32s, 1 test
     [exec] [junit4:junit4] 
     [exec] [junit4:junit4] Suite: org.apache.lucene.analysis.TestCachingTokenFilter
     [exec] [junit4:junit4] Completed on J0 in 0.02s, 1 test
     [exec] [junit4:junit4] 
     [exec] [junit4:junit4] Suite: org.apache.lucene.util.TestWeakIdentityMap
     [exec] [junit4:junit4] Completed on J0 in 1.46s, 2 tests
     [exec] [junit4:junit4] 
     [exec] [junit4:junit4] Suite: org.apache.lucene.index.TestIndexWriterWithThreads
     [exec] [junit4:junit4] Completed on J2 in 5.74s, 12 tests
     [exec] [junit4:junit4] 
     [exec] [junit4:junit4] Suite: org.apache.lucene.index.TestIndexWriterMergePolicy
     [exec] [junit4:junit4] Completed on J0 in 3.28s, 7 tests
     [exec] [junit4:junit4] 
     [exec] [junit4:junit4] Suite: org.apache.lucene.index.TestIndexWriterOutOfFileDescriptors
     [exec] [junit4:junit4] Completed on J3 in 7.99s, 1 test
     [exec] [junit4:junit4] 
     [exec] [junit4:junit4] Suite: org.apache.lucene.util.TestPagedBytes
     [exec] [junit4:junit4] Completed on J3 in 0.84s, 2 tests, 1 skipped
     [exec] [junit4:junit4] 
     [exec] [junit4:junit4] Suite: org.apache.lucene.search.TestSloppyPhraseQuery
     [exec] [junit4:junit4] Completed on J2 in 4.84s, 9 tests
     [exec] [junit4:junit4] 
     [exec] [junit4:junit4] Suite: org.apache.lucene.index.TestIndexWriterMerging
     [exec] [junit4:junit4] Completed on J1 in 11.85s, 6 tests
     [exec] [junit4:junit4] 
     [exec] [junit4:junit4] Suite: org.apache.lucene.index.TestMultiDocValues
     [exec] [junit4:junit4] IGNOR/A 0.01s J1 | TestMultiDocValues.testSortedSetWithDups
     [exec] [junit4:junit4]    > Assumption #1: codec does not support SORTED_SET
     [exec] [junit4:junit4] IGNOR/A 0.01s J1 | TestMultiDocValues.testSortedSet
     [exec] [junit4:junit4]    > Assumption #1: codec does not support SORTED_SET
     [exec] [junit4:junit4] Completed on J1 in 0.38s, 6 tests, 2 skipped
     [exec] [junit4:junit4] 
     [exec] [junit4:junit4] Suite: org.apache.lucene.search.TestShardSearching
     [exec] [junit4:junit4] Completed on J0 in 4.67s, 1 test
     [exec] [junit4:junit4] 
     [exec] [junit4:junit4] Suite: org.apache.lucene.search.TestDocBoost
     [exec] [junit4:junit4] Completed on J0 in 0.07s, 1 test
     [exec] [junit4:junit4] 
     [exec] [junit4:junit4] Suite: org.apache.lucene.index.TestForceMergeForever
     [exec] [junit4:junit4] Completed on J0 in 0.30s, 1 test
     [exec] [junit4:junit4] 
     [exec] [junit4:junit4] Suite: org.apache.lucene.search.TestSameScoresWithThreads
     [exec] [junit4:junit4] Completed on J0 in 0.28s, 1 test
     [exec] [junit4:junit4] 
     [exec] [junit4:junit4] Suite: org.apache.lucene.codecs.compressing.TestCompressingTermVectorsFormat
     [exec] [junit4:junit4] Completed on J1 in 3.43s, 7 tests
     [exec] [junit4:junit4] 
     [exec] [junit4:junit4] Suite: org.apache.lucene.util.TestCollectionUtil
     [exec] [junit4:junit4] Completed on J2 in 5.24s, 7 tests
     [exec] [junit4:junit4] 
     [exec] [junit4:junit4] Suite: org.apache.lucene.index.TestIndexWriterExceptions
     [exec] [junit4:junit4] Completed on J3 in 5.65s, 26 tests
     [exec] [junit4:junit4] 
     [exec] [junit4:junit4] Suite: org.apache.lucene.index.TestDuelingCodecs
     [exec] [junit4:junit4] Completed on J0 in 2.94s, 1 test
     [exec] [junit4:junit4] 
     [exec] [junit4:junit4] Suite: org.apache.lucene.index.TestFlushByRamOrCountsPolicy
     [exec] [junit4:junit4] Completed on J1 in 3.61s, 5 tests
     [exec] [junit4:junit4] 
     [exec] [junit4:junit4] Suite: org.apache.lucene.codecs.lucene40.TestLucene40TermVectorsFormat
     [exec] [junit4:junit4] Completed on J2 in 2.96s, 7 tests
     [exec] [junit4:junit4] 
     [exec] [junit4:junit4] Suite: org.apache.lucene.search.TestDocTermOrdsRewriteMethod
     [exec] [junit4:junit4] Completed on J1 in 0.94s, 2 tests
     [exec] [junit4:junit4] 
     [exec] [junit4:junit4] Suite: org.apache.lucene.codecs.lucene42.TestLucene42DocValuesFormat
     [exec] [junit4:junit4] Completed on J0 in 2.82s, 54 tests
     [exec] [junit4:junit4] 
     [exec] [junit4:junit4] Suite: org.apache.lucene.index.TestDeletionPolicy
     [exec] [junit4:junit4] Completed on J3 in 4.11s, 6 tests
     [exec] [junit4:junit4] 
     [exec] [junit4:junit4] Suite: org.apache.lucene.search.TestSearchAfter
     [exec] [junit4:junit4] Completed on J2 in 1.63s, 1 test
     [exec] [junit4:junit4] 
     [exec] [junit4:junit4] Suite: org.apache.lucene.util.TestNumericUtils
     [exec] [junit4:junit4] Completed on J3 in 0.88s, 12 tests
     [exec] [junit4:junit4] 
     [exec] [junit4:junit4] Suite: org.apache.lucene.codecs.lucene40.TestLucene40PostingsReader
     [exec] [junit4:junit4] Completed on J0 in 1.97s, 1 test
     [exec] [junit4:junit4] 
     [exec] [junit4:junit4] Suite: org.apache.lucene.search.TestBooleanOr
     [exec] [junit4:junit4] Completed on J2 in 1.10s, 6 tests
     [exec] [junit4:junit4] 
     [exec] [junit4:junit4] Suite: org.apache.lucene.index.TestCustomNorms
     [exec] [junit4:junit4] Completed on J3 in 1.12s, 1 test
     [exec] [junit4:junit4] 
     [exec] [junit4:junit4] Suite: org.apache.lucene.codecs.lucene3x.TestLucene3xTermVectorsFormat
     [exec] [junit4:junit4] Completed on J1 in 2.96s, 7 tests
     [exec] [junit4:junit4] 
     [exec] [junit4:junit4] Suite: org.apache.lucene.index.TestMixedCodecs
     [exec] [junit4:junit4] Completed on J0 in 0.72s, 1 test
     [exec] [junit4:junit4] 
     [exec] [junit4:junit4] Suite: org.apache.lucene.search.spans.TestSpanExplanations
     [exec] [junit4:junit4] Completed on J2 in 0.97s, 31 tests
     [exec] [junit4:junit4] 
     [exec] [junit4:junit4] Suite: org.apache.lucene.index.TestPostingsFormat
     [exec] [junit4:junit4] Completed on J0 in 0.67s, 7 tests
     [exec] [junit4:junit4] 
     [exec] [junit4:junit4] Suite: org.apache.lucene.index.TestStoredFieldsFormat
     [exec] [junit4:junit4] IGNOR/A 0.01s J3 | TestStoredFieldsFormat.testBigDocuments
     [exec] [junit4:junit4]    > Assumption #1: 'nightly' test group is disabled (@Nightly)
     [exec] [junit4:junit4] Completed on J3 in 1.80s, 10 tests, 1 skipped
     [exec] [junit4:junit4] 
     [exec] [junit4:junit4] Suite: org.apache.lucene.index.TestIndexWriterForceMerge
     [exec] [junit4:junit4] Completed on J2 in 1.61s, 4 tests
     [exec] [junit4:junit4] 
     [exec] [junit4:junit4] Suite: org.apache.lucene.search.TestRegexpRandom2
     [exec] [junit4:junit4] Completed on J1 in 2.03s, 1 test
     [exec] [junit4:junit4] 
     [exec] [junit4:junit4] Suite: org.apache.lucene.index.TestIndexWriterUnicode
     [exec] [junit4:junit4] Completed on J0 in 1.86s, 5 tests
     [exec] [junit4:junit4] 
     [exec] [junit4:junit4] Suite: org.apache.lucene.search.TestTermVectors
     [exec] [junit4:junit4] Completed on J0 in 0.23s, 4 tests
     [exec] [junit4:junit4] 
     [exec] [junit4:junit4] Suite: org.apache.lucene.store.TestBufferedIndexInput
     [exec] [junit4:junit4] Completed on J3 in 1.77s, 4 tests
     [exec] [junit4:junit4] 
     [exec] [junit4:junit4] Suite: org.apache.lucene.index.TestBagOfPositions
     [exec] [junit4:junit4] Completed on J1 in 1.75s, 1 test
     [exec] [junit4:junit4] 
     [exec] [junit4:junit4] Suite: org.apache.lucene.index.TestByteSlices
     [exec] [junit4:junit4] Completed on J0 in 1.73s, 1 test
     [exec] [junit4:junit4] 
     [exec] [junit4:junit4] Suite: org.apache.lucene.codecs.compressing.TestCompressingStoredFieldsFormat
     [exec] [junit4:junit4] IGNOR/A 0.00s J1 | TestCompressingStoredFieldsFormat.testBigDocuments
     [exec] [junit4:junit4]    > Assumption #1: 'nightly' test group is disabled (@Nightly)
     [exec] [junit4:junit4] Completed on J1 in 1.13s, 11 tests, 1 skipped
     [exec] [junit4:junit4] 
     [exec] [junit4:junit4] Suite: org.apache.lucene.index.TestBagOfPostings
     [exec] [junit4:junit4] Completed on J0 in 0.46s, 1 test
     [exec] [junit4:junit4] 
     [exec] [junit4:junit4] Suite: org.apache.lucene.index.TestIndexWriterCommit
     [exec] [junit4:junit4] Completed on J3 in 1.56s, 12 tests
     [exec] [junit4:junit4] 
     [exec] [junit4:junit4] Suite: org.apache.lucene.index.TestTransactions
     [exec] [junit4:junit4] Completed on J3 in 0.71s, 1 test
     [exec] [junit4:junit4] 
     [exec] [junit4:junit4] Suite: org.apache.lucene.index.TestStressIndexing
     [exec] [junit4:junit4] Completed on J0 in 1.55s, 1 test
     [exec] [junit4:junit4] 
     [exec] [junit4:junit4] Suite: org.apache.lucene.index.TestIndexWriterNRTIsCurrent
     [exec] [junit4:junit4] Completed on J0 in 0.82s, 1 test
     [exec] [junit4:junit4] 
     [exec] [junit4:junit4] Suite: org.apache.lucene.index.TestTermsEnum
     [exec] [junit4:junit4] Completed on J3 in 1.56s, 7 tests
     [exec] [junit4:junit4] 
     [exec] [junit4:junit4] Suite: org.apache.lucene.index.TestDirectoryReaderReopen
     [exec] [junit4:junit4] Completed on J1 in 2.86s, 6 tests
     [exec] [junit4:junit4] 
     [exec] [junit4:junit4] Suite: org.apache.lucene.index.TestLongPostings
     [exec] [junit4:junit4] Completed on J2 in 6.66s, 2 tests
     [exec] [junit4:junit4] 
     [exec] [junit4:junit4] Suite: org.apache.lucene.index.TestSegmentTermDocs
     [exec] [junit4:junit4] Completed on J1 in 0.79s, 5 tests
     [exec] [junit4:junit4] 
     [exec] [junit4:junit4] Suite: org.apache.lucene.util.automaton.TestMinimize
     [exec] [junit4:junit4] Completed on J3 in 1.74s, 3 tests
     [exec] [junit4:junit4] 
     [exec] [junit4:junit4] Suite: org.apache.lucene.codecs.compressing.TestFastDecompressionMode
     [exec] [junit4:junit4] Completed on J2 in 1.30s, 8 tests
     [exec] [junit4:junit4] 
     [exec] [junit4:junit4] Suite: org.apache.lucene.index.TestRollingUpdates
     [exec] [junit4:junit4] Completed on J0 in 2.66s, 2 tests
     [exec] [junit4:junit4] 
     [exec] [junit4:junit4] Suite: org.apache.lucene.index.TestOmitNorms
     [exec] [junit4:junit4] Completed on J1 in 1.39s, 5 tests
     [exec] [junit4:junit4] 
     [exec] [junit4:junit4] Suite: org.apache.lucene.search.spans.TestSpansAdvanced2
     [exec] [junit4:junit4] Completed on J2 in 0.30s, 4 tests
     [exec] [junit4:junit4] 
     [exec] [junit4:junit4] Suite: org.apache.lucene.search.TestPrefixInBooleanQuery
     [exec] [junit4:junit4] Completed on J2 in 0.16s, 4 tests
     [exec] [junit4:junit4] 
     [exec] [junit4:junit4] Suite: org.apache.lucene.index.TestDirectoryReader
     [exec] [junit4:junit4] Completed on J3 in 1.26s, 27 tests
     [exec] [junit4:junit4] 
     [exec] [junit4:junit4] Suite: org.apache.lucene.index.TestNorms
     [exec] [junit4:junit4] Completed on J0 in 0.76s, 2 tests
     [exec] [junit4:junit4] 
     [exec] [junit4:junit4] Suite: org.apache.lucene.store.TestLockFactory
     [exec] [junit4:junit4] IGNOR/A 0.00s J1 | TestLockFactory.testStressLocksNativeFSLockFactory
     [exec] [junit4:junit4]    > Assumption #1: 'nightly' test group is disabled (@Nightly)
     [exec] [junit4:junit4] IGNOR/A 0.01s J1 | TestLockFactory.testStressLocks
     [exec] [junit4:junit4]    > Assumption #1: 'nightly' test group is disabled (@Nightly)
     [exec] [junit4:junit4] Completed on J1 in 1.10s, 11 tests, 2 skipped
     [exec] [junit4:junit4] 
     [exec] [junit4:junit4] Suite: org.apache.lucene.search.similarities.TestSimilarityBase
     [exec] [junit4:junit4] Completed on J2 in 0.92s, 29 tests
     [exec] [junit4:junit4] 
     [exec] [junit4:junit4] Suite: org.apache.lucene.codecs.lucene3x.TestTermInfosReaderIndex
     [exec] [junit4:junit4] Completed on J1 in 0.41s, 3 tests
     [exec] [junit4:junit4] 
     [exec] [junit4:junit4] Suite: org.apache.lucene.index.TestThreadedForceMerge
     [exec] [junit4:junit4] Completed on J2 in 0.53s, 1 test
     [exec] [junit4:junit4] 
     [exec] [junit4:junit4] Suite: org.apache.lucene.index.TestConsistentFieldNumbers
     [exec] [junit4:junit4] Completed on J3 in 1.40s, 4 tests
     [exec] [junit4:junit4] 
     [exec] [junit4:junit4] Suite: org.apache.lucene.analysis.TestToken
     [exec] [junit4:junit4] Completed on J0 in 1.10s, 10 tests
     [exec] [junit4:junit4] 
     [exec] [junit4:junit4] Suite: org.apache.lucene.util.TestFieldCacheSanityChecker
     [exec] [junit4:junit4] Completed on J3 in 0.37s, 3 tests
     [exec] [junit4:junit4] 
     [exec] [junit4:junit4] Suite: org.apache.lucene.index.TestCrash
     [exec] [junit4:junit4] Completed on J1 in 0.76s, 5 tests
     [exec] [junit4:junit4] 
     [exec] [junit4:junit4] Suite: org.apache.lucene.codecs.lucene41.TestBlockPostingsFormat
     [exec] [junit4:junit4] Completed on J2 in 0.55s, 7 tests
     [exec] [junit4:junit4] 
     [exec] [junit4:junit4] Suite: org.apache.lucene.index.TestDocValuesIndexing
     [exec] [junit4:junit4] Completed on J3 in 0.67s, 30 tests
     [exec] [junit4:junit4] 
     [exec] [junit4:junit4] Suite: org.apache.lucene.index.TestParallelCompositeReader
     [exec] [junit4:junit4] Completed on J0 in 1.15s, 13 tests
     [exec] [junit4:junit4] 
     [exec] [junit4:junit4] Suite: org.apache.lucene.index.TestSegmentReader
     [exec] [junit4:junit4] Completed on J1 in 0.73s, 7 tests
     [exec] [junit4:junit4] 
     [exec] [junit4:junit4] Suite: org.apache.lucene.search.TestSort
     [exec] [junit4:junit4] Completed on J2 in 0.84s, 49 tests
     [exec] [junit4:junit4] 
     [exec] [junit4:junit4] Suite: org.apache.lucene.search.TestDocTermOrdsRangeFilter
     [exec] [junit4:junit4] Completed on J3 in 0.62s, 1 test
     [exec] [junit4:junit4] 
     [exec] [junit4:junit4] Suite: org.apache.lucene.util.automaton.TestDeterminizeLexicon
     [exec] [junit4:junit4] Completed on J0 in 0.64s, 1 test
     [exec] [junit4:junit4] 
     [exec] [junit4:junit4] Suite: org.apache.lucene.util.automaton.TestUTF32ToUTF8
     [exec] [junit4:junit4] Completed on J1 in 0.65s, 5 tests
     [exec] [junit4:junit4] 
     [exec] [junit4:junit4] Suite: org.apache.lucene.search.TestFilteredQuery
     [exec] [junit4:junit4] Completed on J2 in 0.42s, 12 tests
     [exec] [junit4:junit4] 
     [exec] [junit4:junit4] Suite: org.apache.lucene.index.TestCrashCausesCorruptIndex
     [exec] [junit4:junit4] Completed on J3 in 0.34s, 1 test
     [exec] [junit4:junit4] 
     [exec] [junit4:junit4] Suite: org.apache.lucene.index.TestTermsEnum2
     [exec] [junit4:junit4] Completed on J0 in 0.43s, 4 tests
     [exec] [junit4:junit4] 
     [exec] [junit4:junit4] Suite: org.apache.lucene.search.TestSloppyPhraseQuery2
     [exec] [junit4:junit4] Completed on J1 in 0.67s, 9 tests
     [exec] [junit4:junit4] 
     [exec] [junit4:junit4] Suite: org.apache.lucene.search.spans.TestPayloadSpans
     [exec] [junit4:junit4] Completed on J2 in 0.67s, 10 tests
     [exec] [junit4:junit4] 
     [exec] [junit4:junit4] Suite: org.apache.lucene.util.TestRamUsageEstimatorOnWildAnimals
     [exec] [junit4:junit4] Completed on J3 in 0.95s, 1 test
     [exec] [junit4:junit4] 
     [exec] [junit4:junit4] Suite: org.apache.lucene.index.TestStressNRT
     [exec] [junit4:junit4] Completed on J0 in 0.82s, 1 test
     [exec] [junit4:junit4] 
     [exec] [junit4:junit4] Suite: org.apache.lucene.index.TestLazyProxSkipping
     [exec] [junit4:junit4] Completed on J2 in 0.67s, 2 tests
     [exec] [junit4:junit4] 
     [exec] [junit4:junit4] Suite: org.apache.lucene.index.TestStressIndexing2
     [exec] [junit4:junit4] Completed on J1 in 0.88s, 3 tests
     [exec] [junit4:junit4] 
     [exec] [junit4:junit4] Suite: org.apache.lucene.search.payloads.TestPayloadTermQuery
     [exec] [junit4:junit4] Completed on J3 in 0.35s, 6 tests
     [exec] [junit4:junit4] 
     [exec] [junit4:junit4] Suite: org.apache.lucene.util.TestSorterTemplate
     [exec] [junit4:junit4] Completed on J2 in 0.35s, 6 tests
     [exec] [junit4:junit4] 
     [exec] [junit4:junit4] Suite: org.apache.lucene.index.TestFilterAtomicReader
     [exec] [junit4:junit4] Completed on J3 in 0.04s, 2 tests
     [exec] [junit4:junit4] 
     [exec] [junit4:junit4] Suite: org.apache.lucene.search.TestSortDocValues
     [exec] [junit4:junit4] Completed on J0 in 0.61s, 19 tests
     [exec] [junit4:junit4] 
     [exec] [junit4:junit4] Suite: org.apache.lucene.index.TestOmitPositions
     [exec] [junit4:junit4] Completed on J1 in 0.35s, 4 tests
     [exec] [junit4:junit4] 
     [exec] [junit4:junit4] Suite: org.apache.lucene.util.junitcompat.TestReproduceMessage
     [exec] [junit4:junit4] Completed on J3 in 0.49s, 21 tests
     [exec] [junit4:junit4] 
     [exec] [junit4:junit4] Suite: org.apache.lucene.search.TestFieldCacheRangeFilter
     [exec] [junit4:junit4] Completed on J1 in 0.45s, 9 tests
     [exec] [junit4:junit4] 
     [exec] [junit4:junit4] Suite: org.apache.lucene.index.TestDocCount
     [exec] [junit4:junit4] Completed on J3 in 0.09s, 1 test
     [exec] [junit4:junit4] 
     [exec] [junit4:junit4] Suite: org.apache.lucene.index.TestStressAdvance
     [exec] [junit4:junit4] Completed on J0 in 0.63s, 1 test
     [exec] [junit4:junit4] 
     [exec] [junit4:junit4] Suite: org.apache.lucene.codecs.compressing.TestFastCompressionMode
     [exec] [junit4:junit4] Completed on J2 in 0.82s, 8 tests
     [exec] [junit4:junit4] 
     [exec] [junit4:junit4] Suite: org.apache.lucene.index.TestCodecs
     [exec] [junit4:junit4] Completed on J3 in 0.24s, 4 tests
     [exec] [junit4:junit4] 
     [exec] [junit4:junit4] Suite: org.apache.lucene.search.payloads.TestPayloadExplanations
     [exec] [junit4:junit4] Completed on J1 in 0.31s, 5 tests
     [exec] [junit4:junit4] 
     [exec] [junit4:junit4] Suite: org.apache.lucene.index.TestForTooMuchCloning
     [exec] [junit4:junit4] Completed on J2 in 0.20s, 1 test
     [exec] [junit4:junit4] 
     [exec] [junit4:junit4] Suite: org.apache.lucene.search.TestSimpleExplanationsOfNonMatches
     [exec] [junit4:junit4] Completed on J0 in 0.26s, 69 tests
     [exec] [junit4:junit4] 
     [exec] [junit4:junit4] Suite: org.apache.lucene.search.TestTopFieldCollector
     [exec] [junit4:junit4] Completed on J1 in 0.15s, 8 tests
     [exec] [junit4:junit4] 
     [exec] [junit4:junit4] Suite: org.apache.lucene.search.TestTermRangeQuery
     [exec] [junit4:junit4] Completed on J2 in 0.12s, 7 tests
     [exec] [junit4:junit4] 
     [exec] [junit4:junit4] Suite: org.apache.lucene.index.TestDocsAndPositions
     [exec] [junit4:junit4] Completed on J3 in 0.42s, 6 tests
     [exec] [junit4:junit4] 
     [exec] [junit4:junit4] Suite: org.apache.lucene.index.TestPrefixCodedTerms
     [exec] [junit4:junit4] Completed on J0 in 0.15s, 6 tests
     [exec] [junit4:junit4] 
     [exec] [junit4:junit4] Suite: org.apache.lucene.search.TestAutomatonQueryUnicode
     [exec] [junit4:junit4] Completed on J1 in 0.02s, 1 test
     [exec] [junit4:junit4] 
     [exec] [junit4:junit4] Suite: org.apache.lucene.search.similarities.TestSimilarity2
     [exec] [junit4:junit4] Completed on J2 in 0.11s, 7 tests
     [exec] [junit4:junit4] 
     [exec] [junit4:junit4] Suite: org.apache.lucene.analysis.TestNumericTokenStream
     [exec] [junit4:junit4] Completed on J3 in 0.02s, 4 tests
     [exec] [junit4:junit4] 
     [exec] [junit4:junit4] Suite: org.apache.lucene.util.TestUnicodeUtil
     [exec] [junit4:junit4] Completed on J0 in 0.19s, 4 tests
     [exec] [junit4:junit4] 
     [exec] [junit4:junit4] Suite: org.apache.lucene.TestExternalCodecs
     [exec] [junit4:junit4] Completed on J1 in 0.05s, 1 test
     [exec] [junit4:junit4] 
     [exec] [junit4:junit4] Suite: org.apache.lucene.index.TestDocValuesWithThreads
     [exec] [junit4:junit4] Completed on J2 in 0.11s, 2 tests
     [exec] [junit4:junit4] 
     [exec] [junit4:junit4] Suite: org.apache.lucene.search.spans.TestNearSpansOrdered
     [exec] [junit4:junit4] Completed on J0 in 0.15s, 10 tests
     [exec] [junit4:junit4] 
     [exec] [junit4:junit4] Suite: org.apache.lucene.store.TestFileSwitchDirectory
     [exec] [junit4:junit4] Completed on J1 in 0.05s, 4 tests
     [exec] [junit4:junit4] 
     [exec] [junit4:junit4] Suite: org.apache.lucene.store.TestDirectory
     [exec] [junit4:junit4] IGNOR/A 0.00s J2 | TestDirectory.testThreadSafety
     [exec] [junit4:junit4]    > Assumption #1: 'nightly' test group is disabled (@Nightly)
     [exec] [junit4:junit4] Completed on J2 in 0.06s, 8 tests, 1 skipped
     [exec] [junit4:junit4] 
     [exec] [junit4:junit4] Suite: org.apache.lucene.search.TestQueryWrapperFilter
     [exec] [junit4:junit4] Completed on J3 in 0.38s, 3 tests
     [exec] [junit4:junit4] 
     [exec] [junit4:junit4] Suite: org.apache.lucene.store.TestWindowsMMap
     [exec] [junit4:junit4] Completed on J1 in 0.19s, 1 test
     [exec] [junit4:junit4] 
     [exec] [junit4:junit4] Suite: org.apache.lucene.util.TestIndexableBinaryStringTools
     [exec] [junit4:junit4] Completed on J2 in 0.22s, 5 tests
     [exec] [junit4:junit4] 
     [exec] [junit4:junit4] Suite: org.apache.lucene.search.spans.TestSpanMultiTermQueryWrapper
     [exec] [junit4:junit4] Completed on J3 in 0.18s, 4 tests
     [exec] [junit4:junit4] 
     [exec] [junit4:junit4] Suite: org.apache.lucene.search.TestComplexExplanationsOfNonMatches
     [exec] [junit4:junit4] Completed on J0 in 0.35s, 22 tests
     [exec] [junit4:junit4] 
     [exec] [junit4:junit4] Suite: org.apache.lucene.search.TestDocValuesScoring
     [exec] [junit4:junit4] Completed on J1 in 0.11s, 1 test
     [exec] [junit4:junit4] 
     [exec] [junit4:junit4] Suite: org.apache.lucene.index.TestFlex
     [exec] [junit4:junit4] Completed on J2 in 0.06s, 2 tests
     [exec] [junit4:junit4] 
     [exec] [junit4:junit4] Suite: org.apache.lucene.index.TestPerSegmentDeletes
     [exec] [junit4:junit4] Completed on J3 in 0.07s, 1 test
     [exec] [junit4:junit4] 
     [exec] [junit4:junit4] Suite: org.apache.lucene.search.TestMultiTermQueryRewrites
     [exec] [junit4:junit4] Completed on J0 in 0.10s, 3 tests
     [exec] [junit4:junit4] 
     [exec] [junit4:junit4] Suite: org.apache.lucene.index.Test2BPostings
     [exec] [junit4:junit4] IGNOR/A 0.00s J1 | Test2BPostings.test
     [exec] [junit4:junit4]    > Assumption #1: 'nightly' test group is disabled (@Nightly)
     [exec] [junit4:junit4] Completed on J1 in 0.06s, 1 test, 1 skipped
     [exec] [junit4:junit4] 
     [exec] [junit4:junit4] Suite: org.apache.lucene.search.TestTopDocsCollector
     [exec] [junit4:junit4] Completed on J2 in 0.17s, 8 tests
     [exec] [junit4:junit4] 
     [exec] [junit4:junit4] Suite: org.apache.lucene.index.TestCheckIndex
     [exec] [junit4:junit4] Completed on J3 in 0.06s, 3 tests
     [exec] [junit4:junit4] 
     [exec] [junit4:junit4] Suite: org.apache.lucene.search.TestFilteredSearch
     [exec] [junit4:junit4] Completed on J0 in 0.14s, 1 test
     [exec] [junit4:junit4] 
     [exec] [junit4:junit4] Suite: org.apache.lucene.index.TestParallelReaderEmptyIndex
     [exec] [junit4:junit4] Completed on J1 in 0.05s, 2 tests
     [exec] [junit4:junit4] 
     [exec] [junit4:junit4] Suite: org.apache.lucene.search.TestWildcardRandom
     [exec] [junit4:junit4] Completed on J2 in 0.10s, 1 test
     [exec] [junit4:junit4] 
     [exec] [junit4:junit4] Suite: org.apache.lucene.util.TestRecyclingIntBlockAllocator
     [exec] [junit4:junit4] Completed on J3 in 0.04s, 3 tests
     [exec] [junit4:junit4] 
     [exec] [junit4:junit4] Suite: org.apache.lucene.util.TestIdentityHashSet
     [exec] [junit4:junit4] Completed on J0 in 0.14s, 1 test
     [exec] [junit4:junit4] 
     [exec] [junit4:junit4] Suite: org.apache.lucene.search.TestFieldValueFilter
     [exec] [junit4:junit4] Completed on J1 in 0.06s, 2 tests
     [exec] [junit4:junit4] 
     [exec] [junit4:junit4] Suite: org.apache.lucene.index.TestSegmentTermEnum
     [exec] [junit4:junit4] Completed on J2 in 0.03s, 2 tests
     [exec] [junit4:junit4] 
     [exec] [junit4:junit4] Suite: org.apache.lucene.search.TestEarlyTermination
     [exec] [junit4:junit4] Completed on J3 in 0.02s, 1 test
     [exec] [junit4:junit4] 
     [exec] [junit4:junit4] Suite: org.apache.lucene.index.TestTermVectorsReader
     [exec] [junit4:junit4] Completed on J0 in 0.08s, 5 tests
     [exec] [junit4:junit4] 
     [exec] [junit4:junit4] Suite: org.apache.lucene.search.TestIndexSearcher
     [exec] [junit4:junit4] Completed on J1 in 0.09s, 1 test
     [exec] [junit4:junit4] 
     [exec] [junit4:junit4] Suite: org.apache.lucene.index.TestBinaryTerms
     [exec] [junit4:junit4] Completed on J2 in 0.11s, 2 tests
     [exec] [junit4:junit4] 
     [exec] [junit4:junit4] Suite: org.apache.lucene.search.TestScoreCachingWrappingScorer
     [exec] [junit4:junit4] Completed on J3 in 0.02s, 1 test
     [exec] [junit4:junit4] 
     [exec] [junit4:junit4] Suite: org.apache.lucene.search.TestRegexpRandom
     [exec] [junit4:junit4] Completed on J0 in 0.07s, 1 test
     [exec] [junit4:junit4] 
     [exec] [junit4:junit4] Suite: org.apache.lucene.util.automaton.TestSpecialOperations
     [exec] [junit4:junit4] Completed on J1 in 0.08s, 2 tests
     [exec] [junit4:junit4] 
     [exec] [junit4:junit4] Suite: org.apache.lucene.util.TestSetOnce
     [exec] [junit4:junit4] Completed on J2 in 0.04s, 4 tests
     [exec] [junit4:junit4] 
     [exec] [junit4:junit4] Suite: org.apache.lucene.document.TestDateTools
     [exec] [junit4:junit4] Completed on J3 in 0.05s, 5 tests
     [exec] [junit4:junit4] 
     [exec] [junit4:junit4] Suite: org.apache.lucene.search.TestCachingCollector
     [exec] [junit4:junit4] Completed on J0 in 0.05s, 5 tests
     [exec] [junit4:junit4] 
     [exec] [junit4:junit4] Suite: org.apache.lucene.search.TestTermScorer
     [exec] [junit4:junit4] Completed on J1 in 0.04s, 3 tests
     [exec] [junit4:junit4] 
     [exec] [junit4:junit4] Suite: org.apache.lucene.util.TestCharsRef
     [exec] [junit4:junit4] Completed on J3 in 0.04s, 8 tests
     [exec] [junit4:junit4] 
     [exec] [junit4:junit4] Suite: org.apache.lucene.util.TestAttributeSource
     [exec] [junit4:junit4] Completed on J0 in 0.03s, 5 tests
     [exec] [junit4:junit4] 
     [exec] [junit4:junit4] Suite: org.apache.lucene.util.TestBytesRef
     [exec] [junit4:junit4] Completed on J1 in 0.03s, 5 tests
     [exec] [junit4:junit4] 
     [exec] [junit4:junit4] Suite: org.apache.lucene.index.TestSameTokenSamePosition
     [exec] [junit4:junit4] Completed on J2 in 0.26s, 2 tests
     [exec] [junit4:junit4] 
     [exec] [junit4:junit4] Suite: org.apache.lucene.codecs.lucene41.TestForUtil
     [exec] [junit4:junit4] Completed on J3 in 0.16s, 1 test
     [exec] [junit4:junit4] 
     [exec] [junit4:junit4] Suite: org.apache.lucene.util.TestRamUsageEstimator
     [exec] [junit4:junit4] Completed on J0 in 0.03s, 3 tests
     [exec] [junit4:junit4] 
     [exec] [junit4:junit4] Suite: org.apache.lucene.index.TestUniqueTermCount
     [exec] [junit4:junit4] Completed on J1 in 0.06s, 1 test
     [exec] [junit4:junit4] 
     [exec] [junit4:junit4] Suite: org.apache.lucene.util.TestPriorityQueue
     [exec] [junit4:junit4] Completed on J2 in 0.04s, 4 tests
     [exec] [junit4:junit4] 
     [exec] [junit4:junit4] Suite: org.apache.lucene.search.TestDocIdSet
     [exec] [junit4:junit4] Completed on J3 in 0.04s, 3 tests
     [exec] [junit4:junit4] 
     [exec] [junit4:junit4] Suite: org.apache.lucene.util.junitcompat.TestSameRandomnessLocalePassedOrNot
     [exec] [junit4:junit4] Completed on J0 in 0.05s, 1 test
     [exec] [junit4:junit4] 
     [exec] [junit4:junit4] Suite: org.apache.lucene.TestDemo
     [exec] [junit4:junit4] Completed on J1 in 0.02s, 1 test
     [exec] [junit4:junit4] 
     [exec] [junit4:junit4] Suite: org.apache.lucene.search.TestExplanations
     [exec] [junit4:junit4] Completed on J2 in 0.02s, 1 test
     [exec] [junit4:junit4] 
     [exec] [junit4:junit4] Suite: org.apache.lucene.analysis.TestCharFilter
     [exec] [junit4:junit4] Completed on J3 in 0.02s, 4 tests
     [exec] [junit4:junit4] 
     [exec] [junit4:junit4] Suite: org.apache.lucene.search.TestDateFilter
     [exec] [junit4:junit4] Completed on J0 in 0.03s, 2 tests
     [exec] [junit4:junit4] 
     [exec] [junit4:junit4] Suite: org.apache.lucene.index.TestNoMergeScheduler
     [exec] [junit4:junit4] Completed on J1 in 0.03s, 3 tests
     [exec] [junit4:junit4] 
     [exec] [junit4:junit4] Suite: org.apache.lucene.search.TestFieldCacheTermsFilter
     [exec] [junit4:junit4] Completed on J2 in 0.04s, 1 test
     [exec] [junit4:junit4] 
     [exec] [junit4:junit4] Suite: org.apache.lucene.index.TestTwoPhaseCommitTool
     [exec] [junit4:junit4] Completed on J3 in 0.03s, 3 tests
     [exec] [junit4:junit4] 
     [exec] [junit4:junit4] Suite: org.apache.lucene.search.TestSimilarityProvider
     [exec] [junit4:junit4] Completed on J0 in 0.08s, 1 test
     [exec] [junit4:junit4] 
     [exec] [junit4:junit4] Suite: org.apache.lucene.util.junitcompat.TestCodecReported
     [exec] [junit4:junit4] Completed on J1 in 0.03s, 1 test
     [exec] [junit4:junit4] 
     [exec] [junit4:junit4] Suite: org.apache.lucene.store.TestMockDirectoryWrapper
     [exec] [junit4:junit4] Completed on J2 in 0.02s, 2 tests
     [exec] [junit4:junit4] 
     [exec] [junit4:junit4] Suite: org.apache.lucene.util.TestVersionComparator
     [exec] [junit4:junit4] Completed on J3 in 0.01s, 1 test
     [exec] [junit4:junit4] 
     [exec] [junit4:junit4] Suite: org.apache.lucene.TestAssertions
     [exec] [junit4:junit4] Completed on J0 in 0.02s, 1 test
     [exec] [junit4:junit4] 
     [exec] [junit4:junit4] Suite: org.apache.lucene.index.TestIsCurrent
     [exec] [junit4:junit4] Completed on J1 in 0.03s, 2 tests
     [exec] [junit4:junit4] 
     [exec] [junit4:junit4] Suite: org.apache.lucene.util.TestNamedSPILoader
     [exec] [junit4:junit4] Completed on J2 in 0.02s, 3 tests
     [exec] [junit4:junit4] 
     [exec] [junit4:junit4] Suite: org.apache.lucene.index.TestRollback
     [exec] [junit4:junit4] Completed on J3 in 0.02s, 1 test
     [exec] [junit4:junit4] 
     [exec] [junit4:junit4] Suite: org.apache.lucene.search.MultiCollectorTest
     [exec] [junit4:junit4] Completed on J0 in 0.03s, 3 tests
     [exec] [junit4:junit4] 
     [exec] [junit4:junit4] Suite: org.apache.lucene.search.TestPrefixFilter
     [exec] [junit4:junit4] Completed on J1 in 0.02s, 1 test
     [exec] [junit4:junit4] 
     [exec] [junit4:junit4] Suite: org.apache.lucene.analysis.TestMockCharFilter
     [exec] [junit4:junit4] Completed on J2 in 0.02s, 1 test
     [exec] [junit4:junit4] 
     [exec] [junit4:junit4] Suite: org.apache.lucene.index.TestCodecHoldsOpenFiles
     [exec] [junit4:junit4] Completed on J3 in 0.02s, 1 test
     [exec] [junit4:junit4] 
     [exec] [junit4:junit4] Suite: org.apache.lucene.search.TestPrefixQuery
     [exec] [junit4:junit4] Completed on J0 in 0.10s, 1 test
     [exec] [junit4:junit4] 
     [exec] [junit4:junit4] Suite: org.apache.lucene.util.TestIntsRef
     [exec] [junit4:junit4] Completed on J1 in 0.02s, 2 tests
     [exec] [junit4:junit4] 
     [exec] [junit4:junit4] Suite: org.apache.lucene.index.Test2BPositions
     [exec] [junit4:junit4] Completed on J2 in 0.01s, 1 test, 1 skipped
     [exec] [junit4:junit4] 
     [exec] [junit4:junit4] Suite: org.apache.lucene.search.TestPositiveScoresOnlyCollector
     [exec] [junit4:junit4] Completed on J3 in 0.02s, 1 test
     [exec] [junit4:junit4] 
     [exec] [junit4:junit4] Suite: org.apache.lucene.index.TestFieldInfos
     [exec] [junit4:junit4] Completed on J0 in 0.02s, 2 tests
     [exec] [junit4:junit4] 
     [exec] [junit4:junit4] Suite: org.apache.lucene.index.TestIndexCommit
     [exec] [junit4:junit4] Completed on J1 in 0.04s, 1 test
     [exec] [junit4:junit4] 
     [exec] [junit4:junit4] Suite: org.apache.lucene.index.TestNewestSegment
     [exec] [junit4:junit4] Completed on J2 in 0.02s, 1 test
     [exec] [junit4:junit4] 
     [exec] [junit4:junit4] Suite: org.apache.lucene.store.TestByteArrayDataInput
     [exec] [junit4:junit4] Completed on J3 in 0.02s, 1 test
     [exec] [junit4:junit4] 
     [exec] [junit4:junit4] Suite: org.apache.lucene.index.Test2BTerms
     [exec] [junit4:junit4] Completed on J0 in 0.01s, 1 test, 1 skipped
     [exec] [junit4:junit4] 
     [exec] [junit4:junit4] Suite: org.apache.lucene.index.Test2BPostingsBytes
     [exec] [junit4:junit4] Completed on J1 in 0.01s, 1 test, 1 skipped
     [exec] [junit4:junit4] 
     [exec] [junit4:junit4] Suite: org.apache.lucene.util.fst.Test2BFST
     [exec] [junit4:junit4] Completed on J2 in 0.00s, 0 tests
     [exec] [junit4:junit4] 
     [exec] [junit4:junit4] Suite: org.apache.lucene.util.Test2BPagedBytes
     [exec] [junit4:junit4] Completed on J3 in 0.00s, 0 tests
     [exec] [junit4:junit4] 
     [exec] [junit4:junit4] Suite: org.apache.lucene.index.Test2BNumericDocValues
     [exec] [junit4:junit4] Completed on J0 in 0.00s, 0 tests
     [exec] [junit4:junit4] 
     [exec] [junit4:junit4] JVM J0:     4.33 ..   131.81 =   127.48s
     [exec] [junit4:junit4] JVM J1:     4.57 ..   131.56 =   126.99s
     [exec] [junit4:junit4] JVM J2:     4.57 ..   131.70 =   127.13s
     [exec] [junit4:junit4] JVM J3:     4.57 ..   131.76 =   127.18s
     [exec] [junit4:junit4] Execution time total: 2 minutes 11 seconds
     [exec] [junit4:junit4] Tests summary: 361 suites, 2276 tests, 64 ignored (52 assumptions)
     [exec]      [echo] 5 slowest tests:
     [exec] [junit4:tophints]  12.82s | org.apache.lucene.index.TestIndexWriter
     [exec] [junit4:tophints]  10.76s | org.apache.lucene.index.TestBackwardsCompatibility3x
     [exec] [junit4:tophints]  10.54s | org.apache.lucene.util.fst.TestFSTs
     [exec] [junit4:tophints]  10.26s | org.apache.lucene.index.TestIndexWriterMerging
     [exec] [junit4:tophints]   9.56s | org.apache.lucene.index.TestIndexWriterReader
     [exec] 
     [exec] compile-test:
     [exec] 
     [exec] ivy-availability-check:
     [exec] 
     [exec] ivy-fail:
     [exec] 
     [exec] ivy-configure:
     [exec] [ivy:configure] :: loading settings :: file = /usr/home/hudson/hudson-slave/workspace/Lucene-Solr-SmokeRelease-4.3/lucene/build/fakeReleaseTmp/unpack/lucene-4.3.1/ivy-settings.xml
     [exec] 
     [exec] resolve:
     [exec] 
     [exec] init:
     [exec] 
     [exec] -clover.disable:
     [exec] 
     [exec] -clover.load:
     [exec] 
     [exec] -clover.classpath:
     [exec] 
     [exec] -clover.setup:
     [exec] 
     [exec] clover:
     [exec] 
     [exec] compile-core:
     [exec] 
     [exec] compile-test-framework:
     [exec] 
     [exec] ivy-availability-check:
     [exec] 
     [exec] ivy-fail:
     [exec] 
     [exec] ivy-configure:
     [exec] [ivy:configure] :: loading settings :: file = /usr/home/hudson/hudson-slave/workspace/Lucene-Solr-SmokeRelease-4.3/lucene/build/fakeReleaseTmp/unpack/lucene-4.3.1/ivy-settings.xml
     [exec] 
     [exec] resolve:
     [exec] 
     [exec] init:
     [exec] 
     [exec] compile-lucene-core:
     [exec] 
     [exec] ivy-availability-check:
     [exec] 
     [exec] ivy-fail:
     [exec] 
     [exec] ivy-configure:
     [exec] [ivy:configure] :: loading settings :: file = /usr/home/hudson/hudson-slave/workspace/Lucene-Solr-SmokeRelease-4.3/lucene/build/fakeReleaseTmp/unpack/lucene-4.3.1/ivy-settings.xml
     [exec] 
     [exec] resolve:
     [exec] 
     [exec] init:
     [exec] 
     [exec] -clover.disable:
     [exec] 
     [exec] -clover.load:
     [exec] 
     [exec] -clover.classpath:
     [exec] 
     [exec] -clover.setup:
     [exec] 
     [exec] clover:
     [exec] 
     [exec] compile-core:
     [exec] 
     [exec] compile-codecs:
     [exec]      [echo] Building codecs...
     [exec] 
     [exec] ivy-availability-check:
     [exec]      [echo] Building codecs...
     [exec] 
     [exec] ivy-fail:
     [exec] 
     [exec] ivy-configure:
     [exec] [ivy:configure] :: loading settings :: file = /usr/home/hudson/hudson-slave/workspace/Lucene-Solr-SmokeRelease-4.3/lucene/build/fakeReleaseTmp/unpack/lucene-4.3.1/ivy-settings.xml
     [exec] 
     [exec] resolve:
     [exec] 
     [exec] common.init:
     [exec] 
     [exec] compile-lucene-core:
     [exec] 
     [exec] init:
     [exec] 
     [exec] -clover.disable:
     [exec] 
     [exec] -clover.load:
     [exec] 
     [exec] -clover.classpath:
     [exec] 
     [exec] -clover.setup:
     [exec] 
     [exec] clover:
     [exec] 
     [exec] compile-core:
     [exec] 
     [exec] -clover.disable:
     [exec] 
     [exec] -clover.load:
     [exec] 
     [exec] -clover.classpath:
     [exec] 
     [exec] -clover.setup:
     [exec] 
     [exec] clover:
     [exec] 
     [exec] common.compile-core:
     [exec] 
     [exec] compile-core:
     [exec] 
     [exec] compile-test:
     [exec] 
     [exec] compile-test:
     [exec]      [echo] Building analyzers-common...
     [exec] 
     [exec] ivy-availability-check:
     [exec]      [echo] Building analyzers-common...
     [exec] 
     [exec] ivy-fail:
     [exec] 
     [exec] ivy-configure:
     [exec] [ivy:configure] :: loading settings :: file = /usr/home/hudson/hudson-slave/workspace/Lucene-Solr-SmokeRelease-4.3/lucene/build/fakeReleaseTmp/unpack/lucene-4.3.1/ivy-settings.xml
     [exec] 
     [exec] resolve:
     [exec] 
     [exec] common.init:
     [exec] 
     [exec] compile-lucene-core:
     [exec] 
     [exec] ivy-availability-check:
     [exec] 
     [exec] ivy-fail:
     [exec] 
     [exec] ivy-configure:
     [exec] [ivy:configure] :: loading settings :: file = /usr/home/hudson/hudson-slave/workspace/Lucene-Solr-SmokeRelease-4.3/lucene/build/fakeReleaseTmp/unpack/lucene-4.3.1/ivy-settings.xml
     [exec] 
     [exec] resolve:
     [exec] 
     [exec] init:
     [exec] 
     [exec] -clover.disable:
     [exec] 
     [exec] -clover.load:
     [exec] 
     [exec] -clover.classpath:
     [exec] 
     [exec] -clover.setup:
     [exec] 
     [exec] clover:
     [exec] 
     [exec] compile-core:
     [exec] 
     [exec] init:
     [exec] 
     [exec] compile-test:
     [exec]      [echo] Building analyzers-common...
     [exec] 
     [exec] jflex-uptodate-check:
     [exec] 
     [exec] jflex-notice:
     [exec]      [echo] 
     [exec]      [echo]       One or more of the JFlex .jflex files is newer than its corresponding
     [exec]      [echo]       .java file.  Run the "jflex" target to regenerate the artifacts.
     [exec]      [echo]     
     [exec] 
     [exec] ivy-availability-check:
     [exec] 
     [exec] ivy-configure:
     [exec] [ivy:configure] :: loading settings :: file = /usr/home/hudson/hudson-slave/workspace/Lucene-Solr-SmokeRelease-4.3/lucene/build/fakeReleaseTmp/unpack/lucene-4.3.1/ivy-settings.xml
     [exec] 
     [exec] resolve:
     [exec] 
     [exec] common.init:
     [exec] 
     [exec] compile-lucene-core:
     [exec] 
     [exec] init:
     [exec] 
     [exec] -clover.disable:
     [exec] 
     [exec] -clover.load:
     [exec] 
     [exec] -clover.classpath:
     [exec] 
     [exec] -clover.setup:
     [exec] 
     [exec] clover:
     [exec] 
     [exec] common.compile-core:
     [exec]     [mkdir] Created dir: /usr/home/hudson/hudson-slave/workspace/Lucene-Solr-SmokeRelease-4.3/lucene/build/fakeReleaseTmp/unpack/lucene-4.3.1/build/analysis/common/classes/java
     [exec]     [javac] Compiling 389 source files to /usr/home/hudson/hudson-slave/workspace/Lucene-Solr-SmokeRelease-4.3/lucene/build/fakeReleaseTmp/unpack/lucene-4.3.1/build/analysis/common/classes/java
     [exec]     [javac] /usr/home/hudson/hudson-slave/workspace/Lucene-Solr-SmokeRelease-4.3/lucene/build/fakeReleaseTmp/unpack/lucene-4.3.1/analysis/common/src/java/org/apache/lucene/analysis/nl/DutchStemmer.java:42: warning: [rawtypes] found raw type: Map
     [exec]     [javac]   private Map _stemDict;
     [exec]     [javac]           ^
     [exec]     [javac]   missing type arguments for generic class Map<K,V>
     [exec]     [javac]   where K,V are type-variables:
     [exec]     [javac]     K extends Object declared in interface Map
     [exec]     [javac]     V extends Object declared in interface Map
     [exec]     [javac] /usr/home/hudson/hudson-slave/workspace/Lucene-Solr-SmokeRelease-4.3/lucene/build/fakeReleaseTmp/unpack/lucene-4.3.1/analysis/common/src/java/org/apache/lucene/analysis/nl/DutchStemmer.java:408: warning: [rawtypes] found raw type: Map
     [exec]     [javac]   void setStemDictionary(Map dict) {
     [exec]     [javac]                          ^
     [exec]     [javac]   missing type arguments for generic class Map<K,V>
     [exec]     [javac]   where K,V are type-variables:
     [exec]     [javac]     K extends Object declared in interface Map
     [exec]     [javac]     V extends Object declared in interface Map
     [exec]     [javac] /usr/home/hudson/hudson-slave/workspace/Lucene-Solr-SmokeRelease-4.3/lucene/build/fakeReleaseTmp/unpack/lucene-4.3.1/analysis/common/src/java/org/tartarus/snowball/Among.java:46: warning: [rawtypes] found raw type: Class
     [exec]     [javac]   private static final Class<?>[] EMPTY_PARAMS = new Class[0];
     [exec]     [javac]                                                      ^
     [exec]     [javac]   missing type arguments for generic class Class<T>
     [exec]     [javac]   where T is a type-variable:
     [exec]     [javac]     T extends Object declared in class Class
     [exec]     [javac] /usr/home/hudson/hudson-slave/workspace/Lucene-Solr-SmokeRelease-4.3/lucene/build/fakeReleaseTmp/unpack/lucene-4.3.1/analysis/common/src/java/org/apache/lucene/analysis/synonym/SynonymFilterFactory.java:86: warning: [dep-ann] deprecated item is not annotated with @Deprecated
     [exec]     [javac]   TokenFilterFactory getDelegator() {
     [exec]     [javac]                      ^
     [exec]     [javac] Note: Some input files use or override a deprecated API.
     [exec]     [javac] Note: Recompile with -Xlint:deprecation for details.
     [exec]     [javac] 4 warnings
     [exec]      [copy] Copying 37 files to /usr/home/hudson/hudson-slave/workspace/Lucene-Solr-SmokeRelease-4.3/lucene/build/fakeReleaseTmp/unpack/lucene-4.3.1/build/analysis/common/classes/java
     [exec] 
     [exec] compile-core:
     [exec] 
     [exec] compile-test-framework:
     [exec] 
     [exec] ivy-availability-check:
     [exec] 
     [exec] ivy-fail:
     [exec] 
     [exec] ivy-configure:
     [exec] [ivy:configure] :: loading settings :: file = /usr/home/hudson/hudson-slave/workspace/Lucene-Solr-SmokeRelease-4.3/lucene/build/fakeReleaseTmp/unpack/lucene-4.3.1/ivy-settings.xml
     [exec] 
     [exec] resolve:
     [exec] 
     [exec] init:
     [exec] 
     [exec] compile-lucene-core:
     [exec] 
     [exec] compile-codecs:
     [exec]      [echo] Building codecs...
     [exec] 
     [exec] ivy-availability-check:
     [exec]      [echo] Building codecs...
     [exec] 
     [exec] ivy-fail:
     [exec] 
     [exec] ivy-configure:
     [exec] [ivy:configure] :: loading settings :: file = /usr/home/hudson/hudson-slave/workspace/Lucene-Solr-SmokeRelease-4.3/lucene/build/fakeReleaseTmp/unpack/lucene-4.3.1/ivy-settings.xml
     [exec] 
     [exec] resolve:
     [exec] 
     [exec] common.init:
     [exec] 
     [exec] compile-lucene-core:
     [exec] 
     [exec] init:
     [exec] 
     [exec] -clover.disable:
     [exec] 
     [exec] -clover.load:
     [exec] 
     [exec] -clover.classpath:
     [exec] 
     [exec] -clover.setup:
     [exec] 
     [exec] clover:
     [exec] 
     [exec] compile-core:
     [exec] 
     [exec] -clover.disable:
     [exec] 
     [exec] -clover.load:
     [exec] 
     [exec] -clover.classpath:
     [exec] 
     [exec] -clover.setup:
     [exec] 
     [exec] clover:
     [exec] 
     [exec] common.compile-core:
     [exec] 
     [exec] compile-core:
     [exec] 
     [exec] common.compile-test:
     [exec]     [mkdir] Created dir: /usr/home/hudson/hudson-slave/workspace/Lucene-Solr-SmokeRelease-4.3/lucene/build/fakeReleaseTmp/unpack/lucene-4.3.1/build/analysis/common/classes/test
     [exec]     [javac] Compiling 232 source files to /usr/home/hudson/hudson-slave/workspace/Lucene-Solr-SmokeRelease-4.3/lucene/build/fakeReleaseTmp/unpack/lucene-4.3.1/build/analysis/common/classes/test
     [exec]     [javac] /usr/home/hudson/hudson-slave/workspace/Lucene-Solr-SmokeRelease-4.3/lucene/build/fakeReleaseTmp/unpack/lucene-4.3.1/analysis/common/src/test/org/apache/lucene/analysis/synonym/TestSynonymFilterFactory.java:117: warning: [rawtypes] found raw type: Class
     [exec]     [javac]                                                  final Class delegatorClass) 
     [exec]     [javac]                                                        ^
     [exec]     [javac]   missing type arguments for generic class Class<T>
     [exec]     [javac]   where T is a type-variable:
     [exec]     [javac]     T extends Object declared in class Class
     [exec]     [javac] /usr/home/hudson/hudson-slave/workspace/Lucene-Solr-SmokeRelease-4.3/lucene/build/fakeReleaseTmp/unpack/lucene-4.3.1/analysis/common/src/test/org/apache/lucene/analysis/synonym/TestSynonymFilterFactory.java:163: warning: [rawtypes] found raw type: Class
     [exec]     [javac]                                       final Class delegatorClass) {
     [exec]     [javac]                                             ^
     [exec]     [javac]   missing type arguments for generic class Class<T>
     [exec]     [javac]   where T is a type-variable:
     [exec]     [javac]     T extends Object declared in class Class
     [exec]     [javac] Note: Some input files use or override a deprecated API.
     [exec]     [javac] Note: Recompile with -Xlint:deprecation for details.
     [exec]     [javac] 2 warnings
     [exec]      [copy] Copying 49 files to /usr/home/hudson/hudson-slave/workspace/Lucene-Solr-SmokeRelease-4.3/lucene/build/fakeReleaseTmp/unpack/lucene-4.3.1/build/analysis/common/classes/test
     [exec]      [echo] Building analyzers-icu...
     [exec] 
     [exec] ivy-availability-check:
     [exec]      [echo] Building analyzers-icu...
     [exec] 
     [exec] ivy-fail:
     [exec] 
     [exec] ivy-configure:
     [exec] [ivy:configure] :: loading settings :: file = /usr/home/hudson/hudson-slave/workspace/Lucene-Solr-SmokeRelease-4.3/lucene/build/fakeReleaseTmp/unpack/lucene-4.3.1/ivy-settings.xml
     [exec] 
     [exec] resolve:
     [exec] 
     [exec] common.init:
     [exec] 
     [exec] compile-lucene-core:
     [exec] 
     [exec] ivy-availability-check:
     [exec] 
     [exec] ivy-fail:
     [exec] 
     [exec] ivy-configure:
     [exec] [ivy:configure] :: loading settings :: file = /usr/home/hudson/hudson-slave/workspace/Lucene-Solr-SmokeRelease-4.3/lucene/build/fakeReleaseTmp/unpack/lucene-4.3.1/ivy-settings.xml
     [exec] 
     [exec] resolve:
     [exec] 
     [exec] init:
     [exec] 
     [exec] -clover.disable:
     [exec] 
     [exec] -clover.load:
     [exec] 
     [exec] -clover.classpath:
     [exec] 
     [exec] -clover.setup:
     [exec] 
     [exec] clover:
     [exec] 
     [exec] compile-core:
     [exec] 
     [exec] init:
     [exec] 
     [exec] compile-test:
     [exec]      [echo] Building analyzers-icu...
     [exec] 
     [exec] check-analyzers-common-uptodate:
     [exec] 
     [exec] jar-analyzers-common:
     [exec]      [echo] Building analyzers-common...
     [exec] 
     [exec] jflex-uptodate-check:
     [exec] 
     [exec] jflex-notice:
     [exec]      [echo] 
     [exec]      [echo]       One or more of the JFlex .jflex files is newer than its corresponding
     [exec]      [echo]       .java file.  Run the "jflex" target to regenerate the artifacts.
     [exec]      [echo]     
     [exec] 
     [exec] ivy-availability-check:
     [exec]      [echo] Building analyzers-common...
     [exec] 
     [exec] ivy-fail:
     [exec] 
     [exec] ivy-configure:
     [exec] [ivy:configure] :: loading settings :: file = /usr/home/hudson/hudson-slave/workspace/Lucene-Solr-SmokeRelease-4.3/lucene/build/fakeReleaseTmp/unpack/lucene-4.3.1/ivy-settings.xml
     [exec] 
     [exec] resolve:
     [exec] 
     [exec] common.init:
     [exec] 
     [exec] compile-lucene-core:
     [exec] 
     [exec] init:
     [exec] 
     [exec] -clover.disable:
     [exec] 
     [exec] -clover.load:
     [exec] 
     [exec] -clover.classpath:
     [exec] 
     [exec] -clover.setup:
     [exec] 
     [exec] clover:
     [exec] 
     [exec] common.compile-core:
     [exec] 
     [exec] compile-core:
     [exec] 
     [exec] jar-core:
     [exec]       [jar] Building jar: /usr/home/hudson/hudson-slave/workspace/Lucene-Solr-SmokeRelease-4.3/lucene/build/fakeReleaseTmp/unpack/lucene-4.3.1/build/analysis/common/lucene-analyzers-common-4.3.1-SNAPSHOT.jar
     [exec] 
     [exec] ivy-availability-check:
     [exec] 
     [exec] ivy-configure:
     [exec] [ivy:configure] :: loading settings :: file = /usr/home/hudson/hudson-slave/workspace/Lucene-Solr-SmokeRelease-4.3/lucene/build/fakeReleaseTmp/unpack/lucene-4.3.1/ivy-settings.xml
     [exec] 
     [exec] resolve:
     [exec] 
     [exec] common.init:
     [exec] 
     [exec] compile-lucene-core:
     [exec] 
     [exec] init:
     [exec] 
     [exec] -clover.disable:
     [exec] 
     [exec] -clover.load:
     [exec] 
     [exec] -clover.classpath:
     [exec] 
     [exec] -clover.setup:
     [exec] 
     [exec] clover:
     [exec] 
     [exec] common.compile-core:
     [exec]     [mkdir] Created dir: /usr/home/hudson/hudson-slave/workspace/Lucene-Solr-SmokeRelease-4.3/lucene/build/fakeReleaseTmp/unpack/lucene-4.3.1/build/analysis/icu/classes/java
     [exec]     [javac] Compiling 23 source files to /usr/home/hudson/hudson-slave/workspace/Lucene-Solr-SmokeRelease-4.3/lucene/build/fakeReleaseTmp/unpack/lucene-4.3.1/build/analysis/icu/classes/java
     [exec]     [javac] Note: Some input files use or override a deprecated API.
     [exec]     [javac] Note: Recompile with -Xlint:deprecation for details.
     [exec]      [copy] Copying 8 files to /usr/home/hudson/hudson-slave/workspace/Lucene-Solr-SmokeRelease-4.3/lucene/build/fakeReleaseTmp/unpack/lucene-4.3.1/build/analysis/icu/classes/java
     [exec] 
     [exec] compile-core:
     [exec] 
     [exec] compile-test-framework:
     [exec] 
     [exec] ivy-availability-check:
     [exec] 
     [exec] ivy-fail:
     [exec] 
     [exec] ivy-configure:
     [exec] [ivy:configure] :: loading settings :: file = /usr/home/hudson/hudson-slave/workspace/Lucene-Solr-SmokeRelease-4.3/lucene/build/fakeReleaseTmp/unpack/lucene-4.3.1/ivy-settings.xml
     [exec] 
     [exec] resolve:
     [exec] 
     [exec] init:
     [exec] 
     [exec] compile-lucene-core:
     [exec] 
     [exec] compile-codecs:
     [exec]      [echo] Building codecs...
     [exec] 
     [exec] ivy-availability-check:
     [exec]      [echo] Building codecs...
     [exec] 
     [exec] ivy-fail:
     [exec] 
     [exec] ivy-configure:
     [exec] [ivy:configure] :: loading settings :: file = /usr/home/hudson/hudson-slave/workspace/Lucene-Solr-SmokeRelease-4.3/lucene/build/fakeReleaseTmp/unpack/lucene-4.3.1/ivy-settings.xml
     [exec] 
     [exec] resolve:
     [exec] 
     [exec] common.init:
     [exec] 
     [exec] compile-lucene-core:
     [exec] 
     [exec] init:
     [exec] 
     [exec] -clover.disable:
     [exec] 
     [exec] -clover.load:
     [exec] 
     [exec] -clover.classpath:
     [exec] 
     [exec] -clover.setup:
     [exec] 
     [exec] clover:
     [exec] 
     [exec] compile-core:
     [exec] 
     [exec] -clover.disable:
     [exec] 
     [exec] -clover.load:
     [exec] 
     [exec] -clover.classpath:
     [exec] 
     [exec] -clover.setup:
     [exec] 
     [exec] clover:
     [exec] 
     [exec] common.compile-core:
     [exec] 
     [exec] compile-core:
     [exec] 
     [exec] common.compile-test:
     [exec]     [mkdir] Created dir: /usr/home/hudson/hudson-slave/workspace/Lucene-Solr-SmokeRelease-4.3/lucene/build/fakeReleaseTmp/unpack/lucene-4.3.1/build/analysis/icu/classes/test
     [exec]     [javac] Compiling 15 source files to /usr/home/hudson/hudson-slave/workspace/Lucene-Solr-SmokeRelease-4.3/lucene/build/fakeReleaseTmp/unpack/lucene-4.3.1/build/analysis/icu/classes/test
     [exec]      [copy] Copying 3 files to /usr/home/hudson/hudson-slave/workspace/Lucene-Solr-SmokeRelease-4.3/lucene/build/fakeReleaseTmp/unpack/lucene-4.3.1/build/analysis/icu/classes/test
     [exec]      [echo] Building analyzers-kuromoji...
     [exec] 
     [exec] ivy-availability-check:
     [exec]      [echo] Building analyzers-kuromoji...
     [exec] 
     [exec] ivy-fail:
     [exec] 
     [exec] ivy-configure:
     [exec] [ivy:configure] :: loading settings :: file = /usr/home/hudson/hudson-slave/workspace/Lucene-Solr-SmokeRelease-4.3/lucene/build/fakeReleaseTmp/unpack/lucene-4.3.1/ivy-settings.xml
     [exec] 
     [exec] resolve:
     [exec] 
     [exec] common.init:
     [exec] 
     [exec] compile-lucene-core:
     [exec] 
     [exec] ivy-availability-check:
     [exec] 
     [exec] ivy-fail:
     [exec] 
     [exec] ivy-configure:
     [exec] [ivy:configure] :: loading settings :: file = /usr/home/hudson/hudson-slave/workspace/Lucene-Solr-SmokeRelease-4.3/lucene/build/fakeReleaseTmp/unpack/lucene-4.3.1/ivy-settings.xml
     [exec] 
     [exec] resolve:
     [exec] 
     [exec] init:
     [exec] 
     [exec] -clover.disable:
     [exec] 
     [exec] -clover.load:
     [exec] 
     [exec] -clover.classpath:
     [exec] 
     [exec] -clover.setup:
     [exec] 
     [exec] clover:
     [exec] 
     [exec] compile-core:
     [exec] 
     [exec] init:
     [exec] 
     [exec] module-build.compile-test:
     [exec]      [echo] Building analyzers-kuromoji...
     [exec] 
     [exec] check-analyzers-common-uptodate:
     [exec] 
     [exec] jar-analyzers-common:
     [exec] 
     [exec] ivy-availability-check:
     [exec] 
     [exec] ivy-configure:
     [exec] [ivy:configure] :: loading settings :: file = /usr/home/hudson/hudson-slave/workspace/Lucene-Solr-SmokeRelease-4.3/lucene/build/fakeReleaseTmp/unpack/lucene-4.3.1/ivy-settings.xml
     [exec] 
     [exec] resolve:
     [exec] 
     [exec] common.init:
     [exec] 
     [exec] compile-lucene-core:
     [exec] 
     [exec] init:
     [exec] 
     [exec] -clover.disable:
     [exec] 
     [exec] -clover.load:
     [exec] 
     [exec] -clover.classpath:
     [exec] 
     [exec] -clover.setup:
     [exec] 
     [exec] clover:
     [exec] 
     [exec] common.compile-core:
     [exec]     [mkdir] Created dir: /usr/home/hudson/hudson-slave/workspace/Lucene-Solr-SmokeRelease-4.3/lucene/build/fakeReleaseTmp/unpack/lucene-4.3.1/build/analysis/kuromoji/classes/java
     [exec]     [javac] Compiling 33 source files to /usr/home/hudson/hudson-slave/workspace/Lucene-Solr-SmokeRelease-4.3/lucene/build/fakeReleaseTmp/unpack/lucene-4.3.1/build/analysis/kuromoji/classes/java
     [exec]      [copy] Copying 14 files to /usr/home/hudson/hudson-slave/workspace/Lucene-Solr-SmokeRelease-4.3/lucene/build/fakeReleaseTmp/unpack/lucene-4.3.1/build/analysis/kuromoji/classes/java
     [exec] 
     [exec] compile-core:
     [exec] 
     [exec] compile-test-framework:
     [exec] 
     [exec] ivy-availability-check:
     [exec] 
     [exec] ivy-fail:
     [exec] 
     [exec] ivy-configure:
     [exec] [ivy:configure] :: loading settings :: file = /usr/home/hudson/hudson-slave/workspace/Lucene-Solr-SmokeRelease-4.3/lucene/build/fakeReleaseTmp/unpack/lucene-4.3.1/ivy-settings.xml
     [exec] 
     [exec] resolve:
     [exec] 
     [exec] init:
     [exec] 
     [exec] compile-lucene-core:
     [exec] 
     [exec] compile-codecs:
     [exec]      [echo] Building codecs...
     [exec] 
     [exec] ivy-availability-check:
     [exec]      [echo] Building codecs...
     [exec] 
     [exec] ivy-fail:
     [exec] 
     [exec] ivy-configure:
     [exec] [ivy:configure] :: loading settings :: file = /usr/home/hudson/hudson-slave/workspace/Lucene-Solr-SmokeRelease-4.3/lucene/build/fakeReleaseTmp/unpack/lucene-4.3.1/ivy-settings.xml
     [exec] 
     [exec] resolve:
     [exec] 
     [exec] common.init:
     [exec] 
     [exec] compile-lucene-core:
     [exec] 
     [exec] init:
     [exec] 
     [exec] -clover.disable:
     [exec] 
     [exec] -clover.load:
     [exec] 
     [exec] -clover.classpath:
     [exec] 
     [exec] -clover.setup:
     [exec] 
     [exec] clover:
     [exec] 
     [exec] compile-core:
     [exec] 
     [exec] -clover.disable:
     [exec] 
     [exec] -clover.load:
     [exec] 
     [exec] -clover.classpath:
     [exec] 
     [exec] -clover.setup:
     [exec] 
     [exec] clover:
     [exec] 
     [exec] common.compile-core:
     [exec] 
     [exec] compile-core:
     [exec] 
     [exec] common.compile-test:
     [exec]     [mkdir] Created dir: /usr/home/hudson/hudson-slave/workspace/Lucene-Solr-SmokeRelease-4.3/lucene/build/fakeReleaseTmp/unpack/lucene-4.3.1/build/analysis/kuromoji/classes/test
     [exec]     [javac] Compiling 18 source files to /usr/home/hudson/hudson-slave/workspace/Lucene-Solr-SmokeRelease-4.3/lucene/build/fakeReleaseTmp/unpack/lucene-4.3.1/build/analysis/kuromoji/classes/test
     [exec]      [copy] Copying 3 files to /usr/home/hudson/hudson-slave/workspace/Lucene-Solr-SmokeRelease-4.3/lucene/build/fakeReleaseTmp/unpack/lucene-4.3.1/build/analysis/kuromoji/classes/test
     [exec] 
     [exec] resolve-icu:
     [exec]      [echo] Building analyzers-icu...
     [exec] 
     [exec] ivy-availability-check:
     [exec]      [echo] Building analyzers-icu...
     [exec] 
     [exec] ivy-fail:
     [exec] 
     [exec] ivy-configure:
     [exec] [ivy:configure] :: loading settings :: file = /usr/home/hudson/hudson-slave/workspace/Lucene-Solr-SmokeRelease-4.3/lucene/build/fakeReleaseTmp/unpack/lucene-4.3.1/ivy-settings.xml
     [exec] 
     [exec] resolve:
     [exec] 
     [exec] check-analyzers-common-uptodate:
     [exec] 
     [exec] jar-analyzers-common:
     [exec] 
     [exec] -clover.disable:
     [exec] 
     [exec] -clover.load:
     [exec] 
     [exec] -clover.classpath:
     [exec] 
     [exec] -clover.setup:
     [exec] 
     [exec] clover:
     [exec] 
     [exec] common.compile-core:
     [exec] 
     [exec] compile-core:
     [exec] 
     [exec] common.compile-tools:
     [exec] 
     [exec] ivy-availability-check:
     [exec] 
     [exec] ivy-fail:
     [exec] 
     [exec] ivy-configure:
     [exec] [ivy:configure] :: loading settings :: file = /usr/home/hudson/hudson-slave/workspace/Lucene-Solr-SmokeRelease-4.3/lucene/build/fakeReleaseTmp/unpack/lucene-4.3.1/ivy-settings.xml
     [exec] 
     [exec] resolve:
     [exec] 
     [exec] init:
     [exec] 
     [exec] compile-core:
     [exec]     [mkdir] Created dir: /usr/home/hudson/hudson-slave/workspace/Lucene-Solr-SmokeRelease-4.3/lucene/build/fakeReleaseTmp/unpack/lucene-4.3.1/build/tools/classes/java
     [exec]     [javac] Compiling 2 source files to /usr/home/hudson/hudson-slave/workspace/Lucene-Solr-SmokeRelease-4.3/lucene/build/fakeReleaseTmp/unpack/lucene-4.3.1/build/tools/classes/java
     [exec]      [copy] Copying 1 file to /usr/home/hudson/hudson-slave/workspace/Lucene-Solr-SmokeRelease-4.3/lucene/build/fakeReleaseTmp/unpack/lucene-4.3.1/build/tools/classes/java
     [exec] 
     [exec] compile-tools:
     [exec]     [mkdir] Created dir: /usr/home/hudson/hudson-slave/workspace/Lucene-Solr-SmokeRelease-4.3/lucene/build/fakeReleaseTmp/unpack/lucene-4.3.1/build/analysis/kuromoji/classes/tools
     [exec]     [javac] Compiling 9 source files to /usr/home/hudson/hudson-slave/workspace/Lucene-Solr-SmokeRelease-4.3/lucene/build/fakeReleaseTmp/unpack/lucene-4.3.1/build/analysis/kuromoji/classes/tools
     [exec] 
     [exec] compile-tools-tests:
     [exec]     [mkdir] Created dir: /usr/home/hudson/hudson-slave/workspace/Lucene-Solr-SmokeRelease-4.3/lucene/build/fakeReleaseTmp/unpack/lucene-4.3.1/build/analysis/kuromoji/classes/tools-test
     [exec]     [javac] Compiling 1 source file to /usr/home/hudson/hudson-slave/workspace/Lucene-Solr-SmokeRelease-4.3/lucene/build/fakeReleaseTmp/unpack/lucene-4.3.1/build/analysis/kuromoji/classes/tools-test
     [exec] 
     [exec] compile-test:
     [exec]      [echo] Building analyzers-morfologik...
     [exec] 
     [exec] ivy-availability-check:
     [exec]      [echo] Building analyzers-morfologik...
     [exec] 
     [exec] ivy-fail:
     [exec] 
     [exec] ivy-configure:
     [exec] [ivy:configure] :: loading settings :: file = /usr/home/hudson/hudson-slave/workspace/Lucene-Solr-SmokeRelease-4.3/lucene/build/fakeReleaseTmp/unpack/lucene-4.3.1/ivy-settings.xml
     [exec] 
     [exec] resolve:
     [exec] 
     [exec] common.init:
     [exec] 
     [exec] compile-lucene-core:
     [exec] 
     [exec] ivy-availability-check:
     [exec] 
     [exec] ivy-fail:
     [exec] 
     [exec] ivy-configure:
     [exec] [ivy:configure] :: loading settings :: file = /usr/home/hudson/hudson-slave/workspace/Lucene-Solr-SmokeRelease-4.3/lucene/build/fakeReleaseTmp/unpack/lucene-4.3.1/ivy-settings.xml
     [exec] 
     [exec] resolve:
     [exec] 
     [exec] init:
     [exec] 
     [exec] -clover.disable:
     [exec] 
     [exec] -clover.load:
     [exec] 
     [exec] -clover.classpath:
     [exec] 
     [exec] -clover.setup:
     [exec] 
     [exec] clover:
     [exec] 
     [exec] compile-core:
     [exec] 
     [exec] init:
     [exec] 
     [exec] compile-test:
     [exec]      [echo] Building analyzers-morfologik...
     [exec] 
     [exec] check-analyzers-common-uptodate:
     [exec] 
     [exec] jar-analyzers-common:
     [exec] 
     [exec] ivy-availability-check:
     [exec] 
     [exec] ivy-configure:
     [exec] [ivy:configure] :: loading settings :: file = /usr/home/hudson/hudson-slave/workspace/Lucene-Solr-SmokeRelease-4.3/lucene/build/fakeReleaseTmp/unpack/lucene-4.3.1/ivy-settings.xml
     [exec] 
     [exec] resolve:
     [exec] 
     [exec] common.init:
     [exec] 
     [exec] compile-lucene-core:
     [exec] 
     [exec] init:
     [exec] 
     [exec] -clover.disable:
     [exec] 
     [exec] -clover.load:
     [exec] 
     [exec] -clover.classpath:
     [exec] 
     [exec] -clover.setup:
     [exec] 
     [exec] clover:
     [exec] 
     [exec] common.compile-core:
     [exec]     [mkdir] Created dir: /usr/home/hudson/hudson-slave/workspace/Lucene-Solr-SmokeRelease-4.3/lucene/build/fakeReleaseTmp/unpack/lucene-4.3.1/build/analysis/morfologik/classes/java
     [exec]     [javac] Compiling 5 source files to /usr/home/hudson/hudson-slave/workspace/Lucene-Solr-SmokeRelease-4.3/lucene/build/fakeReleaseTmp/unpack/lucene-4.3.1/build/analysis/morfologik/classes/java
     [exec]      [copy] Copying 1 file to /usr/home/hudson/hudson-slave/workspace/Lucene-Solr-SmokeRelease-4.3/lucene/build/fakeReleaseTmp/unpack/lucene-4.3.1/build/analysis/morfologik/classes/java
     [exec] 
     [exec] compile-core:
     [exec] 
     [exec] compile-test-framework:
     [exec] 
     [exec] ivy-availability-check:
     [exec] 
     [exec] ivy-fail:
     [exec] 
     [exec] ivy-configure:
     [exec] [ivy:configure] :: loading settings :: file = /usr/home/hudson/hudson-slave/workspace/Lucene-Solr-SmokeRelease-4.3/lucene/build/fakeReleaseTmp/unpack/lucene-4.3.1/ivy-settings.xml
     [exec] 
     [exec] resolve:
     [exec] 
     [exec] init:
     [exec] 
     [exec] compile-lucene-core:
     [exec] 
     [exec] compile-codecs:
     [exec]      [echo] Building codecs...
     [exec] 
     [exec] ivy-availability-check:
     [exec]      [echo] Building codecs...
     [exec] 
     [exec] ivy-fail:
     [exec] 
     [exec] ivy-configure:
     [exec] [ivy:configure] :: loading settings :: file = /usr/home/hudson/hudson-slave/workspace/Lucene-Solr-SmokeRelease-4.3/lucene/build/fakeReleaseTmp/unpack/lucene-4.3.1/ivy-settings.xml
     [exec] 
     [exec] resolve:
     [exec] 
     [exec] common.init:
     [exec] 
     [exec] compile-lucene-core:
     [exec] 
     [exec] init:
     [exec] 
     [exec] -clover.disable:
     [exec] 
     [exec] -clover.load:
     [exec] 
     [exec] -clover.classpath:
     [exec] 
     [exec] -clover.setup:
     [exec] 
     [exec] clover:
     [exec] 
     [exec] compile-core:
     [exec] 
     [exec] -clover.disable:
     [exec] 
     [exec] -clover.load:
     [exec] 
     [exec] -clover.classpath:
     [exec] 
     [exec] -clover.setup:
     [exec] 
     [exec] clover:
     [exec] 
     [exec] common.compile-core:
     [exec] 
     [exec] compile-core:
     [exec] 
     [exec] common.compile-test:
     [exec]     [mkdir] Created dir: /usr/home/hudson/hudson-slave/workspace/Lucene-Solr-SmokeRelease-4.3/lucene/build/fakeReleaseTmp/unpack/lucene-4.3.1/build/analysis/morfologik/classes/test
     [exec]     [javac] Compiling 2 source files to /usr/home/hudson/hudson-slave/workspace/Lucene-Solr-SmokeRelease-4.3/lucene/build/fakeReleaseTmp/unpack/lucene-4.3.1/build/analysis/morfologik/classes/test
     [exec]      [echo] Building analyzers-phonetic...
     [exec] 
     [exec] ivy-availability-check:
     [exec]      [echo] Building analyzers-phonetic...
     [exec] 
     [exec] ivy-fail:
     [exec] 
     [exec] ivy-configure:
     [exec] [ivy:configure] :: loading settings :: file = /usr/home/hudson/hudson-slave/workspace/Lucene-Solr-SmokeRelease-4.3/lucene/build/fakeReleaseTmp/unpack/lucene-4.3.1/ivy-settings.xml
     [exec] 
     [exec] resolve:
     [exec] 
     [exec] common.init:
     [exec] 
     [exec] compile-lucene-core:
     [exec] 
     [exec] ivy-availability-check:
     [exec] 
     [exec] ivy-fail:
     [exec] 
     [exec] ivy-configure:
     [exec] [ivy:configure] :: loading settings :: file = /usr/home/hudson/hudson-slave/workspace/Lucene-Solr-SmokeRelease-4.3/lucene/build/fakeReleaseTmp/unpack/lucene-4.3.1/ivy-settings.xml
     [exec] 
     [exec] resolve:
     [exec] 
     [exec] init:
     [exec] 
     [exec] -clover.disable:
     [exec] 
     [exec] -clover.load:
     [exec] 
     [exec] -clover.classpath:
     [exec] 
     [exec] -clover.setup:
     [exec] 
     [exec] clover:
     [exec] 
     [exec] compile-core:
     [exec] 
     [exec] init:
     [exec] 
     [exec] compile-test:
     [exec]      [echo] Building analyzers-phonetic...
     [exec] 
     [exec] check-analyzers-common-uptodate:
     [exec] 
     [exec] jar-analyzers-common:
     [exec] 
     [exec] ivy-availability-check:
     [exec] 
     [exec] ivy-configure:
     [exec] [ivy:configure] :: loading settings :: file = /usr/home/hudson/hudson-slave/workspace/Lucene-Solr-SmokeRelease-4.3/lucene/build/fakeReleaseTmp/unpack/lucene-4.3.1/ivy-settings.xml
     [exec] 
     [exec] resolve:
     [exec] 
     [exec] common.init:
     [exec] 
     [exec] compile-lucene-core:
     [exec] 
     [exec] init:
     [exec] 
     [exec] -clover.disable:
     [exec] 
     [exec] -clover.load:
     [exec] 
     [exec] -clover.classpath:
     [exec] 
     [exec] -clover.setup:
     [exec] 
     [exec] clover:
     [exec] 
     [exec] common.compile-core:
     [exec]     [mkdir] Created dir: /usr/home/hudson/hudson-slave/workspace/Lucene-Solr-SmokeRelease-4.3/lucene/build/fakeReleaseTmp/unpack/lucene-4.3.1/build/analysis/phonetic/classes/java
     [exec]     [javac] Compiling 6 source files to /usr/home/hudson/hudson-slave/workspace/Lucene-Solr-SmokeRelease-4.3/lucene/build/fakeReleaseTmp/unpack/lucene-4.3.1/build/analysis/phonetic/classes/java
     [exec]      [copy] Copying 1 file to /usr/home/hudson/hudson-slave/workspace/Lucene-Solr-SmokeRelease-4.3/lucene/build/fakeReleaseTmp/unpack/lucene-4.3.1/build/analysis/phonetic/classes/java
     [exec] 
     [exec] compile-core:
     [exec] 
     [exec] compile-test-framework:
     [exec] 
     [exec] ivy-availability-check:
     [exec] 
     [exec] ivy-fail:
     [exec] 
     [exec] ivy-configure:
     [exec] [ivy:configure] :: loading settings :: file = /usr/home/hudson/hudson-slave/workspace/Lucene-Solr-SmokeRelease-4.3/lucene/build/fakeReleaseTmp/unpack/lucene-4.3.1/ivy-settings.xml
     [exec] 
     [exec] resolve:
     [exec] 
     [exec] init:
     [exec] 
     [exec] compile-lucene-core:
     [exec] 
     [exec] compile-codecs:
     [exec]      [echo] Building codecs...
     [exec] 
     [exec] ivy-availability-check:
     [exec]      [echo] Building codecs...
     [exec] 
     [exec] ivy-fail:
     [exec] 
     [exec] ivy-configure:
     [exec] [ivy:configure] :: loading settings :: file = /usr/home/hudson/hudson-slave/workspace/Lucene-Solr-SmokeRelease-4.3/lucene/build/fakeReleaseTmp/unpack/lucene-4.3.1/ivy-settings.xml
     [exec] 
     [exec] resolve:
     [exec] 
     [exec] common.init:
     [exec] 
     [exec] compile-lucene-core:
     [exec] 
     [exec] init:
     [exec] 
     [exec] -clover.disable:
     [exec] 
     [exec] -clover.load:
     [exec] 
     [exec] -clover.classpath:
     [exec] 
     [exec] -clover.setup:
     [exec] 
     [exec] clover:
     [exec] 
     [exec] compile-core:
     [exec] 
     [exec] -clover.disable:
     [exec] 
     [exec] -clover.load:
     [exec] 
     [exec] -clover.classpath:
     [exec] 
     [exec] -clover.setup:
     [exec] 
     [exec] clover:
     [exec] 
     [exec] common.compile-core:
     [exec] 
     [exec] compile-core:
     [exec] 
     [exec] common.compile-test:
     [exec]     [mkdir] Created dir: /usr/home/hudson/hudson-slave/workspace/Lucene-Solr-SmokeRelease-4.3/lucene/build/fakeReleaseTmp/unpack/lucene-4.3.1/build/analysis/phonetic/classes/test
     [exec]     [javac] Compiling 6 source files to /usr/home/hudson/hudson-slave/workspace/Lucene-Solr-SmokeRelease-4.3/lucene/build/fakeReleaseTmp/unpack/lucene-4.3.1/build/analysis/phonetic/classes/test
     [exec]      [echo] Building analyzers-smartcn...
     [exec] 
     [exec] ivy-availability-check:
     [exec]      [echo] Building analyzers-smartcn...
     [exec] 
     [exec] ivy-fail:
     [exec] 
     [exec] ivy-configure:
     [exec] [ivy:configure] :: loading settings :: file = /usr/home/hudson/hudson-slave/workspace/Lucene-Solr-SmokeRelease-4.3/lucene/build/fakeReleaseTmp/unpack/lucene-4.3.1/ivy-settings.xml
     [exec] 
     [exec] resolve:
     [exec] 
     [exec] common.init:
     [exec] 
     [exec] compile-lucene-core:
     [exec] 
     [exec] ivy-availability-check:
     [exec] 
     [exec] ivy-fail:
     [exec] 
     [exec] ivy-configure:
     [exec] [ivy:configure] :: loading settings :: file = /usr/home/hudson/hudson-slave/workspace/Lucene-Solr-SmokeRelease-4.3/lucene/build/fakeReleaseTmp/unpack/lucene-4.3.1/ivy-settings.xml
     [exec] 
     [exec] resolve:
     [exec] 
     [exec] init:
     [exec] 
     [exec] -clover.disable:
     [exec] 
     [exec] -clover.load:
     [exec] 
     [exec] -clover.classpath:
     [exec] 
     [exec] -clover.setup:
     [exec] 
     [exec] clover:
     [exec] 
     [exec] compile-core:
     [exec] 
     [exec] init:
     [exec] 
     [exec] compile-test:
     [exec]      [echo] Building analyzers-smartcn...
     [exec] 
     [exec] check-analyzers-common-uptodate:
     [exec] 
     [exec] jar-analyzers-common:
     [exec] 
     [exec] ivy-availability-check:
     [exec] 
     [exec] ivy-configure:
     [exec] [ivy:configure] :: loading settings :: file = /usr/home/hudson/hudson-slave/workspace/Lucene-Solr-SmokeRelease-4.3/lucene/build/fakeReleaseTmp/unpack/lucene-4.3.1/ivy-settings.xml
     [exec] 
     [exec] resolve:
     [exec] 
     [exec] common.init:
     [exec] 
     [exec] compile-lucene-core:
     [exec] 
     [exec] init:
     [exec] 
     [exec] -clover.disable:
     [exec] 
     [exec] -clover.load:
     [exec] 
     [exec] -clover.classpath:
     [exec] 
     [exec] -clover.setup:
     [exec] 
     [exec] clover:
     [exec] 
     [exec] common.compile-core:
     [exec]     [mkdir] Created dir: /usr/home/hudson/hudson-slave/workspace/Lucene-Solr-SmokeRelease-4.3/lucene/build/fakeReleaseTmp/unpack/lucene-4.3.1/build/analysis/smartcn/classes/java
     [exec]     [javac] Compiling 20 source files to /usr/home/hudson/hudson-slave/workspace/Lucene-Solr-SmokeRelease-4.3/lucene/build/fakeReleaseTmp/unpack/lucene-4.3.1/build/analysis/smartcn/classes/java
     [exec]     [javac] Note: /usr/home/hudson/hudson-slave/workspace/Lucene-Solr-SmokeRelease-4.3/lucene/build/fakeReleaseTmp/unpack/lucene-4.3.1/analysis/smartcn/src/java/org/apache/lucene/analysis/cn/smart/SmartChineseAnalyzer.java uses or overrides a deprecated API.
     [exec]     [javac] Note: Recompile with -Xlint:deprecation for details.
     [exec]      [copy] Copying 5 files to /usr/home/hudson/hudson-slave/workspace/Lucene-Solr-SmokeRelease-4.3/lucene/build/fakeReleaseTmp/unpack/lucene-4.3.1/build/analysis/smartcn/classes/java
     [exec] 
     [exec] compile-core:
     [exec] 
     [exec] compile-test-framework:
     [exec] 
     [exec] ivy-availability-check:
     [exec] 
     [exec] ivy-fail:
     [exec] 
     [exec] ivy-configure:
     [exec] [ivy:configure] :: loading settings :: file = /usr/home/hudson/hudson-slave/workspace/Lucene-Solr-SmokeRelease-4.3/lucene/build/fakeReleaseTmp/unpack/lucene-4.3.1/ivy-settings.xml
     [exec] 
     [exec] resolve:
     [exec] 
     [exec] init:
     [exec] 
     [exec] compile-lucene-core:
     [exec] 
     [exec] compile-codecs:
     [exec]      [echo] Building codecs...
     [exec] 
     [exec] ivy-availability-check:
     [exec]      [echo] Building codecs...
     [exec] 
     [exec] ivy-fail:
     [exec] 
     [exec] ivy-configure:
     [exec] [ivy:configure] :: loading settings :: file = /usr/home/hudson/hudson-slave/workspace/Lucene-Solr-SmokeRelease-4.3/lucene/build/fakeReleaseTmp/unpack/lucene-4.3.1/ivy-settings.xml
     [exec] 
     [exec] resolve:
     [exec] 
     [exec] common.init:
     [exec] 
     [exec] compile-lucene-core:
     [exec] 
     [exec] init:
     [exec] 
     [exec] -clover.disable:
     [exec] 
     [exec] -clover.load:
     [exec] 
     [exec] -clover.classpath:
     [exec] 
     [exec] -clover.setup:
     [exec] 
     [exec] clover:
     [exec] 
     [exec] compile-core:
     [exec] 
     [exec] -clover.disable:
     [exec] 
     [exec] -clover.load:
     [exec] 
     [exec] -clover.classpath:
     [exec] 
     [exec] -clover.setup:
     [exec] 
     [exec] clover:
     [exec] 
     [exec] common.compile-core:
     [exec] 
     [exec] compile-core:
     [exec] 
     [exec] common.compile-test:
     [exec]     [mkdir] Created dir: /usr/home/hudson/hudson-slave/workspace/Lucene-Solr-SmokeRelease-4.3/lucene/build/fakeReleaseTmp/unpack/lucene-4.3.1/build/analysis/smartcn/classes/test
     [exec]     [javac] Compiling 2 source files to /usr/home/hudson/hudson-slave/workspace/Lucene-Solr-SmokeRelease-4.3/lucene/build/fakeReleaseTmp/unpack/lucene-4.3.1/build/analysis/smartcn/classes/test
     [exec]     [javac] Note: /usr/home/hudson/hudson-slave/workspace/Lucene-Solr-SmokeRelease-4.3/lucene/build/fakeReleaseTmp/unpack/lucene-4.3.1/analysis/smartcn/src/test/org/apache/lucene/analysis/cn/smart/TestSmartChineseAnalyzer.java uses or overrides a deprecated API.
     [exec]     [javac] Note: Recompile with -Xlint:deprecation for details.
     [exec]      [echo] Building analyzers-stempel...
     [exec] 
     [exec] ivy-availability-check:
     [exec]      [echo] Building analyzers-stempel...
     [exec] 
     [exec] ivy-fail:
     [exec] 
     [exec] ivy-configure:
     [exec] [ivy:configure] :: loading settings :: file = /usr/home/hudson/hudson-slave/workspace/Lucene-Solr-SmokeRelease-4.3/lucene/build/fakeReleaseTmp/unpack/lucene-4.3.1/ivy-settings.xml
     [exec] 
     [exec] resolve:
     [exec] 
     [exec] common.init:
     [exec] 
     [exec] compile-lucene-core:
     [exec] 
     [exec] ivy-availability-check:
     [exec] 
     [exec] ivy-fail:
     [exec] 
     [exec] ivy-configure:
     [exec] [ivy:configure] :: loading settings :: file = /usr/home/hudson/hudson-slave/workspace/Lucene-Solr-SmokeRelease-4.3/lucene/build/fakeReleaseTmp/unpack/lucene-4.3.1/ivy-settings.xml
     [exec] 
     [exec] resolve:
     [exec] 
     [exec] init:
     [exec] 
     [exec] -clover.disable:
     [exec] 
     [exec] -clover.load:
     [exec] 
     [exec] -clover.classpath:
     [exec] 
     [exec] -clover.setup:
     [exec] 
     [exec] clover:
     [exec] 
     [exec] compile-core:
     [exec] 
     [exec] init:
     [exec] 
     [exec] compile-test:
     [exec]      [echo] Building analyzers-stempel...
     [exec] 
     [exec] check-analyzers-common-uptodate:
     [exec] 
     [exec] jar-analyzers-common:
     [exec] 
     [exec] ivy-availability-check:
     [exec] 
     [exec] ivy-configure:
     [exec] [ivy:configure] :: loading settings :: file = /usr/home/hudson/hudson-slave/workspace/Lucene-Solr-SmokeRelease-4.3/lucene/build/fakeReleaseTmp/unpack/lucene-4.3.1/ivy-settings.xml
     [exec] 
     [exec] resolve:
     [exec] 
     [exec] common.init:
     [exec] 
     [exec] compile-lucene-core:
     [exec] 
     [exec] init:
     [exec] 
     [exec] -clover.disable:
     [exec] 
     [exec] -clover.load:
     [exec] 
     [exec] -clover.classpath:
     [exec] 
     [exec] -clover.setup:
     [exec] 
     [exec] clover:
     [exec] 
     [exec] common.compile-core:
     [exec]     [mkdir] Created dir: /usr/home/hudson/hudson-slave/workspace/Lucene-Solr-SmokeRelease-4.3/lucene/build/fakeReleaseTmp/unpack/lucene-4.3.1/build/analysis/stempel/classes/java
     [exec]     [javac] Compiling 17 source files to /usr/home/hudson/hudson-slave/workspace/Lucene-Solr-SmokeRelease-4.3/lucene/build/fakeReleaseTmp/unpack/lucene-4.3.1/build/analysis/stempel/classes/java
     [exec]     [javac] Note: /usr/home/hudson/hudson-slave/workspace/Lucene-Solr-SmokeRelease-4.3/lucene/build/fakeReleaseTmp/unpack/lucene-4.3.1/analysis/stempel/src/java/org/apache/lucene/analysis/pl/PolishAnalyzer.java uses or overrides a deprecated API.
     [exec]     [javac] Note: Recompile with -Xlint:deprecation for details.
     [exec]      [copy] Copying 3 files to /usr/home/hudson/hudson-slave/workspace/Lucene-Solr-SmokeRelease-4.3/lucene/build/fakeReleaseTmp/unpack/lucene-4.3.1/build/analysis/stempel/classes/java
     [exec] 
     [exec] compile-core:
     [exec] 
     [exec] compile-test-framework:
     [exec] 
     [exec] ivy-availability-check:
     [exec] 
     [exec] ivy-fail:
     [exec] 
     [exec] ivy-configure:
     [exec] [ivy:configure] :: loading settings :: file = /usr/home/hudson/hudson-slave/workspace/Lucene-Solr-SmokeRelease-4.3/lucene/build/fakeReleaseTmp/unpack/lucene-4.3.1/ivy-settings.xml
     [exec] 
     [exec] resolve:
     [exec] 
     [exec] init:
     [exec] 
     [exec] compile-lucene-core:
     [exec] 
     [exec] compile-codecs:
     [exec]      [echo] Building codecs...
     [exec] 
     [exec] ivy-availability-check:
     [exec]      [echo] Building codecs...
     [exec] 
     [exec] ivy-fail:
     [exec] 
     [exec] ivy-configure:
     [exec] [ivy:configure] :: loading settings :: file = /usr/home/hudson/hudson-slave/workspace/Lucene-Solr-SmokeRelease-4.3/lucene/build/fakeReleaseTmp/unpack/lucene-4.3.1/ivy-settings.xml
     [exec] 
     [exec] resolve:
     [exec] 
     [exec] common.init:
     [exec] 
     [exec] compile-lucene-core:
     [exec] 
     [exec] init:
     [exec] 
     [exec] -clover.disable:
     [exec] 
     [exec] -clover.load:
     [exec] 
     [exec] -clover.classpath:
     [exec] 
     [exec] -clover.setup:
     [exec] 
     [exec] clover:
     [exec] 
     [exec] compile-core:
     [exec] 
     [exec] -clover.disable:
     [exec] 
     [exec] -clover.load:
     [exec] 
     [exec] -clover.classpath:
     [exec] 
     [exec] -clover.setup:
     [exec] 
     [exec] clover:
     [exec] 
     [exec] common.compile-core:
     [exec] 
     [exec] compile-core:
     [exec] 
     [exec] common.compile-test:
     [exec]     [mkdir] Created dir: /usr/home/hudson/hudson-slave/workspace/Lucene-Solr-SmokeRelease-4.3/lucene/build/fakeReleaseTmp/unpack/lucene-4.3.1/build/analysis/stempel/classes/test
     [exec]     [javac] Compiling 4 source files to /usr/home/hudson/hudson-slave/workspace/Lucene-Solr-SmokeRelease-4.3/lucene/build/fakeReleaseTmp/unpack/lucene-4.3.1/build/analysis/stempel/classes/test
     [exec]      [copy] Copying 1 file to /usr/home/hudson/hudson-slave/workspace/Lucene-Solr-SmokeRelease-4.3/lucene/build/fakeReleaseTmp/unpack/lucene-4.3.1/build/analysis/stempel/classes/test
     [exec]      [echo] Building analyzers-uima...
     [exec] 
     [exec] ivy-availability-check:
     [exec]      [echo] Building analyzers-uima...
     [exec] 
     [exec] ivy-fail:
     [exec] 
     [exec] ivy-configure:
     [exec] [ivy:configure] :: loading settings :: file = /usr/home/hudson/hudson-slave/workspace/Lucene-Solr-SmokeRelease-4.3/lucene/build/fakeReleaseTmp/unpack/lucene-4.3.1/ivy-settings.xml
     [exec] 
     [exec] resolve:
     [exec] 
     [exec] common.init:
     [exec] 
     [exec] compile-lucene-core:
     [exec] 
     [exec] ivy-availability-check:
     [exec] 
     [exec] ivy-fail:
     [exec] 
     [exec] ivy-configure:
     [exec] [ivy:configure] :: loading settings :: file = /usr/home/hudson/hudson-slave/workspace/Lucene-Solr-SmokeRelease-4.3/lucene/build/fakeReleaseTmp/unpack/lucene-4.3.1/ivy-settings.xml
     [exec] 
     [exec] resolve:
     [exec] 
     [exec] init:
     [exec] 
     [exec] -clover.disable:
     [exec] 
     [exec] -clover.load:
     [exec] 
     [exec] -clover.classpath:
     [exec] 
     [exec] -clover.setup:
     [exec] 
     [exec] clover:
     [exec] 
     [exec] compile-core:
     [exec] 
     [exec] init:
     [exec] 
     [exec] compile-test:
     [exec]      [echo] Building analyzers-uima...
     [exec] 
     [exec] check-analyzers-common-uptodate:
     [exec] 
     [exec] jar-analyzers-common:
     [exec] 
     [exec] ivy-availability-check:
     [exec] 
     [exec] ivy-configure:
     [exec] [ivy:configure] :: loading settings :: file = /usr/home/hudson/hudson-slave/workspace/Lucene-Solr-SmokeRelease-4.3/lucene/build/fakeReleaseTmp/unpack/lucene-4.3.1/ivy-settings.xml
     [exec] 
     [exec] resolve:
     [exec] 
     [exec] common.init:
     [exec] 
     [exec] compile-lucene-core:
     [exec] 
     [exec] init:
     [exec] 
     [exec] -clover.disable:
     [exec] 
     [exec] -clover.load:
     [exec] 
     [exec] -clover.classpath:
     [exec] 
     [exec] -clover.setup:
     [exec] 
     [exec] clover:
     [exec] 
     [exec] common.compile-core:
     [exec]     [mkdir] Created dir: /usr/home/hudson/hudson-slave/workspace/Lucene-Solr-SmokeRelease-4.3/lucene/build/fakeReleaseTmp/unpack/lucene-4.3.1/build/analysis/uima/classes/java
     [exec]     [javac] Compiling 11 source files to /usr/home/hudson/hudson-slave/workspace/Lucene-Solr-SmokeRelease-4.3/lucene/build/fakeReleaseTmp/unpack/lucene-4.3.1/build/analysis/uima/classes/java
     [exec]      [copy] Copying 2 files to /usr/home/hudson/hudson-slave/workspace/Lucene-Solr-SmokeRelease-4.3/lucene/build/fakeReleaseTmp/unpack/lucene-4.3.1/build/analysis/uima/classes/java
     [exec] 
     [exec] compile-core:
     [exec] 
     [exec] compile-test-framework:
     [exec] 
     [exec] ivy-availability-check:
     [exec] 
     [exec] ivy-fail:
     [exec] 
     [exec] ivy-configure:
     [exec] [ivy:configure] :: loading settings :: file = /usr/home/hudson/hudson-slave/workspace/Lucene-Solr-SmokeRelease-4.3/lucene/build/fakeReleaseTmp/unpack/lucene-4.3.1/ivy-settings.xml
     [exec] 
     [exec] resolve:
     [exec] 
     [exec] init:
     [exec] 
     [exec] compile-lucene-core:
     [exec] 
     [exec] compile-codecs:
     [exec]      [echo] Building codecs...
     [exec] 
     [exec] ivy-availability-check:
     [exec]      [echo] Building codecs...
     [exec] 
     [exec] ivy-fail:
     [exec] 
     [exec] ivy-configure:
     [exec] [ivy:configure] :: loading settings :: file = /usr/home/hudson/hudson-slave/workspace/Lucene-Solr-SmokeRelease-4.3/lucene/build/fakeReleaseTmp/unpack/lucene-4.3.1/ivy-settings.xml
     [exec] 
     [exec] resolve:
     [exec] 
     [exec] common.init:
     [exec] 
     [exec] compile-lucene-core:
     [exec] 
     [exec] init:
     [exec] 
     [exec] -clover.disable:
     [exec] 
     [exec] -clover.load:
     [exec] 
     [exec] -clover.classpath:
     [exec] 
     [exec] -clover.setup:
     [exec] 
     [exec] clover:
     [exec] 
     [exec] compile-core:
     [exec] 
     [exec] -clover.disable:
     [exec] 
     [exec] -clover.load:
     [exec] 
     [exec] -clover.classpath:
     [exec] 
     [exec] -clover.setup:
     [exec] 
     [exec] clover:
     [exec] 
     [exec] common.compile-core:
     [exec] 
     [exec] compile-core:
     [exec] 
     [exec] common.compile-test:
     [exec]     [mkdir] Created dir: /usr/home/hudson/hudson-slave/workspace/Lucene-Solr-SmokeRelease-4.3/lucene/build/fakeReleaseTmp/unpack/lucene-4.3.1/build/analysis/uima/classes/test
     [exec]     [javac] Compiling 8 source files to /usr/home/hudson/hudson-slave/workspace/Lucene-Solr-SmokeRelease-4.3/lucene/build/fakeReleaseTmp/unpack/lucene-4.3.1/build/analysis/uima/classes/test
     [exec]     [javac] Note: /usr/home/hudson/hudson-slave/workspace/Lucene-Solr-SmokeRelease-4.3/lucene/build/fakeReleaseTmp/unpack/lucene-4.3.1/analysis/uima/src/test/org/apache/lucene/analysis/uima/UIMABaseAnalyzerTest.java uses or overrides a deprecated API.
     [exec]     [javac] Note: Recompile with -Xlint:deprecation for details.
     [exec]      [echo] Building benchmark...
     [exec] 
     [exec] copy-alg-files-for-testing:
     [exec]      [copy] Copying 34 files to /usr/home/hudson/hudson-slave/workspace/Lucene-Solr-SmokeRelease-4.3/lucene/build/fakeReleaseTmp/unpack/lucene-4.3.1/build/benchmark/classes/test/conf
     [exec] 
     [exec] ivy-availability-check:
     [exec]      [echo] Building benchmark...
     [exec] 
     [exec] ivy-fail:
     [exec] 
     [exec] ivy-configure:
     [exec] [ivy:configure] :: loading settings :: file = /usr/home/hudson/hudson-slave/workspace/Lucene-Solr-SmokeRelease-4.3/lucene/build/fakeReleaseTmp/unpack/lucene-4.3.1/ivy-settings.xml
     [exec] 
     [exec] resolve:
     [exec] 
     [exec] common.init:
     [exec] 
     [exec] compile-lucene-core:
     [exec] 
     [exec] ivy-availability-check:
     [exec] 
     [exec] ivy-fail:
     [exec] 
     [exec] ivy-configure:
     [exec] [ivy:configure] :: loading settings :: file = /usr/home/hudson/hudson-slave/workspace/Lucene-Solr-SmokeRelease-4.3/lucene/build/fakeReleaseTmp/unpack/lucene-4.3.1/ivy-settings.xml
     [exec] 
     [exec] resolve:
     [exec] 
     [exec] init:
     [exec] 
     [exec] -clover.disable:
     [exec] 
     [exec] -clover.load:
     [exec] 
     [exec] -clover.classpath:
     [exec] 
     [exec] -clover.setup:
     [exec] 
     [exec] clover:
     [exec] 
     [exec] compile-core:
     [exec] 
     [exec] module-build.init:
     [exec] 
     [exec] resolve-icu:
     [exec]      [echo] Building analyzers-icu...
     [exec] 
     [exec] ivy-availability-check:
     [exec]      [echo] Building analyzers-icu...
     [exec] 
     [exec] ivy-fail:
     [exec] 
     [exec] ivy-configure:
     [exec] [ivy:configure] :: loading settings :: file = /usr/home/hudson/hudson-slave/workspace/Lucene-Solr-SmokeRelease-4.3/lucene/build/fakeReleaseTmp/unpack/lucene-4.3.1/ivy-settings.xml
     [exec] 
     [exec] resolve:
     [exec] 
     [exec] check-memory-uptodate:
     [exec] 
     [exec] jar-memory:
     [exec]      [echo] Building memory...
     [exec] 
     [exec] check-queryparser-uptodate:
     [exec] 
     [exec] jar-queryparser:
     [exec]      [echo] Building queryparser...
     [exec] 
     [exec] check-queries-uptodate:
     [exec] 
     [exec] jar-queries:
     [exec]      [echo] Building queries...
     [exec] 
     [exec] ivy-availability-check:
     [exec]      [echo] Building queries...
     [exec] 
     [exec] ivy-fail:
     [exec] 
     [exec] ivy-configure:
     [exec] [ivy:configure] :: loading settings :: file = /usr/home/hudson/hudson-slave/workspace/Lucene-Solr-SmokeRelease-4.3/lucene/build/fakeReleaseTmp/unpack/lucene-4.3.1/ivy-settings.xml
     [exec] 
     [exec] resolve:
     [exec] 
     [exec] common.init:
     [exec] 
     [exec] compile-lucene-core:
     [exec] 
     [exec] init:
     [exec] 
     [exec] -clover.disable:
     [exec] 
     [exec] -clover.load:
     [exec] 
     [exec] -clover.classpath:
     [exec] 
     [exec] -clover.setup:
     [exec] 
     [exec] clover:
     [exec] 
     [exec] compile-core:
     [exec]     [mkdir] Created dir: /usr/home/hudson/hudson-slave/workspace/Lucene-Solr-SmokeRelease-4.3/lucene/build/fakeReleaseTmp/unpack/lucene-4.3.1/build/queries/classes/java
     [exec]     [javac] Compiling 69 source files to /usr/home/hudson/hudson-slave/workspace/Lucene-Solr-SmokeRelease-4.3/lucene/build/fakeReleaseTmp/unpack/lucene-4.3.1/build/queries/classes/java
     [exec]     [javac] /usr/home/hudson/hudson-slave/workspace/Lucene-Solr-SmokeRelease-4.3/lucene/build/fakeReleaseTmp/unpack/lucene-4.3.1/queries/src/java/org/apache/lucene/queries/CommonTermsQuery.java:167: warning: [cast] redundant cast to int
     [exec]     [javac]       return (int) (Math.round(minNrShouldMatch * numOptional));
     [exec]     [javac]              ^
     [exec]     [javac] /usr/home/hudson/hudson-slave/workspace/Lucene-Solr-SmokeRelease-4.3/lucene/build/fakeReleaseTmp/unpack/lucene-4.3.1/queries/src/java/org/apache/lucene/queries/function/BoostedQuery.java:72: warning: [rawtypes] found raw type: Map
     [exec]     [javac]     Map fcontext;
     [exec]     [javac]     ^
     [exec]     [javac]   missing type arguments for generic class Map<K,V>
     [exec]     [javac]   where K,V are type-variables:
     [exec]     [javac]     K extends Object declared in interface Map
     [exec]     [javac]     V extends Object declared in interface Map
     [exec]     [javac] /usr/home/hudson/hudson-slave/workspace/Lucene-Solr-SmokeRelease-4.3/lucene/build/fakeReleaseTmp/unpack/lucene-4.3.1/queries/src/java/org/apache/lucene/queries/function/ValueSource.java:43: warning: [rawtypes] found raw type: Map
     [exec]     [javac]   public abstract FunctionValues getValues(Map context, AtomicReaderContext readerContext) throws IOException;
     [exec]     [javac]                                            ^
     [exec]     [javac]   missing type arguments for generic class Map<K,V>
     [exec]     [javac]   where K,V are type-variables:
     [exec]     [javac]     K extends Object declared in interface Map
     [exec]     [javac]     V extends Object declared in interface Map
     [exec]     [javac] /usr/home/hudson/hudson-slave/workspace/Lucene-Solr-SmokeRelease-4.3/lucene/build/fakeReleaseTmp/unpack/lucene-4.3.1/queries/src/java/org/apache/lucene/queries/function/ValueSource.java:67: warning: [rawtypes] found raw type: Map
     [exec]     [javac]   public void createWeight(Map context, IndexSearcher searcher) throws IOException {
     [exec]     [javac]                            ^
     [exec]     [javac]   missing type arguments for generic class Map<K,V>
     [exec]     [javac]   where K,V are type-variables:
     [exec]     [javac]     K extends Object declared in interface Map
     [exec]     [javac]     V extends Object declared in interface Map
     [exec]     [javac] /usr/home/hudson/hudson-slave/workspace/Lucene-Solr-SmokeRelease-4.3/lucene/build/fakeReleaseTmp/unpack/lucene-4.3.1/queries/src/java/org/apache/lucene/queries/function/ValueSource.java:73: warning: [rawtypes] found raw type: Map
     [exec]     [javac]   public static Map newContext(IndexSearcher searcher) {
     [exec]     [javac]                 ^
     [exec]     [javac]   missing type arguments for generic class Map<K,V>
     [exec]     [javac]   where K,V are type-variables:
     [exec]     [javac]     K extends Object declared in interface Map
     [exec]     [javac]     V extends Object declared in interface Map
     [exec]     [javac] /usr/home/hudson/hudson-slave/workspace/Lucene-Solr-SmokeRelease-4.3/lucene/build/fakeReleaseTmp/unpack/lucene-4.3.1/queries/src/java/org/apache/lucene/queries/function/ValueSource.java:74: warning: [rawtypes] found raw type: Map
     [exec]     [javac]     Map context = new IdentityHashMap();
     [exec]     [javac]     ^
     [exec]     [javac]   missing type arguments for generic class Map<K,V>
     [exec]     [javac]   where K,V are type-variables:
     [exec]     [javac]     K extends Object declared in interface Map
     [exec]     [javac]     V extends Object declared in interface Map
     [exec]     [javac] /usr/home/hudson/hudson-slave/workspace/Lucene-Solr-SmokeRelease-4.3/lucene/build/fakeReleaseTmp/unpack/lucene-4.3.1/queries/src/java/org/apache/lucene/queries/function/ValueSource.java:74: warning: [rawtypes] found raw type: IdentityHashMap
     [exec]     [javac]     Map context = new IdentityHashMap();
     [exec]     [javac]                       ^
     [exec]     [javac]   missing type arguments for generic class IdentityHashMap<K,V>
     [exec]     [javac]   where K,V are type-variables:
     [exec]     [javac]     K extends Object declared in class IdentityHashMap
     [exec]     [javac]     V extends Object declared in class IdentityHashMap
     [exec]     [javac] /usr/home/hudson/hudson-slave/workspace/Lucene-Solr-SmokeRelease-4.3/lucene/build/fakeReleaseTmp/unpack/lucene-4.3.1/queries/src/java/org/apache/lucene/queries/function/ValueSource.java:75: warning: [unchecked] unchecked call to put(K,V) as a member of the raw type Map
     [exec]     [javac]     context.put("searcher", searcher);
     [exec]     [javac]                ^
     [exec]     [javac]   where K,V are type-variables:
     [exec]     [javac]     K extends Object declared in interface Map
     [exec]     [javac]     V extends Object declared in interface Map
     [exec]     [javac] /usr/home/hudson/hudson-slave/workspace/Lucene-Solr-SmokeRelease-4.3/lucene/build/fakeReleaseTmp/unpack/lucene-4.3.1/queries/src/java/org/apache/lucene/queries/function/ValueSource.java:104: warning: [rawtypes] found raw type: Map
     [exec]     [javac]       Map context = newContext(searcher);
     [exec]     [javac]       ^
     [exec]     [javac]   missing type arguments for generic class Map<K,V>
     [exec]     [javac]   where K,V are type-variables:
     [exec]     [javac]     K extends Object declared in interface Map
     [exec]     [javac]     V extends Object declared in interface Map
     [exec]     [javac] /usr/home/hudson/hudson-slave/workspace/Lucene-Solr-SmokeRelease-4.3/lucene/build/fakeReleaseTmp/unpack/lucene-4.3.1/queries/src/java/org/apache/lucene/queries/function/ValueSource.java:111: warning: [rawtypes] found raw type: Map
     [exec]     [javac]     private final Map context;
     [exec]     [javac]                   ^
     [exec]     [javac]   missing type arguments for generic class Map<K,V>
     [exec]     [javac]   where K,V are type-variables:
     [exec]     [javac]     K extends Object declared in interface Map
     [exec]     [javac]     V extends Object declared in interface Map
     [exec]     [javac] /usr/home/hudson/hudson-slave/workspace/Lucene-Solr-SmokeRelease-4.3/lucene/build/fakeReleaseTmp/unpack/lucene-4.3.1/queries/src/java/org/apache/lucene/queries/function/ValueSource.java:113: warning: [rawtypes] found raw type: Map
     [exec]     [javac]     public ValueSourceComparatorSource(Map context) {
     [exec]     [javac]                                        ^
     [exec]     [javac]   missing type arguments for generic class Map<K,V>
     [exec]     [javac]   where K,V are type-variables:
     [exec]     [javac]     K extends Object declared in interface Map
     [exec]     [javac]     V extends Object declared in interface Map
     [exec]     [javac] /usr/home/hudson/hudson-slave/workspace/Lucene-Solr-SmokeRelease-4.3/lucene/build/fakeReleaseTmp/unpack/lucene-4.3.1/queries/src/java/org/apache/lucene/queries/function/ValueSource.java:156: warning: [unchecked] setNextReader(AtomicReaderContext) in ValueSource.ValueSourceComparator overrides setNextReader(AtomicReaderContext) in FieldComparator
     [exec]     [javac]     public FieldComparator setNextReader(AtomicReaderContext context) throws IOException {
     [exec]     [javac]                            ^
     [exec]     [javac]   return type requires unchecked conversion from FieldComparator to FieldComparator<Double>
     [exec]     [javac]   where T is a type-variable:
     [exec]     [javac]     T extends Object declared in class FieldComparator
     [exec]     [javac] /usr/home/hudson/hudson-slave/workspace/Lucene-Solr-SmokeRelease-4.3/lucene/build/fakeReleaseTmp/unpack/lucene-4.3.1/queries/src/java/org/apache/lucene/queries/function/ValueSource.java:133: warning: [rawtypes] found raw type: Map
     [exec]     [javac]     private final Map fcontext;
     [exec]     [javac]                   ^
     [exec]     [javac]   missing type arguments for generic class Map<K,V>
     [exec]     [javac]   where K,V are type-variables:
     [exec]     [javac]     K extends Object declared in interface Map
     [exec]     [javac]     V extends Object declared in interface Map
     [exec]     [javac] /usr/home/hudson/hudson-slave/workspace/Lucene-Solr-SmokeRelease-4.3/lucene/build/fakeReleaseTmp/unpack/lucene-4.3.1/queries/src/java/org/apache/lucene/queries/function/ValueSource.java:135: warning: [rawtypes] found raw type: Map
     [exec]     [javac]     ValueSourceComparator(Map fcontext, int numHits) {
     [exec]     [javac]                           ^
     [exec]     [javac]   missing type arguments for generic class Map<K,V>
     [exec]     [javac]   where K,V are type-variables:
     [exec]     [javac]     K extends Object declared in interface Map
     [exec]     [javac]     V extends Object declared in interface Map
     [exec]     [javac] /usr/home/hudson/hudson-slave/workspace/Lucene-Solr-SmokeRelease-4.3/lucene/build/fakeReleaseTmp/unpack/lucene-4.3.1/queries/src/java/org/apache/lucene/queries/function/ValueSource.java:156: warning: [rawtypes] found raw type: FieldComparator
     [exec]     [javac]     public FieldComparator setNextReader(AtomicReaderContext context) throws IOException {
     [exec]     [javac]            ^
     [exec]     [javac]   missing type arguments for generic class FieldComparator<T>
     [exec]     [javac]   where T is a type-variable:
     [exec]     [javac]     T extends Object declared in class FieldComparator
     [exec]     [javac] /usr/home/hudson/hudson-slave/workspace/Lucene-Solr-SmokeRelease-4.3/lucene/build/fakeReleaseTmp/unpack/lucene-4.3.1/queries/src/java/org/apache/lucene/queries/function/FunctionQuery.java:67: warning: [rawtypes] found raw type: Map
     [exec]     [javac]     protected final Map context;
     [exec]     [javac]                     ^
     [exec]     [javac]   missing type arguments for generic class Map<K,V>
     [exec]     [javac]   where K,V are type-variables:
     [exec]     [javac]     K extends Object declared in interface Map
     [exec]     [javac]     V extends Object declared in interface Map
     [exec]     [javac] /usr/home/hudson/hudson-slave/workspace/Lucene-Solr-SmokeRelease-4.3/lucene/build/fakeReleaseTmp/unpack/lucene-4.3.1/queries/src/java/org/apache/lucene/queries/function/valuesource/ByteFieldSource.java:53: warning: [rawtypes] found raw type: Map
     [exec]     [javac]   public FunctionValues getValues(Map context, AtomicReaderContext readerContext) throws IOException {
     [exec]     [javac]                                   ^
     [exec]     [javac]   missing type arguments for generic class Map<K,V>
     [exec]     [javac]   where K,V are type-variables:
     [exec]     [javac]     K extends Object declared in interface Map
     [exec]     [javac]     V extends Object declared in interface Map
     [exec]     [javac] /usr/home/hudson/hudson-slave/workspace/Lucene-Solr-SmokeRelease-4.3/lucene/build/fakeReleaseTmp/unpack/lucene-4.3.1/queries/src/java/org/apache/lucene/queries/function/valuesource/BytesRefFieldSource.java:43: warning: [rawtypes] found raw type: Map
     [exec]     [javac]   public FunctionValues getValues(Map context, AtomicReaderContext readerContext) throws IOException {
     [exec]     [javac]                                   ^
     [exec]     [javac]   missing type arguments for generic class Map<K,V>
     [exec]     [javac]   where K,V are type-variables:
     [exec]     [javac]     K extends Object declared in interface Map
     [exec]     [javac]     V extends Object declared in interface Map
     [exec]     [javac] /usr/home/hudson/hudson-slave/workspace/Lucene-Solr-SmokeRelease-4.3/lucene/build/fakeReleaseTmp/unpack/lucene-4.3.1/queries/src/java/org/apache/lucene/queries/function/valuesource/ConstValueSource.java:45: warning: [rawtypes] found raw type: Map
     [exec]     [javac]   public FunctionValues getValues(Map context, AtomicReaderContext readerContext) throws IOException {
     [exec]     [javac]                                   ^
     [exec]     [javac]   missing type arguments for generic class Map<K,V>
     [exec]     [javac]   where K,V are type-variables:
     [exec]     [javac]     K extends Object declared in interface Map
     [exec]     [javac]     V extends Object declared in interface Map
     [exec]     [javac] /usr/home/hudson/hudson-slave/workspace/Lucene-Solr-SmokeRelease-4.3/lucene/build/fakeReleaseTmp/unpack/lucene-4.3.1/queries/src/java/org/apache/lucene/queries/function/valuesource/MultiFunction.java:64: warning: [rawtypes] found raw type: Map
     [exec]     [javac]   public static FunctionValues[] valsArr(List<ValueSource> sources, Map fcontext, AtomicReaderContext readerContext) throws IOException {
     [exec]     [javac]                                                                     ^
     [exec]     [javac]   missing type arguments for generic class Map<K,V>
     [exec]     [javac]   where K,V are type-variables:
     [exec]     [javac]     K extends Object declared in interface Map
     [exec]     [javac]     V extends Object declared in interface Map
     [exec]     [javac] /usr/home/hudson/hudson-slave/workspace/Lucene-Solr-SmokeRelease-4.3/lucene/build/fakeReleaseTmp/unpack/lucene-4.3.1/queries/src/java/org/apache/lucene/queries/function/valuesource/MultiFunction.java:110: warning: [rawtypes] found raw type: Map
     [exec]     [javac]   public void createWeight(Map context, IndexSearcher searcher) throws IOException {
     [exec]     [javac]                            ^
     [exec]     [javac]   missing type arguments for generic class Map<K,V>
     [exec]     [javac]   where K,V are type-variables:
     [exec]     [javac]     K extends Object declared in interface Map
     [exec]     [javac]     V extends Object declared in interface Map
     [exec]     [javac] /usr/home/hudson/hudson-slave/workspace/Lucene-Solr-SmokeRelease-4.3/lucene/build/fakeReleaseTmp/unpack/lucene-4.3.1/queries/src/java/org/apache/lucene/queries/function/valuesource/DefFunction.java:48: warning: [rawtypes] found raw type: Map
     [exec]     [javac]   public FunctionValues getValues(Map fcontext, AtomicReaderContext readerContext) throws IOException {
     [exec]     [javac]                                   ^
     [exec]     [javac]   missing type arguments for generic class Map<K,V>
     [exec]     [javac]   where K,V are type-variables:
     [exec]     [javac]     K extends Object declared in interface Map
     [exec]     [javac]     V extends Object declared in interface Map
     [exec]     [javac] /usr/home/hudson/hudson-slave/workspace/Lucene-Solr-SmokeRelease-4.3/lucene/build/fakeReleaseTmp/unpack/lucene-4.3.1/queries/src/java/org/apache/lucene/queries/function/valuesource/DualFloatFunction.java:55: warning: [rawtypes] found raw type: Map
     [exec]     [javac]   public FunctionValues getValues(Map context, AtomicReaderContext readerContext) throws IOException {
     [exec]     [javac]                                   ^
     [exec]     [javac]   missing type arguments for generic class Map<K,V>
     [exec]     [javac]   where K,V are type-variables:
     [exec]     [javac]     K extends Object declared in interface Map
     [exec]     [javac]     V extends Object declared in interface Map
     [exec]     [javac] /usr/home/hudson/hudson-slave/workspace/Lucene-Solr-SmokeRelease-4.3/lucene/build/fakeReleaseTmp/unpack/lucene-4.3.1/queries/src/java/org/apache/lucene/queries/function/valuesource/DualFloatFunction.java:72: warning: [rawtypes] found raw type: Map
     [exec]     [javac]   public void createWeight(Map context, IndexSearcher searcher) throws IOException {
     [exec]     [javac]                            ^
     [exec]     [javac]   missing type arguments for generic class Map<K,V>
     [exec]     [javac]   where K,V are type-variables:
     [exec]     [javac]     K extends Object declared in interface Map
     [exec]     [javac]     V extends Object declared in interface Map
     [exec]     [javac] /usr/home/hudson/hudson-slave/workspace/Lucene-Solr-SmokeRelease-4.3/lucene/build/fakeReleaseTmp/unpack/lucene-4.3.1/queries/src/java/org/apache/lucene/queries/function/valuesource/DocFreqValueSource.java:149: warning: [rawtypes] found raw type: Map
     [exec]     [javac]   public FunctionValues getValues(Map context, AtomicReaderContext readerContext) throws IOException {
     [exec]     [javac]                                   ^
     [exec]     [javac]   missing type arguments for generic class Map<K,V>
     [exec]     [javac]   where K,V are type-variables:
     [exec]     [javac]     K extends Object declared in interface Map
     [exec]     [javac]     V extends Object declared in interface Map
     [exec]     [javac] /usr/home/hudson/hudson-slave/workspace/Lucene-Solr-SmokeRelease-4.3/lucene/build/fakeReleaseTmp/unpack/lucene-4.3.1/queries/src/java/org/apache/lucene/queries/function/valuesource/DocFreqValueSource.java:156: warning: [rawtypes] found raw type: Map
     [exec]     [javac]   public void createWeight(Map context, IndexSearcher searcher) throws IOException {
     [exec]     [javac]                            ^
     [exec]     [javac]   missing type arguments for generic class Map<K,V>
     [exec]     [javac]   where K,V are type-variables:
     [exec]     [javac]     K extends Object declared in interface Map
     [exec]     [javac]     V extends Object declared in interface Map
     [exec]     [javac] /usr/home/hudson/hudson-slave/workspace/Lucene-Solr-SmokeRelease-4.3/lucene/build/fakeReleaseTmp/unpack/lucene-4.3.1/queries/src/java/org/apache/lucene/queries/function/valuesource/DocFreqValueSource.java:157: warning: [unchecked] unchecked call to put(K,V) as a member of the raw type Map
     [exec]     [javac]     context.put("searcher",searcher);
     [exec]     [javac]                ^
     [exec]     [javac]   where K,V are type-variables:
     [exec]     [javac]     K extends Object declared in interface Map
     [exec]     [javac]     V extends Object declared in interface Map
     [exec]     [javac] /usr/home/hudson/hudson-slave/workspace/Lucene-Solr-SmokeRelease-4.3/lucene/build/fakeReleaseTmp/unpack/lucene-4.3.1/queries/src/java/org/apache/lucene/queries/function/valuesource/DoubleConstValueSource.java:47: warning: [rawtypes] found raw type: Map
     [exec]     [javac]   public FunctionValues getValues(Map context, AtomicReaderContext readerContext) throws IOException {
     [exec]     [javac]                                   ^
     [exec]     [javac]   missing type arguments for generic class Map<K,V>
     [exec]     [javac]   where K,V are type-variables:
     [exec]     [javac]     K extends Object declared in interface Map
     [exec]     [javac]     V extends Object declared in interface Map
     [exec]     [javac] /usr/home/hudson/hudson-slave/workspace/Lucene-Solr-SmokeRelease-4.3/lucene/build/fakeReleaseTmp/unpack/lucene-4.3.1/queries/src/java/org/apache/lucene/queries/function/valuesource/DoubleFieldSource.java:60: warning: [rawtypes] found raw type: Map
     [exec]     [javac]   public FunctionValues getValues(Map context, AtomicReaderContext readerContext) throws IOException {
     [exec]     [javac]                                   ^
     [exec]     [javac]   missing type arguments for generic class Map<K,V>
     [exec]     [javac]   where K,V are type-variables:
     [exec]     [javac]     K extends Object declared in interface Map
     [exec]     [javac]     V extends Object declared in interface Map
     [exec]     [javac] /usr/home/hudson/hudson-slave/workspace/Lucene-Solr-SmokeRelease-4.3/lucene/build/fakeReleaseTmp/unpack/lucene-4.3.1/queries/src/java/org/apache/lucene/queries/function/valuesource/FloatFieldSource.java:58: warning: [rawtypes] found raw type: Map
     [exec]     [javac]   public FunctionValues getValues(Map context, AtomicReaderContext readerContext) throws IOException {
     [exec]     [javac]                                   ^
     [exec]     [javac]   missing type arguments for generic class Map<K,V>
     [exec]     [javac]   where K,V are type-variables:
     [exec]     [javac]     K extends Object declared in interface Map
     [exec]     [javac]     V extends Object declared in interface Map
     [exec]     [javac] /usr/home/hudson/hudson-slave/workspace/Lucene-Solr-SmokeRelease-4.3/lucene/build/fakeReleaseTmp/unpack/lucene-4.3.1/queries/src/java/org/apache/lucene/queries/function/valuesource/IDFValueSource.java:49: warning: [rawtypes] found raw type: Map
     [exec]     [javac]   public FunctionValues getValues(Map context, AtomicReaderContext readerContext) throws IOException {
     [exec]     [javac]                                   ^
     [exec]     [javac]   missing type arguments for generic class Map<K,V>
     [exec]     [javac]   where K,V are type-variables:
     [exec]     [javac]     K extends Object declared in interface Map
     [exec]     [javac]     V extends Object declared in interface Map
     [exec]     [javac] /usr/home/hudson/hudson-slave/workspace/Lucene-Solr-SmokeRelease-4.3/lucene/build/fakeReleaseTmp/unpack/lucene-4.3.1/queries/src/java/org/apache/lucene/queries/function/valuesource/IfFunction.java:50: warning: [rawtypes] found raw type: Map
     [exec]     [javac]   public FunctionValues getValues(Map context, AtomicReaderContext readerContext) throws IOException {
     [exec]     [javac]                                   ^
     [exec]     [javac]   missing type arguments for generic class Map<K,V>
     [exec]     [javac]   where K,V are type-variables:
     [exec]     [javac]     K extends Object declared in interface Map
     [exec]     [javac]     V extends Object declared in interface Map
     [exec]     [javac] /usr/home/hudson/hudson-slave/workspace/Lucene-Solr-SmokeRelease-4.3/lucene/build/fakeReleaseTmp/unpack/lucene-4.3.1/queries/src/java/org/apache/lucene/queries/function/valuesource/IfFunction.java:149: warning: [rawtypes] found raw type: Map
     [exec]     [javac]   public void createWeight(Map context, IndexSearcher searcher) throws IOException {
     [exec]     [javac]                            ^
     [exec]     [javac]   missing type arguments for generic class Map<K,V>
     [exec]     [javac]   where K,V are type-variables:
     [exec]     [javac]     K extends Object declared in interface Map
     [exec]     [javac]     V extends Object declared in interface Map
     [exec]     [javac] /usr/home/hudson/hudson-slave/workspace/Lucene-Solr-SmokeRelease-4.3/lucene/build/fakeReleaseTmp/unpack/lucene-4.3.1/queries/src/java/org/apache/lucene/queries/function/valuesource/IntFieldSource.java:59: warning: [rawtypes] found raw type: Map
     [exec]     [javac]   public FunctionValues getValues(Map context, AtomicReaderContext readerContext) throws IOException {
     [exec]     [javac]                                   ^
     [exec]     [javac]   missing type arguments for generic class Map<K,V>
     [exec]     [javac]   where K,V are type-variables:
     [exec]     [javac]     K extends Object declared in interface Map
     [exec]     [javac]     V extends Object declared in interface Map
     [exec]     [javac] /usr/home/hudson/hudson-slave/workspace/Lucene-Solr-SmokeRelease-4.3/lucene/build/fakeReleaseTmp/unpack/lucene-4.3.1/queries/src/java/org/apache/lucene/queries/function/valuesource/JoinDocFreqValueSource.java:57: warning: [rawtypes] found raw type: Map
     [exec]     [javac]   public FunctionValues getValues(Map context, AtomicReaderContext readerContext) throws IOException
     [exec]     [javac]                                   ^
     [exec]     [javac]   missing type arguments for generic class Map<K,V>
     [exec]     [javac]   where K,V are type-variables:
     [exec]     [javac]     K extends Object declared in interface Map
     [exec]     [javac]     V extends Object declared in interface Map
     [exec]     [javac] /usr/home/hudson/hudson-slave/workspace/Lucene-Solr-SmokeRelease-4.3/lucene/build/fakeReleaseTmp/unpack/lucene-4.3.1/queries/src/java/org/apache/lucene/queries/function/valuesource/LinearFloatFunction.java:54: warning: [rawtypes] found raw type: Map
     [exec]     [javac]   public FunctionValues getValues(Map context, AtomicReaderContext readerContext) throws IOException {
     [exec]     [javac]                                   ^
     [exec]     [javac]   missing type arguments for generic class Map<K,V>
     [exec]     [javac]   where K,V are type-variables:
     [exec]     [javac]     K extends Object declared in interface Map
     [exec]     [javac]     V extends Object declared in interface Map
     [exec]     [javac] /usr/home/hudson/hudson-slave/workspace/Lucene-Solr-SmokeRelease-4.3/lucene/build/fakeReleaseTmp/unpack/lucene-4.3.1/queries/src/java/org/apache/lucene/queries/function/valuesource/LinearFloatFunction.java:69: warning: [rawtypes] found raw type: Map
     [exec]     [javac]   public void createWeight(Map context, IndexSearcher searcher) throws IOException {
     [exec]     [javac]                            ^
     [exec]     [javac]   missing type arguments for generic class Map<K,V>
     [exec]     [javac]   where K,V are type-variables:
     [exec]     [javac]     K extends Object declared in interface Map
     [exec]     [javac]     V extends Object declared in interface Map
     [exec]     [javac] /usr/home/hudson/hudson-slave/workspace/Lucene-Solr-SmokeRelease-4.3/lucene/build/fakeReleaseTmp/unpack/lucene-4.3.1/queries/src/java/org/apache/lucene/queries/function/valuesource/LiteralValueSource.java:48: warning: [rawtypes] found raw type: Map
     [exec]     [javac]   public FunctionValues getValues(Map context, AtomicReaderContext readerContext) throws IOException {
     [exec]     [javac]                                   ^
     [exec]     [javac]   missing type arguments for generic class Map<K,V>
     [exec]     [javac]   where K,V are type-variables:
     [exec]     [javac]     K extends Object declared in interface Map
     [exec]     [javac]     V extends Object declared in interface Map
     [exec]     [javac] /usr/home/hudson/hudson-slave/workspace/Lucene-Solr-SmokeRelease-4.3/lucene/build/fakeReleaseTmp/unpack/lucene-4.3.1/queries/src/java/org/apache/lucene/queries/function/valuesource/LongFieldSource.java:72: warning: [rawtypes] found raw type: Map
     [exec]     [javac]   public FunctionValues getValues(Map context, AtomicReaderContext readerContext) throws IOException {
     [exec]     [javac]                                   ^
     [exec]     [javac]   missing type arguments for generic class Map<K,V>
     [exec]     [javac]   where K,V are type-variables:
     [exec]     [javac]     K extends Object declared in interface Map
     [exec]     [javac]     V extends Object declared in interface Map
     [exec]     [javac] /usr/home/hudson/hudson-slave/workspace/Lucene-Solr-SmokeRelease-4.3/lucene/build/fakeReleaseTmp/unpack/lucene-4.3.1/queries/src/java/org/apache/lucene/queries/function/valuesource/MaxDocValueSource.java:44: warning: [rawtypes] found raw type: Map
     [exec]     [javac]   public void createWeight(Map context, IndexSearcher searcher) throws IOException {
     [exec]     [javac]                            ^
     [exec]     [javac]   missing type arguments for generic class Map<K,V>
     [exec]     [javac]   where K,V are type-variables:
     [exec]     [javac]     K extends Object declared in interface Map
     [exec]     [javac]     V extends Object declared in interface Map
     [exec]     [javac] /usr/home/hudson/hudson-slave/workspace/Lucene-Solr-SmokeRelease-4.3/lucene/build/fakeReleaseTmp/unpack/lucene-4.3.1/queries/src/java/org/apache/lucene/queries/function/valuesource/MaxDocValueSource.java:45: warning: [unchecked] unchecked call to put(K,V) as a member of the raw type Map
     [exec]     [javac]     context.put("searcher",searcher);
     [exec]     [javac]                ^
     [exec]     [javac]   where K,V are type-variables:
     [exec]     [javac]     K extends Object declared in interface Map
     [exec]     [javac]     V extends Object declared in interface Map
     [exec]     [javac] /usr/home/hudson/hudson-slave/workspace/Lucene-Solr-SmokeRelease-4.3/lucene/build/fakeReleaseTmp/unpack/lucene-4.3.1/queries/src/java/org/apache/lucene/queries/function/valuesource/MaxDocValueSource.java:49: warning: [rawtypes] found raw type: Map
     [exec]     [javac]   public FunctionValues getValues(Map context, AtomicReaderContext readerContext) throws IOException {
     [exec]     [javac]                                   ^
     [exec]     [javac]   missing type arguments for generic class Map<K,V>
     [exec]     [javac]   where K,V are type-variables:
     [exec]     [javac]     K extends Object declared in interface Map
     [exec]     [javac]     V extends Object declared in interface Map
     [exec]     [javac] /usr/home/hudson/hudson-slave/workspace/Lucene-Solr-SmokeRelease-4.3/lucene/build/fakeReleaseTmp/unpack/lucene-4.3.1/queries/src/java/org/apache/lucene/queries/function/valuesource/MultiFloatFunction.java:62: warning: [rawtypes] found raw type: Map
     [exec]     [javac]   public FunctionValues getValues(Map context, AtomicReaderContext readerContext) throws IOException {
     [exec]     [javac]                                   ^
     [exec]     [javac]   missing type arguments for generic class Map<K,V>
     [exec]     [javac]   where K,V are type-variables:
     [exec]     [javac]     K extends Object declared in interface Map
     [exec]     [javac]     V extends Object declared in interface Map
     [exec]     [javac] /usr/home/hudson/hudson-slave/workspace/Lucene-Solr-SmokeRelease-4.3/lucene/build/fakeReleaseTmp/unpack/lucene-4.3.1/queries/src/java/org/apache/lucene/queries/function/valuesource/MultiFloatFunction.java:93: warning: [rawtypes] found raw type: Map
     [exec]     [javac]   public void createWeight(Map context, IndexSearcher searcher) throws IOException {
     [exec]     [javac]                            ^
     [exec]     [javac]   missing type arguments for generic class Map<K,V>
     [exec]     [javac]   where K,V are type-variables:
     [exec]     [javac]     K extends Object declared in interface Map
     [exec]     [javac]     V extends Object declared in interface Map
     [exec]     [javac] /usr/home/hudson/hudson-slave/workspace/Lucene-Solr-SmokeRelease-4.3/lucene/build/fakeReleaseTmp/unpack/lucene-4.3.1/queries/src/java/org/apache/lucene/queries/function/valuesource/MultiBoolFunction.java:46: warning: [rawtypes] found raw type: Map
     [exec]     [javac]   public BoolDocValues getValues(Map context, AtomicReaderContext readerContext) throws IOException {
     [exec]     [javac]                                  ^
     [exec]     [javac]   missing type arguments for generic class Map<K,V>
     [exec]     [javac]   where K,V are type-variables:
     [exec]     [javac]     K extends Object declared in interface Map
     [exec]     [javac]     V extends Object declared in interface Map
     [exec]     [javac] /usr/home/hudson/hudson-slave/workspace/Lucene-Solr-SmokeRelease-4.3/lucene/build/fakeReleaseTmp/unpack/lucene-4.3.1/queries/src/java/org/apache/lucene/queries/function/valuesource/MultiBoolFunction.java:106: warning: [rawtypes] found raw type: Map
     [exec]     [javac]   public void createWeight(Map context, IndexSearcher searcher) throws IOException {
     [exec]     [javac]                            ^
     [exec]     [javac]   missing type arguments for generic class Map<K,V>
     [exec]     [javac]   where K,V are type-variables:
     [exec]     [javac]     K extends Object declared in interface Map
     [exec]     [javac]     V extends Object declared in interface Map
     [exec]     [javac] /usr/home/hudson/hudson-slave/workspace/Lucene-Solr-SmokeRelease-4.3/lucene/build/fakeReleaseTmp/unpack/lucene-4.3.1/queries/src/java/org/apache/lucene/queries/function/valuesource/NormValueSource.java:54: warning: [rawtypes] found raw type: Map
     [exec]     [javac]   public void createWeight(Map context, IndexSearcher searcher) throws IOException {
     [exec]     [javac]                            ^
     [exec]     [javac]   missing type arguments for generic class Map<K,V>
     [exec]     [javac]   where K,V are type-variables:
     [exec]     [javac]     K extends Object declared in interface Map
     [exec]     [javac]     V extends Object declared in interface Map
     [exec]     [javac] /usr/home/hudson/hudson-slave/workspace/Lucene-Solr-SmokeRelease-4.3/lucene/build/fakeReleaseTmp/unpack/lucene-4.3.1/queries/src/java/org/apache/lucene/queries/function/valuesource/NormValueSource.java:55: warning: [unchecked] unchecked call to put(K,V) as a member of the raw type Map
     [exec]     [javac]     context.put("searcher",searcher);
     [exec]     [javac]                ^
     [exec]     [javac]   where K,V are type-variables:
     [exec]     [javac]     K extends Object declared in interface Map
     [exec]     [javac]     V extends Object declared in interface Map
     [exec]     [javac] /usr/home/hudson/hudson-slave/workspace/Lucene-Solr-SmokeRelease-4.3/lucene/build/fakeReleaseTmp/unpack/lucene-4.3.1/queries/src/java/org/apache/lucene/queries/function/valuesource/NormValueSource.java:59: warning: [rawtypes] found raw type: Map
     [exec]     [javac]   public FunctionValues getValues(Map context, AtomicReaderContext readerContext) throws IOException {
     [exec]     [javac]                                   ^
     [exec]     [javac]   missing type arguments for generic class Map<K,V>
     [exec]     [javac]   where K,V are type-variables:
     [exec]     [javac]     K extends Object declared in interface Map
     [exec]     [javac]     V extends Object declared in interface Map
     [exec]     [javac] /usr/home/hudson/hudson-slave/workspace/Lucene-Solr-SmokeRelease-4.3/lucene/build/fakeReleaseTmp/unpack/lucene-4.3.1/queries/src/java/org/apache/lucene/queries/function/valuesource/NumDocsValueSource.java:44: warning: [rawtypes] found raw type: Map
     [exec]     [javac]   public FunctionValues getValues(Map context, AtomicReaderContext readerContext) throws IOException {
     [exec]     [javac]                                   ^
     [exec]     [javac]   missing type arguments for generic class Map<K,V>
     [exec]     [javac]   where K,V are type-variables:
     [exec]     [javac]     K extends Object declared in interface Map
     [exec]     [javac]     V extends Object declared in interface Map
     [exec]     [javac] /usr/home/hudson/hudson-slave/workspace/Lucene-Solr-SmokeRelease-4.3/lucene/build/fakeReleaseTmp/unpack/lucene-4.3.1/queries/src/java/org/apache/lucene/queries/function/valuesource/OrdFieldSource.java:70: warning: [rawtypes] found raw type: Map
     [exec]     [javac]   public FunctionValues getValues(Map context, AtomicReaderContext readerContext) throws IOException {
     [exec]     [javac]                                   ^
     [exec]     [javac]   missing type arguments for generic class Map<K,V>
     [exec]     [javac]   where K,V are type-variables:
     [exec]     [javac]     K extends Object declared in interface Map
     [exec]     [javac]     V extends Object declared in interface Map
     [exec]     [javac] /usr/home/hudson/hudson-slave/workspace/Lucene-Solr-SmokeRelease-4.3/lucene/build/fakeReleaseTmp/unpack/lucene-4.3.1/queries/src/java/org/apache/lucene/queries/function/valuesource/QueryValueSource.java:54: warning: [rawtypes] found raw type: Map
     [exec]     [javac]   public FunctionValues getValues(Map fcontext, AtomicReaderContext readerContext) throws IOException {
     [exec]     [javac]                                   ^
     [exec]     [javac]   missing type arguments for generic class Map<K,V>
     [exec]     [javac]   where K,V are type-variables:
     [exec]     [javac]     K extends Object declared in interface Map
     [exec]     [javac]     V extends Object declared in interface Map
     [exec]     [javac] /usr/home/hudson/hudson-slave/workspace/Lucene-Solr-SmokeRelease-4.3/lucene/build/fakeReleaseTmp/unpack/lucene-4.3.1/queries/src/java/org/apache/lucene/queries/function/valuesource/QueryValueSource.java:71: warning: [rawtypes] found raw type: Map
     [exec]     [javac]   public void createWeight(Map context, IndexSearcher searcher) throws IOException {
     [exec]     [javac]                            ^
     [exec]     [javac]   missing type arguments for generic class Map<K,V>
     [exec]     [javac]   where K,V are type-variables:
     [exec]     [javac]     K extends Object declared in interface Map
     [exec]     [javac]     V extends Object declared in interface Map
     [exec]     [javac] /usr/home/hudson/hudson-slave/workspace/Lucene-Solr-SmokeRelease-4.3/lucene/build/fakeReleaseTmp/unpack/lucene-4.3.1/queries/src/java/org/apache/lucene/queries/function/valuesource/QueryValueSource.java:73: warning: [unchecked] unchecked call to put(K,V) as a member of the raw type Map
     [exec]     [javac]     context.put(this, w);
     [exec]     [javac]                ^
     [exec]     [javac]   where K,V are type-variables:
     [exec]     [javac]     K extends Object declared in interface Map
     [exec]     [javac]     V extends Object declared in interface Map
     [exec]     [javac] /usr/home/hudson/hudson-slave/workspace/Lucene-Solr-SmokeRelease-4.3/lucene/build/fakeReleaseTmp/unpack/lucene-4.3.1/queries/src/java/org/apache/lucene/queries/function/valuesource/QueryValueSource.java:83: warning: [rawtypes] found raw type: Map
     [exec]     [javac]   final Map fcontext;
     [exec]     [javac]         ^
     [exec]     [javac]   missing type arguments for generic class Map<K,V>
     [exec]     [javac]   where K,V are type-variables:
     [exec]     [javac]     K extends Object declared in interface Map
     [exec]     [javac]     V extends Object declared in interface Map
     [exec]     [javac] /usr/home/hudson/hudson-slave/workspace/Lucene-Solr-SmokeRelease-4.3/lucene/build/fakeReleaseTmp/unpack/lucene-4.3.1/queries/src/java/org/apache/lucene/queries/function/valuesource/QueryValueSource.java:95: warning: [rawtypes] found raw type: Map
     [exec]     [javac]   public QueryDocValues(QueryValueSource vs, AtomicReaderContext readerContext, Map fcontext) throws IOException {
     [exec]     [javac]                                                                                 ^
     [exec]     [javac]   missing type arguments for generic class Map<K,V>
     [exec]     [javac]   where K,V are type-variables:
     [exec]     [javac]     K extends Object declared in interface Map
     [exec]     [javac]     V extends Object declared in interface Map
     [exec]     [javac] /usr/home/hudson/hudson-slave/workspace/Lucene-Solr-SmokeRelease-4.3/lucene/build/fakeReleaseTmp/unpack/lucene-4.3.1/queries/src/java/org/apache/lucene/queries/function/valuesource/RangeMapFloatFunction.java:58: warning: [rawtypes] found raw type: Map
     [exec]     [javac]   public FunctionValues getValues(Map context, AtomicReaderContext readerContext) throws IOException {
     [exec]     [javac]                                   ^
     [exec]     [javac]   missing type arguments for generic class Map<K,V>
     [exec]     [javac]   where K,V are type-variables:
     [exec]     [javac]     K extends Object declared in interface Map
     [exec]     [javac]     V extends Object declared in interface Map
     [exec]     [javac] /usr/home/hudson/hudson-slave/workspace/Lucene-Solr-SmokeRelease-4.3/lucene/build/fakeReleaseTmp/unpack/lucene-4.3.1/queries/src/java/org/apache/lucene/queries/function/valuesource/RangeMapFloatFunction.java:74: warning: [rawtypes] found raw type: Map
     [exec]     [javac]   public void createWeight(Map context, IndexSearcher searcher) throws IOException {
     [exec]     [javac]                            ^
     [exec]     [javac]   missing type arguments for generic class Map<K,V>
     [exec]     [javac]   where K,V are type-variables:
     [exec]     [javac]     K extends Object declared in interface Map
     [exec]     [javac]     V extends Object declared in interface Map
     [exec]     [javac] /usr/home/hudson/hudson-slave/workspace/Lucene-Solr-SmokeRelease-4.3/lucene/build/fakeReleaseTmp/unpack/lucene-4.3.1/queries/src/java/org/apache/lucene/queries/function/valuesource/ReciprocalFloatFunction.java:64: warning: [rawtypes] found raw type: Map
     [exec]     [javac]   public FunctionValues getValues(Map context, AtomicReaderContext readerContext) throws IOException {
     [exec]     [javac]                                   ^
     [exec]     [javac]   missing type arguments for generic class Map<K,V>
     [exec]     [javac]   where K,V are type-variables:
     [exec]     [javac]     K extends Object declared in interface Map
     [exec]     [javac]     V extends Object declared in interface Map
     [exec]     [javac] /usr/home/hudson/hudson-slave/workspace/Lucene-Solr-SmokeRelease-4.3/lucene/build/fakeReleaseTmp/unpack/lucene-4.3.1/queries/src/java/org/apache/lucene/queries/function/valuesource/ReciprocalFloatFunction.java:81: warning: [rawtypes] found raw type: Map
     [exec]     [javac]   public void createWeight(Map context, IndexSearcher searcher) throws IOException {
     [exec]     [javac]                            ^
     [exec]     [javac]   missing type arguments for generic class Map<K,V>
     [exec]     [javac]   where K,V are type-variables:
     [exec]     [javac]     K extends Object declared in interface Map
     [exec]     [javac]     V extends Object declared in interface Map
     [exec]     [javac] /usr/home/hudson/hudson-slave/workspace/Lucene-Solr-SmokeRelease-4.3/lucene/build/fakeReleaseTmp/unpack/lucene-4.3.1/queries/src/java/org/apache/lucene/queries/function/valuesource/ReverseOrdFieldSource.java:70: warning: [rawtypes] found raw type: Map
     [exec]     [javac]   public FunctionValues getValues(Map context, AtomicReaderContext readerContext) throws IOException {
     [exec]     [javac]                                   ^
     [exec]     [javac]   missing type arguments for generic class Map<K,V>
     [exec]     [javac]   where K,V are type-variables:
     [exec]     [javac]     K extends Object declared in interface Map
     [exec]     [javac]     V extends Object declared in interface Map
     [exec]     [javac] /usr/home/hudson/hudson-slave/workspace/Lucene-Solr-SmokeRelease-4.3/lucene/build/fakeReleaseTmp/unpack/lucene-4.3.1/queries/src/java/org/apache/lucene/queries/function/valuesource/ScaleFloatFunction.java:63: warning: [rawtypes] found raw type: Map
     [exec]     [javac]   private ScaleInfo createScaleInfo(Map context, AtomicReaderContext readerContext) throws IOException {
     [exec]     [javac]                                     ^
     [exec]     [javac]   missing type arguments for generic class Map<K,V>
     [exec]     [javac]   where K,V are type-variables:
     [exec]     [javac]     K extends Object declared in interface Map
     [exec]     [javac]     V extends Object declared in interface Map
     [exec]     [javac] /usr/home/hudson/hudson-slave/workspace/Lucene-Solr-SmokeRelease-4.3/lucene/build/fakeReleaseTmp/unpack/lucene-4.3.1/queries/src/java/org/apache/lucene/queries/function/valuesource/ScaleFloatFunction.java:97: warning: [unchecked] unchecked call to put(K,V) as a member of the raw type Map
     [exec]     [javac]     context.put(this.source, scaleInfo);
     [exec]     [javac]                ^
     [exec]     [javac]   where K,V are type-variables:
     [exec]     [javac]     K extends Object declared in interface Map
     [exec]     [javac]     V extends Object declared in interface Map
     [exec]     [javac] /usr/home/hudson/hudson-slave/workspace/Lucene-Solr-SmokeRelease-4.3/lucene/build/fakeReleaseTmp/unpack/lucene-4.3.1/queries/src/java/org/apache/lucene/queries/function/valuesource/ScaleFloatFunction.java:102: warning: [rawtypes] found raw type: Map
     [exec]     [javac]   public FunctionValues getValues(Map context, AtomicReaderContext readerContext) throws IOException {
     [exec]     [javac]                                   ^
     [exec]     [javac]   missing type arguments for generic class Map<K,V>
     [exec]     [javac]   where K,V are type-variables:
     [exec]     [javac]     K extends Object declared in interface Map
     [exec]     [javac]     V extends Object declared in interface Map
     [exec]     [javac] /usr/home/hudson/hudson-slave/workspace/Lucene-Solr-SmokeRelease-4.3/lucene/build/fakeReleaseTmp/unpack/lucene-4.3.1/queries/src/java/org/apache/lucene/queries/function/valuesource/ScaleFloatFunction.java:131: warning: [rawtypes] found raw type: Map
     [exec]     [javac]   public void createWeight(Map context, IndexSearcher searcher) throws IOException {
     [exec]     [javac]                            ^
     [exec]     [javac]   missing type arguments for generic class Map<K,V>
     [exec]     [javac]   where K,V are type-variables:
     [exec]     [javac]     K extends Object declared in interface Map
     [exec]     [javac]     V extends Object declared in interface Map
     [exec]     [javac] /usr/home/hudson/hudson-slave/workspace/Lucene-Solr-SmokeRelease-4.3/lucene/build/fakeReleaseTmp/unpack/lucene-4.3.1/queries/src/java/org/apache/lucene/queries/function/valuesource/ShortFieldSource.java:51: warning: [rawtypes] found raw type: Map
     [exec]     [javac]   public FunctionValues getValues(Map context, AtomicReaderContext readerContext) throws IOException {
     [exec]     [javac]                                   ^
     [exec]     [javac]   missing type arguments for generic class Map<K,V>
     [exec]     [javac]   where K,V are type-variables:
     [exec]     [javac]     K extends Object declared in interface Map
     [exec]     [javac]     V extends Object declared in interface Map
     [exec]     [javac] /usr/home/hudson/hudson-slave/workspace/Lucene-Solr-SmokeRelease-4.3/lucene/build/fakeReleaseTmp/unpack/lucene-4.3.1/queries/src/java/org/apache/lucene/queries/function/valuesource/SimpleBoolFunction.java:48: warning: [rawtypes] found raw type: Map
     [exec]     [javac]   public BoolDocValues getValues(Map context, AtomicReaderContext readerContext) throws IOException {
     [exec]     [javac]                                  ^
     [exec]     [javac]   missing type arguments for generic class Map<K,V>
     [exec]     [javac]   where K,V are type-variables:
     [exec]     [javac]     K extends Object declared in interface Map
     [exec]     [javac]     V extends Object declared in interface Map
     [exec]     [javac] /usr/home/hudson/hudson-slave/workspace/Lucene-Solr-SmokeRelease-4.3/lucene/build/fakeReleaseTmp/unpack/lucene-4.3.1/queries/src/java/org/apache/lucene/queries/function/valuesource/SimpleBoolFunction.java:80: warning: [rawtypes] found raw type: Map
     [exec]     [javac]   public void createWeight(Map context, IndexSearcher searcher) throws IOException {
     [exec]     [javac]                            ^
     [exec]     [javac]   missing type arguments for generic class Map<K,V>
     [exec]     [javac]   where K,V are type-variables:
     [exec]     [javac]     K extends Object declared in interface Map
     [exec]     [javac]     V extends Object declared in interface Map
     [exec]     [javac] /usr/home/hudson/hudson-slave/workspace/Lucene-Solr-SmokeRelease-4.3/lucene/build/fakeReleaseTmp/unpack/lucene-4.3.1/queries/src/java/org/apache/lucene/queries/function/valuesource/SingleFunction.java:56: warning: [rawtypes] found raw type: Map
     [exec]     [javac]   public void createWeight(Map context, IndexSearcher searcher) throws IOException {
     [exec]     [javac]                            ^
     [exec]     [javac]   missing type arguments for generic class Map<K,V>
     [exec]     [javac]   where K,V are type-variables:
     [exec]     [javac]     K extends Object declared in interface Map
     [exec]     [javac]     V extends Object declared in interface Map
     [exec]     [javac] /usr/home/hudson/hudson-slave/workspace/Lucene-Solr-SmokeRelease-4.3/lucene/build/fakeReleaseTmp/unpack/lucene-4.3.1/queries/src/java/org/apache/lucene/queries/function/valuesource/SimpleFloatFunction.java:38: warning: [rawtypes] found raw type: Map
     [exec]     [javac]   public FunctionValues getValues(Map context, AtomicReaderContext readerContext) throws IOException {
     [exec]     [javac]                                   ^
     [exec]     [javac]   missing type arguments for generic class Map<K,V>
     [exec]     [javac]   where K,V are type-variables:
     [exec]     [javac]     K extends Object declared in interface Map
     [exec]     [javac]     V extends Object declared in interface Map
     [exec]     [javac] /usr/home/hudson/hudson-slave/workspace/Lucene-Solr-SmokeRelease-4.3/lucene/build/fakeReleaseTmp/unpack/lucene-4.3.1/queries/src/java/org/apache/lucene/queries/function/valuesource/SumTotalTermFreqValueSource.java:56: warning: [rawtypes] found raw type: Map
     [exec]     [javac]   public FunctionValues getValues(Map context, AtomicReaderContext readerContext) throws IOException {
     [exec]     [javac]                                   ^
     [exec]     [javac]   missing type arguments for generic class Map<K,V>
     [exec]     [javac]   where K,V are type-variables:
     [exec]     [javac]     K extends Object declared in interface Map
     [exec]     [javac]     V extends Object declared in interface Map
     [exec]     [javac] /usr/home/hudson/hudson-slave/workspace/Lucene-Solr-SmokeRelease-4.3/lucene/build/fakeReleaseTmp/unpack/lucene-4.3.1/queries/src/java/org/apache/lucene/queries/function/valuesource/SumTotalTermFreqValueSource.java:61: warning: [rawtypes] found raw type: Map
     [exec]     [javac]   public void createWeight(Map context, IndexSearcher searcher) throws IOException {
     [exec]     [javac]                            ^
     [exec]     [javac]   missing type arguments for generic class Map<K,V>
     [exec]     [javac]   where K,V are type-variables:
     [exec]     [javac]     K extends Object declared in interface Map
     [exec]     [javac]     V extends Object declared in interface Map
     [exec]     [javac] /usr/home/hudson/hudson-slave/workspace/Lucene-Solr-SmokeRelease-4.3/lucene/build/fakeReleaseTmp/unpack/lucene-4.3.1/queries/src/java/org/apache/lucene/queries/function/valuesource/SumTotalTermFreqValueSource.java:77: warning: [unchecked] unchecked call to put(K,V) as a member of the raw type Map
     [exec]     [javac]     context.put(this, new LongDocValues(this) {
     [exec]     [javac]                ^
     [exec]     [javac]   where K,V are type-variables:
     [exec]     [javac]     K extends Object declared in interface Map
     [exec]     [javac]     V extends Object declared in interface Map
     [exec]     [javac] /usr/home/hudson/hudson-slave/workspace/Lucene-Solr-SmokeRelease-4.3/lucene/build/fakeReleaseTmp/unpack/lucene-4.3.1/queries/src/java/org/apache/lucene/queries/function/valuesource/TermFreqValueSource.java:47: warning: [rawtypes] found raw type: Map
     [exec]     [javac]   public FunctionValues getValues(Map context, AtomicReaderContext readerContext) throws IOException {
     [exec]     [javac]                                   ^
     [exec]     [javac]   missing type arguments for generic class Map<K,V>
     [exec]     [javac]   where K,V are type-variables:
     [exec]     [javac]     K extends Object declared in interface Map
     [exec]     [javac]     V extends Object declared in interface Map
     [exec]     [javac] /usr/home/hudson/hudson-slave/workspace/Lucene-Solr-SmokeRelease-4.3/lucene/build/fakeReleaseTmp/unpack/lucene-4.3.1/queries/src/java/org/apache/lucene/queries/function/valuesource/TFValueSource.java:49: warning: [rawtypes] found raw type: Map
     [exec]     [javac]   public FunctionValues getValues(Map context, AtomicReaderContext readerContext) throws IOException {
     [exec]     [javac]                                   ^
     [exec]     [javac]   missing type arguments for generic class Map<K,V>
     [exec]     [javac]   where K,V are type-variables:
     [exe

[...truncated too long message...]

t4] 
     [exec] [junit4:junit4] Suite: org.apache.lucene.queries.function.TestValueSources
     [exec] [junit4:junit4] Completed on J2 in 0.75s, 30 tests
     [exec] [junit4:junit4] 
     [exec] [junit4:junit4] Suite: org.apache.lucene.queries.function.TestFunctionQuerySort
     [exec] [junit4:junit4] Completed on J2 in 0.12s, 1 test
     [exec] [junit4:junit4] 
     [exec] [junit4:junit4] Suite: org.apache.lucene.queries.TermsFilterTest
     [exec] [junit4:junit4] Completed on J3 in 1.11s, 9 tests
     [exec] [junit4:junit4] 
     [exec] [junit4:junit4] Suite: org.apache.lucene.queries.function.TestOrdValues
     [exec] [junit4:junit4] Completed on J1 in 0.50s, 5 tests
     [exec] [junit4:junit4] 
     [exec] [junit4:junit4] Suite: org.apache.lucene.queries.TestCustomScoreQuery
     [exec] [junit4:junit4]   2> NOTE: reproduce with: ant test  -Dtestcase=TestCustomScoreQuery -Dtests.method=testCustomScoreFloat -Dtests.seed=11F9CE4823A60AE -Dtests.slow=true -Dtests.locale=ga -Dtests.timezone=GB -Dtests.file.encoding=UTF-8
     [exec] [junit4:junit4] FAILURE 2.83s J0 | TestCustomScoreQuery.testCustomScoreFloat <<<
     [exec] [junit4:junit4]    > Throwable #1: java.lang.AssertionError: new score for custom mul add expected:<20585.240234375> but was:<20585.23828125>
     [exec] [junit4:junit4]    > 	at __randomizedtesting.SeedInfo.seed([11F9CE4823A60AE:A282377936C9DC83]:0)
     [exec] [junit4:junit4]    > 	at org.apache.lucene.queries.TestCustomScoreQuery.verifyResults(TestCustomScoreQuery.java:352)
     [exec] [junit4:junit4]    > 	at org.apache.lucene.queries.TestCustomScoreQuery.doTestCustomScore(TestCustomScoreQuery.java:302)
     [exec] [junit4:junit4]    > 	at org.apache.lucene.queries.TestCustomScoreQuery.testCustomScoreFloat(TestCustomScoreQuery.java:90)
     [exec] [junit4:junit4]    > 	at java.lang.Thread.run(Thread.java:722)
     [exec] [junit4:junit4]   2> NOTE: reproduce with: ant test  -Dtestcase=TestCustomScoreQuery -Dtests.method=testCustomScoreShort -Dtests.seed=11F9CE4823A60AE -Dtests.slow=true -Dtests.locale=ga -Dtests.timezone=GB -Dtests.file.encoding=UTF-8
     [exec] [junit4:junit4] FAILURE 2.40s J0 | TestCustomScoreQuery.testCustomScoreShort <<<
     [exec] [junit4:junit4]    > Throwable #1: java.lang.AssertionError: new score for custom mul expected:<22069.541015625> but was:<22069.54296875>
     [exec] [junit4:junit4]    > 	at __randomizedtesting.SeedInfo.seed([11F9CE4823A60AE:74417EB8DBD727FE]:0)
     [exec] [junit4:junit4]    > 	at org.apache.lucene.queries.TestCustomScoreQuery.verifyResults(TestCustomScoreQuery.java:344)
     [exec] [junit4:junit4]    > 	at org.apache.lucene.queries.TestCustomScoreQuery.doTestCustomScore(TestCustomScoreQuery.java:302)
     [exec] [junit4:junit4]    > 	at org.apache.lucene.queries.TestCustomScoreQuery.testCustomScoreShort(TestCustomScoreQuery.java:71)
     [exec] [junit4:junit4]    > 	at java.lang.Thread.run(Thread.java:722)
     [exec] [junit4:junit4]   2> NOTE: test params are: codec=Lucene3x, sim=RandomSimilarityProvider(queryNorm=false,coord=no): {text=DFR I(F)3(800.0)}, locale=ga, timezone=GB
     [exec] [junit4:junit4]   2> NOTE: FreeBSD 9.1-RELEASE-p3 amd64/Oracle Corporation 1.7.0_21 (64-bit)/cpus=16,threads=1,free=223567288,total=257425408
     [exec] [junit4:junit4]   2> NOTE: All tests run in this JVM: [TestCustomScoreQuery]
     [exec] [junit4:junit4]   2> NOTE: reproduce with: ant test  -Dtestcase=TestCustomScoreQuery -Dtests.seed=11F9CE4823A60AE -Dtests.slow=true -Dtests.locale=ga -Dtests.timezone=GB -Dtests.file.encoding=UTF-8
     [exec] [junit4:junit4] ERROR   0.00s J0 | TestCustomScoreQuery (suite) <<<
     [exec] [junit4:junit4]    > Throwable #1: java.lang.RuntimeException: MockDirectoryWrapper: cannot close: there are still open files: {_0.tis=2, _1.tis=2, _3.cfs=12, _1.frq=2, _2.cfs=12, _1.prx=2, _1.fdx=2, _1.fdt=2, _0.frq=2, _0.fdx=2, _0.prx=2, _0.fdt=2}
     [exec] [junit4:junit4]    > 	at __randomizedtesting.SeedInfo.seed([11F9CE4823A60AE]:0)
     [exec] [junit4:junit4]    > 	at org.apache.lucene.store.MockDirectoryWrapper.close(MockDirectoryWrapper.java:621)
     [exec] [junit4:junit4]    > 	at org.apache.lucene.queries.function.FunctionTestSetup.afterClassFunctionTestSetup(FunctionTestSetup.java:84)
     [exec] [junit4:junit4]    > 	at java.lang.Thread.run(Thread.java:722)
     [exec] [junit4:junit4]    > Caused by: java.lang.RuntimeException: unclosed IndexSlice: _3.cfs
     [exec] [junit4:junit4]    > 	at org.apache.lucene.store.MockDirectoryWrapper.addFileHandle(MockDirectoryWrapper.java:510)
     [exec] [junit4:junit4]    > 	at org.apache.lucene.store.MockDirectoryWrapper.createSlicer(MockDirectoryWrapper.java:942)
     [exec] [junit4:junit4]    > 	at org.apache.lucene.store.CompoundFileDirectory.<init>(CompoundFileDirectory.java:102)
     [exec] [junit4:junit4]    > 	at org.apache.lucene.index.SegmentCoreReaders.<init>(SegmentCoreReaders.java:116)
     [exec] [junit4:junit4]    > 	at org.apache.lucene.index.SegmentReader.<init>(SegmentReader.java:56)
     [exec] [junit4:junit4]    > 	at org.apache.lucene.index.StandardDirectoryReader$1.doBody(StandardDirectoryReader.java:62)
     [exec] [junit4:junit4]    > 	at org.apache.lucene.index.SegmentInfos$FindSegmentsFile.run(SegmentInfos.java:783)
     [exec] [junit4:junit4]    > 	at org.apache.lucene.index.StandardDirectoryReader.open(StandardDirectoryReader.java:52)
     [exec] [junit4:junit4]    > 	at org.apache.lucene.index.DirectoryReader.open(DirectoryReader.java:66)
     [exec] [junit4:junit4]    > 	at org.apache.lucene.queries.TestCustomScoreQuery.doTestCustomScore(TestCustomScoreQuery.java:250)
     [exec] [junit4:junit4]    > 	at org.apache.lucene.queries.TestCustomScoreQuery.testCustomScoreFloat(TestCustomScoreQuery.java:90)
     [exec] [junit4:junit4]    > 	... 13 more
     [exec] [junit4:junit4] Completed on J0 in 18.44s, 6 tests, 2 failures, 1 error <<< FAILURES!
     [exec] [junit4:junit4] 
     [exec] [junit4:junit4] 
     [exec] [junit4:junit4] Tests with failures:
     [exec] [junit4:junit4]   - org.apache.lucene.queries.TestCustomScoreQuery.testCustomScoreFloat
     [exec] [junit4:junit4]   - org.apache.lucene.queries.TestCustomScoreQuery.testCustomScoreShort
     [exec] [junit4:junit4]   - org.apache.lucene.queries.TestCustomScoreQuery (suite)
     [exec] [junit4:junit4] 
     [exec] [junit4:junit4] 
     [exec] [junit4:junit4] JVM J0:     5.78 ..    26.17 =    20.39s
     [exec] [junit4:junit4] JVM J1:     5.54 ..    17.47 =    11.93s
     [exec] [junit4:junit4] JVM J2:     5.78 ..    17.17 =    11.39s
     [exec] [junit4:junit4] JVM J3:     5.78 ..    17.40 =    11.62s
     [exec] [junit4:junit4] Execution time total: 26 seconds
     [exec] [junit4:junit4] Tests summary: 13 suites, 92 tests, 1 suite-level error, 2 failures
     [exec] 
     [exec] BUILD FAILED
     [exec] /usr/home/hudson/hudson-slave/workspace/Lucene-Solr-SmokeRelease-4.3/lucene/build/fakeReleaseTmp/unpack/lucene-4.3.1/build.xml:548: The following error occurred while executing this line:
     [exec] /usr/home/hudson/hudson-slave/workspace/Lucene-Solr-SmokeRelease-4.3/lucene/build/fakeReleaseTmp/unpack/lucene-4.3.1/common-build.xml:1800: The following error occurred while executing this line:
     [exec] /usr/home/hudson/hudson-slave/workspace/Lucene-Solr-SmokeRelease-4.3/lucene/build/fakeReleaseTmp/unpack/lucene-4.3.1/module-build.xml:61: The following error occurred while executing this line:
     [exec] /usr/home/hudson/hudson-slave/workspace/Lucene-Solr-SmokeRelease-4.3/lucene/build/fakeReleaseTmp/unpack/lucene-4.3.1/common-build.xml:1243: The following error occurred while executing this line:
     [exec] /usr/home/hudson/hudson-slave/workspace/Lucene-Solr-SmokeRelease-4.3/lucene/build/fakeReleaseTmp/unpack/lucene-4.3.1/common-build.xml:887: There were test failures: 13 suites, 92 tests, 1 suite-level error, 2 failures
     [exec] 
     [exec] Total time: 10 minutes 37 seconds
     [exec] 
     [exec] 
     [exec] Traceback (most recent call last):
     [exec]   File "/usr/home/hudson/hudson-slave/workspace/Lucene-Solr-SmokeRelease-4.3/dev-tools/scripts/smokeTestRelease.py", line 1385, in <module>
     [exec]     main()
     [exec]   File "/usr/home/hudson/hudson-slave/workspace/Lucene-Solr-SmokeRelease-4.3/dev-tools/scripts/smokeTestRelease.py", line 1331, in main
     [exec]     smokeTest(baseURL, version, tmpDir, isSigned)
     [exec]   File "/usr/home/hudson/hudson-slave/workspace/Lucene-Solr-SmokeRelease-4.3/dev-tools/scripts/smokeTestRelease.py", line 1367, in smokeTest
     [exec]     unpackAndVerify('lucene', tmpDir, 'lucene-%s-src.tgz' % version, version)
     [exec]   File "/usr/home/hudson/hudson-slave/workspace/Lucene-Solr-SmokeRelease-4.3/dev-tools/scripts/smokeTestRelease.py", line 589, in unpackAndVerify
     [exec]     verifyUnpacked(project, artifact, unpackPath, version, tmpDir)
     [exec]   File "/usr/home/hudson/hudson-slave/workspace/Lucene-Solr-SmokeRelease-4.3/dev-tools/scripts/smokeTestRelease.py", line 693, in verifyUnpacked
     [exec]     run('%s; ant clean test' % javaExe('1.7'), '%s/test.log' % unpackPath)
     [exec]   File "/usr/home/hudson/hudson-slave/workspace/Lucene-Solr-SmokeRelease-4.3/dev-tools/scripts/smokeTestRelease.py", line 514, in run
     [exec]     raise RuntimeError('command "%s" failed; see log file %s' % (command, logPath))
     [exec] RuntimeError: command "export JAVA_HOME="/home/hudson/tools/java/latest1.7" PATH="/home/hudson/tools/java/latest1.7/bin:$PATH" JAVACMD="/home/hudson/tools/java/latest1.7/bin/java"; ant clean test" failed; see log file /usr/home/hudson/hudson-slave/workspace/Lucene-Solr-SmokeRelease-4.3/lucene/build/fakeReleaseTmp/unpack/lucene-4.3.1/test.log

BUILD FAILED
/usr/home/hudson/hudson-slave/workspace/Lucene-Solr-SmokeRelease-4.3/build.xml:303: exec returned: 1

Total time: 44 minutes 5 seconds
Build step 'Invoke Ant' marked build as failure
Email was triggered for: Failure
Sending email for trigger: Failure



Mime
View raw message