lucene-dev mailing list archives

Site index · List index
Message view « Date » · « Thread »
Top « Date » · « Thread »
From Policeman Jenkins Server <jenk...@thetaphi.de>
Subject [JENKINS] Lucene-Solr-trunk-MacOSX (64bit/jdk1.7.0) - Build # 613 - Still Failing!
Date Mon, 01 Jul 2013 08:43:04 GMT
Build: http://jenkins.thetaphi.de/job/Lucene-Solr-trunk-MacOSX/613/
Java: 64bit/jdk1.7.0 -XX:-UseCompressedOops -XX:+UseConcMarkSweepGC

2 tests failed.
FAILED:  junit.framework.TestSuite.org.apache.solr.handler.component.TermsComponentTest

Error Message:
1 thread leaked from SUITE scope at org.apache.solr.handler.component.TermsComponentTest:
    1) Thread[id=9767, name=IPC Parameter Sending Thread #5, state=TIMED_WAITING, group=TGRP-TestRecoveryHdfs]
        at sun.misc.Unsafe.park(Native Method)         at java.util.concurrent.locks.LockSupport.parkNanos(LockSupport.java:226)
        at java.util.concurrent.SynchronousQueue$TransferStack.awaitFulfill(SynchronousQueue.java:460)
        at java.util.concurrent.SynchronousQueue$TransferStack.transfer(SynchronousQueue.java:359)
        at java.util.concurrent.SynchronousQueue.poll(SynchronousQueue.java:942)         at
java.util.concurrent.ThreadPoolExecutor.getTask(ThreadPoolExecutor.java:1068)         at java.util.concurrent.ThreadPoolExecutor.runWorker(ThreadPoolExecutor.java:1130)
        at java.util.concurrent.ThreadPoolExecutor$Worker.run(ThreadPoolExecutor.java:615)
        at java.lang.Thread.run(Thread.java:724)

Stack Trace:
com.carrotsearch.randomizedtesting.ThreadLeakError: 1 thread leaked from SUITE scope at org.apache.solr.handler.component.TermsComponentTest:

   1) Thread[id=9767, name=IPC Parameter Sending Thread #5, state=TIMED_WAITING, group=TGRP-TestRecoveryHdfs]
        at sun.misc.Unsafe.park(Native Method)
        at java.util.concurrent.locks.LockSupport.parkNanos(LockSupport.java:226)
        at java.util.concurrent.SynchronousQueue$TransferStack.awaitFulfill(SynchronousQueue.java:460)
        at java.util.concurrent.SynchronousQueue$TransferStack.transfer(SynchronousQueue.java:359)
        at java.util.concurrent.SynchronousQueue.poll(SynchronousQueue.java:942)
        at java.util.concurrent.ThreadPoolExecutor.getTask(ThreadPoolExecutor.java:1068)
        at java.util.concurrent.ThreadPoolExecutor.runWorker(ThreadPoolExecutor.java:1130)
        at java.util.concurrent.ThreadPoolExecutor$Worker.run(ThreadPoolExecutor.java:615)
        at java.lang.Thread.run(Thread.java:724)
	at __randomizedtesting.SeedInfo.seed([7B6BEEDA49392ED8]:0)


FAILED:  junit.framework.TestSuite.org.apache.solr.handler.component.TermsComponentTest

Error Message:
There are still zombie threads that couldn't be terminated:    1) Thread[id=9767, name=IPC
Parameter Sending Thread #5, state=TIMED_WAITING, group=TGRP-TestRecoveryHdfs]         at
sun.misc.Unsafe.park(Native Method)         at java.util.concurrent.locks.LockSupport.parkNanos(LockSupport.java:226)
        at java.util.concurrent.SynchronousQueue$TransferStack.awaitFulfill(SynchronousQueue.java:460)
        at java.util.concurrent.SynchronousQueue$TransferStack.transfer(SynchronousQueue.java:359)
        at java.util.concurrent.SynchronousQueue.poll(SynchronousQueue.java:942)         at
java.util.concurrent.ThreadPoolExecutor.getTask(ThreadPoolExecutor.java:1068)         at java.util.concurrent.ThreadPoolExecutor.runWorker(ThreadPoolExecutor.java:1130)
        at java.util.concurrent.ThreadPoolExecutor$Worker.run(ThreadPoolExecutor.java:615)
        at java.lang.Thread.run(Thread.java:724)

Stack Trace:
com.carrotsearch.randomizedtesting.ThreadLeakError: There are still zombie threads that couldn't
be terminated:
   1) Thread[id=9767, name=IPC Parameter Sending Thread #5, state=TIMED_WAITING, group=TGRP-TestRecoveryHdfs]
        at sun.misc.Unsafe.park(Native Method)
        at java.util.concurrent.locks.LockSupport.parkNanos(LockSupport.java:226)
        at java.util.concurrent.SynchronousQueue$TransferStack.awaitFulfill(SynchronousQueue.java:460)
        at java.util.concurrent.SynchronousQueue$TransferStack.transfer(SynchronousQueue.java:359)
        at java.util.concurrent.SynchronousQueue.poll(SynchronousQueue.java:942)
        at java.util.concurrent.ThreadPoolExecutor.getTask(ThreadPoolExecutor.java:1068)
        at java.util.concurrent.ThreadPoolExecutor.runWorker(ThreadPoolExecutor.java:1130)
        at java.util.concurrent.ThreadPoolExecutor$Worker.run(ThreadPoolExecutor.java:615)
        at java.lang.Thread.run(Thread.java:724)
	at __randomizedtesting.SeedInfo.seed([7B6BEEDA49392ED8]:0)




Build Log:
[...truncated 9790 lines...]
[junit4:junit4] Suite: org.apache.solr.handler.component.TermsComponentTest
[junit4:junit4]   2> 3554383 T9765 oas.SolrTestCaseJ4.initCore ####initCore
[junit4:junit4]   2> Creating dataDir: /Users/jenkins/jenkins-slave/workspace/Lucene-Solr-trunk-MacOSX/solr/build/solr-core/test/J0/./solrtest-TermsComponentTest-1372668076149
[junit4:junit4]   2> 3554385 T9765 oasc.SolrResourceLoader.<init> new SolrResourceLoader
for directory: '/Users/jenkins/jenkins-slave/workspace/Lucene-Solr-trunk-MacOSX/solr/build/solr-core/test-files/solr/collection1/'
[junit4:junit4]   2> 3554387 T9765 oasc.SolrResourceLoader.replaceClassLoader Adding 'file:/Users/jenkins/jenkins-slave/workspace/Lucene-Solr-trunk-MacOSX/solr/build/solr-core/test-files/solr/collection1/lib/classes/'
to classloader
[junit4:junit4]   2> 3554387 T9765 oasc.SolrResourceLoader.replaceClassLoader Adding 'file:/Users/jenkins/jenkins-slave/workspace/Lucene-Solr-trunk-MacOSX/solr/build/solr-core/test-files/solr/collection1/lib/README'
to classloader
[junit4:junit4]   2> 3554509 T9765 oasc.SolrConfig.<init> Using Lucene MatchVersion:
LUCENE_50
[junit4:junit4]   2> 3554619 T9765 oasc.SolrConfig.<init> Loaded SolrConfig: solrconfig.xml
[junit4:junit4]   2> 3554621 T9765 oass.IndexSchema.readSchema Reading Solr Schema from
schema12.xml
[junit4:junit4]   2> 3554631 T9765 oass.IndexSchema.readSchema [null] Schema name=test
[junit4:junit4]   2> 3555523 T9765 oass.IndexSchema.readSchema default search field in
schema is text
[junit4:junit4]   2> 3555542 T9765 oass.IndexSchema.readSchema unique key field: id
[junit4:junit4]   2> 3555546 T9765 oass.IndexSchema.readSchema WARN Field text is not multivalued
and destination for multiple copyFields (2)
[junit4:junit4]   2> 3555560 T9765 oass.FileExchangeRateProvider.reload Reloading exchange
rates from file currency.xml
[junit4:junit4]   2> 3555596 T9765 oass.FileExchangeRateProvider.reload Reloading exchange
rates from file currency.xml
[junit4:junit4]   2> 3555623 T9765 oasc.SolrResourceLoader.locateSolrHome JNDI not configured
for solr (NoInitialContextEx)
[junit4:junit4]   2> 3555623 T9765 oasc.SolrResourceLoader.locateSolrHome using system
property solr.solr.home: /Users/jenkins/jenkins-slave/workspace/Lucene-Solr-trunk-MacOSX/solr/build/solr-core/test-files/solr
[junit4:junit4]   2> 3555624 T9765 oasc.SolrResourceLoader.<init> new SolrResourceLoader
for directory: '/Users/jenkins/jenkins-slave/workspace/Lucene-Solr-trunk-MacOSX/solr/build/solr-core/test-files/solr/'
[junit4:junit4]   2> 3555648 T9765 oasc.CoreContainer.<init> New CoreContainer 613703175
[junit4:junit4]   2> 3555816 T9765 oasc.SolrCore.initDirectoryFactory org.apache.solr.core.MockDirectoryFactory
[junit4:junit4]   2> 3555817 T9765 oasc.SolrCore.<init> [collection1] Opening new
SolrCore at /Users/jenkins/jenkins-slave/workspace/Lucene-Solr-trunk-MacOSX/solr/build/solr-core/test-files/solr/collection1/,
dataDir=/Users/jenkins/jenkins-slave/workspace/Lucene-Solr-trunk-MacOSX/solr/build/solr-core/test/J0/./solrtest-TermsComponentTest-1372668076149/
[junit4:junit4]   2> 3555817 T9765 oasc.JmxMonitoredMap.<init> JMX monitoring is
enabled. Adding Solr mbeans to JMX Server: com.sun.jmx.mbeanserver.JmxMBeanServer@7d8bf453
[junit4:junit4]   2> 3555819 T9765 oasc.CachingDirectoryFactory.get return new directory
for /Users/jenkins/jenkins-slave/workspace/Lucene-Solr-trunk-MacOSX/solr/build/solr-core/test/J0/./solrtest-TermsComponentTest-1372668076149
[junit4:junit4]   2> 3555819 T9765 oasc.SolrCore.getNewIndexDir New index directory detected:
old=null new=/Users/jenkins/jenkins-slave/workspace/Lucene-Solr-trunk-MacOSX/solr/build/solr-core/test/J0/./solrtest-TermsComponentTest-1372668076149/index/
[junit4:junit4]   2> 3555820 T9765 oasc.SolrCore.initIndex WARN [collection1] Solr index
directory '/Users/jenkins/jenkins-slave/workspace/Lucene-Solr-trunk-MacOSX/solr/build/solr-core/test/J0/./solrtest-TermsComponentTest-1372668076149/index'
doesn't exist. Creating new index...
[junit4:junit4]   2> 3555821 T9765 oasc.CachingDirectoryFactory.get return new directory
for /Users/jenkins/jenkins-slave/workspace/Lucene-Solr-trunk-MacOSX/solr/build/solr-core/test/J0/./solrtest-TermsComponentTest-1372668076149/index
[junit4:junit4]   2> 3555831 T9765 oasc.SolrDeletionPolicy.onCommit SolrDeletionPolicy.onCommit:
commits: num=1
[junit4:junit4]   2> 		commit{dir=RateLimitedDirectoryWrapper(MockDirWrapper(org.apache.lucene.store.RAMDirectory@2b32c2ee
lockFactory=org.apache.lucene.store.NativeFSLockFactory@71c532d8)),segFN=segments_1,generation=1}
[junit4:junit4]   2> 3555833 T9765 oasc.SolrDeletionPolicy.updateCommits newest commit
generation = 1
[junit4:junit4]   2> 3555834 T9765 oasc.SolrCore.initWriters created xml: solr.XMLResponseWriter
[junit4:junit4]   2> 3555855 T9765 oasup.UpdateRequestProcessorChain.init inserting DistributedUpdateProcessorFactory
into updateRequestProcessorChain "dedupe"
[junit4:junit4]   2> 3555856 T9765 oasup.UpdateRequestProcessorChain.init inserting DistributedUpdateProcessorFactory
into updateRequestProcessorChain "dedupe-allfields"
[junit4:junit4]   2> 3555856 T9765 oasup.UpdateRequestProcessorChain.init inserting DistributedUpdateProcessorFactory
into updateRequestProcessorChain "stored_sig"
[junit4:junit4]   2> 3555861 T9765 oasup.UpdateRequestProcessorChain.init inserting DistributedUpdateProcessorFactory
into updateRequestProcessorChain "uniq-fields"
[junit4:junit4]   2> 3555862 T9765 oasup.UpdateRequestProcessorChain.init inserting DistributedUpdateProcessorFactory
into updateRequestProcessorChain "distrib-dup-test-chain-implicit"
[junit4:junit4]   2> 3555863 T9765 oasc.RequestHandlers.initHandlersFromConfig adding lazy
requestHandler: solr.ReplicationHandler
[junit4:junit4]   2> 3555870 T9765 oasc.RequestHandlers.initHandlersFromConfig created
/replication: solr.ReplicationHandler
[junit4:junit4]   2> 3555871 T9765 oasc.RequestHandlers.initHandlersFromConfig created
standard: solr.StandardRequestHandler
[junit4:junit4]   2> 3555872 T9765 oasc.RequestHandlers.initHandlersFromConfig created
/get: solr.RealTimeGetHandler
[junit4:junit4]   2> 3555873 T9765 oasc.RequestHandlers.initHandlersFromConfig created
dismax: solr.SearchHandler
[junit4:junit4]   2> 3555874 T9765 oasc.RequestHandlers.initHandlersFromConfig created
mock: org.apache.solr.core.MockQuerySenderListenerReqHandler
[junit4:junit4]   2> 3555875 T9765 oasc.RequestHandlers.initHandlersFromConfig created
/admin/: org.apache.solr.handler.admin.AdminHandlers
[junit4:junit4]   2> 3555876 T9765 oasc.RequestHandlers.initHandlersFromConfig created
defaults: solr.StandardRequestHandler
[junit4:junit4]   2> 3555876 T9765 oasc.RequestHandlers.initHandlersFromConfig adding lazy
requestHandler: solr.StandardRequestHandler
[junit4:junit4]   2> 3555877 T9765 oasc.RequestHandlers.initHandlersFromConfig created
lazy: solr.StandardRequestHandler
[junit4:junit4]   2> 3555878 T9765 oasc.RequestHandlers.initHandlersFromConfig created
/update: solr.UpdateRequestHandler
[junit4:junit4]   2> 3555879 T9765 oasc.RequestHandlers.initHandlersFromConfig created
/terms: org.apache.solr.handler.component.SearchHandler
[junit4:junit4]   2> 3555880 T9765 oasc.RequestHandlers.initHandlersFromConfig created
spellCheckCompRH: org.apache.solr.handler.component.SearchHandler
[junit4:junit4]   2> 3555881 T9765 oasc.RequestHandlers.initHandlersFromConfig created
spellCheckCompRH_Direct: org.apache.solr.handler.component.SearchHandler
[junit4:junit4]   2> 3555882 T9765 oasc.RequestHandlers.initHandlersFromConfig created
spellCheckWithWordbreak: org.apache.solr.handler.component.SearchHandler
[junit4:junit4]   2> 3555883 T9765 oasc.RequestHandlers.initHandlersFromConfig created
spellCheckWithWordbreak_Direct: org.apache.solr.handler.component.SearchHandler
[junit4:junit4]   2> 3555884 T9765 oasc.RequestHandlers.initHandlersFromConfig created
spellCheckCompRH1: org.apache.solr.handler.component.SearchHandler
[junit4:junit4]   2> 3555885 T9765 oasc.RequestHandlers.initHandlersFromConfig created
mltrh: org.apache.solr.handler.component.SearchHandler
[junit4:junit4]   2> 3555886 T9765 oasc.RequestHandlers.initHandlersFromConfig created
tvrh: org.apache.solr.handler.component.SearchHandler
[junit4:junit4]   2> 3555887 T9765 oasc.RequestHandlers.initHandlersFromConfig created
/mlt: solr.MoreLikeThisHandler
[junit4:junit4]   2> 3555888 T9765 oasc.RequestHandlers.initHandlersFromConfig created
/debug/dump: solr.DumpRequestHandler
[junit4:junit4]   2> 3555927 T9765 oashl.XMLLoader.init xsltCacheLifetimeSeconds=60
[junit4:junit4]   2> 3555933 T9765 oasc.SolrCore.initDeprecatedSupport WARN solrconfig.xml
uses deprecated <admin/gettableFiles>, Please update your config to use the ShowFileRequestHandler.
[junit4:junit4]   2> 3555939 T9765 oasc.SolrCore.initDeprecatedSupport WARN adding ShowFileRequestHandler
with hidden files: [THROW.ERROR.ON.ADD.UPDATEPROCESSOR.JS, SOLRCONFIG-HIGHLIGHT.XML, SCHEMA-REQUIRED-FIELDS.XML,
TRIVIAL.UPDATEPROCESSOR1.JS, BAD-SCHEMA-DOCVALUES-NOT-REQUIRED-NO-DEFAULT.XML, BAD-SCHEMA-DUP-DYNAMICFIELD.XML,
SCHEMA-MINIMAL.XML, SCHEMA-REPLICATION2.XML, SOLRCONFIG-CACHING.XML, BAD-SOLRCONFIG-UNEXPECTED-SCHEMA-ATTRIBUTE.XML,
SCHEMA-POSTINGSHIGHLIGHT.XML, SOLRCONFIG-REPEATER.XML, REGEX-BOOST-PROCESSOR-TEST.TXT, SOLRCONFIG-MERGEPOLICY.XML,
CURRENCY.XML, BAD-SCHEMA-CURRENCY-FT-BOGUS-CODE-IN-XML.XML, BAD-SCHEMA-NONTEXT-ANALYZER.XML,
SOLRCONFIG-TLOG.XML, SOLRCONFIG-MASTER.XML, SOLRCONFIG-MERGEPOLICY-LEGACY.XML, SOLRCONFIG-COMPONENTS-NAME.XML,
BAD-SCHEMA-UNIQUEKEY-MULTIVALUED.XML, SCHEMA11.XML, SOLRCONFIG-BASIC.XML, DA_COMPOUNDDICTIONARY.TXT,
MISSLEADING.EXTENSION.UPDATEPROCESSOR.JS.TXT, SCHEMA-COPYFIELD-TEST.XML, SOLRCONFIG-SLAVE.XML,
SOLRCONFIG-PROPINJECT-INDEXDEFAULT.XML, ELEVATE.XML, TRIVIAL.UPDATEPROCESSOR0.JS, SCHEMA-SWEETSPOT.XML,
BAD-SOLRCONFIG-BOGUS-SCRIPTENGINE-NAME.XML, SCHEMA-CHARFILTERS.XML, SCHEMA-IB.XML, SOLRCONFIG-QUERYSENDER.XML,
BAD-SCHEMA-MISPLACED-ASTERISK-COPYFIELD-SOURCE-SHOULD-FAIL-TEST.XML, SOLRCONFIG-SNIPPET-PROCESSOR.XML,
DA_UTF8.XML, SCHEMA-REPLICATION1.XML, BAD-SCHEMA-NON-GLOB-COPYFIELD-SOURCE-MATCHING-NOTHING-SHOULD-FAIL-TEST.XML,
SCHEMA-TINY.XML, CONDITIONAL.UPDATEPROCESSOR.JS, SOLRCONFIG-DEFAULTS.XML, MISSING.FUNCTIONS.UPDATEPROCESSOR.JS,
SOLRCONFIG-ENABLEPLUGIN.XML, HYPHENATION.DTD, BAD-SOLRCONFIG-SCHEMA-MUTABLE-BUT-NOT-MANAGED.XML,
STEMDICT.TXT, SCHEMA-PHRASESUGGEST.XML, SCHEMA-ID-AND-VERSION-FIELDS-ONLY.XML, HUNSPELL-TEST.AFF,
BAD-SCHEMA-CURRENCY-FT-OER-NORATES.XML, SCHEMA-SNIPPET-TYPE.XML, STOPTYPES-1.TXT, STOPWORDSWRONGENCODING.TXT,
SCHEMA-NUMERIC.XML, SOLRCONFIG-TRANSFORMERS.XML, SOLRCONFIG-PROPINJECT.XML, BAD-SCHEMA-NOT-INDEXED-BUT-TF.XML,
SOLRCONFIG-SIMPLELOCK.XML, SOLRCONFIG-TLOG-MUTABLE-MANAGED-SCHEMA.XML, SCHEMA-DOCVALUES.XML,
WDFTYPES.TXT, STOPTYPES-2.TXT, SCHEMA-REVERSED.XML, BAD-SCHEMA-CURRENCY-FT-MULTIVALUED.XML,
BAD-SCHEMA-BOGUS-ANALYSIS-PARAMETERS.XML, SOLRCONFIG-SPELLCHECKCOMPONENT.XML, SOLRCONFIG-PHRASESUGGEST.XML,
BAD-SCHEMA-CURRENCY-MULTIVALUED.XML, SCHEMA-DFR.XML, BAD-SCHEMA-NOT-INDEXED-BUT-POS.XML, KEEP-1.TXT,
SCHEMA-SPATIAL.XML, OPEN-EXCHANGE-RATES.JSON, STOPWITHBOM.TXT, SOLRCONFIG-SPELLCHECKER.XML,
SOLRCONFIG-POSTINGSHIGHLIGHT.XML, SCHEMA-BINARYFIELD.XML, SOLRCONFIG-WARMER.XML, SOLRCONFIG-UPDATE-PROCESSOR-CHAINS.XML,
BAD-SCHEMA-OMIT-TF-BUT-NOT-POS.XML, SCHEMA-XINCLUDE.XML, BAD-SCHEMA-DUP-FIELDTYPE.XML, SOLRCONFIG-MASTER1.XML,
BAD-SCHEMA-MULTIPLE-ASTERISK-COPYFIELD-SOURCE-SHOULD-FAIL-TEST.XML, SCHEMA-BEHAVIOR.XML, SYNONYMS.TXT,
SOLRCONFIG-MINIMAL.XML, SCHEMA-DOCVALUESMULTI.XML, BAD-SCHEMA-UNSUPPORTED-DOCVALUES.XML, BAD-SCHEMA-CURRENCY-DYNAMIC-MULTIVALUED.XML,
SCHEMA_CODEC.XML, BAD-SCHEMA-SWEETSPOT-PARTIAL-HYPERBOLIC.XML, SOLRCONFIG-SOLR-749.XML, SOLRCONFIG-MASTER1-KEEPONEBACKUP.XML,
SCHEMA-EFF.XML, STOP-2.TXT, SOLRCONFIG-FUNCTIONQUERY.XML, SOLRCONFIG-TERMINDEX.XML, SCHEMA-LMDIRICHLET.XML,
SCHEMA-ONE-FIELD-NO-DYNAMIC-FIELD.XML, SOLRCONFIG-ELEVATE.XML, BAD-SCHEMA-SWEETSPOT-PARTIAL-NORMS.XML,
BAD-SCHEMA-SWEETSPOT-PARTIAL-BASELINE.XML, STOPWORDS.TXT, SCHEMA-FOLDING.XML, SCHEMA-STOP-KEEP.XML,
BAD-SCHEMA-BOGUS-FIELD-PARAMETERS.XML, BAD-SOLRCONFIG-MANAGED-SCHEMA-NAMED-SCHEMA.XML.XML,
FUZZYSUGGEST.TXT, BAD-SCHEMA-NOT-INDEXED-BUT-NORMS.XML, SCHEMA-REST.XML, SOLRCONFIG-TLOG-MANAGED-SCHEMA.XML,
SOLRCONFIG-SOLCOREPROPERTIES.XML, SOLRCONFIG-PARSING-UPDATE-PROCESSOR-CHAINS.XML, STOP-1.TXT,
SOLRCONFIG-MASTER2.XML, SOLRCONFIG-MANAGED-SCHEMA.XML, SOLRCONFIG-MERGEPOLICY-DEFAULTS.XML,
SCHEMA-SPELLCHECKER.XML, SOLRCONFIG-RESPONSE-LOG-COMPONENT.XML, SOLRCONFIG-LAZYWRITER.XML,
BAD-SCHEMA-MISPLACED-ASTERISK-COPYFIELD-DEST-SHOULD-FAIL-TEST.XML, SCHEMA-LUCENEMATCHVERSION.XML,
SCHEMA-CLASS-NAME-SHORTENING-ON-SERIALIZATION.XML, BAD-MP-SOLRCONFIG.XML, FRENCHARTICLES.TXT,
SCHEMA15.XML, SOLRCONFIG-REQHANDLER.INCL, SCHEMASURROUND.XML, SOLRCONFIG-MASTER3.XML, BAD-SCHEMA-MULTIPLE-ASTERISK-COPYFIELD-DEST-SHOULD-FAIL-TEST.XML,
HUNSPELL-TEST.DIC, SOLRCONFIG-XINCLUDE.XML, BAD-SCHEMA-CODEC-GLOBAL-VS-FT-MISMATCH.XML, SOLRCONFIG-SLAVE1.XML,
SOLRCONFIG-DELPOLICY1.XML, SCHEMA-SIM.XML, SCHEMA-SNIPPET-FIELD.XML, SCHEMA-COLLATE.XML, STOP-SNOWBALL.TXT,
BAD-SCHEMA-SIM-GLOBAL-VS-FT-MISMATCH.XML, PROTWORDS.TXT, SCHEMA-TRIE.XML, SOLRCONFIG_CODEC.XML,
SCHEMA-SYNONYM-TOKENIZER.XML, BAD-SOLRCONFIG-INVALID-SCRIPTFILE.XML, JASUGGEST.TXT, SCHEMA-REST-LUCENE-MATCH-VERSION.XML,
SCHEMA-DOCVALUESFACETING.XML, SCHEMA-TFIDF.XML, SOLRCONFIG-SCRIPT-UPDATEPROCESSOR.XML, SCHEMA-LMJELINEKMERCER.XML,
PHRASESUGGEST.TXT, BAD-SOLRCONFIG-MISSING-SCRIPTFILE.XML, BAD-SCHEMA-UNIQUEKEY-USES-DEFAULT.XML,
OLD_SYNONYMS.TXT, SOLRCONFIG-DELPOLICY2.XML, XSLT, SOLRCONFIG-NATIVELOCK.XML, SOLRCONFIG-MUTABLE-MANAGED-SCHEMA.XML,
BAD-SCHEMA-DUP-FIELD.XML, SOLRCONFIG-NOCACHE.XML, BAD-SCHEMA-SWEETSPOT-BOTH-TF.XML, SCHEMA-BM25.XML,
ADDFIELDS.UPDATEPROCESSOR.JS, SOLRCONFIG-QUERYSENDER-NOQUERY.XML, SOLRCONFIG-ALTDIRECTORY.XML,
COMPOUNDDICTIONARY.TXT, SOLRCONFIG_PERF.XML, SOLRCONFIG-INDEXCONFIG.XML, BAD-SCHEMA-CURRENCY-FT-BOGUS-DEFAULT-CODE.XML,
BAD-CURRENCY.XML, BAD-SCHEMA-ANALYZER-CLASS-AND-NESTED.XML, SCHEMA-NOT-REQUIRED-UNIQUE-KEY.XML,
KEEP-2.TXT, SCHEMA12.XML, BAD-SCHEMA-UNIQUEKEY-IS-COPYFIELD-DEST.XML, MAPPING-ISOLATIN1ACCENT.TXT,
BAD_SOLRCONFIG.XML, SOLRCONFIG.SNIPPET.RANDOMINDEXCONFIG.XML, BAD-SCHEMA-EXTERNAL-FILEFIELD.XML]
[junit4:junit4]   2> 3555945 T9765 oass.SolrIndexSearcher.<init> Opening Searcher@1f960a86
main
[junit4:junit4]   2> 3555946 T9765 oasu.CommitTracker.<init> Hard AutoCommit: disabled
[junit4:junit4]   2> 3555947 T9765 oasu.CommitTracker.<init> Soft AutoCommit: disabled
[junit4:junit4]   2> 3555947 T9765 oashc.SpellCheckComponent.inform Initializing spell
checkers
[junit4:junit4]   2> 3555962 T9765 oass.DirectSolrSpellChecker.init init: {name=direct,classname=DirectSolrSpellChecker,field=lowerfilt,minQueryLength=3}
[junit4:junit4]   2> 3556054 T9766 oasc.SolrCore.registerSearcher [collection1] Registered
new searcher Searcher@1f960a86 main{StandardDirectoryReader(segments_1:1)}
[junit4:junit4]   2> 3556099 T9765 oasc.CoreContainer.registerCore registering core: collection1
[junit4:junit4]   2> 3556129 T9765 oas.SolrTestCaseJ4.initCore ####initCore end
[junit4:junit4]   2> ASYNC  NEW_CORE C2646 name=collection1 org.apache.solr.core.SolrCore@8a93054
[junit4:junit4]   2> 3556148 T9765 C2646 oasc.SolrDeletionPolicy.onInit SolrDeletionPolicy.onInit:
commits: num=1
[junit4:junit4]   2> 		commit{dir=RateLimitedDirectoryWrapper(MockDirWrapper(org.apache.lucene.store.RAMDirectory@2b32c2ee
lockFactory=org.apache.lucene.store.NativeFSLockFactory@71c532d8)),segFN=segments_1,generation=1}
[junit4:junit4]   2> 3556149 T9765 C2646 oasc.SolrDeletionPolicy.updateCommits newest commit
generation = 1
[junit4:junit4]   2> 3556151 T9765 C2646 oasup.LogUpdateProcessor.finish [collection1]
webapp=null path=null params={} {add=[0]} 0 7
[junit4:junit4]   2> 3556182 T9765 C2646 oasup.LogUpdateProcessor.finish [collection1]
webapp=null path=null params={} {add=[1]} 0 1
[junit4:junit4]   2> 3556233 T9765 C2646 oasup.LogUpdateProcessor.finish [collection1]
webapp=null path=null params={} {add=[2]} 0 0
[junit4:junit4]   2> 3556253 T9765 C2646 oasup.LogUpdateProcessor.finish [collection1]
webapp=null path=null params={} {add=[3]} 0 1
[junit4:junit4]   2> 3556274 T9765 C2646 oasup.LogUpdateProcessor.finish [collection1]
webapp=null path=null params={} {add=[4]} 0 0
[junit4:junit4]   2> 3556318 T9765 C2646 oasup.LogUpdateProcessor.finish [collection1]
webapp=null path=null params={} {add=[5]} 0 1
[junit4:junit4]   2> 3556332 T9765 C2646 oasup.LogUpdateProcessor.finish [collection1]
webapp=null path=null params={} {add=[6]} 0 1
[junit4:junit4]   2> 3556354 T9765 C2646 oasup.LogUpdateProcessor.finish [collection1]
webapp=null path=null params={} {add=[7]} 0 1
[junit4:junit4]   2> 3556368 T9765 C2646 oasup.LogUpdateProcessor.finish [collection1]
webapp=null path=null params={} {add=[8]} 0 1
[junit4:junit4]   2> 3556382 T9765 C2646 oasup.LogUpdateProcessor.finish [collection1]
webapp=null path=null params={} {add=[9]} 0 2
[junit4:junit4]   2> 3556404 T9765 C2646 oasup.LogUpdateProcessor.finish [collection1]
webapp=null path=null params={} {add=[10]} 0 1
[junit4:junit4]   2> 3556418 T9765 C2646 oasup.LogUpdateProcessor.finish [collection1]
webapp=null path=null params={} {add=[11]} 0 0
[junit4:junit4]   2> 3556430 T9765 C2646 oasup.LogUpdateProcessor.finish [collection1]
webapp=null path=null params={} {add=[12]} 0 0
[junit4:junit4]   2> 3556464 T9765 C2646 oasup.LogUpdateProcessor.finish [collection1]
webapp=null path=null params={} {add=[13]} 0 1
[junit4:junit4]   2> 3556477 T9765 C2646 oasup.LogUpdateProcessor.finish [collection1]
webapp=null path=null params={} {add=[14]} 0 0
[junit4:junit4]   2> 3556490 T9765 C2646 oasup.LogUpdateProcessor.finish [collection1]
webapp=null path=null params={} {add=[15]} 0 1
[junit4:junit4]   2> 3556503 T9765 C2646 oasup.LogUpdateProcessor.finish [collection1]
webapp=null path=null params={} {add=[16]} 0 1
[junit4:junit4]   2> 3556529 T9765 C2646 oasup.LogUpdateProcessor.finish [collection1]
webapp=null path=null params={} {add=[17]} 0 1
[junit4:junit4]   2> 3556545 T9765 C2646 oasup.LogUpdateProcessor.finish [collection1]
webapp=null path=null params={} {add=[18]} 0 1
[junit4:junit4]   2> 3556588 T9765 C2646 oasup.LogUpdateProcessor.finish [collection1]
webapp=null path=null params={} {add=[19]} 0 4
[junit4:junit4]   2> ASYNC  NEW_CORE C2647 name=collection1 org.apache.solr.core.SolrCore@8a93054
[junit4:junit4]   2> 3556663 T9765 C2647 oasup.LogUpdateProcessor.finish [collection1]
webapp=null path=null params={} {add=[20]} 0 1
[junit4:junit4]   2> 3556711 T9765 C2647 oasup.LogUpdateProcessor.finish [collection1]
webapp=null path=null params={} {add=[21]} 0 1
[junit4:junit4]   2> 3556732 T9765 C2647 oasup.LogUpdateProcessor.finish [collection1]
webapp=null path=null params={} {add=[22]} 0 1
[junit4:junit4]   2> 3556745 T9765 C2647 oasu.DirectUpdateHandler2.commit start commit{,optimize=false,openSearcher=true,waitSearcher=true,expungeDeletes=false,softCommit=false,prepareCommit=false}
[junit4:junit4]   2> 3556788 T9765 C2647 oasc.SolrDeletionPolicy.onCommit SolrDeletionPolicy.onCommit:
commits: num=2
[junit4:junit4]   2> 		commit{dir=RateLimitedDirectoryWrapper(MockDirWrapper(org.apache.lucene.store.RAMDirectory@2b32c2ee
lockFactory=org.apache.lucene.store.NativeFSLockFactory@71c532d8)),segFN=segments_1,generation=1}
[junit4:junit4]   2> 		commit{dir=RateLimitedDirectoryWrapper(MockDirWrapper(org.apache.lucene.store.RAMDirectory@2b32c2ee
lockFactory=org.apache.lucene.store.NativeFSLockFactory@71c532d8)),segFN=segments_2,generation=2}
[junit4:junit4]   2> 3556788 T9765 C2647 oasc.SolrDeletionPolicy.updateCommits newest commit
generation = 2
[junit4:junit4]   2> 3556792 T9765 C2647 oass.SolrIndexSearcher.<init> Opening Searcher@261ec06f
main
[junit4:junit4]   2> 3556794 T9765 C2647 oasu.DirectUpdateHandler2.commit end_commit_flush
[junit4:junit4]   2> 3556796 T9766 oasc.SolrCore.registerSearcher [collection1] Registered
new searcher Searcher@261ec06f main{StandardDirectoryReader(segments_2:7:nrt _0(5.0):c10 _1(5.0):c10
_2(5.0):c3)}
[junit4:junit4]   2> 3556797 T9765 C2647 oasup.LogUpdateProcessor.finish [collection1]
webapp=null path=null params={} {commit=} 0 52
[junit4:junit4]   2> 3556848 T9765 oas.SolrTestCaseJ4.setUp ###Starting testSortIndex
[junit4:junit4]   2> 3556849 T9765 C2647 oasc.SolrCore.execute [collection1] webapp=null
path=null params={terms.lower.incl=false&terms.lower=s&indent=true&terms.fl=standardfilt&terms=true&qt=/terms&terms.sort=index&terms.prefix=s}
status=0 QTime=0 
[junit4:junit4]   2> 3556857 T9765 oas.SolrTestCaseJ4.tearDown ###Ending testSortIndex
[junit4:junit4]   2> 3556912 T9765 oas.SolrTestCaseJ4.setUp ###Starting testRegexpWithFlags
[junit4:junit4]   2> 3556922 T9765 C2647 oasc.SolrCore.execute [collection1] webapp=null
path=null params={terms.lower.incl=false&terms.regex.flag=case_insensitive&terms.lower=a&indent=true&terms.fl=standardfilt&terms=true&terms.upper.incl=true&terms.regex=B.*&qt=/terms&terms.upper=c}
status=0 QTime=9 
[junit4:junit4]   2> 3556928 T9765 oas.SolrTestCaseJ4.tearDown ###Ending testRegexpWithFlags
[junit4:junit4]   2> 3556974 T9765 oas.SolrTestCaseJ4.setUp ###Starting testRegexpFlagParsing
[junit4:junit4]   2> 3556975 T9765 oas.SolrTestCaseJ4.tearDown ###Ending testRegexpFlagParsing
[junit4:junit4]   2> 3557029 T9765 oas.SolrTestCaseJ4.setUp ###Starting test
[junit4:junit4]   2> 3557031 T9765 C2647 oasc.SolrCore.execute [collection1] webapp=null
path=null params={terms.lower=a&indent=true&terms.fl=lowerfilt&terms=true&qt=/terms&terms.upper=b}
status=0 QTime=1 
[junit4:junit4]   2> 3557045 T9765 C2647 oasc.SolrCore.execute [collection1] webapp=null
path=null params={terms.lower=a&indent=true&terms.fl=lowerfilt&terms=true&terms.limit=2&qt=/terms&terms.raw=true&terms.upper=b}
status=0 QTime=0 
[junit4:junit4]   2> 3557062 T9765 C2647 oasc.SolrCore.execute [collection1] webapp=null
path=null params={indent=true&terms.fl=foo_i&terms=true&qt=/terms} status=0 QTime=0

[junit4:junit4]   2> 3557067 T9765 C2647 oasc.SolrCore.execute [collection1] webapp=null
path=null params={indent=true&terms.fl=foo_i&terms=true&qt=/terms&terms.raw=true}
status=0 QTime=0 
[junit4:junit4]   2> 3557073 T9765 C2647 oasc.SolrCore.execute [collection1] webapp=null
path=null params={indent=true&terms.fl=zzz_i&terms=true&qt=/terms} status=0 QTime=0

[junit4:junit4]   2> 3557075 T9765 oas.SolrTestCaseJ4.tearDown ###Ending test
[junit4:junit4]   2> 3557138 T9765 oas.SolrTestCaseJ4.setUp ###Starting testSortCount
[junit4:junit4]   2> 3557139 T9765 C2647 oasc.SolrCore.execute [collection1] webapp=null
path=null params={terms.lower.incl=false&terms.lower=s&indent=true&terms.fl=standardfilt&terms=true&qt=/terms&terms.sort=count&terms.prefix=s}
status=0 QTime=1 
[junit4:junit4]   2> 3557148 T9765 oas.SolrTestCaseJ4.tearDown ###Ending testSortCount
[junit4:junit4]   2> 3557207 T9765 oas.SolrTestCaseJ4.setUp ###Starting testRegexp
[junit4:junit4]   2> 3557209 T9765 C2647 oasc.SolrCore.execute [collection1] webapp=null
path=null params={terms.lower.incl=false&terms.lower=a&indent=true&terms.fl=standardfilt&terms=true&terms.upper.incl=true&terms.regex=b.*&qt=/terms&terms.upper=c}
status=0 QTime=0 
[junit4:junit4]   2> 3557211 T9765 oas.SolrTestCaseJ4.tearDown ###Ending testRegexp
[junit4:junit4]   2> 3557263 T9765 oas.SolrTestCaseJ4.setUp ###Starting testMinMaxFreq
[junit4:junit4]   2> 3557264 T9765 C2647 oasc.SolrCore.execute [collection1] webapp=null
path=null params={terms.mincount=2&terms.lower=a&indent=true&terms.fl=lowerfilt&terms=true&terms.limit=50&qt=/terms&terms.maxcount=-1}
status=0 QTime=0 
[junit4:junit4]   2> 3557267 T9765 C2647 oasc.SolrCore.execute [collection1] webapp=null
path=null params={terms.mincount=2&terms.lower=d&indent=true&terms.fl=standardfilt&terms=true&terms.limit=50&qt=/terms&terms.maxcount=3}
status=0 QTime=0 
[junit4:junit4]   2> 3557269 T9765 oas.SolrTestCaseJ4.tearDown ###Ending testMinMaxFreq
[junit4:junit4]   2> 3557321 T9765 oas.SolrTestCaseJ4.setUp ###Starting testPrefix
[junit4:junit4]   2> 3557322 T9765 C2647 oasc.SolrCore.execute [collection1] webapp=null
path=null params={terms.lower.incl=false&terms.lower=aa&indent=true&terms.fl=lowerfilt&terms.fl=standardfilt&terms=true&terms.limit=50&qt=/terms&terms.prefix=aa&terms.upper=b&terms.upper=b}
status=0 QTime=0 
[junit4:junit4]   2> 3557326 T9765 oas.SolrTestCaseJ4.tearDown ###Ending testPrefix
[junit4:junit4]   2> 3557369 T9765 oas.SolrTestCaseJ4.setUp ###Starting testUnlimitedRows
[junit4:junit4]   2> 3557370 T9765 C2647 oasc.SolrCore.execute [collection1] webapp=null
path=null params={indent=true&terms.fl=lowerfilt&terms.fl=standardfilt&terms=true&qt=/terms&terms.rows=-1}
status=0 QTime=0 
[junit4:junit4]   2> 3557381 T9765 oas.SolrTestCaseJ4.tearDown ###Ending testUnlimitedRows
[junit4:junit4]   2> 3557431 T9765 oas.SolrTestCaseJ4.setUp ###Starting testPastUpper
[junit4:junit4]   2> 3557432 T9765 C2647 oasc.SolrCore.execute [collection1] webapp=null
path=null params={terms.lower=d&indent=true&terms.fl=lowerfilt&terms=true&qt=/terms}
status=0 QTime=0 
[junit4:junit4]   2> 3557435 T9765 oas.SolrTestCaseJ4.tearDown ###Ending testPastUpper
[junit4:junit4]   2> 3557505 T9765 oas.SolrTestCaseJ4.setUp ###Starting testMultipleFields
[junit4:junit4]   2> 3557507 T9765 C2647 oasc.SolrCore.execute [collection1] webapp=null
path=null params={indent=true&terms.fl=lowerfilt&terms.fl=standardfilt&terms=true&qt=/terms&terms.upper=b}
status=0 QTime=1 
[junit4:junit4]   2> 3557512 T9765 oas.SolrTestCaseJ4.tearDown ###Ending testMultipleFields
[junit4:junit4]   2> 3557571 T9765 oas.SolrTestCaseJ4.setUp ###Starting testLowerExclusive
[junit4:junit4]   2> 3557572 T9765 C2647 oasc.SolrCore.execute [collection1] webapp=null
path=null params={terms.lower.incl=false&terms.lower=a&indent=true&terms.fl=lowerfilt&terms=true&qt=/terms&terms.upper=b}
status=0 QTime=0 
[junit4:junit4]   2> 3557584 T9765 C2647 oasc.SolrCore.execute [collection1] webapp=null
path=null params={terms.lower.incl=false&terms.lower=cc&indent=true&terms.fl=standardfilt&terms=true&qt=/terms&terms.upper=d}
status=0 QTime=1 
[junit4:junit4]   2> 3557594 T9765 oas.SolrTestCaseJ4.tearDown ###Ending testLowerExclusive
[junit4:junit4]   2> 3557650 T9765 oas.SolrTestCaseJ4.setUp ###Starting testEmptyLower
[junit4:junit4]   2> 3557651 T9765 C2647 oasc.SolrCore.execute [collection1] webapp=null
path=null params={indent=true&terms.fl=lowerfilt&terms=true&qt=/terms&terms.upper=b}
status=0 QTime=0 
[junit4:junit4]   2> 3557672 T9765 oas.SolrTestCaseJ4.tearDown ###Ending testEmptyLower
[junit4:junit4]   2> 3557675 T9765 oas.SolrTestCaseJ4.deleteCore ###deleteCore
[junit4:junit4]   2> 3557675 T9765 oasc.CoreContainer.shutdown Shutting down CoreContainer
instance=613703175
[junit4:junit4]   2> 3557675 T9765 oasc.SolrCore.close [collection1]  CLOSING SolrCore
org.apache.solr.core.SolrCore@8a93054
[junit4:junit4]   2> 3557697 T9765 oasu.DirectUpdateHandler2.close closing DirectUpdateHandler2{commits=1,autocommits=0,soft
autocommits=0,optimizes=0,rollbacks=0,expungeDeletes=0,docsPending=0,adds=0,deletesById=0,deletesByQuery=0,errors=0,cumulative_adds=23,cumulative_deletesById=0,cumulative_deletesByQuery=0,cumulative_errors=0}
[junit4:junit4]   2> 3557699 T9765 oasu.SolrCoreState.decrefSolrCoreState Closing SolrCoreState
[junit4:junit4]   2> 3557699 T9765 oasu.DefaultSolrCoreState.closeIndexWriter SolrCoreState
ref count has reached 0 - closing IndexWriter
[junit4:junit4]   2> 3557699 T9765 oasu.DefaultSolrCoreState.closeIndexWriter closing IndexWriter
with IndexWriterCloser
[junit4:junit4]   2> 3557708 T9765 oasc.SolrCore.closeSearcher [collection1] Closing main
searcher on request.
[junit4:junit4]   2> 3557709 T9765 oasc.CachingDirectoryFactory.close Closing MockDirectoryFactory
- 2 directories currently being tracked
[junit4:junit4]   2> 3557709 T9765 oasc.CachingDirectoryFactory.closeCacheValue looking
to close /Users/jenkins/jenkins-slave/workspace/Lucene-Solr-trunk-MacOSX/solr/build/solr-core/test/J0/./solrtest-TermsComponentTest-1372668076149/index
[CachedDir<<refCount=0;path=/Users/jenkins/jenkins-slave/workspace/Lucene-Solr-trunk-MacOSX/solr/build/solr-core/test/J0/./solrtest-TermsComponentTest-1372668076149/index;done=false>>]
[junit4:junit4]   2> 3557710 T9765 oasc.CachingDirectoryFactory.close Closing directory:
/Users/jenkins/jenkins-slave/workspace/Lucene-Solr-trunk-MacOSX/solr/build/solr-core/test/J0/./solrtest-TermsComponentTest-1372668076149/index
[junit4:junit4]   2> 3557710 T9765 oasc.CachingDirectoryFactory.closeCacheValue looking
to close /Users/jenkins/jenkins-slave/workspace/Lucene-Solr-trunk-MacOSX/solr/build/solr-core/test/J0/./solrtest-TermsComponentTest-1372668076149
[CachedDir<<refCount=0;path=/Users/jenkins/jenkins-slave/workspace/Lucene-Solr-trunk-MacOSX/solr/build/solr-core/test/J0/./solrtest-TermsComponentTest-1372668076149;done=false>>]
[junit4:junit4]   2> 3557711 T9765 oasc.CachingDirectoryFactory.close Closing directory:
/Users/jenkins/jenkins-slave/workspace/Lucene-Solr-trunk-MacOSX/solr/build/solr-core/test/J0/./solrtest-TermsComponentTest-1372668076149
[junit4:junit4]   2> 3438 T9764 ccr.ThreadLeakControl.checkThreadLeaks WARNING Will linger
awaiting termination of 1 leaked thread(s).
[junit4:junit4]   2> 23727 T9764 ccr.ThreadLeakControl.checkThreadLeaks SEVERE 1 thread
leaked from SUITE scope at org.apache.solr.handler.component.TermsComponentTest: 
[junit4:junit4]   2> 	   1) Thread[id=9767, name=IPC Parameter Sending Thread #5, state=TIMED_WAITING,
group=TGRP-TestRecoveryHdfs]
[junit4:junit4]   2> 	        at sun.misc.Unsafe.park(Native Method)
[junit4:junit4]   2> 	        at java.util.concurrent.locks.LockSupport.parkNanos(LockSupport.java:226)
[junit4:junit4]   2> 	        at java.util.concurrent.SynchronousQueue$TransferStack.awaitFulfill(SynchronousQueue.java:460)
[junit4:junit4]   2> 	        at java.util.concurrent.SynchronousQueue$TransferStack.transfer(SynchronousQueue.java:359)
[junit4:junit4]   2> 	        at java.util.concurrent.SynchronousQueue.poll(SynchronousQueue.java:942)
[junit4:junit4]   2> 	        at java.util.concurrent.ThreadPoolExecutor.getTask(ThreadPoolExecutor.java:1068)
[junit4:junit4]   2> 	        at java.util.concurrent.ThreadPoolExecutor.runWorker(ThreadPoolExecutor.java:1130)
[junit4:junit4]   2> 	        at java.util.concurrent.ThreadPoolExecutor$Worker.run(ThreadPoolExecutor.java:615)
[junit4:junit4]   2> 	        at java.lang.Thread.run(Thread.java:724)
[junit4:junit4]   2> 23728 T9764 ccr.ThreadLeakControl.tryToInterruptAll Starting to interrupt
leaked threads:
[junit4:junit4]   2> 	   1) Thread[id=9767, name=IPC Parameter Sending Thread #5, state=TIMED_WAITING,
group=TGRP-TestRecoveryHdfs]
[junit4:junit4]   2> 26742 T9764 ccr.ThreadLeakControl.tryToInterruptAll SEVERE There are
still zombie threads that couldn't be terminated:
[junit4:junit4]   2> 	   1) Thread[id=9767, name=IPC Parameter Sending Thread #5, state=TIMED_WAITING,
group=TGRP-TestRecoveryHdfs]
[junit4:junit4]   2> 	        at sun.misc.Unsafe.park(Native Method)
[junit4:junit4]   2> 	        at java.util.concurrent.locks.LockSupport.parkNanos(LockSupport.java:226)
[junit4:junit4]   2> 	        at java.util.concurrent.SynchronousQueue$TransferStack.awaitFulfill(SynchronousQueue.java:460)
[junit4:junit4]   2> 	        at java.util.concurrent.SynchronousQueue$TransferStack.transfer(SynchronousQueue.java:359)
[junit4:junit4]   2> 	        at java.util.concurrent.SynchronousQueue.poll(SynchronousQueue.java:942)
[junit4:junit4]   2> 	        at java.util.concurrent.ThreadPoolExecutor.getTask(ThreadPoolExecutor.java:1068)
[junit4:junit4]   2> 	        at java.util.concurrent.ThreadPoolExecutor.runWorker(ThreadPoolExecutor.java:1130)
[junit4:junit4]   2> 	        at java.util.concurrent.ThreadPoolExecutor$Worker.run(ThreadPoolExecutor.java:615)
[junit4:junit4]   2> 	        at java.lang.Thread.run(Thread.java:724)
[junit4:junit4]   2> NOTE: test params are: codec=Lucene40, sim=RandomSimilarityProvider(queryNorm=false,coord=yes):
{}, locale=pl, timezone=Antarctica/Syowa
[junit4:junit4]   2> NOTE: Mac OS X 10.8.4 x86_64/Oracle Corporation 1.7.0_25 (64-bit)/cpus=2,threads=1,free=230633192,total=519438336
[junit4:junit4]   2> NOTE: All tests run in this JVM: [CoreContainerCoreInitFailuresTest,
QueryElevationComponentTest, UnloadDistributedZkTest, TestRecoveryHdfs, OpenExchangeRatesOrgProviderTest,
TestTrie, TestPartialUpdateDeduplication, TestDocSet, TestShardHandlerFactory, TestBM25SimilarityFactory,
SyncSliceTest, AlternateDirectoryTest, ClusterStateUpdateTest, StatsComponentTest, SynonymTokenizerTest,
TestSchemaNameResource, ChaosMonkeyNothingIsSafeTest, SolrRequestParserTest, TestAddFieldRealTimeGet,
ZkNodePropsTest, CSVRequestHandlerTest, StandardRequestHandlerTest, AliasIntegrationTest,
TestElisionMultitermQuery, TestPhraseSuggestions, HighlighterTest, RequiredFieldsTest, TestIndexingPerformance,
URLClassifyProcessorTest, TestJmxMonitoredMap, TestWordDelimiterFilterFactory, HdfsSyncSliceTest,
NumericFieldsTest, SimplePostToolTest, TestFieldTypeCollectionResource, TestDocumentBuilder,
UUIDFieldTest, NoCacheHeaderTest, HdfsLockFactoryTest, DirectUpdateHandlerTest, FileBasedSpellCheckerTest,
FieldMutatingUpdateProcessorTest, ReturnFieldsTest, DirectUpdateHandlerOptimizeTest, BasicZkTest,
TestSchemaSimilarityResource, HdfsRecoveryZkTest, TestNumberUtils, BasicDistributedZk2Test,
TestReplicationHandler, CoreAdminHandlerTest, SuggesterWFSTTest, TestLRUCache, TestPropInject,
JsonLoaderTest, PrimitiveFieldTypeTest, SliceStateUpdateTest, TestSystemIdResolver, TestReload,
TestAnalyzedSuggestions, BlockDirectoryTest, ClusterStateTest, BadIndexSchemaTest, SoftAutoCommitTest,
TestRecovery, UniqFieldsUpdateProcessorFactoryTest, HdfsChaosMonkeySafeLeaderTest, IndexBasedSpellCheckerTest,
HdfsDirectoryTest, PeerSyncTest, TestSolrXml, HighlighterConfigTest, QueryEqualityTest, SpellCheckComponentTest,
TestComponentsName, TestLazyCores, TestDefaultSimilarityFactory, CopyFieldTest, TestDynamicFieldCollectionResource,
DateFieldTest, ConvertedLegacyTest, PreAnalyzedFieldTest, DebugComponentTest, LeaderElectionIntegrationTest,
ShardRoutingTest, LukeRequestHandlerTest, DirectSolrConnectionTest, TestIBSimilarityFactory,
BlockCacheTest, TestUtils, SchemaVersionSpecificBehaviorTest, HdfsBasicDistributedZk2Test,
TestBinaryResponseWriter, TestRealTimeGet, PluginInfoTest, RequestHandlersTest, RegexBoostProcessorTest,
TimeZoneUtilsTest, SuggesterTest, TestLuceneMatchVersion, TestManagedSchema, OverseerTest,
IndexSchemaTest, TestBinaryField, ZkSolrClientTest, TermVectorComponentTest, ShowFileRequestHandlerTest,
TestGroupingSearch, SimpleFacetsTest, TestCSVResponseWriter, TestSolrXmlPersistence, TestStressVersions,
TestFiltering, LeaderElectionTest, SpellCheckCollatorTest, TestPostingsSolrHighlighter, SortByFunctionTest,
TestFastLRUCache, TestFieldResource, SpellPossibilityIteratorTest, TestCloudManagedSchema,
TestFieldTypeResource, TestSolrQueryParser, CacheHeaderTest, TestStressReorder, TestSolrXMLSerializer,
DocValuesMultiTest, TestDefaultSearchFieldResource, TestQuerySenderListener, TestXIncludeConfig,
ScriptEngineTest, TestCoreDiscovery, TestMultiCoreConfBootstrap, FileUtilsTest, MultiTermTest,
CircularListTest, SolrTestCaseJ4Test, TestSolrDeletionPolicy2, EchoParamsTest, TestSurroundQueryParser,
OpenCloseCoreStressTest, TestExtendedDismaxParser, CurrencyFieldOpenExchangeTest, MoreLikeThisHandlerTest,
WordBreakSolrSpellCheckerTest, SolrCmdDistributorTest, TestSolrIndexConfig, TestPseudoReturnFields,
ResponseLogComponentTest, TestMergePolicyConfig, BasicDistributedZkTest, ChaosMonkeySafeLeaderTest,
CollectionsAPIDistributedZkTest, RecoveryZkTest, FullSolrCloudDistribCmdsTest, TestRandomFaceting,
TestZkChroot, TestRandomDVFaceting, ZkCLITest, ShardRoutingCustomTest, TestDistributedSearch,
AutoCommitTest, TestDistributedGrouping, TestFaceting, TestHashPartitioner, DistributedSpellCheckComponentTest,
TermVectorComponentDistributedTest, ZkControllerTest, TestJoin, HardAutoCommitTest, DistributedTermsComponentTest,
TestRangeQuery, TestCoreContainer, TestSolr4Spatial, SolrCoreTest, TestSort, TestFunctionQuery,
BasicFunctionalityTest, TestBadConfig, OverseerCollectionProcessorTest, TestIndexSearcher,
DistributedQueryElevationComponentTest, CurrencyFieldXmlFileTest, SolrIndexSplitterTest, AnalysisAfterCoreReloadTest,
SignatureUpdateProcessorFactoryTest, SuggesterFSTTest, TestFoldingMultitermQuery, DocValuesTest,
SuggesterTSTTest, TestStressLucene, SpatialFilterTest, TestCSVLoader, PolyFieldTest, SolrCoreCheckLockOnStartupTest,
TestUpdate, TestAtomicUpdateErrorCases, DefaultValueUpdateProcessorTest, StatelessScriptUpdateProcessorFactoryTest,
TestRemoteStreaming, DistanceFunctionTest, TestSolrDeletionPolicy1, SolrInfoMBeanTest, XsltUpdateRequestHandlerTest,
DisMaxRequestHandlerTest, TestQueryUtils, TestWriterPerf, DirectSolrSpellCheckerTest, TestReversedWildcardFilterFactory,
DocumentAnalysisRequestHandlerTest, TestQueryTypes, TestOmitPositions, TermsComponentTest]
[junit4:junit4]   2> NOTE: reproduce with: ant test  -Dtestcase=TermsComponentTest -Dtests.seed=7B6BEEDA49392ED8
-Dtests.slow=true -Dtests.locale=pl -Dtests.timezone=Antarctica/Syowa -Dtests.file.encoding=US-ASCII
[junit4:junit4] ERROR   0.00s | TermsComponentTest (suite) <<<
[junit4:junit4]    > Throwable #1: com.carrotsearch.randomizedtesting.ThreadLeakError:
1 thread leaked from SUITE scope at org.apache.solr.handler.component.TermsComponentTest:

[junit4:junit4]    >    1) Thread[id=9767, name=IPC Parameter Sending Thread #5, state=TIMED_WAITING,
group=TGRP-TestRecoveryHdfs]
[junit4:junit4]    >         at sun.misc.Unsafe.park(Native Method)
[junit4:junit4]    >         at java.util.concurrent.locks.LockSupport.parkNanos(LockSupport.java:226)
[junit4:junit4]    >         at java.util.concurrent.SynchronousQueue$TransferStack.awaitFulfill(SynchronousQueue.java:460)
[junit4:junit4]    >         at java.util.concurrent.SynchronousQueue$TransferStack.transfer(SynchronousQueue.java:359)
[junit4:junit4]    >         at java.util.concurrent.SynchronousQueue.poll(SynchronousQueue.java:942)
[junit4:junit4]    >         at java.util.concurrent.ThreadPoolExecutor.getTask(ThreadPoolExecutor.java:1068)
[junit4:junit4]    >         at java.util.concurrent.ThreadPoolExecutor.runWorker(ThreadPoolExecutor.java:1130)
[junit4:junit4]    >         at java.util.concurrent.ThreadPoolExecutor$Worker.run(ThreadPoolExecutor.java:615)
[junit4:junit4]    >         at java.lang.Thread.run(Thread.java:724)
[junit4:junit4]    > 	at __randomizedtesting.SeedInfo.seed([7B6BEEDA49392ED8]:0)Throwable
#2: com.carrotsearch.randomizedtesting.ThreadLeakError: There are still zombie threads that
couldn't be terminated:
[junit4:junit4]    >    1) Thread[id=9767, name=IPC Parameter Sending Thread #5, state=TIMED_WAITING,
group=TGRP-TestRecoveryHdfs]
[junit4:junit4]    >         at sun.misc.Unsafe.park(Native Method)
[junit4:junit4]    >         at java.util.concurrent.locks.LockSupport.parkNanos(LockSupport.java:226)
[junit4:junit4]    >         at java.util.concurrent.SynchronousQueue$TransferStack.awaitFulfill(SynchronousQueue.java:460)
[junit4:junit4]    >         at java.util.concurrent.SynchronousQueue$TransferStack.transfer(SynchronousQueue.java:359)
[junit4:junit4]    >         at java.util.concurrent.SynchronousQueue.poll(SynchronousQueue.java:942)
[junit4:junit4]    >         at java.util.concurrent.ThreadPoolExecutor.getTask(ThreadPoolExecutor.java:1068)
[junit4:junit4]    >         at java.util.concurrent.ThreadPoolExecutor.runWorker(ThreadPoolExecutor.java:1130)
[junit4:junit4]    >         at java.util.concurrent.ThreadPoolExecutor$Worker.run(ThreadPoolExecutor.java:615)
[junit4:junit4]    >         at java.lang.Thread.run(Thread.java:724)
[junit4:junit4]    > 	at __randomizedtesting.SeedInfo.seed([7B6BEEDA49392ED8]:0)
[junit4:junit4] Completed in 26.83s, 13 tests, 2 errors <<< FAILURES!

[...truncated 292 lines...]
BUILD FAILED
/Users/jenkins/jenkins-slave/workspace/Lucene-Solr-trunk-MacOSX/build.xml:386: The following
error occurred while executing this line:
/Users/jenkins/jenkins-slave/workspace/Lucene-Solr-trunk-MacOSX/build.xml:366: The following
error occurred while executing this line:
/Users/jenkins/jenkins-slave/workspace/Lucene-Solr-trunk-MacOSX/build.xml:39: The following
error occurred while executing this line:
/Users/jenkins/jenkins-slave/workspace/Lucene-Solr-trunk-MacOSX/solr/build.xml:190: The following
error occurred while executing this line:
/Users/jenkins/jenkins-slave/workspace/Lucene-Solr-trunk-MacOSX/solr/common-build.xml:443:
The following error occurred while executing this line:
/Users/jenkins/jenkins-slave/workspace/Lucene-Solr-trunk-MacOSX/lucene/common-build.xml:1245:
The following error occurred while executing this line:
/Users/jenkins/jenkins-slave/workspace/Lucene-Solr-trunk-MacOSX/lucene/common-build.xml:889:
There were test failures: 312 suites, 1316 tests, 2 suite-level errors, 288 ignored (9 assumptions)

Total time: 98 minutes 43 seconds
Build step 'Invoke Ant' marked build as failure
Description set: Java: 64bit/jdk1.7.0 -XX:-UseCompressedOops -XX:+UseConcMarkSweepGC
Archiving artifacts
Recording test results
Email was triggered for: Failure
Sending email for trigger: Failure



Mime
View raw message