lucene-dev mailing list archives

Site index · List index
Message view « Date » · « Thread »
Top « Date » · « Thread »
From Policeman Jenkins Server <jenk...@thetaphi.de>
Subject [JENKINS] Lucene-Solr-trunk-Linux (32bit/jdk1.8.0-ea-b94) - Build # 6408 - Failure!
Date Wed, 03 Jul 2013 11:21:50 GMT
Build: http://jenkins.thetaphi.de/job/Lucene-Solr-trunk-Linux/6408/
Java: 32bit/jdk1.8.0-ea-b94 -client -XX:+UseConcMarkSweepGC

2 tests failed.
FAILED:  junit.framework.TestSuite.org.apache.solr.cloud.TestZkChroot

Error Message:
1 thread leaked from SUITE scope at org.apache.solr.cloud.TestZkChroot:     1) Thread[id=5650,
name=IPC Parameter Sending Thread #3, state=TIMED_WAITING, group=TGRP-TestRecoveryHdfs]  
      at sun.misc.Unsafe.park(Native Method)         at java.util.concurrent.locks.LockSupport.parkNanos(LockSupport.java:215)
        at java.util.concurrent.SynchronousQueue$TransferStack.awaitFulfill(SynchronousQueue.java:458)
        at java.util.concurrent.SynchronousQueue$TransferStack.transfer(SynchronousQueue.java:360)
        at java.util.concurrent.SynchronousQueue.poll(SynchronousQueue.java:939)         at
java.util.concurrent.ThreadPoolExecutor.getTask(ThreadPoolExecutor.java:1069)         at java.util.concurrent.ThreadPoolExecutor.runWorker(ThreadPoolExecutor.java:1130)
        at java.util.concurrent.ThreadPoolExecutor$Worker.run(ThreadPoolExecutor.java:615)
        at java.lang.Thread.run(Thread.java:724)

Stack Trace:
com.carrotsearch.randomizedtesting.ThreadLeakError: 1 thread leaked from SUITE scope at org.apache.solr.cloud.TestZkChroot:

   1) Thread[id=5650, name=IPC Parameter Sending Thread #3, state=TIMED_WAITING, group=TGRP-TestRecoveryHdfs]
        at sun.misc.Unsafe.park(Native Method)
        at java.util.concurrent.locks.LockSupport.parkNanos(LockSupport.java:215)
        at java.util.concurrent.SynchronousQueue$TransferStack.awaitFulfill(SynchronousQueue.java:458)
        at java.util.concurrent.SynchronousQueue$TransferStack.transfer(SynchronousQueue.java:360)
        at java.util.concurrent.SynchronousQueue.poll(SynchronousQueue.java:939)
        at java.util.concurrent.ThreadPoolExecutor.getTask(ThreadPoolExecutor.java:1069)
        at java.util.concurrent.ThreadPoolExecutor.runWorker(ThreadPoolExecutor.java:1130)
        at java.util.concurrent.ThreadPoolExecutor$Worker.run(ThreadPoolExecutor.java:615)
        at java.lang.Thread.run(Thread.java:724)
	at __randomizedtesting.SeedInfo.seed([9D5C960BAEFB5EE3]:0)


FAILED:  junit.framework.TestSuite.org.apache.solr.cloud.TestZkChroot

Error Message:
There are still zombie threads that couldn't be terminated:    1) Thread[id=5650, name=IPC
Parameter Sending Thread #3, state=TIMED_WAITING, group=TGRP-TestRecoveryHdfs]         at
sun.misc.Unsafe.park(Native Method)         at java.util.concurrent.locks.LockSupport.parkNanos(LockSupport.java:215)
        at java.util.concurrent.SynchronousQueue$TransferStack.awaitFulfill(SynchronousQueue.java:458)
        at java.util.concurrent.SynchronousQueue$TransferStack.transfer(SynchronousQueue.java:360)
        at java.util.concurrent.SynchronousQueue.poll(SynchronousQueue.java:939)         at
java.util.concurrent.ThreadPoolExecutor.getTask(ThreadPoolExecutor.java:1069)         at java.util.concurrent.ThreadPoolExecutor.runWorker(ThreadPoolExecutor.java:1130)
        at java.util.concurrent.ThreadPoolExecutor$Worker.run(ThreadPoolExecutor.java:615)
        at java.lang.Thread.run(Thread.java:724)

Stack Trace:
com.carrotsearch.randomizedtesting.ThreadLeakError: There are still zombie threads that couldn't
be terminated:
   1) Thread[id=5650, name=IPC Parameter Sending Thread #3, state=TIMED_WAITING, group=TGRP-TestRecoveryHdfs]
        at sun.misc.Unsafe.park(Native Method)
        at java.util.concurrent.locks.LockSupport.parkNanos(LockSupport.java:215)
        at java.util.concurrent.SynchronousQueue$TransferStack.awaitFulfill(SynchronousQueue.java:458)
        at java.util.concurrent.SynchronousQueue$TransferStack.transfer(SynchronousQueue.java:360)
        at java.util.concurrent.SynchronousQueue.poll(SynchronousQueue.java:939)
        at java.util.concurrent.ThreadPoolExecutor.getTask(ThreadPoolExecutor.java:1069)
        at java.util.concurrent.ThreadPoolExecutor.runWorker(ThreadPoolExecutor.java:1130)
        at java.util.concurrent.ThreadPoolExecutor$Worker.run(ThreadPoolExecutor.java:615)
        at java.lang.Thread.run(Thread.java:724)
	at __randomizedtesting.SeedInfo.seed([9D5C960BAEFB5EE3]:0)




Build Log:
[...truncated 11212 lines...]
BUILD FAILED
/mnt/ssd/jenkins/workspace/Lucene-Solr-trunk-Linux/build.xml:386: The following error occurred
while executing this line:
/mnt/ssd/jenkins/workspace/Lucene-Solr-trunk-Linux/build.xml:366: The following error occurred
while executing this line:
/mnt/ssd/jenkins/workspace/Lucene-Solr-trunk-Linux/build.xml:39: The following error occurred
while executing this line:
/mnt/ssd/jenkins/workspace/Lucene-Solr-trunk-Linux/solr/build.xml:190: The following error
occurred while executing this line:
/mnt/ssd/jenkins/workspace/Lucene-Solr-trunk-Linux/solr/common-build.xml:443: The following
error occurred while executing this line:
/mnt/ssd/jenkins/workspace/Lucene-Solr-trunk-Linux/lucene/common-build.xml:1246: The following
error occurred while executing this line:
/mnt/ssd/jenkins/workspace/Lucene-Solr-trunk-Linux/lucene/common-build.xml:890: There were
test failures: 314 suites, 1324 tests, 2 suite-level errors, 653 ignored (6 assumptions)

Total time: 41 minutes 47 seconds
Build step 'Invoke Ant' marked build as failure
Description set: Java: 32bit/jdk1.8.0-ea-b94 -client -XX:+UseConcMarkSweepGC
Archiving artifacts
Recording test results
Email was triggered for: Failure
Sending email for trigger: Failure



Mime
View raw message