lucene-dev mailing list archives

Site index · List index
Message view « Date » · « Thread »
Top « Date » · « Thread »
From Policeman Jenkins Server <jenk...@thetaphi.de>
Subject [JENKINS] Lucene-Solr-trunk-Windows (64bit/jdk1.7.0_25) - Build # 3030 - Still Failing!
Date Fri, 12 Jul 2013 10:19:06 GMT
Build: http://jenkins.thetaphi.de/job/Lucene-Solr-trunk-Windows/3030/
Java: 64bit/jdk1.7.0_25 -XX:-UseCompressedOops -XX:+UseConcMarkSweepGC

2 tests failed.
REGRESSION:  org.apache.solr.core.TestCoreDiscovery.testNoCoreDir

Error Message:
Unable to delete file: .\org.apache.solr.core.TestCoreDiscovery\solrHome\core2\core.properties

Stack Trace:
java.io.IOException: Unable to delete file: .\org.apache.solr.core.TestCoreDiscovery\solrHome\core2\core.properties
	at org.apache.commons.io.FileUtils.forceDelete(FileUtils.java:1919)
	at org.apache.commons.io.FileUtils.cleanDirectory(FileUtils.java:1399)
	at org.apache.commons.io.FileUtils.deleteDirectory(FileUtils.java:1331)
	at org.apache.commons.io.FileUtils.forceDelete(FileUtils.java:1910)
	at org.apache.commons.io.FileUtils.cleanDirectory(FileUtils.java:1399)
	at org.apache.commons.io.FileUtils.deleteDirectory(FileUtils.java:1331)
	at org.apache.solr.core.TestCoreDiscovery.setMeUp(TestCoreDiscovery.java:43)
	at org.apache.solr.core.TestCoreDiscovery.testNoCoreDir(TestCoreDiscovery.java:226)
	at sun.reflect.NativeMethodAccessorImpl.invoke0(Native Method)
	at sun.reflect.NativeMethodAccessorImpl.invoke(NativeMethodAccessorImpl.java:57)
	at sun.reflect.DelegatingMethodAccessorImpl.invoke(DelegatingMethodAccessorImpl.java:43)
	at java.lang.reflect.Method.invoke(Method.java:606)
	at com.carrotsearch.randomizedtesting.RandomizedRunner.invoke(RandomizedRunner.java:1559)
	at com.carrotsearch.randomizedtesting.RandomizedRunner.access$600(RandomizedRunner.java:79)
	at com.carrotsearch.randomizedtesting.RandomizedRunner$6.evaluate(RandomizedRunner.java:737)
	at com.carrotsearch.randomizedtesting.RandomizedRunner$7.evaluate(RandomizedRunner.java:773)
	at com.carrotsearch.randomizedtesting.RandomizedRunner$8.evaluate(RandomizedRunner.java:787)
	at com.carrotsearch.randomizedtesting.rules.SystemPropertiesRestoreRule$1.evaluate(SystemPropertiesRestoreRule.java:53)
	at org.apache.lucene.util.TestRuleSetupTeardownChained$1.evaluate(TestRuleSetupTeardownChained.java:50)
	at org.apache.lucene.util.TestRuleFieldCacheSanity$1.evaluate(TestRuleFieldCacheSanity.java:51)
	at org.apache.lucene.util.AbstractBeforeAfterRule$1.evaluate(AbstractBeforeAfterRule.java:46)
	at com.carrotsearch.randomizedtesting.rules.SystemPropertiesInvariantRule$1.evaluate(SystemPropertiesInvariantRule.java:55)
	at org.apache.lucene.util.TestRuleThreadAndTestName$1.evaluate(TestRuleThreadAndTestName.java:49)
	at org.apache.lucene.util.TestRuleIgnoreAfterMaxFailures$1.evaluate(TestRuleIgnoreAfterMaxFailures.java:70)
	at org.apache.lucene.util.TestRuleMarkFailure$1.evaluate(TestRuleMarkFailure.java:48)
	at com.carrotsearch.randomizedtesting.rules.StatementAdapter.evaluate(StatementAdapter.java:36)
	at com.carrotsearch.randomizedtesting.ThreadLeakControl$StatementRunner.run(ThreadLeakControl.java:358)
	at com.carrotsearch.randomizedtesting.ThreadLeakControl.forkTimeoutingTask(ThreadLeakControl.java:782)
	at com.carrotsearch.randomizedtesting.ThreadLeakControl$3.evaluate(ThreadLeakControl.java:442)
	at com.carrotsearch.randomizedtesting.RandomizedRunner.runSingleTest(RandomizedRunner.java:746)
	at com.carrotsearch.randomizedtesting.RandomizedRunner$3.evaluate(RandomizedRunner.java:648)
	at com.carrotsearch.randomizedtesting.RandomizedRunner$4.evaluate(RandomizedRunner.java:682)
	at com.carrotsearch.randomizedtesting.RandomizedRunner$5.evaluate(RandomizedRunner.java:693)
	at com.carrotsearch.randomizedtesting.rules.StatementAdapter.evaluate(StatementAdapter.java:36)
	at com.carrotsearch.randomizedtesting.rules.SystemPropertiesRestoreRule$1.evaluate(SystemPropertiesRestoreRule.java:53)
	at org.apache.lucene.util.AbstractBeforeAfterRule$1.evaluate(AbstractBeforeAfterRule.java:46)
	at org.apache.lucene.util.TestRuleStoreClassName$1.evaluate(TestRuleStoreClassName.java:42)
	at com.carrotsearch.randomizedtesting.rules.SystemPropertiesInvariantRule$1.evaluate(SystemPropertiesInvariantRule.java:55)
	at com.carrotsearch.randomizedtesting.rules.NoShadowingOrOverridesOnMethodsRule$1.evaluate(NoShadowingOrOverridesOnMethodsRule.java:39)
	at com.carrotsearch.randomizedtesting.rules.NoShadowingOrOverridesOnMethodsRule$1.evaluate(NoShadowingOrOverridesOnMethodsRule.java:39)
	at com.carrotsearch.randomizedtesting.rules.StatementAdapter.evaluate(StatementAdapter.java:36)
	at org.apache.lucene.util.TestRuleAssertionsRequired$1.evaluate(TestRuleAssertionsRequired.java:43)
	at org.apache.lucene.util.TestRuleMarkFailure$1.evaluate(TestRuleMarkFailure.java:48)
	at org.apache.lucene.util.TestRuleIgnoreAfterMaxFailures$1.evaluate(TestRuleIgnoreAfterMaxFailures.java:70)
	at org.apache.lucene.util.TestRuleIgnoreTestSuites$1.evaluate(TestRuleIgnoreTestSuites.java:55)
	at com.carrotsearch.randomizedtesting.rules.StatementAdapter.evaluate(StatementAdapter.java:36)
	at com.carrotsearch.randomizedtesting.ThreadLeakControl$StatementRunner.run(ThreadLeakControl.java:358)
	at java.lang.Thread.run(Thread.java:724)


FAILED:  org.apache.solr.core.TestCoreDiscovery.testDuplicateNames

Error Message:
Unable to delete file: .\org.apache.solr.core.TestCoreDiscovery\solrHome\core2\core.properties

Stack Trace:
java.io.IOException: Unable to delete file: .\org.apache.solr.core.TestCoreDiscovery\solrHome\core2\core.properties
	at __randomizedtesting.SeedInfo.seed([9EAA38C6911D22AA:65DA88F2CED1D62F]:0)
	at org.apache.commons.io.FileUtils.forceDelete(FileUtils.java:1919)
	at org.apache.commons.io.FileUtils.cleanDirectory(FileUtils.java:1399)
	at org.apache.commons.io.FileUtils.deleteDirectory(FileUtils.java:1331)
	at org.apache.commons.io.FileUtils.forceDelete(FileUtils.java:1910)
	at org.apache.commons.io.FileUtils.cleanDirectory(FileUtils.java:1399)
	at org.apache.commons.io.FileUtils.deleteDirectory(FileUtils.java:1331)
	at org.apache.solr.core.TestCoreDiscovery.after(TestCoreDiscovery.java:117)
	at sun.reflect.NativeMethodAccessorImpl.invoke0(Native Method)
	at sun.reflect.NativeMethodAccessorImpl.invoke(NativeMethodAccessorImpl.java:57)
	at sun.reflect.DelegatingMethodAccessorImpl.invoke(DelegatingMethodAccessorImpl.java:43)
	at java.lang.reflect.Method.invoke(Method.java:606)
	at com.carrotsearch.randomizedtesting.RandomizedRunner.invoke(RandomizedRunner.java:1559)
	at com.carrotsearch.randomizedtesting.RandomizedRunner.access$600(RandomizedRunner.java:79)
	at com.carrotsearch.randomizedtesting.RandomizedRunner$8.evaluate(RandomizedRunner.java:795)
	at com.carrotsearch.randomizedtesting.rules.SystemPropertiesRestoreRule$1.evaluate(SystemPropertiesRestoreRule.java:53)
	at org.apache.lucene.util.TestRuleSetupTeardownChained$1.evaluate(TestRuleSetupTeardownChained.java:50)
	at org.apache.lucene.util.TestRuleFieldCacheSanity$1.evaluate(TestRuleFieldCacheSanity.java:51)
	at org.apache.lucene.util.AbstractBeforeAfterRule$1.evaluate(AbstractBeforeAfterRule.java:46)
	at com.carrotsearch.randomizedtesting.rules.SystemPropertiesInvariantRule$1.evaluate(SystemPropertiesInvariantRule.java:55)
	at org.apache.lucene.util.TestRuleThreadAndTestName$1.evaluate(TestRuleThreadAndTestName.java:49)
	at org.apache.lucene.util.TestRuleIgnoreAfterMaxFailures$1.evaluate(TestRuleIgnoreAfterMaxFailures.java:70)
	at org.apache.lucene.util.TestRuleMarkFailure$1.evaluate(TestRuleMarkFailure.java:48)
	at com.carrotsearch.randomizedtesting.rules.StatementAdapter.evaluate(StatementAdapter.java:36)
	at com.carrotsearch.randomizedtesting.ThreadLeakControl$StatementRunner.run(ThreadLeakControl.java:358)
	at com.carrotsearch.randomizedtesting.ThreadLeakControl.forkTimeoutingTask(ThreadLeakControl.java:782)
	at com.carrotsearch.randomizedtesting.ThreadLeakControl$3.evaluate(ThreadLeakControl.java:442)
	at com.carrotsearch.randomizedtesting.RandomizedRunner.runSingleTest(RandomizedRunner.java:746)
	at com.carrotsearch.randomizedtesting.RandomizedRunner$3.evaluate(RandomizedRunner.java:648)
	at com.carrotsearch.randomizedtesting.RandomizedRunner$4.evaluate(RandomizedRunner.java:682)
	at com.carrotsearch.randomizedtesting.RandomizedRunner$5.evaluate(RandomizedRunner.java:693)
	at com.carrotsearch.randomizedtesting.rules.StatementAdapter.evaluate(StatementAdapter.java:36)
	at com.carrotsearch.randomizedtesting.rules.SystemPropertiesRestoreRule$1.evaluate(SystemPropertiesRestoreRule.java:53)
	at org.apache.lucene.util.AbstractBeforeAfterRule$1.evaluate(AbstractBeforeAfterRule.java:46)
	at org.apache.lucene.util.TestRuleStoreClassName$1.evaluate(TestRuleStoreClassName.java:42)
	at com.carrotsearch.randomizedtesting.rules.SystemPropertiesInvariantRule$1.evaluate(SystemPropertiesInvariantRule.java:55)
	at com.carrotsearch.randomizedtesting.rules.NoShadowingOrOverridesOnMethodsRule$1.evaluate(NoShadowingOrOverridesOnMethodsRule.java:39)
	at com.carrotsearch.randomizedtesting.rules.NoShadowingOrOverridesOnMethodsRule$1.evaluate(NoShadowingOrOverridesOnMethodsRule.java:39)
	at com.carrotsearch.randomizedtesting.rules.StatementAdapter.evaluate(StatementAdapter.java:36)
	at org.apache.lucene.util.TestRuleAssertionsRequired$1.evaluate(TestRuleAssertionsRequired.java:43)
	at org.apache.lucene.util.TestRuleMarkFailure$1.evaluate(TestRuleMarkFailure.java:48)
	at org.apache.lucene.util.TestRuleIgnoreAfterMaxFailures$1.evaluate(TestRuleIgnoreAfterMaxFailures.java:70)
	at org.apache.lucene.util.TestRuleIgnoreTestSuites$1.evaluate(TestRuleIgnoreTestSuites.java:55)
	at com.carrotsearch.randomizedtesting.rules.StatementAdapter.evaluate(StatementAdapter.java:36)
	at com.carrotsearch.randomizedtesting.ThreadLeakControl$StatementRunner.run(ThreadLeakControl.java:358)
	at java.lang.Thread.run(Thread.java:724)




Build Log:
[...truncated 9331 lines...]
   [junit4] Suite: org.apache.solr.core.TestCoreDiscovery
   [junit4]   2> 303166 T777 oas.SolrTestCaseJ4.initCore ####initCore
   [junit4]   2> Creating dataDir: C:\Users\JenkinsSlave\workspace\Lucene-Solr-trunk-Windows\solr\build\solr-core\test\J0\.\solrtest-TestCoreDiscovery-1373621484901
   [junit4]   2> 303169 T777 oas.SolrTestCaseJ4.initCore ####initCore end
   [junit4]   2> 303172 T777 oas.SolrTestCaseJ4.setUp ###Starting testAlternateCoreDir
   [junit4]   2> 303210 T777 oasc.SolrResourceLoader.locateSolrHome JNDI not configured for solr (NoInitialContextEx)
   [junit4]   2> 303211 T777 oasc.SolrResourceLoader.locateSolrHome using system property solr.solr.home: C:\Users\JenkinsSlave\workspace\Lucene-Solr-trunk-Windows\solr\build\solr-core\test\J0\.\org.apache.solr.core.TestCoreDiscovery\solrHome
   [junit4]   2> 303211 T777 oasc.SolrResourceLoader.<init> new SolrResourceLoader for directory: 'C:\Users\JenkinsSlave\workspace\Lucene-Solr-trunk-Windows\solr\build\solr-core\test\J0\.\org.apache.solr.core.TestCoreDiscovery\solrHome\'
   [junit4]   2> 303239 T777 oasc.ConfigSolr.fromFile Loading container configuration from C:\Users\JenkinsSlave\workspace\Lucene-Solr-trunk-Windows\solr\build\solr-core\test\J0\.\org.apache.solr.core.TestCoreDiscovery\solrHome\solr.xml
   [junit4]   2> 303320 T777 oasc.ConfigSolrXml.<init> Config-defined core root directory: C:\Users\JenkinsSlave\workspace\Lucene-Solr-trunk-Windows\solr\build\solr-core\test\J0\.\alternateCoreDir
   [junit4]   2> 303321 T777 oasc.CoreContainer.<init> New CoreContainer 436107183
   [junit4]   2> 303322 T777 oasc.CoreContainer.load Loading cores into CoreContainer [instanceDir=C:\Users\JenkinsSlave\workspace\Lucene-Solr-trunk-Windows\solr\build\solr-core\test\J0\.\org.apache.solr.core.TestCoreDiscovery\solrHome\]
   [junit4]   2> 303324 T777 oashc.HttpShardHandlerFactory.getParameter Setting socketTimeout to: 0
   [junit4]   2> 303324 T777 oashc.HttpShardHandlerFactory.getParameter Setting urlScheme to: http://
   [junit4]   2> 303329 T777 oashc.HttpShardHandlerFactory.getParameter Setting connTimeout to: 0
   [junit4]   2> 303329 T777 oashc.HttpShardHandlerFactory.getParameter Setting maxConnectionsPerHost to: 20
   [junit4]   2> 303329 T777 oashc.HttpShardHandlerFactory.getParameter Setting corePoolSize to: 0
   [junit4]   2> 303329 T777 oashc.HttpShardHandlerFactory.getParameter Setting maximumPoolSize to: 2147483647
   [junit4]   2> 303330 T777 oashc.HttpShardHandlerFactory.getParameter Setting maxThreadIdleTime to: 5
   [junit4]   2> 303330 T777 oashc.HttpShardHandlerFactory.getParameter Setting sizeOfQueue to: -1
   [junit4]   2> 303330 T777 oashc.HttpShardHandlerFactory.getParameter Setting fairnessPolicy to: false
   [junit4]   2> 303330 T777 oascsi.HttpClientUtil.createClient Creating new http client, config:maxConnectionsPerHost=20&maxConnections=10000&socketTimeout=0&connTimeout=0&retry=false
   [junit4]   2> 303340 T777 oasc.SolrCores.allocateLazyCores Allocating transient cache for 2 transient cores
   [junit4]   2> 303340 T777 oasl.LogWatcher.newRegisteredLogWatcher Registering Log Listener [Log4j (org.slf4j.impl.Log4jLoggerFactory)]
   [junit4]   2> 303345 T777 oasc.CorePropertiesLocator.discover Looking for core definitions underneath C:\Users\JenkinsSlave\workspace\Lucene-Solr-trunk-Windows\solr\build\solr-core\test\J0\.\alternateCoreDir
   [junit4]   2> 303348 T777 oasc.CorePropertiesLocator.discoverUnder Found core core1 in C:\Users\JenkinsSlave\workspace\Lucene-Solr-trunk-Windows\solr\build\solr-core\test\J0\.\alternateCoreDir\core1\
   [junit4]   2> 303349 T777 oasc.CorePropertiesLocator.discoverUnder Found core core2 in C:\Users\JenkinsSlave\workspace\Lucene-Solr-trunk-Windows\solr\build\solr-core\test\J0\.\alternateCoreDir\core2\
   [junit4]   2> 303349 T777 oasc.CorePropertiesLocator.discover Found 2 core definitions
   [junit4]   2> 303349 T778 oasc.CoreContainer.create Creating SolrCore 'core1' using instanceDir: C:\Users\JenkinsSlave\workspace\Lucene-Solr-trunk-Windows\solr\build\solr-core\test\J0\.\alternateCoreDir\core1
   [junit4]   2> 303350 T778 oasc.SolrResourceLoader.<init> new SolrResourceLoader for directory: 'C:\Users\JenkinsSlave\workspace\Lucene-Solr-trunk-Windows\solr\build\solr-core\test\J0\.\alternateCoreDir\core1\'
   [junit4]   2> 303407 T778 oasc.SolrConfig.<init> Using Lucene MatchVersion: LUCENE_41
   [junit4]   2> 303485 T778 oasc.SolrConfig.<init> Loaded SolrConfig: solrconfig-minimal.xml
   [junit4]   2> 303485 T778 oass.IndexSchema.readSchema Reading Solr Schema from schema-tiny.xml
   [junit4]   2> 303494 T778 oass.IndexSchema.readSchema [core1] Schema name=tiny
   [junit4]   2> 303524 T778 oass.IndexSchema.readSchema unique key field: id
   [junit4]   2> 303526 T778 oasc.SolrCore.initDirectoryFactory org.apache.solr.core.MockDirectoryFactory
   [junit4]   2> 303526 T778 oasc.SolrCore.<init> [core1] Opening new SolrCore at C:\Users\JenkinsSlave\workspace\Lucene-Solr-trunk-Windows\solr\build\solr-core\test\J0\.\alternateCoreDir\core1\, dataDir=C:\Users\JenkinsSlave\workspace\Lucene-Solr-trunk-Windows\solr\build\solr-core\test\J0\.\alternateCoreDir\core1\core1\
   [junit4]   2> 303527 T778 oasc.JmxMonitoredMap.<init> JMX monitoring is enabled. Adding Solr mbeans to JMX Server: com.sun.jmx.mbeanserver.JmxMBeanServer@dc33904
   [junit4]   2> 303527 T778 oasc.CachingDirectoryFactory.get return new directory for C:\Users\JenkinsSlave\workspace\Lucene-Solr-trunk-Windows\solr\build\solr-core\test\J0\.\alternateCoreDir\core1\core1\
   [junit4]   2> 303527 T778 oasc.SolrCore.getNewIndexDir New index directory detected: old=null new=C:\Users\JenkinsSlave\workspace\Lucene-Solr-trunk-Windows\solr\build\solr-core\test\J0\.\alternateCoreDir\core1\core1\index/
   [junit4]   2> 303528 T778 oasc.SolrCore.initIndex WARN [core1] Solr index directory 'C:\Users\JenkinsSlave\workspace\Lucene-Solr-trunk-Windows\solr\build\solr-core\test\J0\.\alternateCoreDir\core1\core1\index' doesn't exist. Creating new index...
   [junit4]   2> 303528 T778 oasc.CachingDirectoryFactory.get return new directory for C:\Users\JenkinsSlave\workspace\Lucene-Solr-trunk-Windows\solr\build\solr-core\test\J0\.\alternateCoreDir\core1\core1\index
   [junit4]   2> 303532 T778 oasc.SolrDeletionPolicy.onCommit SolrDeletionPolicy.onCommit: commits: num=1
   [junit4]   2> 		commit{dir=MockDirWrapper(org.apache.lucene.store.RAMDirectory@4c4ee589 lockFactory=org.apache.lucene.store.NativeFSLockFactory@5fb0491f),segFN=segments_1,generation=1}
   [junit4]   2> 303532 T778 oasc.SolrDeletionPolicy.updateCommits newest commit generation = 1
   [junit4]   2> 303535 T778 oasc.SolrCore.initWriters created json: solr.JSONResponseWriter
   [junit4]   2> 303541 T778 oasc.RequestHandlers.initHandlersFromConfig created /admin/: solr.admin.AdminHandlers
   [junit4]   2> 303541 T778 oasc.RequestHandlers.initHandlersFromConfig created /select: solr.SearchHandler
   [junit4]   2> 303542 T778 oasc.RequestHandlers.initHandlersFromConfig created /update: solr.UpdateRequestHandler
   [junit4]   2> 303563 T778 oashl.XMLLoader.init xsltCacheLifetimeSeconds=60
   [junit4]   2> 303570 T778 oass.SolrIndexSearcher.<init> Opening Searcher@471ca087 main
   [junit4]   2> 303571 T778 oasc.SolrCore.registerSearcher [core1] Registered new searcher Searcher@471ca087 main{StandardDirectoryReader(segments_1:1)}
   [junit4]   2> 303571 T778 oasu.CommitTracker.<init> Hard AutoCommit: disabled
   [junit4]   2> 303571 T778 oasu.CommitTracker.<init> Soft AutoCommit: disabled
   [junit4]   2> 303578 T778 oasc.CoreContainer.registerCore registering core: core1
   [junit4]   2> 303579 T777 oasc.CoreContainer.create Creating SolrCore 'core2' using instanceDir: C:\Users\JenkinsSlave\workspace\Lucene-Solr-trunk-Windows\solr\build\solr-core\test\J0\.\alternateCoreDir\core2
   [junit4]   2> 303579 T777 oasc.SolrResourceLoader.<init> new SolrResourceLoader for directory: 'C:\Users\JenkinsSlave\workspace\Lucene-Solr-trunk-Windows\solr\build\solr-core\test\J0\.\alternateCoreDir\core2\'
   [junit4]   2> 303673 T777 oasc.SolrConfig.<init> Using Lucene MatchVersion: LUCENE_41
   [junit4]   2> 303751 T777 oasc.SolrConfig.<init> Loaded SolrConfig: solrconfig-minimal.xml
   [junit4]   2> 303752 T777 oass.IndexSchema.readSchema Reading Solr Schema from schema-tiny.xml
   [junit4]   2> 303757 T777 oass.IndexSchema.readSchema [core2] Schema name=tiny
   [junit4]   2> 303789 T777 oass.IndexSchema.readSchema unique key field: id
   [junit4]   2> 303791 T777 oasc.SolrCore.initDirectoryFactory org.apache.solr.core.MockDirectoryFactory
   [junit4]   2> 303792 T777 oasc.SolrCore.<init> [core2] Opening new SolrCore at C:\Users\JenkinsSlave\workspace\Lucene-Solr-trunk-Windows\solr\build\solr-core\test\J0\.\alternateCoreDir\core2\, dataDir=C:\Users\JenkinsSlave\workspace\Lucene-Solr-trunk-Windows\solr\build\solr-core\test\J0\.\alternateCoreDir\core2\core2\
   [junit4]   2> 303792 T777 oasc.JmxMonitoredMap.<init> JMX monitoring is enabled. Adding Solr mbeans to JMX Server: com.sun.jmx.mbeanserver.JmxMBeanServer@dc33904
   [junit4]   2> 303793 T777 oasc.CachingDirectoryFactory.get return new directory for C:\Users\JenkinsSlave\workspace\Lucene-Solr-trunk-Windows\solr\build\solr-core\test\J0\.\alternateCoreDir\core2\core2\
   [junit4]   2> 303793 T777 oasc.SolrCore.getNewIndexDir New index directory detected: old=null new=C:\Users\JenkinsSlave\workspace\Lucene-Solr-trunk-Windows\solr\build\solr-core\test\J0\.\alternateCoreDir\core2\core2\index/
   [junit4]   2> 303793 T777 oasc.SolrCore.initIndex WARN [core2] Solr index directory 'C:\Users\JenkinsSlave\workspace\Lucene-Solr-trunk-Windows\solr\build\solr-core\test\J0\.\alternateCoreDir\core2\core2\index' doesn't exist. Creating new index...
   [junit4]   2> 303794 T777 oasc.CachingDirectoryFactory.get return new directory for C:\Users\JenkinsSlave\workspace\Lucene-Solr-trunk-Windows\solr\build\solr-core\test\J0\.\alternateCoreDir\core2\core2\index
   [junit4]   2> 303798 T777 oasc.SolrDeletionPolicy.onCommit SolrDeletionPolicy.onCommit: commits: num=1
   [junit4]   2> 		commit{dir=MockDirWrapper(org.apache.lucene.store.RAMDirectory@5694bf90 lockFactory=org.apache.lucene.store.NativeFSLockFactory@626ee51),segFN=segments_1,generation=1}
   [junit4]   2> 303799 T777 oasc.SolrDeletionPolicy.updateCommits newest commit generation = 1
   [junit4]   2> 303801 T777 oasc.SolrCore.initWriters created json: solr.JSONResponseWriter
   [junit4]   2> 303804 T777 oasc.RequestHandlers.initHandlersFromConfig created /admin/: solr.admin.AdminHandlers
   [junit4]   2> 303805 T777 oasc.RequestHandlers.initHandlersFromConfig created /select: solr.SearchHandler
   [junit4]   2> 303805 T777 oasc.RequestHandlers.initHandlersFromConfig created /update: solr.UpdateRequestHandler
   [junit4]   2> 303815 T777 oashl.XMLLoader.init xsltCacheLifetimeSeconds=60
   [junit4]   2> 303822 T777 oass.SolrIndexSearcher.<init> Opening Searcher@1f1ebd37 main
   [junit4]   2> 303823 T777 oasc.SolrCore.registerSearcher [core2] Registered new searcher Searcher@1f1ebd37 main{StandardDirectoryReader(segments_1:1)}
   [junit4]   2> 303823 T777 oasu.CommitTracker.<init> Hard AutoCommit: disabled
   [junit4]   2> 303824 T777 oasu.CommitTracker.<init> Soft AutoCommit: disabled
   [junit4]   2> 303833 T777 oasc.CoreContainer.registerCore registering core: core2
   [junit4]   2> 303834 T777 oasc.CoreContainer.shutdown Shutting down CoreContainer instance=436107183
   [junit4]   2> 303834 T777 oasc.SolrCore.close [core1]  CLOSING SolrCore org.apache.solr.core.SolrCore@39f9e067
   [junit4]   2> 303844 T777 oasu.DirectUpdateHandler2.close closing DirectUpdateHandler2{commits=0,autocommits=0,soft autocommits=0,optimizes=0,rollbacks=0,expungeDeletes=0,docsPending=0,adds=0,deletesById=0,deletesByQuery=0,errors=0,cumulative_adds=0,cumulative_deletesById=0,cumulative_deletesByQuery=0,cumulative_errors=0}
   [junit4]   2> 303844 T777 oasu.SolrCoreState.decrefSolrCoreState Closing SolrCoreState
   [junit4]   2> 303844 T777 oasu.DefaultSolrCoreState.closeIndexWriter SolrCoreState ref count has reached 0 - closing IndexWriter
   [junit4]   2> 303844 T777 oasu.DefaultSolrCoreState.closeIndexWriter closing IndexWriter with IndexWriterCloser
   [junit4]   2> 303845 T777 oasc.SolrCore.closeSearcher [core1] Closing main searcher on request.
   [junit4]   2> 303846 T777 oasc.CachingDirectoryFactory.close Closing MockDirectoryFactory - 2 directories currently being tracked
   [junit4]   2> 303846 T777 oasc.CachingDirectoryFactory.closeCacheValue looking to close C:\Users\JenkinsSlave\workspace\Lucene-Solr-trunk-Windows\solr\build\solr-core\test\J0\.\alternateCoreDir\core1\core1\index [CachedDir<<refCount=0;path=C:\Users\JenkinsSlave\workspace\Lucene-Solr-trunk-Windows\solr\build\solr-core\test\J0\.\alternateCoreDir\core1\core1\index;done=false>>]
   [junit4]   2> 303847 T777 oasc.CachingDirectoryFactory.close Closing directory: C:\Users\JenkinsSlave\workspace\Lucene-Solr-trunk-Windows\solr\build\solr-core\test\J0\.\alternateCoreDir\core1\core1\index
   [junit4]   2> 303847 T777 oasc.CachingDirectoryFactory.closeCacheValue looking to close C:\Users\JenkinsSlave\workspace\Lucene-Solr-trunk-Windows\solr\build\solr-core\test\J0\.\alternateCoreDir\core1\core1\ [CachedDir<<refCount=0;path=C:\Users\JenkinsSlave\workspace\Lucene-Solr-trunk-Windows\solr\build\solr-core\test\J0\.\alternateCoreDir\core1\core1\;done=false>>]
   [junit4]   2> 303847 T777 oasc.CachingDirectoryFactory.close Closing directory: C:\Users\JenkinsSlave\workspace\Lucene-Solr-trunk-Windows\solr\build\solr-core\test\J0\.\alternateCoreDir\core1\core1\
   [junit4]   2> 303848 T777 oasc.SolrCore.close [core2]  CLOSING SolrCore org.apache.solr.core.SolrCore@39ff2ffc
   [junit4]   2> 303856 T777 oasu.DirectUpdateHandler2.close closing DirectUpdateHandler2{commits=0,autocommits=0,soft autocommits=0,optimizes=0,rollbacks=0,expungeDeletes=0,docsPending=0,adds=0,deletesById=0,deletesByQuery=0,errors=0,cumulative_adds=0,cumulative_deletesById=0,cumulative_deletesByQuery=0,cumulative_errors=0}
   [junit4]   2> 303857 T777 oasu.SolrCoreState.decrefSolrCoreState Closing SolrCoreState
   [junit4]   2> 303857 T777 oasu.DefaultSolrCoreState.closeIndexWriter SolrCoreState ref count has reached 0 - closing IndexWriter
   [junit4]   2> 303857 T777 oasu.DefaultSolrCoreState.closeIndexWriter closing IndexWriter with IndexWriterCloser
   [junit4]   2> 303858 T777 oasc.SolrCore.closeSearcher [core2] Closing main searcher on request.
   [junit4]   2> 303858 T777 oasc.CachingDirectoryFactory.close Closing MockDirectoryFactory - 2 directories currently being tracked
   [junit4]   2> 303858 T777 oasc.CachingDirectoryFactory.closeCacheValue looking to close C:\Users\JenkinsSlave\workspace\Lucene-Solr-trunk-Windows\solr\build\solr-core\test\J0\.\alternateCoreDir\core2\core2\ [CachedDir<<refCount=0;path=C:\Users\JenkinsSlave\workspace\Lucene-Solr-trunk-Windows\solr\build\solr-core\test\J0\.\alternateCoreDir\core2\core2\;done=false>>]
   [junit4]   2> 303858 T777 oasc.CachingDirectoryFactory.close Closing directory: C:\Users\JenkinsSlave\workspace\Lucene-Solr-trunk-Windows\solr\build\solr-core\test\J0\.\alternateCoreDir\core2\core2\
   [junit4]   2> 303858 T777 oasc.CachingDirectoryFactory.closeCacheValue looking to close C:\Users\JenkinsSlave\workspace\Lucene-Solr-trunk-Windows\solr\build\solr-core\test\J0\.\alternateCoreDir\core2\core2\index [CachedDir<<refCount=0;path=C:\Users\JenkinsSlave\workspace\Lucene-Solr-trunk-Windows\solr\build\solr-core\test\J0\.\alternateCoreDir\core2\core2\index;done=false>>]
   [junit4]   2> 303859 T777 oasc.CachingDirectoryFactory.close Closing directory: C:\Users\JenkinsSlave\workspace\Lucene-Solr-trunk-Windows\solr\build\solr-core\test\J0\.\alternateCoreDir\core2\core2\index
   [junit4]   2> 303900 T777 oas.SolrTestCaseJ4.tearDown ###Ending testAlternateCoreDir
   [junit4]   2> 303903 T777 oas.SolrTestCaseJ4.setUp ###Starting testDiscovery
   [junit4]   2> 303954 T777 oasc.SolrResourceLoader.locateSolrHome JNDI not configured for solr (NoInitialContextEx)
   [junit4]   2> 303955 T777 oasc.SolrResourceLoader.locateSolrHome using system property solr.solr.home: C:\Users\JenkinsSlave\workspace\Lucene-Solr-trunk-Windows\solr\build\solr-core\test\J0\.\org.apache.solr.core.TestCoreDiscovery\solrHome
   [junit4]   2> 303955 T777 oasc.SolrResourceLoader.<init> new SolrResourceLoader for directory: 'C:\Users\JenkinsSlave\workspace\Lucene-Solr-trunk-Windows\solr\build\solr-core\test\J0\.\org.apache.solr.core.TestCoreDiscovery\solrHome\'
   [junit4]   2> 303984 T777 oasc.ConfigSolr.fromFile Loading container configuration from C:\Users\JenkinsSlave\workspace\Lucene-Solr-trunk-Windows\solr\build\solr-core\test\J0\.\org.apache.solr.core.TestCoreDiscovery\solrHome\solr.xml
   [junit4]   2> 304071 T777 oasc.ConfigSolrXml.<init> Config-defined core root directory: 
   [junit4]   2> 304072 T777 oasc.CoreContainer.<init> New CoreContainer 1835449644
   [junit4]   2> 304072 T777 oasc.CoreContainer.load Loading cores into CoreContainer [instanceDir=C:\Users\JenkinsSlave\workspace\Lucene-Solr-trunk-Windows\solr\build\solr-core\test\J0\.\org.apache.solr.core.TestCoreDiscovery\solrHome\]
   [junit4]   2> 304074 T777 oashc.HttpShardHandlerFactory.getParameter Setting socketTimeout to: 0
   [junit4]   2> 304075 T777 oashc.HttpShardHandlerFactory.getParameter Setting urlScheme to: http://
   [junit4]   2> 304075 T777 oashc.HttpShardHandlerFactory.getParameter Setting connTimeout to: 0
   [junit4]   2> 304075 T777 oashc.HttpShardHandlerFactory.getParameter Setting maxConnectionsPerHost to: 20
   [junit4]   2> 304075 T777 oashc.HttpShardHandlerFactory.getParameter Setting corePoolSize to: 0
   [junit4]   2> 304076 T777 oashc.HttpShardHandlerFactory.getParameter Setting maximumPoolSize to: 2147483647
   [junit4]   2> 304076 T777 oashc.HttpShardHandlerFactory.getParameter Setting maxThreadIdleTime to: 5
   [junit4]   2> 304076 T777 oashc.HttpShardHandlerFactory.getParameter Setting sizeOfQueue to: -1
   [junit4]   2> 304077 T777 oashc.HttpShardHandlerFactory.getParameter Setting fairnessPolicy to: false
   [junit4]   2> 304077 T777 oascsi.HttpClientUtil.createClient Creating new http client, config:maxConnectionsPerHost=20&maxConnections=10000&socketTimeout=0&connTimeout=0&retry=false
   [junit4]   2> 304089 T777 oasc.SolrCores.allocateLazyCores Allocating transient cache for 2 transient cores
   [junit4]   2> 304089 T777 oasl.LogWatcher.newRegisteredLogWatcher Registering Log Listener [Log4j (org.slf4j.impl.Log4jLoggerFactory)]
   [junit4]   2> 304093 T777 oasc.CorePropertiesLocator.discover Looking for core definitions underneath C:\Users\JenkinsSlave\workspace\Lucene-Solr-trunk-Windows\solr\build\solr-core\test\J0\.\org.apache.solr.core.TestCoreDiscovery\solrHome
   [junit4]   2> 304096 T777 oasc.CorePropertiesLocator.discoverUnder Found core core1 in C:\Users\JenkinsSlave\workspace\Lucene-Solr-trunk-Windows\solr\build\solr-core\test\J0\.\org.apache.solr.core.TestCoreDiscovery\solrHome\core1\
   [junit4]   2> 304097 T777 oasc.CorePropertiesLocator.discoverUnder Found core core2 in C:\Users\JenkinsSlave\workspace\Lucene-Solr-trunk-Windows\solr\build\solr-core\test\J0\.\org.apache.solr.core.TestCoreDiscovery\solrHome\core2\
   [junit4]   2> 304099 T777 oasc.CorePropertiesLocator.discoverUnder Found core lazy1 in C:\Users\JenkinsSlave\workspace\Lucene-Solr-trunk-Windows\solr\build\solr-core\test\J0\.\org.apache.solr.core.TestCoreDiscovery\solrHome\lazy1\
   [junit4]   2> 304100 T777 oasc.CorePropertiesLocator.discover Found 3 core definitions
   [junit4]   2> 304102 T782 oasc.CoreContainer.create Creating SolrCore 'core1' using instanceDir: C:\Users\JenkinsSlave\workspace\Lucene-Solr-trunk-Windows\solr\build\solr-core\test\J0\.\org.apache.solr.core.TestCoreDiscovery\solrHome\core1
   [junit4]   2> 304102 T782 oasc.SolrResourceLoader.<init> new SolrResourceLoader for directory: 'C:\Users\JenkinsSlave\workspace\Lucene-Solr-trunk-Windows\solr\build\solr-core\test\J0\.\org.apache.solr.core.TestCoreDiscovery\solrHome\core1\'
   [junit4]   2> 304157 T782 oasc.SolrConfig.<init> Using Lucene MatchVersion: LUCENE_41
   [junit4]   2> 304230 T782 oasc.SolrConfig.<init> Loaded SolrConfig: solrconfig-minimal.xml
   [junit4]   2> 304231 T782 oass.IndexSchema.readSchema Reading Solr Schema from schema-tiny.xml
   [junit4]   2> 304238 T782 oass.IndexSchema.readSchema [core1] Schema name=tiny
   [junit4]   2> 304267 T782 oass.IndexSchema.readSchema unique key field: id
   [junit4]   2> 304270 T782 oasc.SolrCore.initDirectoryFactory org.apache.solr.core.MockDirectoryFactory
   [junit4]   2> 304270 T782 oasc.SolrCore.<init> [core1] Opening new SolrCore at C:\Users\JenkinsSlave\workspace\Lucene-Solr-trunk-Windows\solr\build\solr-core\test\J0\.\org.apache.solr.core.TestCoreDiscovery\solrHome\core1\, dataDir=C:\Users\JenkinsSlave\workspace\Lucene-Solr-trunk-Windows\solr\build\solr-core\test\J0\.\org.apache.solr.core.TestCoreDiscovery\solrHome\core1\core1\
   [junit4]   2> 304270 T782 oasc.JmxMonitoredMap.<init> JMX monitoring is enabled. Adding Solr mbeans to JMX Server: com.sun.jmx.mbeanserver.JmxMBeanServer@dc33904
   [junit4]   2> 304271 T782 oasc.CachingDirectoryFactory.get return new directory for C:\Users\JenkinsSlave\workspace\Lucene-Solr-trunk-Windows\solr\build\solr-core\test\J0\.\org.apache.solr.core.TestCoreDiscovery\solrHome\core1\core1\
   [junit4]   2> 304271 T782 oasc.SolrCore.getNewIndexDir New index directory detected: old=null new=C:\Users\JenkinsSlave\workspace\Lucene-Solr-trunk-Windows\solr\build\solr-core\test\J0\.\org.apache.solr.core.TestCoreDiscovery\solrHome\core1\core1\index/
   [junit4]   2> 304271 T782 oasc.SolrCore.initIndex WARN [core1] Solr index directory 'C:\Users\JenkinsSlave\workspace\Lucene-Solr-trunk-Windows\solr\build\solr-core\test\J0\.\org.apache.solr.core.TestCoreDiscovery\solrHome\core1\core1\index' doesn't exist. Creating new index...
   [junit4]   2> 304272 T782 oasc.CachingDirectoryFactory.get return new directory for C:\Users\JenkinsSlave\workspace\Lucene-Solr-trunk-Windows\solr\build\solr-core\test\J0\.\org.apache.solr.core.TestCoreDiscovery\solrHome\core1\core1\index
   [junit4]   2> 304276 T782 oasc.SolrDeletionPolicy.onCommit SolrDeletionPolicy.onCommit: commits: num=1
   [junit4]   2> 		commit{dir=MockDirWrapper(org.apache.lucene.store.RAMDirectory@2b0fa563 lockFactory=org.apache.lucene.store.NativeFSLockFactory@7db03b79),segFN=segments_1,generation=1}
   [junit4]   2> 304276 T782 oasc.SolrDeletionPolicy.updateCommits newest commit generation = 1
   [junit4]   2> 304278 T782 oasc.SolrCore.initWriters created json: solr.JSONResponseWriter
   [junit4]   2> 304281 T782 oasc.RequestHandlers.initHandlersFromConfig created /admin/: solr.admin.AdminHandlers
   [junit4]   2> 304281 T782 oasc.RequestHandlers.initHandlersFromConfig created /select: solr.SearchHandler
   [junit4]   2> 304281 T782 oasc.RequestHandlers.initHandlersFromConfig created /update: solr.UpdateRequestHandler
   [junit4]   2> 304291 T782 oashl.XMLLoader.init xsltCacheLifetimeSeconds=60
   [junit4]   2> 304297 T782 oass.SolrIndexSearcher.<init> Opening Searcher@46203f37 main
   [junit4]   2> 304298 T782 oasc.SolrCore.registerSearcher [core1] Registered new searcher Searcher@46203f37 main{StandardDirectoryReader(segments_1:1)}
   [junit4]   2> 304299 T782 oasu.CommitTracker.<init> Hard AutoCommit: disabled
   [junit4]   2> 304299 T782 oasu.CommitTracker.<init> Soft AutoCommit: disabled
   [junit4]   2> 304303 T782 oasc.CoreContainer.registerCore registering core: core1
   [junit4]   2> 304307 T777 oasc.CoreContainer.create Creating SolrCore 'core2' using instanceDir: C:\Users\JenkinsSlave\workspace\Lucene-Solr-trunk-Windows\solr\build\solr-core\test\J0\.\org.apache.solr.core.TestCoreDiscovery\solrHome\core2
   [junit4]   2> 304308 T777 oasc.SolrResourceLoader.<init> new SolrResourceLoader for directory: 'C:\Users\JenkinsSlave\workspace\Lucene-Solr-trunk-Windows\solr\build\solr-core\test\J0\.\org.apache.solr.core.TestCoreDiscovery\solrHome\core2\'
   [junit4]   2> 304398 T777 oasc.SolrConfig.<init> Using Lucene MatchVersion: LUCENE_41
   [junit4]   2> 304472 T777 oasc.SolrConfig.<init> Loaded SolrConfig: solrconfig-minimal.xml
   [junit4]   2> 304472 T777 oass.IndexSchema.readSchema Reading Solr Schema from schema-tiny.xml
   [junit4]   2> 304484 T777 oass.IndexSchema.readSchema [core2] Schema name=tiny
   [junit4]   2> 304510 T777 oass.IndexSchema.readSchema unique key field: id
   [junit4]   2> 304516 T777 oasc.SolrCore.initDirectoryFactory org.apache.solr.core.MockDirectoryFactory
   [junit4]   2> 304517 T777 oasc.SolrCore.<init> [core2] Opening new SolrCore at C:\Users\JenkinsSlave\workspace\Lucene-Solr-trunk-Windows\solr\build\solr-core\test\J0\.\org.apache.solr.core.TestCoreDiscovery\solrHome\core2\, dataDir=C:\Users\JenkinsSlave\workspace\Lucene-Solr-trunk-Windows\solr\build\solr-core\test\J0\.\org.apache.solr.core.TestCoreDiscovery\solrHome\core2\core2\
   [junit4]   2> 304517 T777 oasc.JmxMonitoredMap.<init> JMX monitoring is enabled. Adding Solr mbeans to JMX Server: com.sun.jmx.mbeanserver.JmxMBeanServer@dc33904
   [junit4]   2> 304518 T777 oasc.CachingDirectoryFactory.get return new directory for C:\Users\JenkinsSlave\workspace\Lucene-Solr-trunk-Windows\solr\build\solr-core\test\J0\.\org.apache.solr.core.TestCoreDiscovery\solrHome\core2\core2\
   [junit4]   2> 304518 T777 oasc.SolrCore.getNewIndexDir New index directory detected: old=null new=C:\Users\JenkinsSlave\workspace\Lucene-Solr-trunk-Windows\solr\build\solr-core\test\J0\.\org.apache.solr.core.TestCoreDiscovery\solrHome\core2\core2\index/
   [junit4]   2> 304518 T777 oasc.SolrCore.initIndex WARN [core2] Solr index directory 'C:\Users\JenkinsSlave\workspace\Lucene-Solr-trunk-Windows\solr\build\solr-core\test\J0\.\org.apache.solr.core.TestCoreDiscovery\solrHome\core2\core2\index' doesn't exist. Creating new index...
   [junit4]   2> 304520 T777 oasc.CachingDirectoryFactory.get return new directory for C:\Users\JenkinsSlave\workspace\Lucene-Solr-trunk-Windows\solr\build\solr-core\test\J0\.\org.apache.solr.core.TestCoreDiscovery\solrHome\core2\core2\index
   [junit4]   2> 304525 T777 oasc.SolrDeletionPolicy.onCommit SolrDeletionPolicy.onCommit: commits: num=1
   [junit4]   2> 		commit{dir=MockDirWrapper(org.apache.lucene.store.RAMDirectory@b92e9ef lockFactory=org.apache.lucene.store.NativeFSLockFactory@674caab5),segFN=segments_1,generation=1}
   [junit4]   2> 304525 T777 oasc.SolrDeletionPolicy.updateCommits newest commit generation = 1
   [junit4]   2> 304527 T777 oasc.SolrCore.initWriters created json: solr.JSONResponseWriter
   [junit4]   2> 304530 T777 oasc.RequestHandlers.initHandlersFromConfig created /admin/: solr.admin.AdminHandlers
   [junit4]   2> 304531 T777 oasc.RequestHandlers.initHandlersFromConfig created /select: solr.SearchHandler
   [junit4]   2> 304531 T777 oasc.RequestHandlers.initHandlersFromConfig created /update: solr.UpdateRequestHandler
   [junit4]   2> 304542 T777 oashl.XMLLoader.init xsltCacheLifetimeSeconds=60
   [junit4]   2> 304547 T777 oass.SolrIndexSearcher.<init> Opening Searcher@6798f9f3 main
   [junit4]   2> 304548 T777 oasc.SolrCore.registerSearcher [core2] Registered new searcher Searcher@6798f9f3 main{StandardDirectoryReader(segments_1:1)}
   [junit4]   2> 304549 T777 oasu.CommitTracker.<init> Hard AutoCommit: disabled
   [junit4]   2> 304549 T777 oasu.CommitTracker.<init> Soft AutoCommit: disabled
   [junit4]   2> 304553 T777 oasc.CoreContainer.registerCore registering core: core2
   [junit4]   2> 304554 T777 oasc.CoreContainer.create Creating SolrCore 'lazy1' using instanceDir: C:\Users\JenkinsSlave\workspace\Lucene-Solr-trunk-Windows\solr\build\solr-core\test\J0\.\org.apache.solr.core.TestCoreDiscovery\solrHome\lazy1
   [junit4]   2> 304554 T777 oasc.SolrResourceLoader.<init> new SolrResourceLoader for directory: 'C:\Users\JenkinsSlave\workspace\Lucene-Solr-trunk-Windows\solr\build\solr-core\test\J0\.\org.apache.solr.core.TestCoreDiscovery\solrHome\lazy1\'
   [junit4]   2> 304648 T777 oasc.SolrConfig.<init> Using Lucene MatchVersion: LUCENE_41
   [junit4]   2> 304726 T777 oasc.SolrConfig.<init> Loaded SolrConfig: solrconfig-minimal.xml
   [junit4]   2> 304726 T777 oass.IndexSchema.readSchema Reading Solr Schema from schema-tiny.xml
   [junit4]   2> 304733 T777 oass.IndexSchema.readSchema [lazy1] Schema name=tiny
   [junit4]   2> 304761 T777 oass.IndexSchema.readSchema unique key field: id
   [junit4]   2> 304762 T777 oasc.SolrCore.initDirectoryFactory org.apache.solr.core.MockDirectoryFactory
   [junit4]   2> 304762 T777 oasc.SolrCore.<init> [lazy1] Opening new SolrCore at C:\Users\JenkinsSlave\workspace\Lucene-Solr-trunk-Windows\solr\build\solr-core\test\J0\.\org.apache.solr.core.TestCoreDiscovery\solrHome\lazy1\, dataDir=C:\Users\JenkinsSlave\workspace\Lucene-Solr-trunk-Windows\solr\build\solr-core\test\J0\.\org.apache.solr.core.TestCoreDiscovery\solrHome\lazy1\lazy1\
   [junit4]   2> 304762 T777 oasc.JmxMonitoredMap.<init> JMX monitoring is enabled. Adding Solr mbeans to JMX Server: com.sun.jmx.mbeanserver.JmxMBeanServer@dc33904
   [junit4]   2> 304763 T777 oasc.CachingDirectoryFactory.get return new directory for C:\Users\JenkinsSlave\workspace\Lucene-Solr-trunk-Windows\solr\build\solr-core\test\J0\.\org.apache.solr.core.TestCoreDiscovery\solrHome\lazy1\lazy1\
   [junit4]   2> 304764 T777 oasc.SolrCore.getNewIndexDir New index directory detected: old=null new=C:\Users\JenkinsSlave\workspace\Lucene-Solr-trunk-Windows\solr\build\solr-core\test\J0\.\org.apache.solr.core.TestCoreDiscovery\solrHome\lazy1\lazy1\index/
   [junit4]   2> 304765 T777 oasc.SolrCore.initIndex WARN [lazy1] Solr index directory 'C:\Users\JenkinsSlave\workspace\Lucene-Solr-trunk-Windows\solr\build\solr-core\test\J0\.\org.apache.solr.core.TestCoreDiscovery\solrHome\lazy1\lazy1\index' doesn't exist. Creating new index...
   [junit4]   2> 304765 T777 oasc.CachingDirectoryFactory.get return new directory for C:\Users\JenkinsSlave\workspace\Lucene-Solr-trunk-Windows\solr\build\solr-core\test\J0\.\org.apache.solr.core.TestCoreDiscovery\solrHome\lazy1\lazy1\index
   [junit4]   2> 304769 T777 oasc.SolrDeletionPolicy.onCommit SolrDeletionPolicy.onCommit: commits: num=1
   [junit4]   2> 		commit{dir=MockDirWrapper(org.apache.lucene.store.RAMDirectory@4a35834f lockFactory=org.apache.lucene.store.NativeFSLockFactory@1121012a),segFN=segments_1,generation=1}
   [junit4]   2> 304769 T777 oasc.SolrDeletionPolicy.updateCommits newest commit generation = 1
   [junit4]   2> 304771 T777 oasc.SolrCore.initWriters created json: solr.JSONResponseWriter
   [junit4]   2> 304774 T777 oasc.RequestHandlers.initHandlersFromConfig created /admin/: solr.admin.AdminHandlers
   [junit4]   2> 304775 T777 oasc.RequestHandlers.initHandlersFromConfig created /select: solr.SearchHandler
   [junit4]   2> 304775 T777 oasc.RequestHandlers.initHandlersFromConfig created /update: solr.UpdateRequestHandler
   [junit4]   2> 304783 T777 oashl.XMLLoader.init xsltCacheLifetimeSeconds=60
   [junit4]   2> 304789 T777 oass.SolrIndexSearcher.<init> Opening Searcher@4d1c1583 main
   [junit4]   2> 304790 T777 oasc.SolrCore.registerSearcher [lazy1] Registered new searcher Searcher@4d1c1583 main{StandardDirectoryReader(segments_1:1)}
   [junit4]   2> 304790 T777 oasu.CommitTracker.<init> Hard AutoCommit: disabled
   [junit4]   2> 304790 T777 oasu.CommitTracker.<init> Soft AutoCommit: disabled
   [junit4]   2> 304794 T777 oasc.SolrCores.putTransientCore Opening transient core lazy1
   [junit4]   2> 304795 T777 oasc.CoreContainer.registerCore registering core: lazy1
   [junit4]   2> 304795 T777 oasc.CoreContainer.shutdown Shutting down CoreContainer instance=1835449644
   [junit4]   2> 304796 T777 oasc.SolrCore.close [core1]  CLOSING SolrCore org.apache.solr.core.SolrCore@3fe03d5d
   [junit4]   2> 304804 T777 oasu.DirectUpdateHandler2.close closing DirectUpdateHandler2{commits=0,autocommits=0,soft autocommits=0,optimizes=0,rollbacks=0,expungeDeletes=0,docsPending=0,adds=0,deletesById=0,deletesByQuery=0,errors=0,cumulative_adds=0,cumulative_deletesById=0,cumulative_deletesByQuery=0,cumulative_errors=0}
   [junit4]   2> 304805 T777 oasu.SolrCoreState.decrefSolrCoreState Closing SolrCoreState
   [junit4]   2> 304805 T777 oasu.DefaultSolrCoreState.closeIndexWriter SolrCoreState ref count has reached 0 - closing IndexWriter
   [junit4]   2> 304805 T777 oasu.DefaultSolrCoreState.closeIndexWriter closing IndexWriter with IndexWriterCloser
   [junit4]   2> 304806 T777 oasc.SolrCore.closeSearcher [core1] Closing main searcher on request.
   [junit4]   2> 304806 T777 oasc.CachingDirectoryFactory.close Closing MockDirectoryFactory - 2 directories currently being tracked
   [junit4]   2> 304806 T777 oasc.CachingDirectoryFactory.closeCacheValue looking to close C:\Users\JenkinsSlave\workspace\Lucene-Solr-trunk-Windows\solr\build\solr-core\test\J0\.\org.apache.solr.core.TestCoreDiscovery\solrHome\core1\core1\ [CachedDir<<refCount=0;path=C:\Users\JenkinsSlave\workspace\Lucene-Solr-trunk-Windows\solr\build\solr-core\test\J0\.\org.apache.solr.core.TestCoreDiscovery\solrHome\core1\core1\;done=false>>]
   [junit4]   2> 304806 T777 oasc.CachingDirectoryFactory.close Closing directory: C:\Users\JenkinsSlave\workspace\Lucene-Solr-trunk-Windows\solr\build\solr-core\test\J0\.\org.apache.solr.core.TestCoreDiscovery\solrHome\core1\core1\
   [junit4]   2> 304806 T777 oasc.CachingDirectoryFactory.closeCacheValue looking to close C:\Users\JenkinsSlave\workspace\Lucene-Solr-trunk-Windows\solr\build\solr-core\test\J0\.\org.apache.solr.core.TestCoreDiscovery\solrHome\core1\core1\index [CachedDir<<refCount=0;path=C:\Users\JenkinsSlave\workspace\Lucene-Solr-trunk-Windows\solr\build\solr-core\test\J0\.\org.apache.solr.core.TestCoreDiscovery\solrHome\core1\core1\index;done=false>>]
   [junit4]   2> 304807 T777 oasc.CachingDirectoryFactory.close Closing directory: C:\Users\JenkinsSlave\workspace\Lucene-Solr-trunk-Windows\solr\build\solr-core\test\J0\.\org.apache.solr.core.TestCoreDiscovery\solrHome\core1\core1\index
   [junit4]   2> 304807 T777 oasc.SolrCore.close [core2]  CLOSING SolrCore org.apache.solr.core.SolrCore@31d2c792
   [junit4]   2> 304813 T777 oasu.DirectUpdateHandler2.close closing DirectUpdateHandler2{commits=0,autocommits=0,soft autocommits=0,optimizes=0,rollbacks=0,expungeDeletes=0,docsPending=0,adds=0,deletesById=0,deletesByQuery=0,errors=0,cumulative_adds=0,cumulative_deletesById=0,cumulative_deletesByQuery=0,cumulative_errors=0}
   [junit4]   2> 304813 T777 oasu.SolrCoreState.decrefSolrCoreState Closing SolrCoreState
   [junit4]   2> 304813 T777 oasu.DefaultSolrCoreState.closeIndexWriter SolrCoreState ref count has reached 0 - closing IndexWriter
   [junit4]   2> 304813 T777 oasu.DefaultSolrCoreState.closeIndexWriter closing IndexWriter with IndexWriterCloser
   [junit4]   2> 304814 T777 oasc.SolrCore.closeSearcher [core2] Closing main searcher on request.
   [junit4]   2> 304815 T777 oasc.CachingDirectoryFactory.close Closing MockDirectoryFactory - 2 directories currently being tracked
   [junit4]   2> 304815 T777 oasc.CachingDirectoryFactory.closeCacheValue looking to close C:\Users\JenkinsSlave\workspace\Lucene-Solr-trunk-Windows\solr\build\solr-core\test\J0\.\org.apache.solr.core.TestCoreDiscovery\solrHome\core2\core2\ [CachedDir<<refCount=0;path=C:\Users\JenkinsSlave\workspace\Lucene-Solr-trunk-Windows\solr\build\solr-core\test\J0\.\org.apache.solr.core.TestCoreDiscovery\solrHome\core2\core2\;done=false>>]
   [junit4]   2> 304815 T777 oasc.CachingDirectoryFactory.close Closing directory: C:\Users\JenkinsSlave\workspace\Lucene-Solr-trunk-Windows\solr\build\solr-core\test\J0\.\org.apache.solr.core.TestCoreDiscovery\solrHome\core2\core2\
   [junit4]   2> 304815 T777 oasc.CachingDirectoryFactory.closeCacheValue looking to close C:\Users\JenkinsSlave\workspace\Lucene-Solr-trunk-Windows\solr\build\solr-core\test\J0\.\org.apache.solr.core.TestCoreDiscovery\solrHome\core2\core2\index [CachedDir<<refCount=0;path=C:\Users\JenkinsSlave\workspace\Lucene-Solr-trunk-Windows\solr\build\solr-core\test\J0\.\org.apache.solr.core.TestCoreDiscovery\solrHome\core2\core2\index;done=false>>]
   [junit4]   2> 304815 T777 oasc.CachingDirectoryFactory.close Closing directory: C:\Users\JenkinsSlave\workspace\Lucene-Solr-trunk-Windows\solr\build\solr-core\test\J0\.\org.apache.solr.core.TestCoreDiscovery\solrHome\core2\core2\index
   [junit4]   2> 304815 T777 oasc.SolrCore.close [lazy1]  CLOSING SolrCore org.apache.solr.core.SolrCore@311cacf6
   [junit4]   2> 304821 T777 oasu.DirectUpdateHandler2.close closing DirectUpdateHandler2{commits=0,autocommits=0,soft autocommits=0,optimizes=0,rollbacks=0,expungeDeletes=0,docsPending=0,adds=0,deletesById=0,deletesByQuery=0,errors=0,cumulative_adds=0,cumulative_deletesById=0,cumulative_deletesByQuery=0,cumulative_errors=0}
   [junit4]   2> 304821 T777 oasu.SolrCoreState.decrefSolrCoreState Closing SolrCoreState
   [junit4]   2> 304821 T777 oasu.DefaultSolrCoreState.closeIndexWriter SolrCoreState ref count has reached 0 - closing IndexWriter
   [junit4]   2> 304822 T777 oasu.DefaultSolrCoreState.closeIndexWriter closing IndexWriter with IndexWriterCloser
   [junit4]   2> 304823 T777 oasc.SolrCore.closeSearcher [lazy1] Closing main searcher on request.
   [junit4]   2> 304823 T777 oasc.CachingDirectoryFactory.close Closing MockDirectoryFactory - 2 directories currently being tracked
   [junit4]   2> 304823 T777 oasc.CachingDirectoryFactory.closeCacheValue looking to close C:\Users\JenkinsSlave\workspace\Lucene-Solr-trunk-Windows\solr\build\solr-core\test\J0\.\org.apache.solr.core.TestCoreDiscovery\solrHome\lazy1\lazy1\index [CachedDir<<refCount=0;path=C:\Users\JenkinsSlave\workspace\Lucene-Solr-trunk-Windows\solr\build\solr-core\test\J0\.\org.apache.solr.core.TestCoreDiscovery\solrHome\lazy1\lazy1\index;done=false>>]
   [junit4]   2> 304823 T777 oasc.CachingDirectoryFactory.close Closing directory: C:\Users\JenkinsSlave\workspace\Lucene-Solr-trunk-Windows\solr\build\solr-core\test\J0\.\org.apache.solr.core.TestCoreDiscovery\solrHome\lazy1\lazy1\index
   [junit4]   2> 304823 T777 oasc.CachingDirectoryFactory.closeCacheValue looking to close C:\Users\JenkinsSlave\workspace\Lucene-Solr-trunk-Windows\solr\build\solr-core\test\J0\.\org.apache.solr.core.TestCoreDiscovery\solrHome\lazy1\lazy1\ [CachedDir<<refCount=0;path=C:\Users\JenkinsSlave\workspace\Lucene-Solr-trunk-Windows\solr\build\solr-core\test\J0\.\org.apache.solr.core.TestCoreDiscovery\solrHome\lazy1\lazy1\;done=false>>]
   [junit4]   2> 304823 T777 oasc.CachingDirectoryFactory.close Closing directory: C:\Users\JenkinsSlave\workspace\Lucene-Solr-trunk-Windows\solr\build\solr-core\test\J0\.\org.apache.solr.core.TestCoreDiscovery\solrHome\lazy1\lazy1\
   [junit4]   2> 304864 T777 oas.SolrTestCaseJ4.tearDown ###Ending testDiscovery
   [junit4]   2> 304868 T777 oas.SolrTestCaseJ4.setUp ###Starting testDuplicateNames
   [junit4]   2> 304890 T777 oasc.SolrResourceLoader.locateSolrHome JNDI not configured for solr (NoInitialContextEx)
   [junit4]   2> 304890 T777 oasc.SolrResourceLoader.locateSolrHome using system property solr.solr.home: C:\Users\JenkinsSlave\workspace\Lucene-Solr-trunk-Windows\solr\build\solr-core\test\J0\.\org.apache.solr.core.TestCoreDiscovery\solrHome
   [junit4]   2> 304890 T777 oasc.SolrResourceLoader.<init> new SolrResourceLoader for directory: 'C:\Users\JenkinsSlave\workspace\Lucene-Solr-trunk-Windows\solr\build\solr-core\test\J0\.\org.apache.solr.core.TestCoreDiscovery\solrHome\'
   [junit4]   2> 304916 T777 oasc.ConfigSolr.fromFile Loading container configuration from C:\Users\JenkinsSlave\workspace\Lucene-Solr-trunk-Windows\solr\build\solr-core\test\J0\.\org.apache.solr.core.TestCoreDiscovery\solrHome\solr.xml
   [junit4]   2> 304994 T777 oasc.ConfigSolrXml.<init> Config-defined core root directory: 
   [junit4]   2> 304995 T777 oasc.CoreContainer.<init> New CoreContainer 678007114
   [junit4]   2> 304995 T777 oasc.CoreContainer.load Loading cores into CoreContainer [instanceDir=C:\Users\JenkinsSlave\workspace\Lucene-Solr-trunk-Windows\solr\build\solr-core\test\J0\.\org.apache.solr.core.TestCoreDiscovery\solrHome\]
   [junit4]   2> 304997 T777 oashc.HttpShardHandlerFactory.getParameter Setting socketTimeout to: 0
   [junit4]   2> 304997 T777 oashc.HttpShardHandlerFactory.getParameter Setting urlScheme to: http://
   [junit4]   2> 304997 T777 oashc.HttpShardHandlerFactory.getParameter Setting connTimeout to: 0
   [junit4]   2> 304997 T777 oashc.HttpShardHandlerFactory.getParameter Setting maxConnectionsPerHost to: 20
   [junit4]   2> 304997 T777 oashc.HttpShardHandlerFactory.getParameter Setting corePoolSize to: 0
   [junit4]   2> 304997 T777 oashc.HttpShardHandlerFactory.getParameter Setting maximumPoolSize to: 2147483647
   [junit4]   2> 304998 T777 oashc.HttpShardHandlerFactory.getParameter Setting maxThreadIdleTime to: 5
   [junit4]   2> 304998 T777 oashc.HttpShardHandlerFactory.getParameter Setting sizeOfQueue to: -1
   [junit4]   2> 304998 T777 oashc.HttpShardHandlerFactory.getParameter Setting fairnessPolicy to: false
   [junit4]   2> 304998 T777 oascsi.HttpClientUtil.createClient Creating new http client, config:maxConnectionsPerHost=20&maxConnections=10000&socketTimeout=0&connTimeout=0&retry=false
   [junit4]   2> 305006 T777 oasc.SolrCores.allocateLazyCores Allocating transient cache for 2 transient cores
   [junit4]   2> 305007 T777 oasl.LogWatcher.newRegisteredLogWatcher Registering Log Listener [Log4j (org.slf4j.impl.Log4jLoggerFactory)]
   [junit4]   2> 305010 T777 oasc.CorePropertiesLocator.discover Looking for core definitions underneath C:\Users\JenkinsSlave\workspace\Lucene-Solr-trunk-Windows\solr\build\solr-core\test\J0\.\org.apache.solr.core.TestCoreDiscovery\solrHome
   [junit4]   2> 305011 T777 oasc.CorePropertiesLocator.discoverUnder Found core core1 in C:\Users\JenkinsSlave\workspace\Lucene-Solr-trunk-Windows\solr\build\solr-core\test\J0\.\org.apache.solr.core.TestCoreDiscovery\solrHome\core1\
   [junit4]   2> 305013 T777 oasc.CorePropertiesLocator.discoverUnder Found core core1 in C:\Users\JenkinsSlave\workspace\Lucene-Solr-trunk-Windows\solr\build\solr-core\test\J0\.\org.apache.solr.core.TestCoreDiscovery\solrHome\core2\
   [junit4]   2> 305014 T777 oasc.CorePropertiesLocator.discover Found 2 core definitions
   [junit4]   2> 305030 T777 oas.SolrTestCaseJ4.tearDown ###Ending testDuplicateNames
   [junit4]   2> NOTE: reproduce with: ant test  -Dtestcase=TestCoreDiscovery -Dtests.method=testDuplicateNames -Dtests.seed=9EAA38C6911D22AA -Dtests.slow=true -Dtests.locale=vi_VN -Dtests.timezone=Mideast/Riyadh88 -Dtests.file.encoding=UTF-8
   [junit4] ERROR   0.17s | TestCoreDiscovery.testDuplicateNames <<<
   [junit4]    > Throwable #1: java.io.IOException: Unable to delete file: .\org.apache.solr.core.TestCoreDiscovery\solrHome\core2\core.properties
   [junit4]    > 	at __randomizedtesting.SeedInfo.seed([9EAA38C6911D22AA:65DA88F2CED1D62F]:0)
   [junit4]    > 	at org.apache.commons.io.FileUtils.forceDelete(FileUtils.java:1919)
   [junit4]    > 	at org.apache.commons.io.FileUtils.cleanDirectory(FileUtils.java:1399)
   [junit4]    > 	at org.apache.commons.io.FileUtils.deleteDirectory(FileUtils.java:1331)
   [junit4]    > 	at org.apache.commons.io.FileUtils.forceDelete(FileUtils.java:1910)
   [junit4]    > 	at org.apache.commons.io.FileUtils.cleanDirectory(FileUtils.java:1399)
   [junit4]    > 	at org.apache.commons.io.FileUtils.deleteDirectory(FileUtils.java:1331)
   [junit4]    > 	at org.apache.solr.core.TestCoreDiscovery.after(TestCoreDiscovery.java:117)
   [junit4]    > 	at java.lang.Thread.run(Thread.java:724)
   [junit4]   2> 305039 T777 oas.SolrTestCaseJ4.setUp ###Starting testNoCoreDir
   [junit4]   2> 305050 T777 oas.SolrTestCaseJ4.tearDown ###Ending testNoCoreDir
   [junit4]   2> NOTE: reproduce with: ant test  -Dtestcase=TestCoreDiscovery -Dtests.method=testNoCoreDir -Dtests.seed=9EAA38C6911D22AA -Dtests.slow=true -Dtests.locale=vi_VN -Dtests.timezone=Mideast/Riyadh88 -Dtests.file.encoding=UTF-8
   [junit4] ERROR   0.02s | TestCoreDiscovery.testNoCoreDir <<<
   [junit4]    > Throwable #1: java.io.IOException: Unable to delete file: .\org.apache.solr.core.TestCoreDiscovery\solrHome\core2\core.properties
   [junit4]    > 	at org.apache.commons.io.FileUtils.forceDelete(FileUtils.java:1919)
   [junit4]    > 	at org.apache.commons.io.FileUtils.cleanDirectory(FileUtils.java:1399)
   [junit4]    > 	at org.apache.commons.io.FileUtils.deleteDirectory(FileUtils.java:1331)
   [junit4]    > 	at org.apache.commons.io.FileUtils.forceDelete(FileUtils.java:1910)
   [junit4]    > 	at org.apache.commons.io.FileUtils.cleanDirectory(FileUtils.java:1399)
   [junit4]    > 	at org.apache.commons.io.FileUtils.deleteDirectory(FileUtils.java:1331)
   [junit4]    > 	at org.apache.solr.core.TestCoreDiscovery.setMeUp(TestCoreDiscovery.java:43)
   [junit4]    > 	at org.apache.solr.core.TestCoreDiscovery.testNoCoreDir(TestCoreDiscovery.java:226)
   [junit4]    > 	at java.lang.Thread.run(Thread.java:724)Throwable #2: java.io.IOException: Unable to delete file: .\org.apache.solr.core.TestCoreDiscovery\solrHome\core2\core.properties
   [junit4]    > 	at org.apache.commons.io.FileUtils.forceDelete(FileUtils.java:1919)
   [junit4]    > 	at org.apache.commons.io.FileUtils.cleanDirectory(FileUtils.java:1399)
   [junit4]    > 	at org.apache.commons.io.FileUtils.deleteDirectory(FileUtils.java:1331)
   [junit4]    > 	at org.apache.commons.io.FileUtils.forceDelete(FileUtils.java:1910)
   [junit4]    > 	at org.apache.commons.io.FileUtils.cleanDirectory(FileUtils.java:1399)
   [junit4]    > 	at org.apache.commons.io.FileUtils.deleteDirectory(FileUtils.java:1331)
   [junit4]    > 	at org.apache.solr.core.TestCoreDiscovery.after(TestCoreDiscovery.java:117)
   [junit4]    > 	at java.lang.Thread.run(Thread.java:724)
   [junit4]   2> 305057 T777 oas.SolrTestCaseJ4.deleteCore ###deleteCore
   [junit4]   2> NOTE: test params are: codec=Lucene40, sim=DefaultSimilarity, locale=vi_VN, timezone=Mideast/Riyadh88
   [junit4]   2> NOTE: Windows 7 6.1 amd64/Oracle Corporation 1.7.0_25 (64-bit)/cpus=2,threads=1,free=21334320,total=119857152
   [junit4]   2> NOTE: All tests run in this JVM: [SolrCoreTest, TestClassNameShortening, UpdateRequestProcessorFactoryTest, FieldAnalysisRequestHandlerTest, TestRangeQuery, SolrInfoMBeanTest, FastVectorHighlighterTest, TestDefaultSimilarityFactory, BadIndexSchemaTest, TestSolrCoreProperties, DistributedSpellCheckComponentTest, TestBinaryResponseWriter, RequiredFieldsTest, ShowFileRequestHandlerTest, SpellingQueryConverterTest, TestRandomDVFaceting, TestMultiCoreConfBootstrap, HdfsCollectionsAPIDistributedZkTest, PluginInfoTest, AlternateDirectoryTest, TestStressLucene, TestFieldTypeResource, TestStressVersions, StandardRequestHandlerTest, TestRealTimeGet, TermVectorComponentTest, ReturnFieldsTest, TestFastWriter, TestShardHandlerFactory, HdfsSyncSliceTest, TermsComponentTest, TestSearchPerf, UpdateParamsTest, TestFuzzyAnalyzedSuggestions, TestDistributedSearch, TestValueSourceCache, SolrRequestParserTest, TestConfig, FileUtilsTest, MBeansHandlerTest, CopyFieldTest, TestWordDelimiterFilterFactory, ConvertedLegacyTest, TestCoreContainer, TestSchemaSimilarityResource, ResponseLogComponentTest, TestCSVLoader, TestArbitraryIndexDir, NotRequiredUniqueKeyTest, TestCoreDiscovery]
   [junit4] Completed in 1.92s, 4 tests, 2 errors <<< FAILURES!

[...truncated 842 lines...]
BUILD FAILED
C:\Users\JenkinsSlave\workspace\Lucene-Solr-trunk-Windows\build.xml:389: The following error occurred while executing this line:
C:\Users\JenkinsSlave\workspace\Lucene-Solr-trunk-Windows\build.xml:369: The following error occurred while executing this line:
C:\Users\JenkinsSlave\workspace\Lucene-Solr-trunk-Windows\build.xml:39: The following error occurred while executing this line:
C:\Users\JenkinsSlave\workspace\Lucene-Solr-trunk-Windows\solr\build.xml:181: The following error occurred while executing this line:
C:\Users\JenkinsSlave\workspace\Lucene-Solr-trunk-Windows\solr\common-build.xml:449: The following error occurred while executing this line:
C:\Users\JenkinsSlave\workspace\Lucene-Solr-trunk-Windows\lucene\common-build.xml:1247: The following error occurred while executing this line:
C:\Users\JenkinsSlave\workspace\Lucene-Solr-trunk-Windows\lucene\common-build.xml:890: There were test failures: 318 suites, 1342 tests, 2 errors, 39 ignored (11 assumptions)

Total time: 97 minutes 5 seconds
Build step 'Invoke Ant' marked build as failure
Description set: Java: 64bit/jdk1.7.0_25 -XX:-UseCompressedOops -XX:+UseConcMarkSweepGC
Archiving artifacts
Recording test results
Email was triggered for: Failure
Sending email for trigger: Failure



Mime
View raw message