lucene-dev mailing list archives

Site index · List index
Message view « Date » · « Thread »
Top « Date » · « Thread »
From Apache Jenkins Server <jenk...@builds.apache.org>
Subject [JENKINS] Lucene-Solr-NightlyTests-trunk - Build # 325 - Still Failing
Date Fri, 19 Jul 2013 09:39:58 GMT
Build: https://builds.apache.org/job/Lucene-Solr-NightlyTests-trunk/325/

1 tests failed.
REGRESSION:  org.apache.lucene.search.TestFieldCache.testIntFieldCache

Error Message:
expected:<0> but was:<-7>

Stack Trace:
java.lang.AssertionError: expected:<0> but was:<-7>
	at __randomizedtesting.SeedInfo.seed([2172D358836432C1:1D23D5247DB7E1DE]:0)
	at org.junit.Assert.fail(Assert.java:93)
	at org.junit.Assert.failNotEquals(Assert.java:647)
	at org.junit.Assert.assertEquals(Assert.java:128)
	at org.junit.Assert.assertEquals(Assert.java:472)
	at org.junit.Assert.assertEquals(Assert.java:456)
	at org.apache.lucene.search.TestFieldCache.testIntFieldCache(TestFieldCache.java:772)
	at sun.reflect.NativeMethodAccessorImpl.invoke0(Native Method)
	at sun.reflect.NativeMethodAccessorImpl.invoke(NativeMethodAccessorImpl.java:57)
	at sun.reflect.DelegatingMethodAccessorImpl.invoke(DelegatingMethodAccessorImpl.java:43)
	at java.lang.reflect.Method.invoke(Method.java:601)
	at com.carrotsearch.randomizedtesting.RandomizedRunner.invoke(RandomizedRunner.java:1559)
	at com.carrotsearch.randomizedtesting.RandomizedRunner.access$600(RandomizedRunner.java:79)
	at com.carrotsearch.randomizedtesting.RandomizedRunner$6.evaluate(RandomizedRunner.java:737)
	at com.carrotsearch.randomizedtesting.RandomizedRunner$7.evaluate(RandomizedRunner.java:773)
	at com.carrotsearch.randomizedtesting.RandomizedRunner$8.evaluate(RandomizedRunner.java:787)
	at org.apache.lucene.util.TestRuleSetupTeardownChained$1.evaluate(TestRuleSetupTeardownChained.java:50)
	at org.apache.lucene.util.TestRuleFieldCacheSanity$1.evaluate(TestRuleFieldCacheSanity.java:51)
	at org.apache.lucene.util.AbstractBeforeAfterRule$1.evaluate(AbstractBeforeAfterRule.java:46)
	at com.carrotsearch.randomizedtesting.rules.SystemPropertiesInvariantRule$1.evaluate(SystemPropertiesInvariantRule.java:55)
	at org.apache.lucene.util.TestRuleThreadAndTestName$1.evaluate(TestRuleThreadAndTestName.java:49)
	at org.apache.lucene.util.TestRuleIgnoreAfterMaxFailures$1.evaluate(TestRuleIgnoreAfterMaxFailures.java:70)
	at org.apache.lucene.util.TestRuleMarkFailure$1.evaluate(TestRuleMarkFailure.java:48)
	at com.carrotsearch.randomizedtesting.rules.StatementAdapter.evaluate(StatementAdapter.java:36)
	at com.carrotsearch.randomizedtesting.ThreadLeakControl$StatementRunner.run(ThreadLeakControl.java:358)
	at com.carrotsearch.randomizedtesting.ThreadLeakControl.forkTimeoutingTask(ThreadLeakControl.java:782)
	at com.carrotsearch.randomizedtesting.ThreadLeakControl$3.evaluate(ThreadLeakControl.java:442)
	at com.carrotsearch.randomizedtesting.RandomizedRunner.runSingleTest(RandomizedRunner.java:746)
	at com.carrotsearch.randomizedtesting.RandomizedRunner$3.evaluate(RandomizedRunner.java:648)
	at com.carrotsearch.randomizedtesting.RandomizedRunner$4.evaluate(RandomizedRunner.java:682)
	at com.carrotsearch.randomizedtesting.RandomizedRunner$5.evaluate(RandomizedRunner.java:693)
	at org.apache.lucene.util.AbstractBeforeAfterRule$1.evaluate(AbstractBeforeAfterRule.java:46)
	at org.apache.lucene.util.TestRuleStoreClassName$1.evaluate(TestRuleStoreClassName.java:42)
	at com.carrotsearch.randomizedtesting.rules.SystemPropertiesInvariantRule$1.evaluate(SystemPropertiesInvariantRule.java:55)
	at com.carrotsearch.randomizedtesting.rules.NoShadowingOrOverridesOnMethodsRule$1.evaluate(NoShadowingOrOverridesOnMethodsRule.java:39)
	at com.carrotsearch.randomizedtesting.rules.NoShadowingOrOverridesOnMethodsRule$1.evaluate(NoShadowingOrOverridesOnMethodsRule.java:39)
	at com.carrotsearch.randomizedtesting.rules.StatementAdapter.evaluate(StatementAdapter.java:36)
	at org.apache.lucene.util.TestRuleAssertionsRequired$1.evaluate(TestRuleAssertionsRequired.java:43)
	at org.apache.lucene.util.TestRuleMarkFailure$1.evaluate(TestRuleMarkFailure.java:48)
	at org.apache.lucene.util.TestRuleIgnoreAfterMaxFailures$1.evaluate(TestRuleIgnoreAfterMaxFailures.java:70)
	at org.apache.lucene.util.TestRuleIgnoreTestSuites$1.evaluate(TestRuleIgnoreTestSuites.java:55)
	at com.carrotsearch.randomizedtesting.rules.StatementAdapter.evaluate(StatementAdapter.java:36)
	at com.carrotsearch.randomizedtesting.ThreadLeakControl$StatementRunner.run(ThreadLeakControl.java:358)
	at java.lang.Thread.run(Thread.java:722)




Build Log:
[...truncated 938 lines...]
   [junit4] Suite: org.apache.lucene.search.TestFieldCache
   [junit4]   2> NOTE: download the large Jenkins line-docs file by running 'ant get-jenkins-line-docs'
in the lucene directory.
   [junit4]   2> NOTE: reproduce with: ant test  -Dtestcase=TestFieldCache -Dtests.method=testIntFieldCache
-Dtests.seed=2172D358836432C1 -Dtests.multiplier=2 -Dtests.nightly=true -Dtests.slow=true
-Dtests.linedocsfile=/home/hudson/lucene-data/enwiki.random.lines.txt -Dtests.locale=da -Dtests.timezone=Asia/Dili
-Dtests.file.encoding=ISO-8859-1
   [junit4] FAILURE 0.03s J1 | TestFieldCache.testIntFieldCache <<<
   [junit4]    > Throwable #1: java.lang.AssertionError: expected:<0> but was:<-7>
   [junit4]    > 	at __randomizedtesting.SeedInfo.seed([2172D358836432C1:1D23D5247DB7E1DE]:0)
   [junit4]    > 	at org.apache.lucene.search.TestFieldCache.testIntFieldCache(TestFieldCache.java:772)
   [junit4]    > 	at java.lang.Thread.run(Thread.java:722)
   [junit4]   2> NOTE: test params are: codec=Lucene41, sim=RandomSimilarityProvider(queryNorm=false,coord=crazy):
{}, locale=da, timezone=Asia/Dili
   [junit4]   2> NOTE: FreeBSD 9.1-RELEASE-p3 amd64/Oracle Corporation 1.7.0_21 (64-bit)/cpus=16,threads=1,free=173617920,total=450428928
   [junit4]   2> NOTE: All tests run in this JVM: [TestDocument, TestCollectionUtil, TestAtomicUpdate,
TestMinimize, TestOmitPositions, TestAttributeSource, TestSpansAdvanced, TestNamedSPILoader,
TestPayloadNearQuery, TestTermRangeFilter, TestCharFilter, Nested1, TestPerFieldDocValuesFormat,
TestHighCompressionMode, TestSearchWithThreads, TestSpans, TestIndexWriterUnicode, TestDocumentWriter,
TestIndexWriterDelete, TestTransactions, TestAssertions, TestDocValuesIndexing, TestNorms,
TestMockDirectoryWrapper, TestMixedCodecs, TestMultiTermConstantScore, TestBoolean2, TestSnapshotDeletionPolicy,
TestReusableStringReader, TestVersion, TestTermVectorsFormat, TestCodecHoldsOpenFiles, TestIndexFileDeleter,
TestSortDocValues, TestDocValuesScoring, TestFieldValueFilter, TestField, TestGraphTokenizers,
TestNumericUtils, TestLongPostings, TestSpanExplanations, TestPerSegmentDeletes, TestFileSwitchDirectory,
TestCachingTokenFilter, TestIndexWriterMergePolicy, TestPositiveScoresOnlyCollector, TestPayloadExplanations,
NestedSetupChain, NestedTeardownChain, TestSimpleSearchEquivalence, TestFlex, TestBinaryDocument,
TestRegexpRandom2, TestRamUsageEstimatorOnWildAnimals, TestIdentityHashSet, TestCopyBytes,
TestBasics, TestCharsRef, TestRecyclingIntBlockAllocator, TestUnicodeUtil, TestMathUtil, TestIndexWriterOnJRECrash,
TestCheckIndex, TestDuelingCodecs, TestDoc, TestPerFieldPostingsFormat, TestByteArrayDataInput,
TestNRTCachingDirectory, TestLiveFieldValues, TestIndexWriterWithThreads, TestTermdocPerf,
TestRollingBuffer, TestCachingWrapperFilter, TestFieldMaskingSpanQuery, TestNewestSegment,
TestBooleanScorer, TestSpanSearchEquivalence, TestInPlaceMergeSorter, TestForceMergeForever,
TestVersionComparator, TestMultiThreadTermVectors, TestCompressingStoredFieldsFormat, TestSmallFloat,
TestCodecs, TestBlockPostingsFormat2, TestPrefixQuery, TestTopDocsCollector, TestDateSort,
TestWeakIdentityMap, Nested1, TestNumericTokenStream, TestDocValuesFormat, TestLucene40TermVectorsFormat,
TestIndexWriterMerging, TestFSTs, TestNumericRangeQuery64, TestPackedInts, TestLucene42DocValuesFormat,
TestBackwardsCompatibility, TestAddIndexes, TestIndexWriterExceptions, TestMultiMMap, TestDeletionPolicy,
TestBooleanOr, TestFlushByRamOrCountsPolicy, TestDirectoryReaderReopen, TestTimeLimitingCollector,
TestSearchAfter, TestConcurrentMergeScheduler, TestOpenBitSet, TestNeverDelete, TestStressIndexing,
TestDocTermOrdsRewriteMethod, TestLucene40PostingsReader, TestNRTReaderWithThreads, TestTieredMergePolicy,
TestIndexWriterForceMerge, TestArrayUtil, TestLevenshteinAutomata, TestBufferedIndexInput,
TestTermsEnum, TestConsistentFieldNumbers, TestDocTermOrdsRangeFilter, TestSegmentMerger,
TestOmitNorms, TestFixedBitSet, TestDoubleBarrelLRUCache, TestComplexExplanations, TestSegmentReader,
TestFastDecompressionMode, TestParallelCompositeReader, TestIndexWriterNRTIsCurrent, TestFieldCacheRewriteMethod,
TestPagedBytes, TestSegmentTermDocs, TestPerFieldPostingsFormat2, TestBlockPostingsFormat,
TestBitVector, TestMultiDocValues, TestFieldCacheSanityChecker, TestToken, TestSimilarityBase,
TestHugeRamFile, TestDeterminizeLexicon, Test2BDocs, TestIndexWriterOnDiskFull, TestFieldCache]
   [junit4] Completed on J1 in 3.43s, 10 tests, 1 failure <<< FAILURES!

[...truncated 449 lines...]
BUILD FAILED
/usr/home/hudson/hudson-slave/workspace/Lucene-Solr-NightlyTests-trunk/build.xml:396: The
following error occurred while executing this line:
/usr/home/hudson/hudson-slave/workspace/Lucene-Solr-NightlyTests-trunk/build.xml:369: The
following error occurred while executing this line:
/usr/home/hudson/hudson-slave/workspace/Lucene-Solr-NightlyTests-trunk/build.xml:39: The following
error occurred while executing this line:
/usr/home/hudson/hudson-slave/workspace/Lucene-Solr-NightlyTests-trunk/lucene/build.xml:49:
The following error occurred while executing this line:
/usr/home/hudson/hudson-slave/workspace/Lucene-Solr-NightlyTests-trunk/lucene/common-build.xml:1247:
The following error occurred while executing this line:
/usr/home/hudson/hudson-slave/workspace/Lucene-Solr-NightlyTests-trunk/lucene/common-build.xml:890:
There were test failures: 363 suites, 2297 tests, 1 failure, 30 ignored (17 assumptions)

Total time: 33 minutes 46 seconds
Build step 'Invoke Ant' marked build as failure
Archiving artifacts
Recording test results
Email was triggered for: Failure
Sending email for trigger: Failure



Mime
View raw message