lucene-dev mailing list archives

Site index · List index
Message view « Date » · « Thread »
Top « Date » · « Thread »
From Michael McCandless <luc...@mikemccandless.com>
Subject Re: [JENKINS] Lucene-Solr-trunk-Windows (32bit/jdk1.7.0_25) - Build # 3037 - Failure!
Date Mon, 15 Jul 2013 19:49:47 GMT
I'll fix.


Mike McCandless

http://blog.mikemccandless.com


On Mon, Jul 15, 2013 at 3:39 PM, Policeman Jenkins Server
<jenkins@thetaphi.de> wrote:
> Build: http://jenkins.thetaphi.de/job/Lucene-Solr-trunk-Windows/3037/
> Java: 32bit/jdk1.7.0_25 -client -XX:+UseSerialGC
>
> 2 tests failed.
> FAILED:  junit.framework.TestSuite.org.apache.lucene.search.suggest.analyzing.AnalyzingInfixSuggesterTest
>
> Error Message:
> Resource in scope SUITE failed to close. Resource was registered from thread Thread[id=16,
name=TEST-AnalyzingInfixSuggesterTest.testRandomMinPrefixLength-seed#[ECF9CF89952D6F7F], state=RUNNABLE,
group=TGRP-AnalyzingInfixSuggesterTest], registration stack trace below.
>
> Stack Trace:
> com.carrotsearch.randomizedtesting.ResourceDisposalError: Resource in scope SUITE failed
to close. Resource was registered from thread Thread[id=16, name=TEST-AnalyzingInfixSuggesterTest.testRandomMinPrefixLength-seed#[ECF9CF89952D6F7F],
state=RUNNABLE, group=TGRP-AnalyzingInfixSuggesterTest], registration stack trace below.
>         at java.lang.Thread.getStackTrace(Thread.java:1568)
>         at com.carrotsearch.randomizedtesting.RandomizedContext.closeAtEnd(RandomizedContext.java:150)
>         at org.apache.lucene.util.LuceneTestCase.closeAfterSuite(LuceneTestCase.java:545)
>         at org.apache.lucene.util._TestUtil.getTempDir(_TestUtil.java:131)
>         at org.apache.lucene.search.suggest.analyzing.AnalyzingInfixSuggesterTest.testRandomMinPrefixLength(AnalyzingInfixSuggesterTest.java:116)
>         at sun.reflect.NativeMethodAccessorImpl.invoke0(Native Method)
>         at sun.reflect.NativeMethodAccessorImpl.invoke(NativeMethodAccessorImpl.java:57)
>         at sun.reflect.DelegatingMethodAccessorImpl.invoke(DelegatingMethodAccessorImpl.java:43)
>         at java.lang.reflect.Method.invoke(Method.java:606)
>         at com.carrotsearch.randomizedtesting.RandomizedRunner.invoke(RandomizedRunner.java:1559)
>         at com.carrotsearch.randomizedtesting.RandomizedRunner.access$600(RandomizedRunner.java:79)
>         at com.carrotsearch.randomizedtesting.RandomizedRunner$6.evaluate(RandomizedRunner.java:737)
>         at com.carrotsearch.randomizedtesting.RandomizedRunner$7.evaluate(RandomizedRunner.java:773)
>         at com.carrotsearch.randomizedtesting.RandomizedRunner$8.evaluate(RandomizedRunner.java:787)
>         at org.apache.lucene.util.TestRuleSetupTeardownChained$1.evaluate(TestRuleSetupTeardownChained.java:50)
>         at org.apache.lucene.util.TestRuleFieldCacheSanity$1.evaluate(TestRuleFieldCacheSanity.java:51)
>         at org.apache.lucene.util.AbstractBeforeAfterRule$1.evaluate(AbstractBeforeAfterRule.java:46)
>         at com.carrotsearch.randomizedtesting.rules.SystemPropertiesInvariantRule$1.evaluate(SystemPropertiesInvariantRule.java:55)
>         at org.apache.lucene.util.TestRuleThreadAndTestName$1.evaluate(TestRuleThreadAndTestName.java:49)
>         at org.apache.lucene.util.TestRuleIgnoreAfterMaxFailures$1.evaluate(TestRuleIgnoreAfterMaxFailures.java:70)
>         at org.apache.lucene.util.TestRuleMarkFailure$1.evaluate(TestRuleMarkFailure.java:48)
>         at com.carrotsearch.randomizedtesting.rules.StatementAdapter.evaluate(StatementAdapter.java:36)
>         at com.carrotsearch.randomizedtesting.ThreadLeakControl$StatementRunner.run(ThreadLeakControl.java:358)
>         at com.carrotsearch.randomizedtesting.ThreadLeakControl.forkTimeoutingTask(ThreadLeakControl.java:782)
>         at com.carrotsearch.randomizedtesting.ThreadLeakControl$3.evaluate(ThreadLeakControl.java:442)
>         at com.carrotsearch.randomizedtesting.RandomizedRunner.runSingleTest(RandomizedRunner.java:746)
>         at com.carrotsearch.randomizedtesting.RandomizedRunner$3.evaluate(RandomizedRunner.java:648)
>         at com.carrotsearch.randomizedtesting.RandomizedRunner$4.evaluate(RandomizedRunner.java:682)
>         at com.carrotsearch.randomizedtesting.RandomizedRunner$5.evaluate(RandomizedRunner.java:693)
>         at org.apache.lucene.util.AbstractBeforeAfterRule$1.evaluate(AbstractBeforeAfterRule.java:46)
>         at org.apache.lucene.util.TestRuleStoreClassName$1.evaluate(TestRuleStoreClassName.java:42)
>         at com.carrotsearch.randomizedtesting.rules.SystemPropertiesInvariantRule$1.evaluate(SystemPropertiesInvariantRule.java:55)
>         at com.carrotsearch.randomizedtesting.rules.NoShadowingOrOverridesOnMethodsRule$1.evaluate(NoShadowingOrOverridesOnMethodsRule.java:39)
>         at com.carrotsearch.randomizedtesting.rules.NoShadowingOrOverridesOnMethodsRule$1.evaluate(NoShadowingOrOverridesOnMethodsRule.java:39)
>         at com.carrotsearch.randomizedtesting.rules.StatementAdapter.evaluate(StatementAdapter.java:36)
>         at org.apache.lucene.util.TestRuleAssertionsRequired$1.evaluate(TestRuleAssertionsRequired.java:43)
>         at org.apache.lucene.util.TestRuleMarkFailure$1.evaluate(TestRuleMarkFailure.java:48)
>         at org.apache.lucene.util.TestRuleIgnoreAfterMaxFailures$1.evaluate(TestRuleIgnoreAfterMaxFailures.java:70)
>         at org.apache.lucene.util.TestRuleIgnoreTestSuites$1.evaluate(TestRuleIgnoreTestSuites.java:55)
>         at com.carrotsearch.randomizedtesting.rules.StatementAdapter.evaluate(StatementAdapter.java:36)
>         at com.carrotsearch.randomizedtesting.ThreadLeakControl$StatementRunner.run(ThreadLeakControl.java:358)
>         at java.lang.Thread.run(Thread.java:724)
> Caused by: java.io.IOException: Could not remove: C:\Users\JenkinsSlave\workspace\Lucene-Solr-trunk-Windows\lucene\build\suggest\test\J0\.\AnalyzingInfixSuggesterTest98689869tmp
>         at org.apache.lucene.util.CloseableFile.close(CloseableFile.java:47)
>         at com.carrotsearch.randomizedtesting.RandomizedRunner$2$1.apply(RandomizedRunner.java:602)
>         at com.carrotsearch.randomizedtesting.RandomizedRunner$2$1.apply(RandomizedRunner.java:599)
>         at com.carrotsearch.randomizedtesting.RandomizedContext.closeResources(RandomizedContext.java:167)
>         at com.carrotsearch.randomizedtesting.RandomizedRunner$2.afterAlways(RandomizedRunner.java:615)
>         at com.carrotsearch.randomizedtesting.rules.StatementAdapter.evaluate(StatementAdapter.java:43)
>         ... 2 more
>
>
> FAILED:  junit.framework.TestSuite.org.apache.lucene.search.suggest.analyzing.AnalyzingInfixSuggesterTest
>
> Error Message:
> Resource in scope SUITE failed to close. Resource was registered from thread Thread[id=16,
name=TEST-AnalyzingInfixSuggesterTest.testHighlightCaseChange-seed#[ECF9CF89952D6F7F], state=RUNNABLE,
group=TGRP-AnalyzingInfixSuggesterTest], registration stack trace below.
>
> Stack Trace:
> com.carrotsearch.randomizedtesting.ResourceDisposalError: Resource in scope SUITE failed
to close. Resource was registered from thread Thread[id=16, name=TEST-AnalyzingInfixSuggesterTest.testHighlightCaseChange-seed#[ECF9CF89952D6F7F],
state=RUNNABLE, group=TGRP-AnalyzingInfixSuggesterTest], registration stack trace below.
>         at java.lang.Thread.getStackTrace(Thread.java:1568)
>         at com.carrotsearch.randomizedtesting.RandomizedContext.closeAtEnd(RandomizedContext.java:150)
>         at org.apache.lucene.util.LuceneTestCase.closeAfterSuite(LuceneTestCase.java:545)
>         at org.apache.lucene.util._TestUtil.getTempDir(_TestUtil.java:131)
>         at org.apache.lucene.search.suggest.analyzing.AnalyzingInfixSuggesterTest.testHighlightCaseChange(AnalyzingInfixSuggesterTest.java:202)
>         at sun.reflect.NativeMethodAccessorImpl.invoke0(Native Method)
>         at sun.reflect.NativeMethodAccessorImpl.invoke(NativeMethodAccessorImpl.java:57)
>         at sun.reflect.DelegatingMethodAccessorImpl.invoke(DelegatingMethodAccessorImpl.java:43)
>         at java.lang.reflect.Method.invoke(Method.java:606)
>         at com.carrotsearch.randomizedtesting.RandomizedRunner.invoke(RandomizedRunner.java:1559)
>         at com.carrotsearch.randomizedtesting.RandomizedRunner.access$600(RandomizedRunner.java:79)
>         at com.carrotsearch.randomizedtesting.RandomizedRunner$6.evaluate(RandomizedRunner.java:737)
>         at com.carrotsearch.randomizedtesting.RandomizedRunner$7.evaluate(RandomizedRunner.java:773)
>         at com.carrotsearch.randomizedtesting.RandomizedRunner$8.evaluate(RandomizedRunner.java:787)
>         at org.apache.lucene.util.TestRuleSetupTeardownChained$1.evaluate(TestRuleSetupTeardownChained.java:50)
>         at org.apache.lucene.util.TestRuleFieldCacheSanity$1.evaluate(TestRuleFieldCacheSanity.java:51)
>         at org.apache.lucene.util.AbstractBeforeAfterRule$1.evaluate(AbstractBeforeAfterRule.java:46)
>         at com.carrotsearch.randomizedtesting.rules.SystemPropertiesInvariantRule$1.evaluate(SystemPropertiesInvariantRule.java:55)
>         at org.apache.lucene.util.TestRuleThreadAndTestName$1.evaluate(TestRuleThreadAndTestName.java:49)
>         at org.apache.lucene.util.TestRuleIgnoreAfterMaxFailures$1.evaluate(TestRuleIgnoreAfterMaxFailures.java:70)
>         at org.apache.lucene.util.TestRuleMarkFailure$1.evaluate(TestRuleMarkFailure.java:48)
>         at com.carrotsearch.randomizedtesting.rules.StatementAdapter.evaluate(StatementAdapter.java:36)
>         at com.carrotsearch.randomizedtesting.ThreadLeakControl$StatementRunner.run(ThreadLeakControl.java:358)
>         at com.carrotsearch.randomizedtesting.ThreadLeakControl.forkTimeoutingTask(ThreadLeakControl.java:782)
>         at com.carrotsearch.randomizedtesting.ThreadLeakControl$3.evaluate(ThreadLeakControl.java:442)
>         at com.carrotsearch.randomizedtesting.RandomizedRunner.runSingleTest(RandomizedRunner.java:746)
>         at com.carrotsearch.randomizedtesting.RandomizedRunner$3.evaluate(RandomizedRunner.java:648)
>         at com.carrotsearch.randomizedtesting.RandomizedRunner$4.evaluate(RandomizedRunner.java:682)
>         at com.carrotsearch.randomizedtesting.RandomizedRunner$5.evaluate(RandomizedRunner.java:693)
>         at org.apache.lucene.util.AbstractBeforeAfterRule$1.evaluate(AbstractBeforeAfterRule.java:46)
>         at org.apache.lucene.util.TestRuleStoreClassName$1.evaluate(TestRuleStoreClassName.java:42)
>         at com.carrotsearch.randomizedtesting.rules.SystemPropertiesInvariantRule$1.evaluate(SystemPropertiesInvariantRule.java:55)
>         at com.carrotsearch.randomizedtesting.rules.NoShadowingOrOverridesOnMethodsRule$1.evaluate(NoShadowingOrOverridesOnMethodsRule.java:39)
>         at com.carrotsearch.randomizedtesting.rules.NoShadowingOrOverridesOnMethodsRule$1.evaluate(NoShadowingOrOverridesOnMethodsRule.java:39)
>         at com.carrotsearch.randomizedtesting.rules.StatementAdapter.evaluate(StatementAdapter.java:36)
>         at org.apache.lucene.util.TestRuleAssertionsRequired$1.evaluate(TestRuleAssertionsRequired.java:43)
>         at org.apache.lucene.util.TestRuleMarkFailure$1.evaluate(TestRuleMarkFailure.java:48)
>         at org.apache.lucene.util.TestRuleIgnoreAfterMaxFailures$1.evaluate(TestRuleIgnoreAfterMaxFailures.java:70)
>         at org.apache.lucene.util.TestRuleIgnoreTestSuites$1.evaluate(TestRuleIgnoreTestSuites.java:55)
>         at com.carrotsearch.randomizedtesting.rules.StatementAdapter.evaluate(StatementAdapter.java:36)
>         at com.carrotsearch.randomizedtesting.ThreadLeakControl$StatementRunner.run(ThreadLeakControl.java:358)
>         at java.lang.Thread.run(Thread.java:724)
> Caused by: java.io.IOException: Could not remove: C:\Users\JenkinsSlave\workspace\Lucene-Solr-trunk-Windows\lucene\build\suggest\test\J0\.\AnalyzingInfixSuggesterTest98689870tmp
>         at org.apache.lucene.util.CloseableFile.close(CloseableFile.java:47)
>         at com.carrotsearch.randomizedtesting.RandomizedRunner$2$1.apply(RandomizedRunner.java:602)
>         at com.carrotsearch.randomizedtesting.RandomizedRunner$2$1.apply(RandomizedRunner.java:599)
>         at com.carrotsearch.randomizedtesting.RandomizedContext.closeResources(RandomizedContext.java:167)
>         at com.carrotsearch.randomizedtesting.RandomizedRunner$2.afterAlways(RandomizedRunner.java:615)
>         at com.carrotsearch.randomizedtesting.rules.StatementAdapter.evaluate(StatementAdapter.java:43)
>         ... 2 more
>
>
>
>
> Build Log:
> [...truncated 8524 lines...]
>    [junit4] Suite: org.apache.lucene.search.suggest.analyzing.AnalyzingInfixSuggesterTest
>    [junit4]   2> NOTE: test params are: codec=Lucene40, sim=RandomSimilarityProvider(queryNorm=true,coord=no):
{}, locale=de_AT, timezone=America/Mexico_City
>    [junit4]   2> NOTE: Windows 7 6.1 x86/Oracle Corporation 1.7.0_25 (32-bit)/cpus=2,threads=1,free=7577752,total=25821184
>    [junit4]   2> NOTE: All tests run in this JVM: [TestBytesRefArray, FSTCompletionTest,
TestPlainTextDictionary, AnalyzingInfixSuggesterTest]
>    [junit4]   2> NOTE: reproduce with: ant test  -Dtestcase=AnalyzingInfixSuggesterTest
-Dtests.seed=ECF9CF89952D6F7F -Dtests.slow=true -Dtests.locale=de_AT -Dtests.timezone=America/Mexico_City
-Dtests.file.encoding=ISO-8859-1
>    [junit4] ERROR   0.00s | AnalyzingInfixSuggesterTest (suite) <<<
>    [junit4]    > Throwable #1: com.carrotsearch.randomizedtesting.ResourceDisposalError:
Resource in scope SUITE failed to close. Resource was registered from thread Thread[id=16,
name=TEST-AnalyzingInfixSuggesterTest.testRandomMinPrefixLength-seed#[ECF9CF89952D6F7F], state=RUNNABLE,
group=TGRP-AnalyzingInfixSuggesterTest], registration stack trace below.
>    [junit4]    >        at java.lang.Thread.getStackTrace(Thread.java:1568)
>    [junit4]    >        at com.carrotsearch.randomizedtesting.RandomizedContext.closeAtEnd(RandomizedContext.java:150)
>    [junit4]    >        at org.apache.lucene.util.LuceneTestCase.closeAfterSuite(LuceneTestCase.java:545)
>    [junit4]    >        at org.apache.lucene.util._TestUtil.getTempDir(_TestUtil.java:131)
>    [junit4]    >        at org.apache.lucene.search.suggest.analyzing.AnalyzingInfixSuggesterTest.testRandomMinPrefixLength(AnalyzingInfixSuggesterTest.java:116)
>    [junit4]    >        at java.lang.Thread.run(Thread.java:724)
>    [junit4]    > Caused by: java.io.IOException: Could not remove: C:\Users\JenkinsSlave\workspace\Lucene-Solr-trunk-Windows\lucene\build\suggest\test\J0\.\AnalyzingInfixSuggesterTest98689869tmp
>    [junit4]    >        at org.apache.lucene.util.CloseableFile.close(CloseableFile.java:47)
>    [junit4]    >        at com.carrotsearch.randomizedtesting.RandomizedContext.closeResources(RandomizedContext.java:167)
>    [junit4]    >        ... 2 moreThrowable #2: com.carrotsearch.randomizedtesting.ResourceDisposalError:
Resource in scope SUITE failed to close. Resource was registered from thread Thread[id=16,
name=TEST-AnalyzingInfixSuggesterTest.testHighlightCaseChange-seed#[ECF9CF89952D6F7F], state=RUNNABLE,
group=TGRP-AnalyzingInfixSuggesterTest], registration stack trace below.
>    [junit4]    >        at java.lang.Thread.getStackTrace(Thread.java:1568)
>    [junit4]    >        at com.carrotsearch.randomizedtesting.RandomizedContext.closeAtEnd(RandomizedContext.java:150)
>    [junit4]    >        at org.apache.lucene.util.LuceneTestCase.closeAfterSuite(LuceneTestCase.java:545)
>    [junit4]    >        at org.apache.lucene.util._TestUtil.getTempDir(_TestUtil.java:131)
>    [junit4]    >        at org.apache.lucene.search.suggest.analyzing.AnalyzingInfixSuggesterTest.testHighlightCaseChange(AnalyzingInfixSuggesterTest.java:202)
>    [junit4]    >        at java.lang.Thread.run(Thread.java:724)
>    [junit4]    > Caused by: java.io.IOException: Could not remove: C:\Users\JenkinsSlave\workspace\Lucene-Solr-trunk-Windows\lucene\build\suggest\test\J0\.\AnalyzingInfixSuggesterTest98689870tmp
>    [junit4]    >        at org.apache.lucene.util.CloseableFile.close(CloseableFile.java:47)
>    [junit4]    >        at com.carrotsearch.randomizedtesting.RandomizedContext.closeResources(RandomizedContext.java:167)
>    [junit4]    >        ... 2 more
>    [junit4] Completed in 1.48s, 7 tests, 2 errors <<< FAILURES!
>
> [...truncated 59 lines...]
> BUILD FAILED
> C:\Users\JenkinsSlave\workspace\Lucene-Solr-trunk-Windows\build.xml:389: The following
error occurred while executing this line:
> C:\Users\JenkinsSlave\workspace\Lucene-Solr-trunk-Windows\build.xml:369: The following
error occurred while executing this line:
> C:\Users\JenkinsSlave\workspace\Lucene-Solr-trunk-Windows\build.xml:39: The following
error occurred while executing this line:
> C:\Users\JenkinsSlave\workspace\Lucene-Solr-trunk-Windows\lucene\build.xml:556: The following
error occurred while executing this line:
> C:\Users\JenkinsSlave\workspace\Lucene-Solr-trunk-Windows\lucene\common-build.xml:1902:
The following error occurred while executing this line:
> C:\Users\JenkinsSlave\workspace\Lucene-Solr-trunk-Windows\lucene\module-build.xml:61:
The following error occurred while executing this line:
> C:\Users\JenkinsSlave\workspace\Lucene-Solr-trunk-Windows\lucene\common-build.xml:1247:
The following error occurred while executing this line:
> C:\Users\JenkinsSlave\workspace\Lucene-Solr-trunk-Windows\lucene\common-build.xml:890:
There were test failures: 20 suites, 103 tests, 2 suite-level errors, 1 ignored (1 assumption)
>
> Total time: 20 minutes 44 seconds
> Build step 'Invoke Ant' marked build as failure
> Description set: Java: 32bit/jdk1.7.0_25 -client -XX:+UseSerialGC
> Archiving artifacts
> Recording test results
> Email was triggered for: Failure
> Sending email for trigger: Failure
>
>
>
>
> ---------------------------------------------------------------------
> To unsubscribe, e-mail: dev-unsubscribe@lucene.apache.org
> For additional commands, e-mail: dev-help@lucene.apache.org

---------------------------------------------------------------------
To unsubscribe, e-mail: dev-unsubscribe@lucene.apache.org
For additional commands, e-mail: dev-help@lucene.apache.org


Mime
View raw message