lucene-dev mailing list archives

Site index · List index
Message view « Date » · « Thread »
Top « Date » · « Thread »
From Apache Jenkins Server <jenk...@builds.apache.org>
Subject [JENKINS] Lucene-Solr-NightlyTests-trunk - Build # 368 - Failure
Date Sun, 01 Sep 2013 12:52:47 GMT
Build: https://builds.apache.org/job/Lucene-Solr-NightlyTests-trunk/368/

1 tests failed.
REGRESSION:  org.apache.solr.spelling.SpellCheckCollatorTest.testEstimatedHitCounts

Error Message:
Exception during query

Stack Trace:
java.lang.RuntimeException: Exception during query
	at __randomizedtesting.SeedInfo.seed([75B3F4FA463088FB:44084ACFE30F982B]:0)
	at org.apache.solr.SolrTestCaseJ4.assertQ(SolrTestCaseJ4.java:637)
	at org.apache.solr.SolrTestCaseJ4.assertQ(SolrTestCaseJ4.java:604)
	at org.apache.solr.spelling.SpellCheckCollatorTest.testEstimatedHitCounts(SpellCheckCollatorTest.java:521)
	at sun.reflect.NativeMethodAccessorImpl.invoke0(Native Method)
	at sun.reflect.NativeMethodAccessorImpl.invoke(NativeMethodAccessorImpl.java:57)
	at sun.reflect.DelegatingMethodAccessorImpl.invoke(DelegatingMethodAccessorImpl.java:43)
	at java.lang.reflect.Method.invoke(Method.java:606)
	at com.carrotsearch.randomizedtesting.RandomizedRunner.invoke(RandomizedRunner.java:1559)
	at com.carrotsearch.randomizedtesting.RandomizedRunner.access$600(RandomizedRunner.java:79)
	at com.carrotsearch.randomizedtesting.RandomizedRunner$6.evaluate(RandomizedRunner.java:737)
	at com.carrotsearch.randomizedtesting.RandomizedRunner$7.evaluate(RandomizedRunner.java:773)
	at com.carrotsearch.randomizedtesting.RandomizedRunner$8.evaluate(RandomizedRunner.java:787)
	at com.carrotsearch.randomizedtesting.rules.SystemPropertiesRestoreRule$1.evaluate(SystemPropertiesRestoreRule.java:53)
	at org.apache.lucene.util.TestRuleSetupTeardownChained$1.evaluate(TestRuleSetupTeardownChained.java:50)
	at org.apache.lucene.util.TestRuleFieldCacheSanity$1.evaluate(TestRuleFieldCacheSanity.java:51)
	at org.apache.lucene.util.AbstractBeforeAfterRule$1.evaluate(AbstractBeforeAfterRule.java:46)
	at com.carrotsearch.randomizedtesting.rules.SystemPropertiesInvariantRule$1.evaluate(SystemPropertiesInvariantRule.java:55)
	at org.apache.lucene.util.TestRuleThreadAndTestName$1.evaluate(TestRuleThreadAndTestName.java:49)
	at org.apache.lucene.util.TestRuleIgnoreAfterMaxFailures$1.evaluate(TestRuleIgnoreAfterMaxFailures.java:70)
	at org.apache.lucene.util.TestRuleMarkFailure$1.evaluate(TestRuleMarkFailure.java:48)
	at com.carrotsearch.randomizedtesting.rules.StatementAdapter.evaluate(StatementAdapter.java:36)
	at com.carrotsearch.randomizedtesting.ThreadLeakControl$StatementRunner.run(ThreadLeakControl.java:358)
	at com.carrotsearch.randomizedtesting.ThreadLeakControl.forkTimeoutingTask(ThreadLeakControl.java:782)
	at com.carrotsearch.randomizedtesting.ThreadLeakControl$3.evaluate(ThreadLeakControl.java:442)
	at com.carrotsearch.randomizedtesting.RandomizedRunner.runSingleTest(RandomizedRunner.java:746)
	at com.carrotsearch.randomizedtesting.RandomizedRunner$3.evaluate(RandomizedRunner.java:648)
	at com.carrotsearch.randomizedtesting.RandomizedRunner$4.evaluate(RandomizedRunner.java:682)
	at com.carrotsearch.randomizedtesting.RandomizedRunner$5.evaluate(RandomizedRunner.java:693)
	at com.carrotsearch.randomizedtesting.rules.StatementAdapter.evaluate(StatementAdapter.java:36)
	at com.carrotsearch.randomizedtesting.rules.SystemPropertiesRestoreRule$1.evaluate(SystemPropertiesRestoreRule.java:53)
	at org.apache.lucene.util.AbstractBeforeAfterRule$1.evaluate(AbstractBeforeAfterRule.java:46)
	at org.apache.lucene.util.TestRuleStoreClassName$1.evaluate(TestRuleStoreClassName.java:42)
	at com.carrotsearch.randomizedtesting.rules.SystemPropertiesInvariantRule$1.evaluate(SystemPropertiesInvariantRule.java:55)
	at com.carrotsearch.randomizedtesting.rules.NoShadowingOrOverridesOnMethodsRule$1.evaluate(NoShadowingOrOverridesOnMethodsRule.java:39)
	at com.carrotsearch.randomizedtesting.rules.NoShadowingOrOverridesOnMethodsRule$1.evaluate(NoShadowingOrOverridesOnMethodsRule.java:39)
	at com.carrotsearch.randomizedtesting.rules.StatementAdapter.evaluate(StatementAdapter.java:36)
	at org.apache.lucene.util.TestRuleAssertionsRequired$1.evaluate(TestRuleAssertionsRequired.java:43)
	at org.apache.lucene.util.TestRuleMarkFailure$1.evaluate(TestRuleMarkFailure.java:48)
	at org.apache.lucene.util.TestRuleIgnoreAfterMaxFailures$1.evaluate(TestRuleIgnoreAfterMaxFailures.java:70)
	at org.apache.lucene.util.TestRuleIgnoreTestSuites$1.evaluate(TestRuleIgnoreTestSuites.java:55)
	at com.carrotsearch.randomizedtesting.rules.StatementAdapter.evaluate(StatementAdapter.java:36)
	at com.carrotsearch.randomizedtesting.ThreadLeakControl$StatementRunner.run(ThreadLeakControl.java:358)
	at java.lang.Thread.run(Thread.java:724)
Caused by: java.lang.RuntimeException: REQUEST FAILED: xpath=//lst[@name='spellcheck']/lst[@name='suggestions']/lst[@name='collation']/int[@name='hits' and 6 <= . and . <= 10]
	xml response was: <?xml version="1.0" encoding="UTF-8"?>
<response>
<lst name="responseHeader"><int name="status">0</int><int name="QTime">5</int></lst><result name="response" numFound="0" start="0"></result><lst name="spellcheck"><lst name="suggestions"><lst name="everother"><int name="numFound">1</int><int name="startOffset">9</int><int name="endOffset">18</int><arr name="suggestion"><str>everyother</str></arr></lst><lst name="collation"><str name="collationQuery">teststop:everyother</str><int name="hits">12</int><lst name="misspellingsAndCorrections"><str name="everother">everyother</str></lst></lst></lst></lst>
</response>

	request was:spellcheck=true&spellcheck.dictionary=direct&spellcheck.count=1&spellcheck.collate=true&spellcheck.maxCollationTries=1&spellcheck.maxCollations=1&spellcheck.collateExtendedResults=true&qt=spellCheckCompRH&q=teststop%3Aeverother&spellcheck.collateMaxCollectDocs=5
	at org.apache.solr.SolrTestCaseJ4.assertQ(SolrTestCaseJ4.java:630)
	... 42 more




Build Log:
[...truncated 9868 lines...]
   [junit4] Suite: org.apache.solr.spelling.SpellCheckCollatorTest
   [junit4]   2> 638798 T2080 oas.SolrTestCaseJ4.initCore ####initCore
   [junit4]   2> Creating dataDir: /usr/home/hudson/hudson-slave/workspace/Lucene-Solr-NightlyTests-trunk/solr/build/solr-core/test/J1/./solrtest-SpellCheckCollatorTest-1378037576000
   [junit4]   2> 638799 T2080 oasc.SolrResourceLoader.<init> new SolrResourceLoader for directory: '/usr/home/hudson/hudson-slave/workspace/Lucene-Solr-NightlyTests-trunk/solr/build/solr-core/test-files/solr/collection1/'
   [junit4]   2> 638800 T2080 oasc.SolrResourceLoader.replaceClassLoader Adding 'file:/usr/home/hudson/hudson-slave/workspace/Lucene-Solr-NightlyTests-trunk/solr/build/solr-core/test-files/solr/collection1/lib/README' to classloader
   [junit4]   2> 638800 T2080 oasc.SolrResourceLoader.replaceClassLoader Adding 'file:/usr/home/hudson/hudson-slave/workspace/Lucene-Solr-NightlyTests-trunk/solr/build/solr-core/test-files/solr/collection1/lib/classes/' to classloader
   [junit4]   2> 638874 T2080 oasc.SolrConfig.<init> Using Lucene MatchVersion: LUCENE_50
   [junit4]   2> 638913 T2080 oasc.SolrConfig.<init> Loaded SolrConfig: solrconfig-spellcheckcomponent.xml
   [junit4]   2> 638914 T2080 oass.IndexSchema.readSchema Reading Solr Schema from schema.xml
   [junit4]   2> 638922 T2080 oass.IndexSchema.readSchema [null] Schema name=test
   [junit4]   2> 639505 T2080 oass.OpenExchangeRatesOrgProvider.init Initialized with rates=open-exchange-rates.json, refreshInterval=1440.
   [junit4]   2> 639516 T2080 oass.IndexSchema.readSchema default search field in schema is text
   [junit4]   2> 639520 T2080 oass.IndexSchema.readSchema unique key field: id
   [junit4]   2> 639531 T2080 oass.FileExchangeRateProvider.reload Reloading exchange rates from file currency.xml
   [junit4]   2> 639535 T2080 oass.FileExchangeRateProvider.reload Reloading exchange rates from file currency.xml
   [junit4]   2> 639539 T2080 oass.OpenExchangeRatesOrgProvider.reload Reloading exchange rates from open-exchange-rates.json
   [junit4]   2> 639540 T2080 oass.OpenExchangeRatesOrgProvider$OpenExchangeRates.<init> WARN Unknown key IMPORTANT NOTE
   [junit4]   2> 639540 T2080 oass.OpenExchangeRatesOrgProvider$OpenExchangeRates.<init> WARN Expected key, got STRING
   [junit4]   2> 639540 T2080 oass.OpenExchangeRatesOrgProvider.reload Reloading exchange rates from open-exchange-rates.json
   [junit4]   2> 639541 T2080 oass.OpenExchangeRatesOrgProvider$OpenExchangeRates.<init> WARN Unknown key IMPORTANT NOTE
   [junit4]   2> 639541 T2080 oass.OpenExchangeRatesOrgProvider$OpenExchangeRates.<init> WARN Expected key, got STRING
   [junit4]   2> 639542 T2080 oasc.SolrResourceLoader.locateSolrHome JNDI not configured for solr (NoInitialContextEx)
   [junit4]   2> 639542 T2080 oasc.SolrResourceLoader.locateSolrHome using system property solr.solr.home: /usr/home/hudson/hudson-slave/workspace/Lucene-Solr-NightlyTests-trunk/solr/build/solr-core/test-files/solr
   [junit4]   2> 639542 T2080 oasc.SolrResourceLoader.<init> new SolrResourceLoader for directory: '/usr/home/hudson/hudson-slave/workspace/Lucene-Solr-NightlyTests-trunk/solr/build/solr-core/test-files/solr/'
   [junit4]   2> 639554 T2080 oasc.SolrResourceLoader.locateSolrHome JNDI not configured for solr (NoInitialContextEx)
   [junit4]   2> 639555 T2080 oasc.SolrResourceLoader.locateSolrHome using system property solr.solr.home: /usr/home/hudson/hudson-slave/workspace/Lucene-Solr-NightlyTests-trunk/solr/build/solr-core/test-files/solr
   [junit4]   2> 639555 T2080 oasc.SolrResourceLoader.<init> new SolrResourceLoader for deduced Solr Home: '/usr/home/hudson/hudson-slave/workspace/Lucene-Solr-NightlyTests-trunk/solr/build/solr-core/test-files/solr/'
   [junit4]   2> 639619 T2080 oasc.CoreContainer.<init> New CoreContainer 1962678700
   [junit4]   2> 639620 T2080 oasc.CoreContainer.load Loading cores into CoreContainer [instanceDir=/usr/home/hudson/hudson-slave/workspace/Lucene-Solr-NightlyTests-trunk/solr/build/solr-core/test-files/solr/]
   [junit4]   2> 639621 T2080 oashc.HttpShardHandlerFactory.getParameter Setting socketTimeout to: 0
   [junit4]   2> 639621 T2080 oashc.HttpShardHandlerFactory.getParameter Setting urlScheme to: http://
   [junit4]   2> 639622 T2080 oashc.HttpShardHandlerFactory.getParameter Setting connTimeout to: 0
   [junit4]   2> 639622 T2080 oashc.HttpShardHandlerFactory.getParameter Setting maxConnectionsPerHost to: 20
   [junit4]   2> 639622 T2080 oashc.HttpShardHandlerFactory.getParameter Setting corePoolSize to: 0
   [junit4]   2> 639622 T2080 oashc.HttpShardHandlerFactory.getParameter Setting maximumPoolSize to: 2147483647
   [junit4]   2> 639623 T2080 oashc.HttpShardHandlerFactory.getParameter Setting maxThreadIdleTime to: 5
   [junit4]   2> 639623 T2080 oashc.HttpShardHandlerFactory.getParameter Setting sizeOfQueue to: -1
   [junit4]   2> 639623 T2080 oashc.HttpShardHandlerFactory.getParameter Setting fairnessPolicy to: false
   [junit4]   2> 639623 T2080 oascsi.HttpClientUtil.createClient Creating new http client, config:maxConnectionsPerHost=20&maxConnections=10000&socketTimeout=0&connTimeout=0&retry=false
   [junit4]   2> 639640 T2080 oasl.LogWatcher.createWatcher SLF4J impl is org.slf4j.impl.Log4jLoggerFactory
   [junit4]   2> 639641 T2080 oasl.LogWatcher.newRegisteredLogWatcher Registering Log Listener [Log4j (org.slf4j.impl.Log4jLoggerFactory)]
   [junit4]   2> 639647 T2081 oasc.CoreContainer.create Creating SolrCore 'collection1' using instanceDir: /usr/home/hudson/hudson-slave/workspace/Lucene-Solr-NightlyTests-trunk/solr/build/solr-core/test-files/solr/collection1
   [junit4]   2> 639647 T2081 oasc.SolrResourceLoader.<init> new SolrResourceLoader for directory: '/usr/home/hudson/hudson-slave/workspace/Lucene-Solr-NightlyTests-trunk/solr/build/solr-core/test-files/solr/collection1/'
   [junit4]   2> 639648 T2081 oasc.SolrResourceLoader.replaceClassLoader Adding 'file:/usr/home/hudson/hudson-slave/workspace/Lucene-Solr-NightlyTests-trunk/solr/build/solr-core/test-files/solr/collection1/lib/README' to classloader
   [junit4]   2> 639649 T2081 oasc.SolrResourceLoader.replaceClassLoader Adding 'file:/usr/home/hudson/hudson-slave/workspace/Lucene-Solr-NightlyTests-trunk/solr/build/solr-core/test-files/solr/collection1/lib/classes/' to classloader
   [junit4]   2> 639707 T2081 oasc.SolrConfig.<init> Using Lucene MatchVersion: LUCENE_50
   [junit4]   2> 639771 T2081 oasc.SolrConfig.<init> Loaded SolrConfig: solrconfig-spellcheckcomponent.xml
   [junit4]   2> 639771 T2081 oass.IndexSchema.readSchema Reading Solr Schema from schema.xml
   [junit4]   2> 639784 T2081 oass.IndexSchema.readSchema [null] Schema name=test
   [junit4]   2> 640382 T2081 oass.OpenExchangeRatesOrgProvider.init Initialized with rates=open-exchange-rates.json, refreshInterval=1440.
   [junit4]   2> 640390 T2081 oass.IndexSchema.readSchema default search field in schema is text
   [junit4]   2> 640394 T2081 oass.IndexSchema.readSchema unique key field: id
   [junit4]   2> 640403 T2081 oass.FileExchangeRateProvider.reload Reloading exchange rates from file currency.xml
   [junit4]   2> 640408 T2081 oass.FileExchangeRateProvider.reload Reloading exchange rates from file currency.xml
   [junit4]   2> 640412 T2081 oass.OpenExchangeRatesOrgProvider.reload Reloading exchange rates from open-exchange-rates.json
   [junit4]   2> 640413 T2081 oass.OpenExchangeRatesOrgProvider$OpenExchangeRates.<init> WARN Unknown key IMPORTANT NOTE
   [junit4]   2> 640413 T2081 oass.OpenExchangeRatesOrgProvider$OpenExchangeRates.<init> WARN Expected key, got STRING
   [junit4]   2> 640413 T2081 oass.OpenExchangeRatesOrgProvider.reload Reloading exchange rates from open-exchange-rates.json
   [junit4]   2> 640414 T2081 oass.OpenExchangeRatesOrgProvider$OpenExchangeRates.<init> WARN Unknown key IMPORTANT NOTE
   [junit4]   2> 640414 T2081 oass.OpenExchangeRatesOrgProvider$OpenExchangeRates.<init> WARN Expected key, got STRING
   [junit4]   2> 640414 T2081 oasc.SolrCore.initDirectoryFactory org.apache.solr.core.MockDirectoryFactory
   [junit4]   2> 640415 T2081 oasc.SolrCore.<init> [collection1] Opening new SolrCore at /usr/home/hudson/hudson-slave/workspace/Lucene-Solr-NightlyTests-trunk/solr/build/solr-core/test-files/solr/collection1/, dataDir=/usr/home/hudson/hudson-slave/workspace/Lucene-Solr-NightlyTests-trunk/solr/build/solr-core/test/J1/./solrtest-SpellCheckCollatorTest-1378037576000/
   [junit4]   2> 640415 T2081 oasc.SolrCore.<init> JMX monitoring not detected for core: collection1
   [junit4]   2> 640415 T2081 oasc.CachingDirectoryFactory.get return new directory for /usr/home/hudson/hudson-slave/workspace/Lucene-Solr-NightlyTests-trunk/solr/build/solr-core/test/J1/./solrtest-SpellCheckCollatorTest-1378037576000
   [junit4]   2> 640416 T2081 oasc.SolrCore.getNewIndexDir New index directory detected: old=null new=/usr/home/hudson/hudson-slave/workspace/Lucene-Solr-NightlyTests-trunk/solr/build/solr-core/test/J1/./solrtest-SpellCheckCollatorTest-1378037576000/index/
   [junit4]   2> 640416 T2081 oasc.SolrCore.initIndex WARN [collection1] Solr index directory '/usr/home/hudson/hudson-slave/workspace/Lucene-Solr-NightlyTests-trunk/solr/build/solr-core/test/J1/./solrtest-SpellCheckCollatorTest-1378037576000/index' doesn't exist. Creating new index...
   [junit4]   2> 640417 T2081 oasc.CachingDirectoryFactory.get return new directory for /usr/home/hudson/hudson-slave/workspace/Lucene-Solr-NightlyTests-trunk/solr/build/solr-core/test/J1/./solrtest-SpellCheckCollatorTest-1378037576000/index
   [junit4]   2> 640418 T2081 oasu.RandomMergePolicy.<init> RandomMergePolicy wrapping class org.apache.lucene.index.TieredMergePolicy: [TieredMergePolicy: maxMergeAtOnce=42, maxMergeAtOnceExplicit=22, maxMergedSegmentMB=32.619140625, floorSegmentMB=0.8046875, forceMergeDeletesPctAllowed=9.080248454410352, segmentsPerTier=45.0, maxCFSSegmentSizeMB=8.796093022207999E12, noCFSRatio=0.0
   [junit4]   2> 640422 T2081 oasc.SolrDeletionPolicy.onCommit SolrDeletionPolicy.onCommit: commits: num=1
   [junit4]   2> 		commit{dir=MockDirWrapper(RateLimitedDirectoryWrapper(NRTCachingDirectory(org.apache.lucene.store.NIOFSDirectory@/usr/home/hudson/hudson-slave/workspace/Lucene-Solr-NightlyTests-trunk/solr/build/solr-core/test/J1/index4483644867tmp lockFactory=org.apache.lucene.store.SingleInstanceLockFactory@2083e406; maxCacheMB=0.8291015625 maxMergeSizeMB=0.4521484375))),segFN=segments_1,generation=1}
   [junit4]   2> 640422 T2081 oasc.SolrDeletionPolicy.updateCommits newest commit generation = 1
   [junit4]   2> 640423 T2081 oasc.SolrCore.loadUpdateProcessorChains no updateRequestProcessorChain defined as default, creating implicit default
   [junit4]   2> 640423 T2081 oasc.RequestHandlers.initHandlersFromConfig created standard: solr.StandardRequestHandler
   [junit4]   2> 640424 T2081 oasc.RequestHandlers.initHandlersFromConfig created spellCheckCompRH: org.apache.solr.handler.component.SearchHandler
   [junit4]   2> 640424 T2081 oasc.RequestHandlers.initHandlersFromConfig created spellCheckCompRH1: org.apache.solr.handler.component.SearchHandler
   [junit4]   2> 640424 T2081 oasc.RequestHandlers.initHandlersFromConfig created spellCheckWithWordbreak: org.apache.solr.handler.component.SearchHandler
   [junit4]   2> 640428 T2081 oasu.CommitTracker.<init> Hard AutoCommit: disabled
   [junit4]   2> 640428 T2081 oasu.CommitTracker.<init> Soft AutoCommit: disabled
   [junit4]   2> 640428 T2081 oasu.RandomMergePolicy.<init> RandomMergePolicy wrapping class org.apache.lucene.index.LogDocMergePolicy: [LogDocMergePolicy: minMergeSize=1000, mergeFactor=22, maxMergeSize=9223372036854775807, maxMergeSizeForForcedMerge=9223372036854775807, calibrateSizeByDeletes=false, maxMergeDocs=2147483647, maxCFSSegmentSizeMB=8.796093022207999E12, noCFSRatio=1.0]
   [junit4]   2> 640431 T2081 oasc.SolrDeletionPolicy.onInit SolrDeletionPolicy.onInit: commits: num=1
   [junit4]   2> 		commit{dir=MockDirWrapper(RateLimitedDirectoryWrapper(NRTCachingDirectory(org.apache.lucene.store.NIOFSDirectory@/usr/home/hudson/hudson-slave/workspace/Lucene-Solr-NightlyTests-trunk/solr/build/solr-core/test/J1/index4483644867tmp lockFactory=org.apache.lucene.store.SingleInstanceLockFactory@2083e406; maxCacheMB=0.8291015625 maxMergeSizeMB=0.4521484375))),segFN=segments_1,generation=1}
   [junit4]   2> 640431 T2081 oasc.SolrDeletionPolicy.updateCommits newest commit generation = 1
   [junit4]   2> 640431 T2081 oass.SolrIndexSearcher.<init> Opening Searcher@7b5bfca6 main
   [junit4]   2> 640432 T2081 oashc.SpellCheckComponent.inform Initializing spell checkers
   [junit4]   2> 640440 T2081 oashc.SpellCheckComponent.inform Registering newSearcher listener for spellchecker: default
   [junit4]   2> 640447 T2081 oashc.SpellCheckComponent.inform Registering newSearcher listener for spellchecker: default_teststop
   [junit4]   2> 640511 T2081 oass.DirectSolrSpellChecker.init init: {name=direct,classname=solr.DirectSolrSpellChecker,minQueryLength=3,maxQueryFrequency=100.0,field=teststop}
   [junit4]   2> 640512 T2081 oass.DirectSolrSpellChecker.init init: {name=direct_lowerfilt,classname=solr.DirectSolrSpellChecker,minQueryLength=3,maxQueryFrequency=100.0,field=lowerfilt}
   [junit4]   2> 640521 T2081 oashc.SpellCheckComponent.inform Registering newSearcher listener for spellchecker: threshold
   [junit4]   2> 640521 T2081 oass.DirectSolrSpellChecker.init init: {name=threshold_direct,classname=solr.DirectSolrSpellChecker,field=lowerfilt,spellcheckIndexDir=spellcheckerThreshold,buildOnCommit=true,thresholdTokenFrequency=0.29}
   [junit4]   2> 640521 T2081 oashc.SpellCheckComponent.inform Registering newSearcher listener for spellchecker: threshold_direct
   [junit4]   2> 640536 T2081 oashc.SpellCheckComponent.inform Registering newSearcher listener for spellchecker: multipleFields
   [junit4]   2> 640561 T2081 oashc.SpellCheckComponent.inform Registering newSearcher listener for spellchecker: freq
   [junit4]   2> 640575 T2081 oashc.SpellCheckComponent.inform Registering newSearcher listener for spellchecker: fqcn
   [junit4]   2> 640575 T2082 oasc.SolrCore.registerSearcher [collection1] Registered new searcher Searcher@7b5bfca6 main{StandardDirectoryReader(segments_1:1:nrt)}
   [junit4]   2> 640575 T2081 oasc.CoreContainer.registerCore registering core: collection1
   [junit4]   2> 640587 T2080 oas.SolrTestCaseJ4.initCore ####initCore end
   [junit4]   2> ASYNC  NEW_CORE C263 name=collection1 org.apache.solr.core.SolrCore@1439e04b
   [junit4]   2> 640596 T2080 C263 oasup.LogUpdateProcessor.finish [collection1] webapp=null path=null params={} {add=[0]} 0 2
   [junit4]   2> 640616 T2080 C263 oasup.LogUpdateProcessor.finish [collection1] webapp=null path=null params={} {add=[1]} 0 1
   [junit4]   2> 640636 T2080 C263 oasup.LogUpdateProcessor.finish [collection1] webapp=null path=null params={} {add=[2]} 0 15
   [junit4]   2> 640651 T2080 C263 oasup.LogUpdateProcessor.finish [collection1] webapp=null path=null params={} {add=[3]} 0 3
   [junit4]   2> 640664 T2080 C263 oasup.LogUpdateProcessor.finish [collection1] webapp=null path=null params={} {add=[4]} 0 1
   [junit4]   2> 640683 T2080 C263 oasup.LogUpdateProcessor.finish [collection1] webapp=null path=null params={} {add=[5]} 0 11
   [junit4]   2> 640693 T2080 C263 oasup.LogUpdateProcessor.finish [collection1] webapp=null path=null params={} {add=[6]} 0 2
   [junit4]   2> 640701 T2080 C263 oasup.LogUpdateProcessor.finish [collection1] webapp=null path=null params={} {add=[7]} 0 0
   [junit4]   2> 640716 T2080 C263 oasup.LogUpdateProcessor.finish [collection1] webapp=null path=null params={} {add=[8]} 0 10
   [junit4]   2> 640726 T2080 C263 oasup.LogUpdateProcessor.finish [collection1] webapp=null path=null params={} {add=[9]} 0 2
   [junit4]   2> 640734 T2080 C263 oasup.LogUpdateProcessor.finish [collection1] webapp=null path=null params={} {add=[10]} 0 0
   [junit4]   2> 640751 T2080 C263 oasup.LogUpdateProcessor.finish [collection1] webapp=null path=null params={} {add=[11]} 0 11
   [junit4]   2> 640766 T2080 C263 oasup.LogUpdateProcessor.finish [collection1] webapp=null path=null params={} {add=[12]} 0 2
   [junit4]   2> 640779 T2080 C263 oasup.LogUpdateProcessor.finish [collection1] webapp=null path=null params={} {add=[13]} 0 1
   [junit4]   2> 640799 T2080 C263 oasup.LogUpdateProcessor.finish [collection1] webapp=null path=null params={} {add=[14]} 0 12
   [junit4]   2> 640813 T2080 C263 oasup.LogUpdateProcessor.finish [collection1] webapp=null path=null params={} {add=[15]} 0 2
   [junit4]   2> 640826 T2080 C263 oasup.LogUpdateProcessor.finish [collection1] webapp=null path=null params={} {add=[16]} 0 1
   [junit4]   2> 640834 T2080 C263 oasu.DirectUpdateHandler2.commit start commit{,optimize=false,openSearcher=true,waitSearcher=true,expungeDeletes=false,softCommit=false,prepareCommit=false}
   [junit4]   2> 641013 T2080 C263 oasc.SolrDeletionPolicy.onCommit SolrDeletionPolicy.onCommit: commits: num=2
   [junit4]   2> 		commit{dir=MockDirWrapper(RateLimitedDirectoryWrapper(NRTCachingDirectory(org.apache.lucene.store.NIOFSDirectory@/usr/home/hudson/hudson-slave/workspace/Lucene-Solr-NightlyTests-trunk/solr/build/solr-core/test/J1/index4483644867tmp lockFactory=org.apache.lucene.store.SingleInstanceLockFactory@2083e406; maxCacheMB=0.8291015625 maxMergeSizeMB=0.4521484375))),segFN=segments_1,generation=1}
   [junit4]   2> 		commit{dir=MockDirWrapper(RateLimitedDirectoryWrapper(NRTCachingDirectory(org.apache.lucene.store.NIOFSDirectory@/usr/home/hudson/hudson-slave/workspace/Lucene-Solr-NightlyTests-trunk/solr/build/solr-core/test/J1/index4483644867tmp lockFactory=org.apache.lucene.store.SingleInstanceLockFactory@2083e406; maxCacheMB=0.8291015625 maxMergeSizeMB=0.4521484375))),segFN=segments_2,generation=2}
   [junit4]   2> 641014 T2080 C263 oasc.SolrDeletionPolicy.updateCommits newest commit generation = 2
   [junit4]   2> 641021 T2080 C263 oass.SolrIndexSearcher.<init> Opening Searcher@850f504 main
   [junit4]   2> 641021 T2080 C263 oasu.DirectUpdateHandler2.commit end_commit_flush
   [junit4]   2> 641021 T2082 oashc.SpellCheckComponent$SpellCheckerListener.buildSpellIndex Building spell index for spell checker: default
   [junit4]   2> 641067 T2082 oashc.SpellCheckComponent$SpellCheckerListener.buildSpellIndex Building spell index for spell checker: default_teststop
   [junit4]   2> 641136 T2082 oashc.SpellCheckComponent$SpellCheckerListener.buildSpellIndex Building spell index for spell checker: threshold
   [junit4]   2> 641162 T2082 oashc.SpellCheckComponent$SpellCheckerListener.buildSpellIndex Building spell index for spell checker: threshold_direct
   [junit4]   2> 641162 T2082 oashc.SpellCheckComponent$SpellCheckerListener.buildSpellIndex Building spell index for spell checker: multipleFields
   [junit4]   2> 641227 T2082 oashc.SpellCheckComponent$SpellCheckerListener.buildSpellIndex Building spell index for spell checker: freq
   [junit4]   2> 641265 T2082 oashc.SpellCheckComponent$SpellCheckerListener.buildSpellIndex Building spell index for spell checker: fqcn
   [junit4]   2> 641320 T2082 oasc.SolrCore.registerSearcher [collection1] Registered new searcher Searcher@850f504 main{StandardDirectoryReader(segments_2:13:nrt _0(5.0):C3 _1(5.0):C3 _2(5.0):C3 _3(5.0):C3 _4(5.0):C3 _5(5.0):C2)}
   [junit4]   2> 641321 T2080 C263 oasup.LogUpdateProcessor.finish [collection1] webapp=null path=null params={} {commit=} 0 487
   [junit4]   2> 641333 T2080 oas.SolrTestCaseJ4.setUp ###Starting testExtendedCollate
   [junit4]   2> 641472 T2080 oas.SolrTestCaseJ4.tearDown ###Ending testExtendedCollate
   [junit4]   2> 641478 T2080 oas.SolrTestCaseJ4.setUp ###Starting testContextSensitiveCollate
   [junit4]   2> 641641 T2080 C263 oasc.SolrCore.execute [collection1] webapp=null path=null params={spellcheck=true&indent=true&spellcheck.maxResultsForSuggest=0&spellcheck.collateExtendedResults=true&spellcheck.extendedResults=true&spellcheck.maxCollations=1&spellcheck.maxCollationTries=10&spellcheck.collate=true&q=teststop:(flew+AND+form+AND+heathrow)&spellcheck.dictionary=direct&spellcheck.count=10&qt=spellCheckCompRH&spellcheck.build=true&spellcheck.alternativeTermCount=5} hits=0 status=0 QTime=162 
   [junit4]   2> 641702 T2080 C263 oasc.SolrCore.execute [collection1] webapp=null path=null params={spellcheck=true&indent=true&spellcheck.maxResultsForSuggest=1&spellcheck.collateExtendedResults=true&spellcheck.extendedResults=true&spellcheck.maxCollationTries=10&spellcheck.maxCollations=1&spellcheck.collate=true&q=teststop:(june+AND+customs)&spellcheck.dictionary=direct&spellcheck.count=10&qt=spellCheckCompRH&spellcheck.alternativeTermCount=5} hits=1 status=0 QTime=47 
   [junit4]   2> 641794 T2080 C263 oasc.SolrCore.execute [collection1] webapp=null path=null params={spellcheck=true&indent=true&spellcheck.maxResultsForSuggest=0&spellcheck.collateExtendedResults=true&spellcheck.extendedResults=true&spellcheck.maxCollations=1&spellcheck.maxCollationTries=10&spellcheck.collate=true&q=teststop:(flew+AND+form+AND+heathrow)&spellcheck.dictionary=default_teststop&spellcheck.count=10&qt=spellCheckCompRH&spellcheck.build=true&spellcheck.alternativeTermCount=5} hits=0 status=0 QTime=82 
   [junit4]   2> 641813 T2080 C263 oasc.SolrCore.execute [collection1] webapp=null path=null params={spellcheck=true&indent=true&spellcheck.maxResultsForSuggest=1&spellcheck.collateExtendedResults=true&spellcheck.extendedResults=true&spellcheck.maxCollationTries=10&spellcheck.maxCollations=1&spellcheck.collate=true&q=teststop:(june+AND+customs)&spellcheck.dictionary=default_teststop&spellcheck.count=10&qt=spellCheckCompRH&spellcheck.alternativeTermCount=5} hits=1 status=0 QTime=5 
   [junit4]   2> 641822 T2080 oas.SolrTestCaseJ4.tearDown ###Ending testContextSensitiveCollate
   [junit4]   2> 641829 T2080 oas.SolrTestCaseJ4.setUp ###Starting testCollateWithFilter
   [junit4]   2> 641907 T2080 oas.SolrTestCaseJ4.tearDown ###Ending testCollateWithFilter
   [junit4]   2> 641913 T2080 oas.SolrTestCaseJ4.setUp ###Starting testEstimatedHitCounts
   [junit4]   2> 641949 T2080 C263 oasc.SolrCore.execute [collection1] webapp=null path=null params={spellcheck=true&spellcheck.dictionary=direct&spellcheck.count=1&spellcheck.collate=true&spellcheck.maxCollationTries=1&spellcheck.maxCollations=1&spellcheck.collateExtendedResults=true&qt=spellCheckCompRH&q=teststop%3Ametnoia} hits=0 status=0 QTime=35 
   [junit4]   2> 641976 T2080 C263 oasc.SolrCore.execute [collection1] webapp=null path=null params={spellcheck=true&spellcheck.dictionary=direct&spellcheck.count=1&spellcheck.collate=true&spellcheck.maxCollationTries=1&spellcheck.maxCollations=1&spellcheck.collateExtendedResults=true&qt=spellCheckCompRH&q=teststop%3Ametnoia&spellcheck.collateMaxCollectDocs=0} hits=0 status=0 QTime=19 
   [junit4]   2> 641999 T2080 C263 oasc.SolrCore.execute [collection1] webapp=null path=null params={spellcheck=true&spellcheck.dictionary=direct&spellcheck.count=1&spellcheck.collate=true&spellcheck.maxCollationTries=1&spellcheck.maxCollations=1&spellcheck.collateExtendedResults=true&qt=spellCheckCompRH&q=teststop%3Ametnoia&spellcheck.collateMaxCollectDocs=30} hits=0 status=0 QTime=19 
   [junit4]   2> 642020 T2080 C263 oasc.SolrCore.execute [collection1] webapp=null path=null params={spellcheck=true&spellcheck.dictionary=direct&spellcheck.count=1&spellcheck.collate=true&spellcheck.maxCollationTries=1&spellcheck.maxCollations=1&spellcheck.collateExtendedResults=true&qt=spellCheckCompRH&q=teststop%3Ametnoia&spellcheck.collateMaxCollectDocs=100} hits=0 status=0 QTime=17 
   [junit4]   2> 642038 T2080 C263 oasc.SolrCore.execute [collection1] webapp=null path=null params={spellcheck=true&spellcheck.dictionary=direct&spellcheck.count=1&spellcheck.collate=true&spellcheck.maxCollationTries=1&spellcheck.maxCollations=1&spellcheck.collateExtendedResults=true&qt=spellCheckCompRH&q=teststop%3Ametnoia&spellcheck.collateMaxCollectDocs=10000} hits=0 status=0 QTime=15 
   [junit4]   2> 642055 T2080 C263 oasc.SolrCore.execute [collection1] webapp=null path=null params={spellcheck=true&spellcheck.dictionary=direct&spellcheck.count=1&spellcheck.collate=true&spellcheck.maxCollationTries=1&spellcheck.maxCollations=1&spellcheck.collateExtendedResults=true&qt=spellCheckCompRH&q=teststop%3Ametnoia&spellcheck.collateMaxCollectDocs=11} hits=0 status=0 QTime=13 
   [junit4]   2> 642071 T2080 C263 oasc.SolrCore.execute [collection1] webapp=null path=null params={spellcheck=true&spellcheck.dictionary=direct&spellcheck.count=1&spellcheck.collate=true&spellcheck.maxCollationTries=1&spellcheck.maxCollations=1&spellcheck.collateExtendedResults=true&qt=spellCheckCompRH&q=teststop%3Ametnoia&spellcheck.collateMaxCollectDocs=12} hits=0 status=0 QTime=11 
   [junit4]   2> 642093 T2080 C263 oasc.SolrCore.execute [collection1] webapp=null path=null params={spellcheck=true&spellcheck.dictionary=direct&spellcheck.count=1&spellcheck.collate=true&spellcheck.maxCollationTries=1&spellcheck.maxCollations=1&spellcheck.collateExtendedResults=true&qt=spellCheckCompRH&q=teststop%3Ametnoia&spellcheck.collateMaxCollectDocs=5} hits=0 status=0 QTime=18 
   [junit4]   2> 642108 T2080 C263 oasc.SolrCore.execute [collection1] webapp=null path=null params={spellcheck=true&spellcheck.dictionary=direct&spellcheck.count=1&spellcheck.collate=true&spellcheck.maxCollationTries=1&spellcheck.maxCollations=1&spellcheck.collateExtendedResults=true&qt=spellCheckCompRH&q=teststop%3Ametnoia&spellcheck.collateMaxCollectDocs=10} hits=0 status=0 QTime=12 
   [junit4]   2> 642121 T2080 C263 oasc.SolrCore.execute [collection1] webapp=null path=null params={spellcheck=true&spellcheck.dictionary=direct&spellcheck.count=1&spellcheck.collate=true&spellcheck.maxCollationTries=1&spellcheck.maxCollations=1&spellcheck.collateExtendedResults=true&qt=spellCheckCompRH&q=teststop%3Ametnoia&spellcheck.collateMaxCollectDocs=13} hits=0 status=0 QTime=10 
   [junit4]   2> 642135 T2080 C263 oasc.SolrCore.execute [collection1] webapp=null path=null params={spellcheck=true&spellcheck.dictionary=direct&spellcheck.count=1&spellcheck.collate=true&spellcheck.maxCollationTries=1&spellcheck.maxCollations=1&spellcheck.collateExtendedResults=true&qt=spellCheckCompRH&q=teststop%3Ametnoia&spellcheck.collateMaxCollectDocs=7} hits=0 status=0 QTime=10 
   [junit4]   2> 642147 T2080 C263 oasc.SolrCore.execute [collection1] webapp=null path=null params={spellcheck=true&spellcheck.dictionary=direct&spellcheck.count=1&spellcheck.collate=true&spellcheck.maxCollationTries=1&spellcheck.maxCollations=1&spellcheck.collateExtendedResults=true&qt=spellCheckCompRH&q=teststop%3Ametnoia&spellcheck.collateMaxCollectDocs=8} hits=0 status=0 QTime=9 
   [junit4]   2> 642159 T2080 C263 oasc.SolrCore.execute [collection1] webapp=null path=null params={spellcheck=true&spellcheck.dictionary=direct&spellcheck.count=1&spellcheck.collate=true&spellcheck.maxCollationTries=1&spellcheck.maxCollations=1&spellcheck.collateExtendedResults=true&qt=spellCheckCompRH&q=teststop%3Ametnoia&spellcheck.collateMaxCollectDocs=4} hits=0 status=0 QTime=8 
   [junit4]   2> 642169 T2080 C263 oasc.SolrCore.execute [collection1] webapp=null path=null params={spellcheck=true&spellcheck.dictionary=direct&spellcheck.count=1&spellcheck.collate=true&spellcheck.maxCollationTries=1&spellcheck.maxCollations=1&spellcheck.collateExtendedResults=true&qt=spellCheckCompRH&q=teststop%3Ametnoia&spellcheck.collateMaxCollectDocs=11} hits=0 status=0 QTime=7 
   [junit4]   2> 642180 T2080 C263 oasc.SolrCore.execute [collection1] webapp=null path=null params={spellcheck=true&spellcheck.dictionary=direct&spellcheck.count=1&spellcheck.collate=true&spellcheck.maxCollationTries=1&spellcheck.maxCollations=1&spellcheck.collateExtendedResults=true&qt=spellCheckCompRH&q=teststop%3Ametnoia&spellcheck.collateMaxCollectDocs=6} hits=0 status=0 QTime=7 
   [junit4]   2> 642191 T2080 C263 oasc.SolrCore.execute [collection1] webapp=null path=null params={spellcheck=true&spellcheck.dictionary=direct&spellcheck.count=1&spellcheck.collate=true&spellcheck.maxCollationTries=1&spellcheck.maxCollations=1&spellcheck.collateExtendedResults=true&qt=spellCheckCompRH&q=teststop%3Ametnoia&spellcheck.collateMaxCollectDocs=5} hits=0 status=0 QTime=7 
   [junit4]   2> 642201 T2080 C263 oasc.SolrCore.execute [collection1] webapp=null path=null params={spellcheck=true&spellcheck.dictionary=direct&spellcheck.count=1&spellcheck.collate=true&spellcheck.maxCollationTries=1&spellcheck.maxCollations=1&spellcheck.collateExtendedResults=true&qt=spellCheckCompRH&q=teststop%3Ametnoia&spellcheck.collateMaxCollectDocs=6} hits=0 status=0 QTime=6 
   [junit4]   2> 642211 T2080 C263 oasc.SolrCore.execute [collection1] webapp=null path=null params={spellcheck=true&spellcheck.dictionary=direct&spellcheck.count=1&spellcheck.collate=true&spellcheck.maxCollationTries=1&spellcheck.maxCollations=1&spellcheck.collateExtendedResults=true&qt=spellCheckCompRH&q=teststop%3Ametnoia&spellcheck.collateMaxCollectDocs=2} hits=0 status=0 QTime=6 
   [junit4]   2> 642221 T2080 C263 oasc.SolrCore.execute [collection1] webapp=null path=null params={spellcheck=true&spellcheck.dictionary=direct&spellcheck.count=1&spellcheck.collate=true&spellcheck.maxCollationTries=1&spellcheck.maxCollations=1&spellcheck.collateExtendedResults=true&qt=spellCheckCompRH&q=teststop%3Ametnoia&spellcheck.collateMaxCollectDocs=3} hits=0 status=0 QTime=6 
   [junit4]   2> ASYNC  NEW_CORE C264 name=collection1 org.apache.solr.core.SolrCore@1439e04b
   [junit4]   2> 642237 T2080 C264 oasc.SolrCore.execute [collection1] webapp=null path=null params={spellcheck=true&spellcheck.dictionary=direct&spellcheck.count=1&spellcheck.collate=true&spellcheck.maxCollationTries=1&spellcheck.maxCollations=1&spellcheck.collateExtendedResults=true&qt=spellCheckCompRH&q=teststop%3Ametnoia&spellcheck.collateMaxCollectDocs=3} hits=0 status=0 QTime=7 
   [junit4]   2> 642248 T2080 C264 oasc.SolrCore.execute [collection1] webapp=null path=null params={spellcheck=true&spellcheck.dictionary=direct&spellcheck.count=1&spellcheck.collate=true&spellcheck.maxCollationTries=1&spellcheck.maxCollations=1&spellcheck.collateExtendedResults=true&qt=spellCheckCompRH&q=teststop%3Ametnoia&spellcheck.collateMaxCollectDocs=8} hits=0 status=0 QTime=6 
   [junit4]   2> 642260 T2080 C264 oasc.SolrCore.execute [collection1] webapp=null path=null params={spellcheck=true&spellcheck.dictionary=direct&spellcheck.count=1&spellcheck.collate=true&spellcheck.maxCollationTries=1&spellcheck.maxCollations=1&spellcheck.collateExtendedResults=true&qt=spellCheckCompRH&q=teststop%3Ametnoia&spellcheck.collateMaxCollectDocs=2} hits=0 status=0 QTime=7 
   [junit4]   2> 642272 T2080 C264 oasc.SolrCore.execute [collection1] webapp=null path=null params={spellcheck=true&spellcheck.dictionary=direct&spellcheck.count=1&spellcheck.collate=true&spellcheck.maxCollationTries=1&spellcheck.maxCollations=1&spellcheck.collateExtendedResults=true&qt=spellCheckCompRH&q=teststop%3Ametnoia&spellcheck.collateMaxCollectDocs=17} hits=0 status=0 QTime=7 
   [junit4]   2> 642285 T2080 C264 oasc.SolrCore.execute [collection1] webapp=null path=null params={spellcheck=true&spellcheck.dictionary=direct&spellcheck.count=1&spellcheck.collate=true&spellcheck.maxCollationTries=1&spellcheck.maxCollations=1&spellcheck.collateExtendedResults=true&qt=spellCheckCompRH&q=teststop%3Ametnoia&spellcheck.collateMaxCollectDocs=6} hits=0 status=0 QTime=7 
   [junit4]   2> 642298 T2080 C264 oasc.SolrCore.execute [collection1] webapp=null path=null params={spellcheck=true&spellcheck.dictionary=direct&spellcheck.count=1&spellcheck.collate=true&spellcheck.maxCollationTries=1&spellcheck.maxCollations=1&spellcheck.collateExtendedResults=true&qt=spellCheckCompRH&q=teststop%3Ametnoia&spellcheck.collateMaxCollectDocs=13} hits=0 status=0 QTime=7 
   [junit4]   2> 642312 T2080 C264 oasc.SolrCore.execute [collection1] webapp=null path=null params={spellcheck=true&spellcheck.dictionary=direct&spellcheck.count=1&spellcheck.collate=true&spellcheck.maxCollationTries=1&spellcheck.maxCollations=1&spellcheck.collateExtendedResults=true&qt=spellCheckCompRH&q=teststop%3Ametnoia&spellcheck.collateMaxCollectDocs=5} hits=0 status=0 QTime=8 
   [junit4]   2> 642324 T2080 C264 oasc.SolrCore.execute [collection1] webapp=null path=null params={spellcheck=true&spellcheck.dictionary=direct&spellcheck.count=1&spellcheck.collate=true&spellcheck.maxCollationTries=1&spellcheck.maxCollations=1&spellcheck.collateExtendedResults=true&qt=spellCheckCompRH&q=teststop%3Ametnoia&spellcheck.collateMaxCollectDocs=15} hits=0 status=0 QTime=7 
   [junit4]   2> 642336 T2080 C264 oasc.SolrCore.execute [collection1] webapp=null path=null params={spellcheck=true&spellcheck.dictionary=direct&spellcheck.count=1&spellcheck.collate=true&spellcheck.maxCollationTries=1&spellcheck.maxCollations=1&spellcheck.collateExtendedResults=true&qt=spellCheckCompRH&q=teststop%3Ametnoia&spellcheck.collateMaxCollectDocs=9} hits=0 status=0 QTime=7 
   [junit4]   2> 642349 T2080 C264 oasc.SolrCore.execute [collection1] webapp=null path=null params={spellcheck=true&spellcheck.dictionary=direct&spellcheck.count=1&spellcheck.collate=true&spellcheck.maxCollationTries=1&spellcheck.maxCollations=1&spellcheck.collateExtendedResults=true&qt=spellCheckCompRH&q=teststop%3Ametnoia&spellcheck.collateMaxCollectDocs=3} hits=0 status=0 QTime=8 
   [junit4]   2> 642360 T2080 C264 oasc.SolrCore.execute [collection1] webapp=null path=null params={spellcheck=true&spellcheck.dictionary=direct&spellcheck.count=1&spellcheck.collate=true&spellcheck.maxCollationTries=1&spellcheck.maxCollations=1&spellcheck.collateExtendedResults=true&qt=spellCheckCompRH&q=teststop%3Ametnoia&spellcheck.collateMaxCollectDocs=9} hits=0 status=0 QTime=6 
   [junit4]   2> 642370 T2080 C264 oasc.SolrCore.execute [collection1] webapp=null path=null params={spellcheck=true&spellcheck.dictionary=direct&spellcheck.count=1&spellcheck.collate=true&spellcheck.maxCollationTries=1&spellcheck.maxCollations=1&spellcheck.collateExtendedResults=true&qt=spellCheckCompRH&q=teststop%3Ametnoia&spellcheck.collateMaxCollectDocs=14} hits=0 status=0 QTime=6 
   [junit4]   2> 642381 T2080 C264 oasc.SolrCore.execute [collection1] webapp=null path=null params={spellcheck=true&spellcheck.dictionary=direct&spellcheck.count=1&spellcheck.collate=true&spellcheck.maxCollationTries=1&spellcheck.maxCollations=1&spellcheck.collateExtendedResults=true&qt=spellCheckCompRH&q=teststop%3Ametnoia&spellcheck.collateMaxCollectDocs=17} hits=0 status=0 QTime=6 
   [junit4]   2> 642391 T2080 C264 oasc.SolrCore.execute [collection1] webapp=null path=null params={spellcheck=true&spellcheck.dictionary=direct&spellcheck.count=1&spellcheck.collate=true&spellcheck.maxCollationTries=1&spellcheck.maxCollations=1&spellcheck.collateExtendedResults=true&qt=spellCheckCompRH&q=teststop%3Ametnoia&spellcheck.collateMaxCollectDocs=10} hits=0 status=0 QTime=5 
   [junit4]   2> 642402 T2080 C264 oasc.SolrCore.execute [collection1] webapp=null path=null params={spellcheck=true&spellcheck.dictionary=direct&spellcheck.count=1&spellcheck.collate=true&spellcheck.maxCollationTries=1&spellcheck.maxCollations=1&spellcheck.collateExtendedResults=true&qt=spellCheckCompRH&q=teststop%3Ametnoia&spellcheck.collateMaxCollectDocs=11} hits=0 status=0 QTime=5 
   [junit4]   2> 642413 T2080 C264 oasc.SolrCore.execute [collection1] webapp=null path=null params={spellcheck=true&spellcheck.dictionary=direct&spellcheck.count=1&spellcheck.collate=true&spellcheck.maxCollationTries=1&spellcheck.maxCollations=1&spellcheck.collateExtendedResults=true&qt=spellCheckCompRH&q=teststop%3Ametnoia&spellcheck.collateMaxCollectDocs=1} hits=0 status=0 QTime=6 
   [junit4]   2> 642424 T2080 C264 oasc.SolrCore.execute [collection1] webapp=null path=null params={spellcheck=true&spellcheck.dictionary=direct&spellcheck.count=1&spellcheck.collate=true&spellcheck.maxCollationTries=1&spellcheck.maxCollations=1&spellcheck.collateExtendedResults=true&qt=spellCheckCompRH&q=teststop%3Ametnoia&spellcheck.collateMaxCollectDocs=3} hits=0 status=0 QTime=5 
   [junit4]   2> 642434 T2080 C264 oasc.SolrCore.execute [collection1] webapp=null path=null params={spellcheck=true&spellcheck.dictionary=direct&spellcheck.count=1&spellcheck.collate=true&spellcheck.maxCollationTries=1&spellcheck.maxCollations=1&spellcheck.collateExtendedResults=true&qt=spellCheckCompRH&q=teststop%3Ametnoia&spellcheck.collateMaxCollectDocs=3} hits=0 status=0 QTime=5 
   [junit4]   2> 642443 T2080 C264 oasc.SolrCore.execute [collection1] webapp=null path=null params={spellcheck=true&spellcheck.dictionary=direct&spellcheck.count=1&spellcheck.collate=true&spellcheck.maxCollationTries=1&spellcheck.maxCollations=1&spellcheck.collateExtendedResults=true&qt=spellCheckCompRH&q=teststop%3Ametnoia&spellcheck.collateMaxCollectDocs=8} hits=0 status=0 QTime=5 
   [junit4]   2> 642453 T2080 C264 oasc.SolrCore.execute [collection1] webapp=null path=null params={spellcheck=true&spellcheck.dictionary=direct&spellcheck.count=1&spellcheck.collate=true&spellcheck.maxCollationTries=1&spellcheck.maxCollations=1&spellcheck.collateExtendedResults=true&qt=spellCheckCompRH&q=teststop%3Ametnoia&spellcheck.collateMaxCollectDocs=15} hits=0 status=0 QTime=5 
   [junit4]   2> 642463 T2080 C264 oasc.SolrCore.execute [collection1] webapp=null path=null params={spellcheck=true&spellcheck.dictionary=direct&spellcheck.count=1&spellcheck.collate=true&spellcheck.maxCollationTries=1&spellcheck.maxCollations=1&spellcheck.collateExtendedResults=true&qt=spellCheckCompRH&q=teststop%3Ametnoia&spellcheck.collateMaxCollectDocs=17} hits=0 status=0 QTime=6 
   [junit4]   2> 642472 T2080 C264 oasc.SolrCore.execute [collection1] webapp=null path=null params={spellcheck=true&spellcheck.dictionary=direct&spellcheck.count=1&spellcheck.collate=true&spellcheck.maxCollationTries=1&spellcheck.maxCollations=1&spellcheck.collateExtendedResults=true&qt=spellCheckCompRH&q=teststop%3Ametnoia&spellcheck.collateMaxCollectDocs=7} hits=0 status=0 QTime=5 
   [junit4]   2> 642482 T2080 C264 oasc.SolrCore.execute [collection1] webapp=null path=null params={spellcheck=true&spellcheck.dictionary=direct&spellcheck.count=1&spellcheck.collate=true&spellcheck.maxCollationTries=1&spellcheck.maxCollations=1&spellcheck.collateExtendedResults=true&qt=spellCheckCompRH&q=teststop%3Ametnoia&spellcheck.collateMaxCollectDocs=2} hits=0 status=0 QTime=5 
   [junit4]   2> 642491 T2080 C264 oasc.SolrCore.execute [collection1] webapp=null path=null params={spellcheck=true&spellcheck.dictionary=direct&spellcheck.count=1&spellcheck.collate=true&spellcheck.maxCollationTries=1&spellcheck.maxCollations=1&spellcheck.collateExtendedResults=true&qt=spellCheckCompRH&q=teststop%3Ametnoia&spellcheck.collateMaxCollectDocs=10} hits=0 status=0 QTime=5 
   [junit4]   2> 642501 T2080 C264 oasc.SolrCore.execute [collection1] webapp=null path=null params={spellcheck=true&spellcheck.dictionary=direct&spellcheck.count=1&spellcheck.collate=true&spellcheck.maxCollationTries=1&spellcheck.maxCollations=1&spellcheck.collateExtendedResults=true&qt=spellCheckCompRH&q=teststop%3Ametnoia&spellcheck.collateMaxCollectDocs=14} hits=0 status=0 QTime=6 
   [junit4]   2> 642511 T2080 C264 oasc.SolrCore.execute [collection1] webapp=null path=null params={spellcheck=true&spellcheck.dictionary=direct&spellcheck.count=1&spellcheck.collate=true&spellcheck.maxCollationTries=1&spellcheck.maxCollations=1&spellcheck.collateExtendedResults=true&qt=spellCheckCompRH&q=teststop%3Ametnoia&spellcheck.collateMaxCollectDocs=9} hits=0 status=0 QTime=5 
   [junit4]   2> 642520 T2080 C264 oasc.SolrCore.execute [collection1] webapp=null path=null params={spellcheck=true&spellcheck.dictionary=direct&spellcheck.count=1&spellcheck.collate=true&spellcheck.maxCollationTries=1&spellcheck.maxCollations=1&spellcheck.collateExtendedResults=true&qt=spellCheckCompRH&q=teststop%3Ametnoia&spellcheck.collateMaxCollectDocs=10} hits=0 status=0 QTime=5 
   [junit4]   2> 642529 T2080 C264 oasc.SolrCore.execute [collection1] webapp=null path=null params={spellcheck=true&spellcheck.dictionary=direct&spellcheck.count=1&spellcheck.collate=true&spellcheck.maxCollationTries=1&spellcheck.maxCollations=1&spellcheck.collateExtendedResults=true&qt=spellCheckCompRH&q=teststop%3Ametnoia&spellcheck.collateMaxCollectDocs=12} hits=0 status=0 QTime=4 
   [junit4]   2> 642538 T2080 C264 oasc.SolrCore.execute [collection1] webapp=null path=null params={spellcheck=true&spellcheck.dictionary=direct&spellcheck.count=1&spellcheck.collate=true&spellcheck.maxCollationTries=1&spellcheck.maxCollations=1&spellcheck.collateExtendedResults=true&qt=spellCheckCompRH&q=teststop%3Ametnoia&spellcheck.collateMaxCollectDocs=3} hits=0 status=0 QTime=4 
   [junit4]   2> 642547 T2080 C264 oasc.SolrCore.execute [collection1] webapp=null path=null params={spellcheck=true&spellcheck.dictionary=direct&spellcheck.count=1&spellcheck.collate=true&spellcheck.maxCollationTries=1&spellcheck.maxCollations=1&spellcheck.collateExtendedResults=true&qt=spellCheckCompRH&q=teststop%3Ametnoia&spellcheck.collateMaxCollectDocs=1} hits=0 status=0 QTime=4 
   [junit4]   2> 642557 T2080 C264 oasc.SolrCore.execute [collection1] webapp=null path=null params={spellcheck=true&spellcheck.dictionary=direct&spellcheck.count=1&spellcheck.collate=true&spellcheck.maxCollationTries=1&spellcheck.maxCollations=1&spellcheck.collateExtendedResults=true&qt=spellCheckCompRH&q=teststop%3Aeverother&spellcheck.collateMaxCollectDocs=5} hits=0 status=0 QTime=5 
   [junit4]   2> 642562 T2080 oas.SolrTestCaseJ4.assertQ ERROR REQUEST FAILED: xpath=//lst[@name='spellcheck']/lst[@name='suggestions']/lst[@name='collation']/int[@name='hits' and 6 <= . and . <= 10]
   [junit4]   2> 		xml response was: <?xml version="1.0" encoding="UTF-8"?>
   [junit4]   2> 	<response>
   [junit4]   2> 	<lst name="responseHeader"><int name="status">0</int><int name="QTime">5</int></lst><result name="response" numFound="0" start="0"></result><lst name="spellcheck"><lst name="suggestions"><lst name="everother"><int name="numFound">1</int><int name="startOffset">9</int><int name="endOffset">18</int><arr name="suggestion"><str>everyother</str></arr></lst><lst name="collation"><str name="collationQuery">teststop:everyother</str><int name="hits">12</int><lst name="misspellingsAndCorrections"><str name="everother">everyother</str></lst></lst></lst></lst>
   [junit4]   2> 	</response>
   [junit4]   2> 	
   [junit4]   2> 		request was:spellcheck=true&spellcheck.dictionary=direct&spellcheck.count=1&spellcheck.collate=true&spellcheck.maxCollationTries=1&spellcheck.maxCollations=1&spellcheck.collateExtendedResults=true&qt=spellCheckCompRH&q=teststop%3Aeverother&spellcheck.collateMaxCollectDocs=5
   [junit4]   2> 642564 T2080 oasc.SolrException.log ERROR REQUEST FAILED: spellcheck=true&spellcheck.dictionary=direct&spellcheck.count=1&spellcheck.collate=true&spellcheck.maxCollationTries=1&spellcheck.maxCollations=1&spellcheck.collateExtendedResults=true&qt=spellCheckCompRH&q=teststop%3Aeverother&spellcheck.collateMaxCollectDocs=5:java.lang.RuntimeException: REQUEST FAILED: xpath=//lst[@name='spellcheck']/lst[@name='suggestions']/lst[@name='collation']/int[@name='hits' and 6 <= . and . <= 10]
   [junit4]   2> 		xml response was: <?xml version="1.0" encoding="UTF-8"?>
   [junit4]   2> 	<response>
   [junit4]   2> 	<lst name="responseHeader"><int name="status">0</int><int name="QTime">5</int></lst><result name="response" numFound="0" start="0"></result><lst name="spellcheck"><lst name="suggestions"><lst name="everother"><int name="numFound">1</int><int name="startOffset">9</int><int name="endOffset">18</int><arr name="suggestion"><str>everyother</str></arr></lst><lst name="collation"><str name="collationQuery">teststop:everyother</str><int name="hits">12</int><lst name="misspellingsAndCorrections"><str name="everother">everyother</str></lst></lst></lst></lst>
   [junit4]   2> 	</response>
   [junit4]   2> 	
   [junit4]   2> 		request was:spellcheck=true&spellcheck.dictionary=direct&spellcheck.count=1&spellcheck.collate=true&spellcheck.maxCollationTries=1&spellcheck.maxCollations=1&spellcheck.collateExtendedResults=true&qt=spellCheckCompRH&q=teststop%3Aeverother&spellcheck.collateMaxCollectDocs=5
   [junit4]   2> 		at org.apache.solr.SolrTestCaseJ4.assertQ(SolrTestCaseJ4.java:630)
   [junit4]   2> 		at org.apache.solr.SolrTestCaseJ4.assertQ(SolrTestCaseJ4.java:604)
   [junit4]   2> 		at org.apache.solr.spelling.SpellCheckCollatorTest.testEstimatedHitCounts(SpellCheckCollatorTest.java:521)
   [junit4]   2> 		at sun.reflect.NativeMethodAccessorImpl.invoke0(Native Method)
   [junit4]   2> 		at sun.reflect.NativeMethodAccessorImpl.invoke(NativeMethodAccessorImpl.java:57)
   [junit4]   2> 		at sun.reflect.DelegatingMethodAccessorImpl.invoke(DelegatingMethodAccessorImpl.java:43)
   [junit4]   2> 		at java.lang.reflect.Method.invoke(Method.java:606)
   [junit4]   2> 		at com.carrotsearch.randomizedtesting.RandomizedRunner.invoke(RandomizedRunner.java:1559)
   [junit4]   2> 		at com.carrotsearch.randomizedtesting.RandomizedRunner.access$600(RandomizedRunner.java:79)
   [junit4]   2> 		at com.carrotsearch.randomizedtesting.RandomizedRunner$6.evaluate(RandomizedRunner.java:737)
   [junit4]   2> 		at com.carrotsearch.randomizedtesting.RandomizedRunner$7.evaluate(RandomizedRunner.java:773)
   [junit4]   2> 		at com.carrotsearch.randomizedtesting.RandomizedRunner$8.evaluate(RandomizedRunner.java:787)
   [junit4]   2> 		at com.carrotsearch.randomizedtesting.rules.SystemPropertiesRestoreRule$1.evaluate(SystemPropertiesRestoreRule.java:53)
   [junit4]   2> 		at org.apache.lucene.util.TestRuleSetupTeardownChained$1.evaluate(TestRuleSetupTeardownChained.java:50)
   [junit4]   2> 		at org.apache.lucene.util.TestRuleFieldCacheSanity$1.evaluate(TestRuleFieldCacheSanity.java:51)
   [junit4]   2> 		at org.apache.lucene.util.AbstractBeforeAfterRule$1.evaluate(AbstractBeforeAfterRule.java:46)
   [junit4]   2> 		at com.carrotsearch.randomizedtesting.rules.SystemPropertiesInvariantRule$1.evaluate(SystemPropertiesInvariantRule.java:55)
   [junit4]   2> 		at org.apache.lucene.util.TestRuleThreadAndTestName$1.evaluate(TestRuleThreadAndTestName.java:49)
   [junit4]   2> 		at org.apache.lucene.util.TestRuleIgnoreAfterMaxFailures$1.evaluate(TestRuleIgnoreAfterMaxFailures.java:70)
   [junit4]   2> 		at org.apache.lucene.util.TestRuleMarkFailure$1.evaluate(TestRuleMarkFailure.java:48)
   [junit4]   2> 		at com.carrotsearch.randomizedtesting.rules.StatementAdapter.evaluate(StatementAdapter.java:36)
   [junit4]   2> 		at com.carrotsearch.randomizedtesting.ThreadLeakControl$StatementRunner.run(ThreadLeakControl.java:358)
   [junit4]   2> 		at com.carrotsearch.randomizedtesting.ThreadLeakControl.forkTimeoutingTask(ThreadLeakControl.java:782)
   [junit4]   2> 		at com.carrotsearch.randomizedtesting.ThreadLeakControl$3.evaluate(ThreadLeakControl.java:442)
   [junit4]   2> 		at com.carrotsearch.randomizedtesting.RandomizedRunner.runSingleTest(RandomizedRunner.java:746)
   [junit4]   2> 		at com.carrotsearch.randomizedtesting.RandomizedRunner$3.evaluate(RandomizedRunner.java:648)
   [junit4]   2> 		at com.carrotsearch.randomizedtesting.RandomizedRunner$4.evaluate(RandomizedRunner.java:682)
   [junit4]   2> 		at com.carrotsearch.randomizedtesting.RandomizedRunner$5.evaluate(RandomizedRunner.java:693)
   [junit4]   2> 		at com.carrotsearch.randomizedtesting.rules.StatementAdapter.evaluate(StatementAdapter.java:36)
   [junit4]   2> 		at com.carrotsearch.randomizedtesting.rules.SystemPropertiesRestoreRule$1.evaluate(SystemPropertiesRestoreRule.java:53)
   [junit4]   2> 		at org.apache.lucene.util.AbstractBeforeAfterRule$1.evaluate(AbstractBeforeAfterRule.java:46)
   [junit4]   2> 		at org.apache.lucene.util.TestRuleStoreClassName$1.evaluate(TestRuleStoreClassName.java:42)
   [junit4]   2> 		at com.carrotsearch.randomizedtesting.rules.SystemPropertiesInvariantRule$1.evaluate(SystemPropertiesInvariantRule.java:55)
   [junit4]   2> 		at com.carrotsearch.randomizedtesting.rules.NoShadowingOrOverridesOnMethodsRule$1.evaluate(NoShadowingOrOverridesOnMethodsRule.java:39)
   [junit4]   2> 		at com.carrotsearch.randomizedtesting.rules.NoShadowingOrOverridesOnMethodsRule$1.evaluate(NoShadowingOrOverridesOnMethodsRule.java:39)
   [junit4]   2> 		at com.carrotsearch.randomizedtesting.rules.StatementAdapter.evaluate(StatementAdapter.java:36)
   [junit4]   2> 		at org.apache.lucene.util.TestRuleAssertionsRequired$1.evaluate(TestRuleAssertionsRequired.java:43)
   [junit4]   2> 		at org.apache.lucene.util.TestRuleMarkFailure$1.evaluate(TestRuleMarkFailure.java:48)
   [junit4]   2> 		at org.apache.lucene.util.TestRuleIgnoreAfterMaxFailures$1.evaluate(TestRuleIgnoreAfterMaxFailures.java:70)
   [junit4]   2> 		at org.apache.lucene.util.TestRuleIgnoreTestSuites$1.evaluate(TestRuleIgnoreTestSuites.java:55)
   [junit4]   2> 		at com.carrotsearch.randomizedtesting.rules.StatementAdapter.evaluate(StatementAdapter.java:36)
   [junit4]   2> 		at com.carrotsearch.randomizedtesting.ThreadLeakControl$StatementRunner.run(ThreadLeakControl.java:358)
   [junit4]   2> 		at java.lang.Thread.run(Thread.java:724)
   [junit4]   2> 	
   [junit4]   2> 642565 T2080 oas.SolrTestCaseJ4.tearDown ###Ending testEstimatedHitCounts
   [junit4]   2> NOTE: download the large Jenkins line-docs file by running 'ant get-jenkins-line-docs' in the lucene directory.
   [junit4]   2> NOTE: reproduce with: ant test  -Dtestcase=SpellCheckCollatorTest -Dtests.method=testEstimatedHitCounts -Dtests.seed=75B3F4FA463088FB -Dtests.multiplier=2 -Dtests.nightly=true -Dtests.slow=true -Dtests.linedocsfile=/home/hudson/lucene-data/enwiki.random.lines.txt -Dtests.locale=es_PA -Dtests.timezone=Pacific/Gambier -Dtests.file.encoding=US-ASCII
   [junit4] ERROR   0.67s J1 | SpellCheckCollatorTest.testEstimatedHitCounts <<<
   [junit4]    > Throwable #1: java.lang.RuntimeException: Exception during query
   [junit4]    > 	at __randomizedtesting.SeedInfo.seed([75B3F4FA463088FB:44084ACFE30F982B]:0)
   [junit4]    > 	at org.apache.solr.SolrTestCaseJ4.assertQ(SolrTestCaseJ4.java:637)
   [junit4]    > 	at org.apache.solr.SolrTestCaseJ4.assertQ(SolrTestCaseJ4.java:604)
   [junit4]    > 	at org.apache.solr.spelling.SpellCheckCollatorTest.testEstimatedHitCounts(SpellCheckCollatorTest.java:521)
   [junit4]    > 	at java.lang.Thread.run(Thread.java:724)
   [junit4]    > Caused by: java.lang.RuntimeException: REQUEST FAILED: xpath=//lst[@name='spellcheck']/lst[@name='suggestions']/lst[@name='collation']/int[@name='hits' and 6 <= . and . <= 10]
   [junit4]    > 	xml response was: <?xml version="1.0" encoding="UTF-8"?>
   [junit4]    > <response>
   [junit4]    > <lst name="responseHeader"><int name="status">0</int><int name="QTime">5</int></lst><result name="response" numFound="0" start="0"></result><lst name="spellcheck"><lst name="suggestions"><lst name="everother"><int name="numFound">1</int><int name="startOffset">9</int><int name="endOffset">18</int><arr name="suggestion"><str>everyother</str></arr></lst><lst name="collation"><str name="collationQuery">teststop:everyother</str><int name="hits">12</int><lst name="misspellingsAndCorrections"><str name="everother">everyother</str></lst></lst></lst></lst>
   [junit4]    > </response>
   [junit4]    > 	request was:spellcheck=true&spellcheck.dictionary=direct&spellcheck.count=1&spellcheck.collate=true&spellcheck.maxCollationTries=1&spellcheck.maxCollations=1&spellcheck.collateExtendedResults=true&qt=spellCheckCompRH&q=teststop%3Aeverother&spellcheck.collateMaxCollectDocs=5
   [junit4]    > 	at org.apache.solr.SolrTestCaseJ4.assertQ(SolrTestCaseJ4.java:630)
   [junit4]    > 	... 42 more
   [junit4]   2> 642585 T2080 oas.SolrTestCaseJ4.setUp ###Starting testCollateWithMultipleRequestHandlers
   [junit4]   2> 642663 T2080 oas.SolrTestCaseJ4.tearDown ###Ending testCollateWithMultipleRequestHandlers
   [junit4]   2> 642669 T2080 oas.SolrTestCaseJ4.setUp ###Starting testCollateWithOverride
   [junit4]   2> 642764 T2080 C264 oasc.SolrCore.execute [collection1] webapp=null path=null params={mm=1&spellcheck=true&q=partisian+politcal+mashine&spellcheck.maxCollations=10&spellcheck.maxCollationTries=10&qf=teststop&spellcheck.dictionary=direct&spellcheck.count=10&qt=spellCheckCompRH&spellcheck.collate=true&defType=edismax} hits=0 status=0 QTime=94 
   [junit4]   2> 642790 T2080 C264 oasc.SolrCore.execute [collection1] webapp=null path=null params={mm=1&spellcheck=true&spellcheck.collateParam.mm=100%25&q=partisian+politcal+mashine&spellcheck.maxCollations=10&spellcheck.maxCollationTries=10&qf=teststop&spellcheck.dictionary=direct&spellcheck.count=10&qt=spellCheckCompRH&spellcheck.collate=true&defType=edismax} hits=0 status=0 QTime=16 
   [junit4]   2> 642794 T2080 oas.SolrTestCaseJ4.tearDown ###Ending testCollateWithOverride
   [junit4]   2> 642801 T2080 oas.SolrTestCaseJ4.setUp ###Starting testCollationWithHypens
   [junit4]   2> 642947 T2080 oas.SolrTestCaseJ4.tearDown ###Ending testCollationWithHypens
   [junit4]   2> 642953 T2080 oas.SolrTestCaseJ4.setUp ###Starting testCollateWithGrouping
   [junit4]   2> 643058 T2080 oas.SolrTestCaseJ4.tearDown ###Ending testCollateWithGrouping
   [junit4]   2> 643061 T2080 oas.SolrTestCaseJ4.deleteCore ###deleteCore
   [junit4]   2> 643061 T2080 oasc.CoreContainer.shutdown Shutting down CoreContainer instance=1962678700
   [junit4]   2> 643062 T2080 oasc.SolrCore.close [collection1]  CLOSING SolrCore org.apache.solr.core.SolrCore@1439e04b
   [junit4]   2> 643062 T2080 oasu.DirectUpdateHandler2.close closing DirectUpdateHandler2{commits=1,autocommits=0,soft autocommits=0,optimizes=0,rollbacks=0,expungeDeletes=0,docsPending=0,adds=0,deletesById=0,deletesByQuery=0,errors=0,cumulative_adds=17,cumulative_deletesById=0,cumulative_deletesByQuery=0,cumulative_errors=0}
   [junit4]   2> 643062 T2080 oasu.SolrCoreState.decrefSolrCoreState Closing SolrCoreState
   [junit4]   2> 643062 T2080 oasu.DefaultSolrCoreState.closeIndexWriter SolrCoreState ref count has reached 0 - closing IndexWriter
   [junit4]   2> 643063 T2080 oasu.DefaultSolrCoreState.closeIndexWriter closing IndexWriter with IndexWriterCloser
   [junit4]   2> 643064 T2080 oasc.SolrCore.closeSearcher [collection1] Closing main searcher on request.
   [junit4]   2> 643065 T2080 oasc.CachingDirectoryFactory.close Closing MockDirectoryFactory - 2 directories currently being tracked
   [junit4]   2> 643065 T2080 oasc.CachingDirectoryFactory.closeCacheValue looking to close /usr/home/hudson/hudson-slave/workspace/Lucene-Solr-NightlyTests-trunk/solr/build/solr-core/test/J1/./solrtest-SpellCheckCollatorTest-1378037576000/index [CachedDir<<refCount=0;path=/usr/home/hudson/hudson-slave/workspace/Lucene-Solr-NightlyTests-trunk/solr/build/solr-core/test/J1/./solrtest-SpellCheckCollatorTest-1378037576000/index;done=false>>]
   [junit4]   2> 643066 T2080 oasc.CachingDirectoryFactory.close Closing directory: /usr/home/hudson/hudson-slave/workspace/Lucene-Solr-NightlyTests-trunk/solr/build/solr-core/test/J1/./solrtest-SpellCheckCollatorTest-1378037576000/index
   [junit4]   2> 643066 T2080 oasc.CachingDirectoryFactory.closeCacheValue looking to close /usr/home/hudson/hudson-slave/workspace/Lucene-Solr-NightlyTests-trunk/solr/build/solr-core/test/J1/./solrtest-SpellCheckCollatorTest-1378037576000 [CachedDir<<refCount=0;path=/usr/home/hudson/hudson-slave/workspace/Lucene-Solr-NightlyTests-trunk/solr/build/solr-core/test/J1/./solrtest-SpellCheckCollatorTest-1378037576000;done=false>>]
   [junit4]   2> 643066 T2080 oasc.CachingDirectoryFactory.close Closing directory: /usr/home/hudson/hudson-slave/workspace/Lucene-Solr-NightlyTests-trunk/solr/build/solr-core/test/J1/./solrtest-SpellCheckCollatorTest-1378037576000
   [junit4]   2> NOTE: test params are: codec=FastCompressingStoredFields(storedFieldsFormat=CompressingStoredFieldsFormat(compressionMode=FAST, chunkSize=241), termVectorsFormat=CompressingTermVectorsFormat(compressionMode=FAST, chunkSize=241)), sim=DefaultSimilarity, locale=es_PA, timezone=Pacific/Gambier
   [junit4]   2> NOTE: FreeBSD 9.1-RELEASE-p3 amd64/Oracle Corporation 1.7.0_25 (64-bit)/cpus=16,threads=1,free=78105664,total=280297472
   [junit4]   2> NOTE: All tests run in this JVM: [CurrencyFieldXmlFileTest, TestHashPartitioner, AliasIntegrationTest, TestSolr4Spatial, TestStressReorder, TestStressRecovery, OutputWriterTest, TestAtomicUpdateErrorCases, TestZkChroot, CoreContainerCoreInitFailuresTest, TestArbitraryIndexDir, HardAutoCommitTest, HdfsDirectoryTest, BasicZkTest, TestAnalyzedSuggestions, BlockCacheTest, TestSolrJ, SolrPluginUtilsTest, TestBinaryResponseWriter, TestCoreDiscovery, TestJmxIntegration, BadIndexSchemaTest, DirectUpdateHandlerTest, TestDistributedGrouping, QueryResultKeyTest, TestRandomMergePolicy, PingRequestHandlerTest, NoCacheHeaderTest, SolrIndexConfigTest, HighlighterTest, LeaderElectionIntegrationTest, TestFieldCollectionResource, PathHierarchyTokenizerFactoryTest, StressHdfsTest, TestSchemaResource, TestAddFieldRealTimeGet, OpenExchangeRatesOrgProviderTest, TestXIncludeConfig, TermVectorComponentDistributedTest, SpellCheckCollatorTest]
   [junit4] Completed on J1 in 4.31s, 8 tests, 1 error <<< FAILURES!

[...truncated 670 lines...]
BUILD FAILED
/usr/home/hudson/hudson-slave/workspace/Lucene-Solr-NightlyTests-trunk/build.xml:403: The following error occurred while executing this line:
/usr/home/hudson/hudson-slave/workspace/Lucene-Solr-NightlyTests-trunk/build.xml:376: The following error occurred while executing this line:
/usr/home/hudson/hudson-slave/workspace/Lucene-Solr-NightlyTests-trunk/build.xml:39: The following error occurred while executing this line:
/usr/home/hudson/hudson-slave/workspace/Lucene-Solr-NightlyTests-trunk/solr/build.xml:189: The following error occurred while executing this line:
/usr/home/hudson/hudson-slave/workspace/Lucene-Solr-NightlyTests-trunk/solr/common-build.xml:455: The following error occurred while executing this line:
/usr/home/hudson/hudson-slave/workspace/Lucene-Solr-NightlyTests-trunk/lucene/common-build.xml:1230: The following error occurred while executing this line:
/usr/home/hudson/hudson-slave/workspace/Lucene-Solr-NightlyTests-trunk/lucene/common-build.xml:873: There were test failures: 324 suites, 1410 tests, 1 error, 33 ignored (4 assumptions)

Total time: 109 minutes 59 seconds
Build step 'Invoke Ant' marked build as failure
Archiving artifacts
Recording test results
Email was triggered for: Failure
Sending email for trigger: Failure



Mime
View raw message