lucene-dev mailing list archives

Site index · List index
Message view « Date » · « Thread »
Top « Date » · « Thread »
From Policeman Jenkins Server <jenk...@thetaphi.de>
Subject [JENKINS] Lucene-Solr-trunk-Linux (64bit/jdk1.8.0-ea-b102) - Build # 7371 - Failure!
Date Sun, 08 Sep 2013 09:25:55 GMT
Build: http://jenkins.thetaphi.de/job/Lucene-Solr-trunk-Linux/7371/
Java: 64bit/jdk1.8.0-ea-b102 -XX:+UseCompressedOops -XX:+UseSerialGC

1 tests failed.
REGRESSION:  org.apache.solr.spelling.SpellCheckCollatorTest.testEstimatedHitCounts

Error Message:
Exception during query

Stack Trace:
java.lang.RuntimeException: Exception during query
	at __randomizedtesting.SeedInfo.seed([EAD13915CDD8580D:DB6A872068E748DD]:0)
	at org.apache.solr.SolrTestCaseJ4.assertQ(SolrTestCaseJ4.java:637)
	at org.apache.solr.SolrTestCaseJ4.assertQ(SolrTestCaseJ4.java:604)
	at org.apache.solr.spelling.SpellCheckCollatorTest.testEstimatedHitCounts(SpellCheckCollatorTest.java:521)
	at sun.reflect.NativeMethodAccessorImpl.invoke0(Native Method)
	at sun.reflect.NativeMethodAccessorImpl.invoke(NativeMethodAccessorImpl.java:57)
	at sun.reflect.DelegatingMethodAccessorImpl.invoke(DelegatingMethodAccessorImpl.java:43)
	at java.lang.reflect.Method.invoke(Method.java:491)
	at com.carrotsearch.randomizedtesting.RandomizedRunner.invoke(RandomizedRunner.java:1559)
	at com.carrotsearch.randomizedtesting.RandomizedRunner.access$600(RandomizedRunner.java:79)
	at com.carrotsearch.randomizedtesting.RandomizedRunner$6.evaluate(RandomizedRunner.java:737)
	at com.carrotsearch.randomizedtesting.RandomizedRunner$7.evaluate(RandomizedRunner.java:773)
	at com.carrotsearch.randomizedtesting.RandomizedRunner$8.evaluate(RandomizedRunner.java:787)
	at com.carrotsearch.randomizedtesting.rules.SystemPropertiesRestoreRule$1.evaluate(SystemPropertiesRestoreRule.java:53)
	at org.apache.lucene.util.TestRuleSetupTeardownChained$1.evaluate(TestRuleSetupTeardownChained.java:50)
	at org.apache.lucene.util.TestRuleFieldCacheSanity$1.evaluate(TestRuleFieldCacheSanity.java:51)
	at org.apache.lucene.util.AbstractBeforeAfterRule$1.evaluate(AbstractBeforeAfterRule.java:46)
	at com.carrotsearch.randomizedtesting.rules.SystemPropertiesInvariantRule$1.evaluate(SystemPropertiesInvariantRule.java:55)
	at org.apache.lucene.util.TestRuleThreadAndTestName$1.evaluate(TestRuleThreadAndTestName.java:49)
	at org.apache.lucene.util.TestRuleIgnoreAfterMaxFailures$1.evaluate(TestRuleIgnoreAfterMaxFailures.java:70)
	at org.apache.lucene.util.TestRuleMarkFailure$1.evaluate(TestRuleMarkFailure.java:48)
	at com.carrotsearch.randomizedtesting.rules.StatementAdapter.evaluate(StatementAdapter.java:36)
	at com.carrotsearch.randomizedtesting.ThreadLeakControl$StatementRunner.run(ThreadLeakControl.java:358)
	at com.carrotsearch.randomizedtesting.ThreadLeakControl.forkTimeoutingTask(ThreadLeakControl.java:782)
	at com.carrotsearch.randomizedtesting.ThreadLeakControl$3.evaluate(ThreadLeakControl.java:442)
	at com.carrotsearch.randomizedtesting.RandomizedRunner.runSingleTest(RandomizedRunner.java:746)
	at com.carrotsearch.randomizedtesting.RandomizedRunner$3.evaluate(RandomizedRunner.java:648)
	at com.carrotsearch.randomizedtesting.RandomizedRunner$4.evaluate(RandomizedRunner.java:682)
	at com.carrotsearch.randomizedtesting.RandomizedRunner$5.evaluate(RandomizedRunner.java:693)
	at com.carrotsearch.randomizedtesting.rules.StatementAdapter.evaluate(StatementAdapter.java:36)
	at com.carrotsearch.randomizedtesting.rules.SystemPropertiesRestoreRule$1.evaluate(SystemPropertiesRestoreRule.java:53)
	at org.apache.lucene.util.AbstractBeforeAfterRule$1.evaluate(AbstractBeforeAfterRule.java:46)
	at org.apache.lucene.util.TestRuleStoreClassName$1.evaluate(TestRuleStoreClassName.java:42)
	at com.carrotsearch.randomizedtesting.rules.SystemPropertiesInvariantRule$1.evaluate(SystemPropertiesInvariantRule.java:55)
	at com.carrotsearch.randomizedtesting.rules.NoShadowingOrOverridesOnMethodsRule$1.evaluate(NoShadowingOrOverridesOnMethodsRule.java:39)
	at com.carrotsearch.randomizedtesting.rules.NoShadowingOrOverridesOnMethodsRule$1.evaluate(NoShadowingOrOverridesOnMethodsRule.java:39)
	at com.carrotsearch.randomizedtesting.rules.StatementAdapter.evaluate(StatementAdapter.java:36)
	at org.apache.lucene.util.TestRuleAssertionsRequired$1.evaluate(TestRuleAssertionsRequired.java:43)
	at org.apache.lucene.util.TestRuleMarkFailure$1.evaluate(TestRuleMarkFailure.java:48)
	at org.apache.lucene.util.TestRuleIgnoreAfterMaxFailures$1.evaluate(TestRuleIgnoreAfterMaxFailures.java:70)
	at org.apache.lucene.util.TestRuleIgnoreTestSuites$1.evaluate(TestRuleIgnoreTestSuites.java:55)
	at com.carrotsearch.randomizedtesting.rules.StatementAdapter.evaluate(StatementAdapter.java:36)
	at com.carrotsearch.randomizedtesting.ThreadLeakControl$StatementRunner.run(ThreadLeakControl.java:358)
	at java.lang.Thread.run(Thread.java:724)
Caused by: java.lang.RuntimeException: REQUEST FAILED: xpath=//lst[@name='spellcheck']/lst[@name='suggestions']/lst[@name='collation']/int[@name='hits' and 6 <= . and . <= 10]
	xml response was: <?xml version="1.0" encoding="UTF-8"?>
<response>
<lst name="responseHeader"><int name="status">0</int><int name="QTime">18</int></lst><result name="response" numFound="0" start="0"></result><lst name="spellcheck"><lst name="suggestions"><lst name="everother"><int name="numFound">1</int><int name="startOffset">9</int><int name="endOffset">18</int><arr name="suggestion"><str>everyother</str></arr></lst><lst name="collation"><str name="collationQuery">teststop:everyother</str><int name="hits">12</int><lst name="misspellingsAndCorrections"><str name="everother">everyother</str></lst></lst></lst></lst>
</response>

	request was:spellcheck=true&spellcheck.dictionary=direct&spellcheck.count=1&spellcheck.collate=true&spellcheck.maxCollationTries=1&spellcheck.maxCollations=1&spellcheck.collateExtendedResults=true&qt=spellCheckCompRH&q=teststop%3Aeverother&spellcheck.collateMaxCollectDocs=5
	at org.apache.solr.SolrTestCaseJ4.assertQ(SolrTestCaseJ4.java:630)
	... 42 more




Build Log:
[...truncated 10060 lines...]
   [junit4] Suite: org.apache.solr.spelling.SpellCheckCollatorTest
   [junit4]   2> 729334 T3219 oas.SolrTestCaseJ4.initCore ####initCore
   [junit4]   2> Creating dataDir: /mnt/ssd/jenkins/workspace/Lucene-Solr-trunk-Linux/solr/build/solr-core/test/J0/./solrtest-SpellCheckCollatorTest-1378632037958
   [junit4]   2> 729334 T3219 oasc.SolrResourceLoader.<init> new SolrResourceLoader for directory: '/mnt/ssd/jenkins/workspace/Lucene-Solr-trunk-Linux/solr/build/solr-core/test-files/solr/collection1/'
   [junit4]   2> 729335 T3219 oasc.SolrResourceLoader.replaceClassLoader Adding 'file:/mnt/ssd/jenkins/workspace/Lucene-Solr-trunk-Linux/solr/build/solr-core/test-files/solr/collection1/lib/classes/' to classloader
   [junit4]   2> 729335 T3219 oasc.SolrResourceLoader.replaceClassLoader Adding 'file:/mnt/ssd/jenkins/workspace/Lucene-Solr-trunk-Linux/solr/build/solr-core/test-files/solr/collection1/lib/README' to classloader
   [junit4]   2> 729362 T3219 oasc.SolrConfig.<init> Using Lucene MatchVersion: LUCENE_50
   [junit4]   2> 729385 T3219 oasc.SolrConfig.<init> Loaded SolrConfig: solrconfig-spellcheckcomponent.xml
   [junit4]   2> 729385 T3219 oass.IndexSchema.readSchema Reading Solr Schema from schema.xml
   [junit4]   2> 729391 T3219 oass.IndexSchema.readSchema [null] Schema name=test
   [junit4]   2> 729525 T3219 oass.OpenExchangeRatesOrgProvider.init Initialized with rates=open-exchange-rates.json, refreshInterval=1440.
   [junit4]   2> 729530 T3219 oass.IndexSchema.readSchema default search field in schema is text
   [junit4]   2> 729532 T3219 oass.IndexSchema.readSchema unique key field: id
   [junit4]   2> 729536 T3219 oass.FileExchangeRateProvider.reload Reloading exchange rates from file currency.xml
   [junit4]   2> 729538 T3219 oass.FileExchangeRateProvider.reload Reloading exchange rates from file currency.xml
   [junit4]   2> 729540 T3219 oass.OpenExchangeRatesOrgProvider.reload Reloading exchange rates from open-exchange-rates.json
   [junit4]   2> 729540 T3219 oass.OpenExchangeRatesOrgProvider$OpenExchangeRates.<init> WARN Unknown key IMPORTANT NOTE
   [junit4]   2> 729540 T3219 oass.OpenExchangeRatesOrgProvider$OpenExchangeRates.<init> WARN Expected key, got STRING
   [junit4]   2> 729541 T3219 oass.OpenExchangeRatesOrgProvider.reload Reloading exchange rates from open-exchange-rates.json
   [junit4]   2> 729541 T3219 oass.OpenExchangeRatesOrgProvider$OpenExchangeRates.<init> WARN Unknown key IMPORTANT NOTE
   [junit4]   2> 729541 T3219 oass.OpenExchangeRatesOrgProvider$OpenExchangeRates.<init> WARN Expected key, got STRING
   [junit4]   2> 729542 T3219 oasc.SolrResourceLoader.locateSolrHome JNDI not configured for solr (NoInitialContextEx)
   [junit4]   2> 729542 T3219 oasc.SolrResourceLoader.locateSolrHome using system property solr.solr.home: /mnt/ssd/jenkins/workspace/Lucene-Solr-trunk-Linux/solr/build/solr-core/test-files/solr
   [junit4]   2> 729542 T3219 oasc.SolrResourceLoader.<init> new SolrResourceLoader for directory: '/mnt/ssd/jenkins/workspace/Lucene-Solr-trunk-Linux/solr/build/solr-core/test-files/solr/'
   [junit4]   2> 729552 T3219 oasc.SolrResourceLoader.locateSolrHome JNDI not configured for solr (NoInitialContextEx)
   [junit4]   2> 729553 T3219 oasc.SolrResourceLoader.locateSolrHome using system property solr.solr.home: /mnt/ssd/jenkins/workspace/Lucene-Solr-trunk-Linux/solr/build/solr-core/test-files/solr
   [junit4]   2> 729553 T3219 oasc.SolrResourceLoader.<init> new SolrResourceLoader for deduced Solr Home: '/mnt/ssd/jenkins/workspace/Lucene-Solr-trunk-Linux/solr/build/solr-core/test-files/solr/'
   [junit4]   2> 729577 T3219 oasc.CoreContainer.<init> New CoreContainer 773331102
   [junit4]   2> 729577 T3219 oasc.CoreContainer.load Loading cores into CoreContainer [instanceDir=/mnt/ssd/jenkins/workspace/Lucene-Solr-trunk-Linux/solr/build/solr-core/test-files/solr/]
   [junit4]   2> 729578 T3219 oashc.HttpShardHandlerFactory.getParameter Setting socketTimeout to: 0
   [junit4]   2> 729578 T3219 oashc.HttpShardHandlerFactory.getParameter Setting urlScheme to: http://
   [junit4]   2> 729578 T3219 oashc.HttpShardHandlerFactory.getParameter Setting connTimeout to: 0
   [junit4]   2> 729578 T3219 oashc.HttpShardHandlerFactory.getParameter Setting maxConnectionsPerHost to: 20
   [junit4]   2> 729579 T3219 oashc.HttpShardHandlerFactory.getParameter Setting corePoolSize to: 0
   [junit4]   2> 729579 T3219 oashc.HttpShardHandlerFactory.getParameter Setting maximumPoolSize to: 2147483647
   [junit4]   2> 729579 T3219 oashc.HttpShardHandlerFactory.getParameter Setting maxThreadIdleTime to: 5
   [junit4]   2> 729579 T3219 oashc.HttpShardHandlerFactory.getParameter Setting sizeOfQueue to: -1
   [junit4]   2> 729579 T3219 oashc.HttpShardHandlerFactory.getParameter Setting fairnessPolicy to: false
   [junit4]   2> 729580 T3219 oascsi.HttpClientUtil.createClient Creating new http client, config:maxConnectionsPerHost=20&maxConnections=10000&socketTimeout=0&connTimeout=0&retry=false
   [junit4]   2> 729584 T3219 oasl.LogWatcher.createWatcher SLF4J impl is org.slf4j.impl.Log4jLoggerFactory
   [junit4]   2> 729584 T3219 oasl.LogWatcher.newRegisteredLogWatcher Registering Log Listener [Log4j (org.slf4j.impl.Log4jLoggerFactory)]
   [junit4]   2> 729585 T3220 oasc.CoreContainer.create Creating SolrCore 'collection1' using instanceDir: /mnt/ssd/jenkins/workspace/Lucene-Solr-trunk-Linux/solr/build/solr-core/test-files/solr/collection1
   [junit4]   2> 729585 T3220 oasc.SolrResourceLoader.<init> new SolrResourceLoader for directory: '/mnt/ssd/jenkins/workspace/Lucene-Solr-trunk-Linux/solr/build/solr-core/test-files/solr/collection1/'
   [junit4]   2> 729586 T3220 oasc.SolrResourceLoader.replaceClassLoader Adding 'file:/mnt/ssd/jenkins/workspace/Lucene-Solr-trunk-Linux/solr/build/solr-core/test-files/solr/collection1/lib/classes/' to classloader
   [junit4]   2> 729586 T3220 oasc.SolrResourceLoader.replaceClassLoader Adding 'file:/mnt/ssd/jenkins/workspace/Lucene-Solr-trunk-Linux/solr/build/solr-core/test-files/solr/collection1/lib/README' to classloader
   [junit4]   2> 729599 T3220 oasc.SolrConfig.<init> Using Lucene MatchVersion: LUCENE_50
   [junit4]   2> 729607 T3220 oasc.SolrConfig.<init> Loaded SolrConfig: solrconfig-spellcheckcomponent.xml
   [junit4]   2> 729607 T3220 oass.IndexSchema.readSchema Reading Solr Schema from schema.xml
   [junit4]   2> 729611 T3220 oass.IndexSchema.readSchema [null] Schema name=test
   [junit4]   2> 729724 T3220 oass.OpenExchangeRatesOrgProvider.init Initialized with rates=open-exchange-rates.json, refreshInterval=1440.
   [junit4]   2> 729728 T3220 oass.IndexSchema.readSchema default search field in schema is text
   [junit4]   2> 729730 T3220 oass.IndexSchema.readSchema unique key field: id
   [junit4]   2> 729733 T3220 oass.FileExchangeRateProvider.reload Reloading exchange rates from file currency.xml
   [junit4]   2> 729735 T3220 oass.FileExchangeRateProvider.reload Reloading exchange rates from file currency.xml
   [junit4]   2> 729736 T3220 oass.OpenExchangeRatesOrgProvider.reload Reloading exchange rates from open-exchange-rates.json
   [junit4]   2> 729737 T3220 oass.OpenExchangeRatesOrgProvider$OpenExchangeRates.<init> WARN Unknown key IMPORTANT NOTE
   [junit4]   2> 729737 T3220 oass.OpenExchangeRatesOrgProvider$OpenExchangeRates.<init> WARN Expected key, got STRING
   [junit4]   2> 729737 T3220 oass.OpenExchangeRatesOrgProvider.reload Reloading exchange rates from open-exchange-rates.json
   [junit4]   2> 729737 T3220 oass.OpenExchangeRatesOrgProvider$OpenExchangeRates.<init> WARN Unknown key IMPORTANT NOTE
   [junit4]   2> 729738 T3220 oass.OpenExchangeRatesOrgProvider$OpenExchangeRates.<init> WARN Expected key, got STRING
   [junit4]   2> 729738 T3220 oasc.SolrCore.initDirectoryFactory org.apache.solr.core.MockDirectoryFactory
   [junit4]   2> 729738 T3220 oasc.SolrCore.<init> [collection1] Opening new SolrCore at /mnt/ssd/jenkins/workspace/Lucene-Solr-trunk-Linux/solr/build/solr-core/test-files/solr/collection1/, dataDir=/mnt/ssd/jenkins/workspace/Lucene-Solr-trunk-Linux/solr/build/solr-core/test/J0/./solrtest-SpellCheckCollatorTest-1378632037958/
   [junit4]   2> 729738 T3220 oasc.SolrCore.<init> JMX monitoring not detected for core: collection1
   [junit4]   2> 729739 T3220 oasc.CachingDirectoryFactory.get return new directory for /mnt/ssd/jenkins/workspace/Lucene-Solr-trunk-Linux/solr/build/solr-core/test/J0/./solrtest-SpellCheckCollatorTest-1378632037958
   [junit4]   2> 729739 T3220 oasc.SolrCore.getNewIndexDir New index directory detected: old=null new=/mnt/ssd/jenkins/workspace/Lucene-Solr-trunk-Linux/solr/build/solr-core/test/J0/./solrtest-SpellCheckCollatorTest-1378632037958/index/
   [junit4]   2> 729739 T3220 oasc.SolrCore.initIndex WARN [collection1] Solr index directory '/mnt/ssd/jenkins/workspace/Lucene-Solr-trunk-Linux/solr/build/solr-core/test/J0/./solrtest-SpellCheckCollatorTest-1378632037958/index' doesn't exist. Creating new index...
   [junit4]   2> 729739 T3220 oasc.CachingDirectoryFactory.get return new directory for /mnt/ssd/jenkins/workspace/Lucene-Solr-trunk-Linux/solr/build/solr-core/test/J0/./solrtest-SpellCheckCollatorTest-1378632037958/index
   [junit4]   2> 729740 T3220 oasu.RandomMergePolicy.<init> RandomMergePolicy wrapping class org.apache.lucene.index.LogDocMergePolicy: [LogDocMergePolicy: minMergeSize=1000, mergeFactor=9, maxMergeSize=9223372036854775807, maxMergeSizeForForcedMerge=9223372036854775807, calibrateSizeByDeletes=true, maxMergeDocs=2147483647, maxCFSSegmentSizeMB=8.796093022207999E12, noCFSRatio=0.19655727215449226]
   [junit4]   2> 729740 T3220 oasc.SolrDeletionPolicy.onCommit SolrDeletionPolicy.onCommit: commits: num=1
   [junit4]   2> 		commit{dir=MockDirWrapper(org.apache.lucene.store.RAMDirectory@6aee2c57 lockFactory=org.apache.lucene.store.SingleInstanceLockFactory@71d2fe81),segFN=segments_1,generation=1}
   [junit4]   2> 729741 T3220 oasc.SolrDeletionPolicy.updateCommits newest commit generation = 1
   [junit4]   2> 729741 T3220 oasc.SolrCore.loadUpdateProcessorChains no updateRequestProcessorChain defined as default, creating implicit default
   [junit4]   2> 729742 T3220 oasc.RequestHandlers.initHandlersFromConfig created standard: solr.StandardRequestHandler
   [junit4]   2> 729742 T3220 oasc.RequestHandlers.initHandlersFromConfig created spellCheckCompRH: org.apache.solr.handler.component.SearchHandler
   [junit4]   2> 729742 T3220 oasc.RequestHandlers.initHandlersFromConfig created spellCheckCompRH1: org.apache.solr.handler.component.SearchHandler
   [junit4]   2> 729742 T3220 oasc.RequestHandlers.initHandlersFromConfig created spellCheckWithWordbreak: org.apache.solr.handler.component.SearchHandler
   [junit4]   2> 729743 T3220 oasu.CommitTracker.<init> Hard AutoCommit: disabled
   [junit4]   2> 729743 T3220 oasu.CommitTracker.<init> Soft AutoCommit: disabled
   [junit4]   2> 729744 T3220 oasu.RandomMergePolicy.<init> RandomMergePolicy wrapping class org.apache.lucene.index.TieredMergePolicy: [TieredMergePolicy: maxMergeAtOnce=37, maxMergeAtOnceExplicit=46, maxMergedSegmentMB=90.5234375, floorSegmentMB=1.33984375, forceMergeDeletesPctAllowed=2.4116757593865588, segmentsPerTier=18.0, maxCFSSegmentSizeMB=8.796093022207999E12, noCFSRatio=0.705701395780085
   [junit4]   2> 729744 T3220 oasc.SolrDeletionPolicy.onInit SolrDeletionPolicy.onInit: commits: num=1
   [junit4]   2> 		commit{dir=MockDirWrapper(org.apache.lucene.store.RAMDirectory@6aee2c57 lockFactory=org.apache.lucene.store.SingleInstanceLockFactory@71d2fe81),segFN=segments_1,generation=1}
   [junit4]   2> 729744 T3220 oasc.SolrDeletionPolicy.updateCommits newest commit generation = 1
   [junit4]   2> 729744 T3220 oass.SolrIndexSearcher.<init> Opening Searcher@e984b76 main
   [junit4]   2> 729745 T3220 oashc.SpellCheckComponent.inform Initializing spell checkers
   [junit4]   2> 729765 T3220 oashc.SpellCheckComponent.inform Registering newSearcher listener for spellchecker: default
   [junit4]   2> 729769 T3220 oashc.SpellCheckComponent.inform Registering newSearcher listener for spellchecker: default_teststop
   [junit4]   2> 729769 T3220 oass.DirectSolrSpellChecker.init init: {name=direct,classname=solr.DirectSolrSpellChecker,minQueryLength=3,maxQueryFrequency=100.0,field=teststop}
   [junit4]   2> 729770 T3220 oass.DirectSolrSpellChecker.init init: {name=direct_lowerfilt,classname=solr.DirectSolrSpellChecker,minQueryLength=3,maxQueryFrequency=100.0,field=lowerfilt}
   [junit4]   2> 729773 T3220 oashc.SpellCheckComponent.inform Registering newSearcher listener for spellchecker: threshold
   [junit4]   2> 729773 T3220 oass.DirectSolrSpellChecker.init init: {name=threshold_direct,classname=solr.DirectSolrSpellChecker,field=lowerfilt,spellcheckIndexDir=spellcheckerThreshold,buildOnCommit=true,thresholdTokenFrequency=0.29}
   [junit4]   2> 729774 T3220 oashc.SpellCheckComponent.inform Registering newSearcher listener for spellchecker: threshold_direct
   [junit4]   2> 729777 T3220 oashc.SpellCheckComponent.inform Registering newSearcher listener for spellchecker: multipleFields
   [junit4]   2> 729788 T3220 oashc.SpellCheckComponent.inform Registering newSearcher listener for spellchecker: freq
   [junit4]   2> 729792 T3220 oashc.SpellCheckComponent.inform Registering newSearcher listener for spellchecker: fqcn
   [junit4]   2> 729792 T3221 oasc.SolrCore.registerSearcher [collection1] Registered new searcher Searcher@e984b76 main{StandardDirectoryReader(segments_1:1:nrt)}
   [junit4]   2> 729793 T3220 oasc.CoreContainer.registerCore registering core: collection1
   [junit4]   2> 729795 T3219 oas.SolrTestCaseJ4.initCore ####initCore end
   [junit4]   2> ASYNC  NEW_CORE C2985 name=collection1 org.apache.solr.core.SolrCore@52b353f1
   [junit4]   2> 729797 T3219 C2985 oasup.LogUpdateProcessor.finish [collection1] webapp=null path=null params={} {add=[0]} 0 0
   [junit4]   2> 729802 T3219 C2985 oasup.LogUpdateProcessor.finish [collection1] webapp=null path=null params={} {add=[1]} 0 0
   [junit4]   2> 729810 T3219 C2985 oasup.LogUpdateProcessor.finish [collection1] webapp=null path=null params={} {add=[2]} 0 6
   [junit4]   2> 729813 T3219 C2985 oasup.LogUpdateProcessor.finish [collection1] webapp=null path=null params={} {add=[3]} 0 1
   [junit4]   2> 729815 T3219 C2985 oasup.LogUpdateProcessor.finish [collection1] webapp=null path=null params={} {add=[4]} 0 0
   [junit4]   2> 729819 T3219 C2985 oasup.LogUpdateProcessor.finish [collection1] webapp=null path=null params={} {add=[5]} 0 2
   [junit4]   2> 729823 T3219 C2985 oasup.LogUpdateProcessor.finish [collection1] webapp=null path=null params={} {add=[6]} 0 1
   [junit4]   2> ASYNC  NEW_CORE C2986 name=collection1 org.apache.solr.core.SolrCore@52b353f1
   [junit4]   2> 729835 T3219 C2986 oasup.LogUpdateProcessor.finish [collection1] webapp=null path=null params={} {add=[7]} 0 0
   [junit4]   2> 729839 T3219 C2986 oasup.LogUpdateProcessor.finish [collection1] webapp=null path=null params={} {add=[8]} 0 2
   [junit4]   2> 729841 T3219 C2986 oasup.LogUpdateProcessor.finish [collection1] webapp=null path=null params={} {add=[9]} 0 0
   [junit4]   2> 729844 T3219 C2986 oasup.LogUpdateProcessor.finish [collection1] webapp=null path=null params={} {add=[10]} 0 1
   [junit4]   2> 729847 T3219 C2986 oasup.LogUpdateProcessor.finish [collection1] webapp=null path=null params={} {add=[11]} 0 2
   [junit4]   2> 729850 T3219 C2986 oasup.LogUpdateProcessor.finish [collection1] webapp=null path=null params={} {add=[12]} 0 1
   [junit4]   2> 729852 T3219 C2986 oasup.LogUpdateProcessor.finish [collection1] webapp=null path=null params={} {add=[13]} 0 0
   [junit4]   2> 729856 T3219 C2986 oasup.LogUpdateProcessor.finish [collection1] webapp=null path=null params={} {add=[14]} 0 2
   [junit4]   2> 729858 T3219 C2986 oasup.LogUpdateProcessor.finish [collection1] webapp=null path=null params={} {add=[15]} 0 0
   [junit4]   2> 729860 T3219 C2986 oasup.LogUpdateProcessor.finish [collection1] webapp=null path=null params={} {add=[16]} 0 0
   [junit4]   2> 729862 T3219 C2986 oasu.DirectUpdateHandler2.commit start commit{,optimize=false,openSearcher=true,waitSearcher=true,expungeDeletes=false,softCommit=false,prepareCommit=false}
   [junit4]   2> 729867 T3219 C2986 oasc.SolrDeletionPolicy.onCommit SolrDeletionPolicy.onCommit: commits: num=2
   [junit4]   2> 		commit{dir=MockDirWrapper(org.apache.lucene.store.RAMDirectory@6aee2c57 lockFactory=org.apache.lucene.store.SingleInstanceLockFactory@71d2fe81),segFN=segments_1,generation=1}
   [junit4]   2> 		commit{dir=MockDirWrapper(org.apache.lucene.store.RAMDirectory@6aee2c57 lockFactory=org.apache.lucene.store.SingleInstanceLockFactory@71d2fe81),segFN=segments_2,generation=2}
   [junit4]   2> 729868 T3219 C2986 oasc.SolrDeletionPolicy.updateCommits newest commit generation = 2
   [junit4]   2> 729869 T3219 C2986 oass.SolrIndexSearcher.<init> Opening Searcher@3f146689 main
   [junit4]   2> 729869 T3219 C2986 oasu.DirectUpdateHandler2.commit end_commit_flush
   [junit4]   2> 729869 T3221 oashc.SpellCheckComponent$SpellCheckerListener.buildSpellIndex Building spell index for spell checker: default
   [junit4]   2> 729920 T3221 oashc.SpellCheckComponent$SpellCheckerListener.buildSpellIndex Building spell index for spell checker: default_teststop
   [junit4]   2> 729984 T3221 oashc.SpellCheckComponent$SpellCheckerListener.buildSpellIndex Building spell index for spell checker: threshold
   [junit4]   2> 730011 T3221 oashc.SpellCheckComponent$SpellCheckerListener.buildSpellIndex Building spell index for spell checker: threshold_direct
   [junit4]   2> 730011 T3221 oashc.SpellCheckComponent$SpellCheckerListener.buildSpellIndex Building spell index for spell checker: multipleFields
   [junit4]   2> 730076 T3221 oashc.SpellCheckComponent$SpellCheckerListener.buildSpellIndex Building spell index for spell checker: freq
   [junit4]   2> 730131 T3221 oashc.SpellCheckComponent$SpellCheckerListener.buildSpellIndex Building spell index for spell checker: fqcn
   [junit4]   2> 730181 T3221 oasc.SolrCore.registerSearcher [collection1] Registered new searcher Searcher@3f146689 main{StandardDirectoryReader(segments_2:13:nrt _0(5.0):c3 _1(5.0):c3 _2(5.0):c3 _3(5.0):c3 _4(5.0):c3 _5(5.0):c2)}
   [junit4]   2> 730181 T3219 C2986 oasup.LogUpdateProcessor.finish [collection1] webapp=null path=null params={} {commit=} 0 319
   [junit4]   2> 730184 T3219 oas.SolrTestCaseJ4.setUp ###Starting testCollationWithHypens
   [junit4]   2> 730293 T3219 oas.SolrTestCaseJ4.tearDown ###Ending testCollationWithHypens
   [junit4]   2> 730297 T3219 oas.SolrTestCaseJ4.setUp ###Starting testCollateWithMultipleRequestHandlers
   [junit4]   2> 730383 T3219 oas.SolrTestCaseJ4.tearDown ###Ending testCollateWithMultipleRequestHandlers
   [junit4]   2> 730392 T3219 oas.SolrTestCaseJ4.setUp ###Starting testEstimatedHitCounts
   [junit4]   2> ASYNC  NEW_CORE C2987 name=collection1 org.apache.solr.core.SolrCore@52b353f1
   [junit4]   2> 730472 T3219 C2987 oasc.SolrCore.execute [collection1] webapp=null path=null params={spellcheck=true&spellcheck.dictionary=direct&spellcheck.count=1&spellcheck.collate=true&spellcheck.maxCollationTries=1&spellcheck.maxCollations=1&spellcheck.collateExtendedResults=true&qt=spellCheckCompRH&q=teststop%3Ametnoia} hits=0 status=0 QTime=80 
   [junit4]   2> 730490 T3219 C2987 oasc.SolrCore.execute [collection1] webapp=null path=null params={spellcheck=true&spellcheck.dictionary=direct&spellcheck.count=1&spellcheck.collate=true&spellcheck.maxCollationTries=1&spellcheck.maxCollations=1&spellcheck.collateExtendedResults=true&qt=spellCheckCompRH&q=teststop%3Ametnoia&spellcheck.collateMaxCollectDocs=0} hits=0 status=0 QTime=17 
   [junit4]   2> 730510 T3219 C2987 oasc.SolrCore.execute [collection1] webapp=null path=null params={spellcheck=true&spellcheck.dictionary=direct&spellcheck.count=1&spellcheck.collate=true&spellcheck.maxCollationTries=1&spellcheck.maxCollations=1&spellcheck.collateExtendedResults=true&qt=spellCheckCompRH&q=teststop%3Ametnoia&spellcheck.collateMaxCollectDocs=30} hits=0 status=0 QTime=19 
   [junit4]   2> 730529 T3219 C2987 oasc.SolrCore.execute [collection1] webapp=null path=null params={spellcheck=true&spellcheck.dictionary=direct&spellcheck.count=1&spellcheck.collate=true&spellcheck.maxCollationTries=1&spellcheck.maxCollations=1&spellcheck.collateExtendedResults=true&qt=spellCheckCompRH&q=teststop%3Ametnoia&spellcheck.collateMaxCollectDocs=100} hits=0 status=0 QTime=18 
   [junit4]   2> 730545 T3219 C2987 oasc.SolrCore.execute [collection1] webapp=null path=null params={spellcheck=true&spellcheck.dictionary=direct&spellcheck.count=1&spellcheck.collate=true&spellcheck.maxCollationTries=1&spellcheck.maxCollations=1&spellcheck.collateExtendedResults=true&qt=spellCheckCompRH&q=teststop%3Ametnoia&spellcheck.collateMaxCollectDocs=10000} hits=0 status=0 QTime=15 
   [junit4]   2> 730561 T3219 C2987 oasc.SolrCore.execute [collection1] webapp=null path=null params={spellcheck=true&spellcheck.dictionary=direct&spellcheck.count=1&spellcheck.collate=true&spellcheck.maxCollationTries=1&spellcheck.maxCollations=1&spellcheck.collateExtendedResults=true&qt=spellCheckCompRH&q=teststop%3Ametnoia&spellcheck.collateMaxCollectDocs=15} hits=0 status=0 QTime=15 
   [junit4]   2> 730603 T3219 C2987 oasc.SolrCore.execute [collection1] webapp=null path=null params={spellcheck=true&spellcheck.dictionary=direct&spellcheck.count=1&spellcheck.collate=true&spellcheck.maxCollationTries=1&spellcheck.maxCollations=1&spellcheck.collateExtendedResults=true&qt=spellCheckCompRH&q=teststop%3Ametnoia&spellcheck.collateMaxCollectDocs=13} hits=0 status=0 QTime=34 
   [junit4]   2> 730615 T3219 C2987 oasc.SolrCore.execute [collection1] webapp=null path=null params={spellcheck=true&spellcheck.dictionary=direct&spellcheck.count=1&spellcheck.collate=true&spellcheck.maxCollationTries=1&spellcheck.maxCollations=1&spellcheck.collateExtendedResults=true&qt=spellCheckCompRH&q=teststop%3Ametnoia&spellcheck.collateMaxCollectDocs=16} hits=0 status=0 QTime=11 
   [junit4]   2> 730626 T3219 C2987 oasc.SolrCore.execute [collection1] webapp=null path=null params={spellcheck=true&spellcheck.dictionary=direct&spellcheck.count=1&spellcheck.collate=true&spellcheck.maxCollationTries=1&spellcheck.maxCollations=1&spellcheck.collateExtendedResults=true&qt=spellCheckCompRH&q=teststop%3Ametnoia&spellcheck.collateMaxCollectDocs=12} hits=0 status=0 QTime=10 
   [junit4]   2> 730636 T3219 C2987 oasc.SolrCore.execute [collection1] webapp=null path=null params={spellcheck=true&spellcheck.dictionary=direct&spellcheck.count=1&spellcheck.collate=true&spellcheck.maxCollationTries=1&spellcheck.maxCollations=1&spellcheck.collateExtendedResults=true&qt=spellCheckCompRH&q=teststop%3Ametnoia&spellcheck.collateMaxCollectDocs=10} hits=0 status=0 QTime=9 
   [junit4]   2> 730646 T3219 C2987 oasc.SolrCore.execute [collection1] webapp=null path=null params={spellcheck=true&spellcheck.dictionary=direct&spellcheck.count=1&spellcheck.collate=true&spellcheck.maxCollationTries=1&spellcheck.maxCollations=1&spellcheck.collateExtendedResults=true&qt=spellCheckCompRH&q=teststop%3Ametnoia&spellcheck.collateMaxCollectDocs=13} hits=0 status=0 QTime=8 
   [junit4]   2> 730656 T3219 C2987 oasc.SolrCore.execute [collection1] webapp=null path=null params={spellcheck=true&spellcheck.dictionary=direct&spellcheck.count=1&spellcheck.collate=true&spellcheck.maxCollationTries=1&spellcheck.maxCollations=1&spellcheck.collateExtendedResults=true&qt=spellCheckCompRH&q=teststop%3Ametnoia&spellcheck.collateMaxCollectDocs=1} hits=0 status=0 QTime=9 
   [junit4]   2> 730666 T3219 C2987 oasc.SolrCore.execute [collection1] webapp=null path=null params={spellcheck=true&spellcheck.dictionary=direct&spellcheck.count=1&spellcheck.collate=true&spellcheck.maxCollationTries=1&spellcheck.maxCollations=1&spellcheck.collateExtendedResults=true&qt=spellCheckCompRH&q=teststop%3Ametnoia&spellcheck.collateMaxCollectDocs=9} hits=0 status=0 QTime=9 
   [junit4]   2> 730681 T3219 C2987 oasc.SolrCore.execute [collection1] webapp=null path=null params={spellcheck=true&spellcheck.dictionary=direct&spellcheck.count=1&spellcheck.collate=true&spellcheck.maxCollationTries=1&spellcheck.maxCollations=1&spellcheck.collateExtendedResults=true&qt=spellCheckCompRH&q=teststop%3Ametnoia&spellcheck.collateMaxCollectDocs=14} hits=0 status=0 QTime=14 
   [junit4]   2> 730688 T3219 C2987 oasc.SolrCore.execute [collection1] webapp=null path=null params={spellcheck=true&spellcheck.dictionary=direct&spellcheck.count=1&spellcheck.collate=true&spellcheck.maxCollationTries=1&spellcheck.maxCollations=1&spellcheck.collateExtendedResults=true&qt=spellCheckCompRH&q=teststop%3Ametnoia&spellcheck.collateMaxCollectDocs=13} hits=0 status=0 QTime=6 
   [junit4]   2> 730703 T3219 C2987 oasc.SolrCore.execute [collection1] webapp=null path=null params={spellcheck=true&spellcheck.dictionary=direct&spellcheck.count=1&spellcheck.collate=true&spellcheck.maxCollationTries=1&spellcheck.maxCollations=1&spellcheck.collateExtendedResults=true&qt=spellCheckCompRH&q=teststop%3Ametnoia&spellcheck.collateMaxCollectDocs=17} hits=0 status=0 QTime=14 
   [junit4]   2> 730709 T3219 C2987 oasc.SolrCore.execute [collection1] webapp=null path=null params={spellcheck=true&spellcheck.dictionary=direct&spellcheck.count=1&spellcheck.collate=true&spellcheck.maxCollationTries=1&spellcheck.maxCollations=1&spellcheck.collateExtendedResults=true&qt=spellCheckCompRH&q=teststop%3Ametnoia&spellcheck.collateMaxCollectDocs=3} hits=0 status=0 QTime=5 
   [junit4]   2> 730716 T3219 C2987 oasc.SolrCore.execute [collection1] webapp=null path=null params={spellcheck=true&spellcheck.dictionary=direct&spellcheck.count=1&spellcheck.collate=true&spellcheck.maxCollationTries=1&spellcheck.maxCollations=1&spellcheck.collateExtendedResults=true&qt=spellCheckCompRH&q=teststop%3Ametnoia&spellcheck.collateMaxCollectDocs=12} hits=0 status=0 QTime=6 
   [junit4]   2> 730722 T3219 C2987 oasc.SolrCore.execute [collection1] webapp=null path=null params={spellcheck=true&spellcheck.dictionary=direct&spellcheck.count=1&spellcheck.collate=true&spellcheck.maxCollationTries=1&spellcheck.maxCollations=1&spellcheck.collateExtendedResults=true&qt=spellCheckCompRH&q=teststop%3Ametnoia&spellcheck.collateMaxCollectDocs=8} hits=0 status=0 QTime=5 
   [junit4]   2> 730729 T3219 C2987 oasc.SolrCore.execute [collection1] webapp=null path=null params={spellcheck=true&spellcheck.dictionary=direct&spellcheck.count=1&spellcheck.collate=true&spellcheck.maxCollationTries=1&spellcheck.maxCollations=1&spellcheck.collateExtendedResults=true&qt=spellCheckCompRH&q=teststop%3Ametnoia&spellcheck.collateMaxCollectDocs=7} hits=0 status=0 QTime=6 
   [junit4]   2> 730736 T3219 C2987 oasc.SolrCore.execute [collection1] webapp=null path=null params={spellcheck=true&spellcheck.dictionary=direct&spellcheck.count=1&spellcheck.collate=true&spellcheck.maxCollationTries=1&spellcheck.maxCollations=1&spellcheck.collateExtendedResults=true&qt=spellCheckCompRH&q=teststop%3Ametnoia&spellcheck.collateMaxCollectDocs=10} hits=0 status=0 QTime=6 
   [junit4]   2> 730754 T3219 C2987 oasc.SolrCore.execute [collection1] webapp=null path=null params={spellcheck=true&spellcheck.dictionary=direct&spellcheck.count=1&spellcheck.collate=true&spellcheck.maxCollationTries=1&spellcheck.maxCollations=1&spellcheck.collateExtendedResults=true&qt=spellCheckCompRH&q=teststop%3Ametnoia&spellcheck.collateMaxCollectDocs=5} hits=0 status=0 QTime=17 
   [junit4]   2> 730760 T3219 C2987 oasc.SolrCore.execute [collection1] webapp=null path=null params={spellcheck=true&spellcheck.dictionary=direct&spellcheck.count=1&spellcheck.collate=true&spellcheck.maxCollationTries=1&spellcheck.maxCollations=1&spellcheck.collateExtendedResults=true&qt=spellCheckCompRH&q=teststop%3Ametnoia&spellcheck.collateMaxCollectDocs=7} hits=0 status=0 QTime=5 
   [junit4]   2> ASYNC  NEW_CORE C2988 name=collection1 org.apache.solr.core.SolrCore@52b353f1
   [junit4]   2> 730788 T3219 C2988 oasc.SolrCore.execute [collection1] webapp=null path=null params={spellcheck=true&spellcheck.dictionary=direct&spellcheck.count=1&spellcheck.collate=true&spellcheck.maxCollationTries=1&spellcheck.maxCollations=1&spellcheck.collateExtendedResults=true&qt=spellCheckCompRH&q=teststop%3Ametnoia&spellcheck.collateMaxCollectDocs=7} hits=0 status=0 QTime=27 
   [junit4]   2> 730793 T3219 C2988 oasc.SolrCore.execute [collection1] webapp=null path=null params={spellcheck=true&spellcheck.dictionary=direct&spellcheck.count=1&spellcheck.collate=true&spellcheck.maxCollationTries=1&spellcheck.maxCollations=1&spellcheck.collateExtendedResults=true&qt=spellCheckCompRH&q=teststop%3Ametnoia&spellcheck.collateMaxCollectDocs=16} hits=0 status=0 QTime=4 
   [junit4]   2> 730809 T3219 C2988 oasc.SolrCore.execute [collection1] webapp=null path=null params={spellcheck=true&spellcheck.dictionary=direct&spellcheck.count=1&spellcheck.collate=true&spellcheck.maxCollationTries=1&spellcheck.maxCollations=1&spellcheck.collateExtendedResults=true&qt=spellCheckCompRH&q=teststop%3Ametnoia&spellcheck.collateMaxCollectDocs=4} hits=0 status=0 QTime=15 
   [junit4]   2> 730814 T3219 C2988 oasc.SolrCore.execute [collection1] webapp=null path=null params={spellcheck=true&spellcheck.dictionary=direct&spellcheck.count=1&spellcheck.collate=true&spellcheck.maxCollationTries=1&spellcheck.maxCollations=1&spellcheck.collateExtendedResults=true&qt=spellCheckCompRH&q=teststop%3Ametnoia&spellcheck.collateMaxCollectDocs=4} hits=0 status=0 QTime=4 
   [junit4]   2> 730835 T3219 C2988 oasc.SolrCore.execute [collection1] webapp=null path=null params={spellcheck=true&spellcheck.dictionary=direct&spellcheck.count=1&spellcheck.collate=true&spellcheck.maxCollationTries=1&spellcheck.maxCollations=1&spellcheck.collateExtendedResults=true&qt=spellCheckCompRH&q=teststop%3Ametnoia&spellcheck.collateMaxCollectDocs=5} hits=0 status=0 QTime=20 
   [junit4]   2> 730840 T3219 C2988 oasc.SolrCore.execute [collection1] webapp=null path=null params={spellcheck=true&spellcheck.dictionary=direct&spellcheck.count=1&spellcheck.collate=true&spellcheck.maxCollationTries=1&spellcheck.maxCollations=1&spellcheck.collateExtendedResults=true&qt=spellCheckCompRH&q=teststop%3Ametnoia&spellcheck.collateMaxCollectDocs=4} hits=0 status=0 QTime=4 
   [junit4]   2> 730846 T3219 C2988 oasc.SolrCore.execute [collection1] webapp=null path=null params={spellcheck=true&spellcheck.dictionary=direct&spellcheck.count=1&spellcheck.collate=true&spellcheck.maxCollationTries=1&spellcheck.maxCollations=1&spellcheck.collateExtendedResults=true&qt=spellCheckCompRH&q=teststop%3Ametnoia&spellcheck.collateMaxCollectDocs=7} hits=0 status=0 QTime=4 
   [junit4]   2> 730863 T3219 C2988 oasc.SolrCore.execute [collection1] webapp=null path=null params={spellcheck=true&spellcheck.dictionary=direct&spellcheck.count=1&spellcheck.collate=true&spellcheck.maxCollationTries=1&spellcheck.maxCollations=1&spellcheck.collateExtendedResults=true&qt=spellCheckCompRH&q=teststop%3Ametnoia&spellcheck.collateMaxCollectDocs=5} hits=0 status=0 QTime=15 
   [junit4]   2> 730868 T3219 C2988 oasc.SolrCore.execute [collection1] webapp=null path=null params={spellcheck=true&spellcheck.dictionary=direct&spellcheck.count=1&spellcheck.collate=true&spellcheck.maxCollationTries=1&spellcheck.maxCollations=1&spellcheck.collateExtendedResults=true&qt=spellCheckCompRH&q=teststop%3Ametnoia&spellcheck.collateMaxCollectDocs=15} hits=0 status=0 QTime=4 
   [junit4]   2> 730873 T3219 C2988 oasc.SolrCore.execute [collection1] webapp=null path=null params={spellcheck=true&spellcheck.dictionary=direct&spellcheck.count=1&spellcheck.collate=true&spellcheck.maxCollationTries=1&spellcheck.maxCollations=1&spellcheck.collateExtendedResults=true&qt=spellCheckCompRH&q=teststop%3Ametnoia&spellcheck.collateMaxCollectDocs=13} hits=0 status=0 QTime=4 
   [junit4]   2> 730895 T3219 C2988 oasc.SolrCore.execute [collection1] webapp=null path=null params={spellcheck=true&spellcheck.dictionary=direct&spellcheck.count=1&spellcheck.collate=true&spellcheck.maxCollationTries=1&spellcheck.maxCollations=1&spellcheck.collateExtendedResults=true&qt=spellCheckCompRH&q=teststop%3Ametnoia&spellcheck.collateMaxCollectDocs=4} hits=0 status=0 QTime=5 
   [junit4]   2> 730900 T3219 C2988 oasc.SolrCore.execute [collection1] webapp=null path=null params={spellcheck=true&spellcheck.dictionary=direct&spellcheck.count=1&spellcheck.collate=true&spellcheck.maxCollationTries=1&spellcheck.maxCollations=1&spellcheck.collateExtendedResults=true&qt=spellCheckCompRH&q=teststop%3Ametnoia&spellcheck.collateMaxCollectDocs=7} hits=0 status=0 QTime=4 
   [junit4]   2> 730905 T3219 C2988 oasc.SolrCore.execute [collection1] webapp=null path=null params={spellcheck=true&spellcheck.dictionary=direct&spellcheck.count=1&spellcheck.collate=true&spellcheck.maxCollationTries=1&spellcheck.maxCollations=1&spellcheck.collateExtendedResults=true&qt=spellCheckCompRH&q=teststop%3Ametnoia&spellcheck.collateMaxCollectDocs=2} hits=0 status=0 QTime=4 
   [junit4]   2> 730932 T3219 C2988 oasc.SolrCore.execute [collection1] webapp=null path=null params={spellcheck=true&spellcheck.dictionary=direct&spellcheck.count=1&spellcheck.collate=true&spellcheck.maxCollationTries=1&spellcheck.maxCollations=1&spellcheck.collateExtendedResults=true&qt=spellCheckCompRH&q=teststop%3Ametnoia&spellcheck.collateMaxCollectDocs=16} hits=0 status=0 QTime=26 
   [junit4]   2> 730937 T3219 C2988 oasc.SolrCore.execute [collection1] webapp=null path=null params={spellcheck=true&spellcheck.dictionary=direct&spellcheck.count=1&spellcheck.collate=true&spellcheck.maxCollationTries=1&spellcheck.maxCollations=1&spellcheck.collateExtendedResults=true&qt=spellCheckCompRH&q=teststop%3Ametnoia&spellcheck.collateMaxCollectDocs=3} hits=0 status=0 QTime=4 
   [junit4]   2> 730943 T3219 C2988 oasc.SolrCore.execute [collection1] webapp=null path=null params={spellcheck=true&spellcheck.dictionary=direct&spellcheck.count=1&spellcheck.collate=true&spellcheck.maxCollationTries=1&spellcheck.maxCollations=1&spellcheck.collateExtendedResults=true&qt=spellCheckCompRH&q=teststop%3Ametnoia&spellcheck.collateMaxCollectDocs=14} hits=0 status=0 QTime=5 
   [junit4]   2> 730948 T3219 C2988 oasc.SolrCore.execute [collection1] webapp=null path=null params={spellcheck=true&spellcheck.dictionary=direct&spellcheck.count=1&spellcheck.collate=true&spellcheck.maxCollationTries=1&spellcheck.maxCollations=1&spellcheck.collateExtendedResults=true&qt=spellCheckCompRH&q=teststop%3Ametnoia&spellcheck.collateMaxCollectDocs=2} hits=0 status=0 QTime=4 
   [junit4]   2> 730953 T3219 C2988 oasc.SolrCore.execute [collection1] webapp=null path=null params={spellcheck=true&spellcheck.dictionary=direct&spellcheck.count=1&spellcheck.collate=true&spellcheck.maxCollationTries=1&spellcheck.maxCollations=1&spellcheck.collateExtendedResults=true&qt=spellCheckCompRH&q=teststop%3Ametnoia&spellcheck.collateMaxCollectDocs=4} hits=0 status=0 QTime=4 
   [junit4]   2> 730971 T3219 C2988 oasc.SolrCore.execute [collection1] webapp=null path=null params={spellcheck=true&spellcheck.dictionary=direct&spellcheck.count=1&spellcheck.collate=true&spellcheck.maxCollationTries=1&spellcheck.maxCollations=1&spellcheck.collateExtendedResults=true&qt=spellCheckCompRH&q=teststop%3Ametnoia&spellcheck.collateMaxCollectDocs=16} hits=0 status=0 QTime=4 
   [junit4]   2> 730991 T3219 C2988 oasc.SolrCore.execute [collection1] webapp=null path=null params={spellcheck=true&spellcheck.dictionary=direct&spellcheck.count=1&spellcheck.collate=true&spellcheck.maxCollationTries=1&spellcheck.maxCollations=1&spellcheck.collateExtendedResults=true&qt=spellCheckCompRH&q=teststop%3Ametnoia&spellcheck.collateMaxCollectDocs=4} hits=0 status=0 QTime=19 
   [junit4]   2> 731000 T3219 C2988 oasc.SolrCore.execute [collection1] webapp=null path=null params={spellcheck=true&spellcheck.dictionary=direct&spellcheck.count=1&spellcheck.collate=true&spellcheck.maxCollationTries=1&spellcheck.maxCollations=1&spellcheck.collateExtendedResults=true&qt=spellCheckCompRH&q=teststop%3Ametnoia&spellcheck.collateMaxCollectDocs=9} hits=0 status=0 QTime=7 
   [junit4]   2> 731021 T3219 C2988 oasc.SolrCore.execute [collection1] webapp=null path=null params={spellcheck=true&spellcheck.dictionary=direct&spellcheck.count=1&spellcheck.collate=true&spellcheck.maxCollationTries=1&spellcheck.maxCollations=1&spellcheck.collateExtendedResults=true&qt=spellCheckCompRH&q=teststop%3Ametnoia&spellcheck.collateMaxCollectDocs=8} hits=0 status=0 QTime=20 
   [junit4]   2> 731026 T3219 C2988 oasc.SolrCore.execute [collection1] webapp=null path=null params={spellcheck=true&spellcheck.dictionary=direct&spellcheck.count=1&spellcheck.collate=true&spellcheck.maxCollationTries=1&spellcheck.maxCollations=1&spellcheck.collateExtendedResults=true&qt=spellCheckCompRH&q=teststop%3Ametnoia&spellcheck.collateMaxCollectDocs=13} hits=0 status=0 QTime=4 
   [junit4]   2> 731031 T3219 C2988 oasc.SolrCore.execute [collection1] webapp=null path=null params={spellcheck=true&spellcheck.dictionary=direct&spellcheck.count=1&spellcheck.collate=true&spellcheck.maxCollationTries=1&spellcheck.maxCollations=1&spellcheck.collateExtendedResults=true&qt=spellCheckCompRH&q=teststop%3Ametnoia&spellcheck.collateMaxCollectDocs=1} hits=0 status=0 QTime=4 
   [junit4]   2> ASYNC  NEW_CORE C2989 name=collection1 org.apache.solr.core.SolrCore@52b353f1
   [junit4]   2> 731050 T3219 C2989 oasc.SolrCore.execute [collection1] webapp=null path=null params={spellcheck=true&spellcheck.dictionary=direct&spellcheck.count=1&spellcheck.collate=true&spellcheck.maxCollationTries=1&spellcheck.maxCollations=1&spellcheck.collateExtendedResults=true&qt=spellCheckCompRH&q=teststop%3Aeverother&spellcheck.collateMaxCollectDocs=5} hits=0 status=0 QTime=18 
   [junit4]   2> 731051 T3219 oas.SolrTestCaseJ4.assertQ ERROR REQUEST FAILED: xpath=//lst[@name='spellcheck']/lst[@name='suggestions']/lst[@name='collation']/int[@name='hits' and 6 <= . and . <= 10]
   [junit4]   2> 		xml response was: <?xml version="1.0" encoding="UTF-8"?>
   [junit4]   2> 	<response>
   [junit4]   2> 	<lst name="responseHeader"><int name="status">0</int><int name="QTime">18</int></lst><result name="response" numFound="0" start="0"></result><lst name="spellcheck"><lst name="suggestions"><lst name="everother"><int name="numFound">1</int><int name="startOffset">9</int><int name="endOffset">18</int><arr name="suggestion"><str>everyother</str></arr></lst><lst name="collation"><str name="collationQuery">teststop:everyother</str><int name="hits">12</int><lst name="misspellingsAndCorrections"><str name="everother">everyother</str></lst></lst></lst></lst>
   [junit4]   2> 	</response>
   [junit4]   2> 	
   [junit4]   2> 		request was:spellcheck=true&spellcheck.dictionary=direct&spellcheck.count=1&spellcheck.collate=true&spellcheck.maxCollationTries=1&spellcheck.maxCollations=1&spellcheck.collateExtendedResults=true&qt=spellCheckCompRH&q=teststop%3Aeverother&spellcheck.collateMaxCollectDocs=5
   [junit4]   2> 731052 T3219 oasc.SolrException.log ERROR REQUEST FAILED: spellcheck=true&spellcheck.dictionary=direct&spellcheck.count=1&spellcheck.collate=true&spellcheck.maxCollationTries=1&spellcheck.maxCollations=1&spellcheck.collateExtendedResults=true&qt=spellCheckCompRH&q=teststop%3Aeverother&spellcheck.collateMaxCollectDocs=5:java.lang.RuntimeException: REQUEST FAILED: xpath=//lst[@name='spellcheck']/lst[@name='suggestions']/lst[@name='collation']/int[@name='hits' and 6 <= . and . <= 10]
   [junit4]   2> 		xml response was: <?xml version="1.0" encoding="UTF-8"?>
   [junit4]   2> 	<response>
   [junit4]   2> 	<lst name="responseHeader"><int name="status">0</int><int name="QTime">18</int></lst><result name="response" numFound="0" start="0"></result><lst name="spellcheck"><lst name="suggestions"><lst name="everother"><int name="numFound">1</int><int name="startOffset">9</int><int name="endOffset">18</int><arr name="suggestion"><str>everyother</str></arr></lst><lst name="collation"><str name="collationQuery">teststop:everyother</str><int name="hits">12</int><lst name="misspellingsAndCorrections"><str name="everother">everyother</str></lst></lst></lst></lst>
   [junit4]   2> 	</response>
   [junit4]   2> 	
   [junit4]   2> 		request was:spellcheck=true&spellcheck.dictionary=direct&spellcheck.count=1&spellcheck.collate=true&spellcheck.maxCollationTries=1&spellcheck.maxCollations=1&spellcheck.collateExtendedResults=true&qt=spellCheckCompRH&q=teststop%3Aeverother&spellcheck.collateMaxCollectDocs=5
   [junit4]   2> 		at org.apache.solr.SolrTestCaseJ4.assertQ(SolrTestCaseJ4.java:630)
   [junit4]   2> 		at org.apache.solr.SolrTestCaseJ4.assertQ(SolrTestCaseJ4.java:604)
   [junit4]   2> 		at org.apache.solr.spelling.SpellCheckCollatorTest.testEstimatedHitCounts(SpellCheckCollatorTest.java:521)
   [junit4]   2> 		at sun.reflect.NativeMethodAccessorImpl.invoke0(Native Method)
   [junit4]   2> 		at sun.reflect.NativeMethodAccessorImpl.invoke(NativeMethodAccessorImpl.java:57)
   [junit4]   2> 		at sun.reflect.DelegatingMethodAccessorImpl.invoke(DelegatingMethodAccessorImpl.java:43)
   [junit4]   2> 		at java.lang.reflect.Method.invoke(Method.java:491)
   [junit4]   2> 		at com.carrotsearch.randomizedtesting.RandomizedRunner.invoke(RandomizedRunner.java:1559)
   [junit4]   2> 		at com.carrotsearch.randomizedtesting.RandomizedRunner.access$600(RandomizedRunner.java:79)
   [junit4]   2> 		at com.carrotsearch.randomizedtesting.RandomizedRunner$6.evaluate(RandomizedRunner.java:737)
   [junit4]   2> 		at com.carrotsearch.randomizedtesting.RandomizedRunner$7.evaluate(RandomizedRunner.java:773)
   [junit4]   2> 		at com.carrotsearch.randomizedtesting.RandomizedRunner$8.evaluate(RandomizedRunner.java:787)
   [junit4]   2> 		at com.carrotsearch.randomizedtesting.rules.SystemPropertiesRestoreRule$1.evaluate(SystemPropertiesRestoreRule.java:53)
   [junit4]   2> 		at org.apache.lucene.util.TestRuleSetupTeardownChained$1.evaluate(TestRuleSetupTeardownChained.java:50)
   [junit4]   2> 		at org.apache.lucene.util.TestRuleFieldCacheSanity$1.evaluate(TestRuleFieldCacheSanity.java:51)
   [junit4]   2> 		at org.apache.lucene.util.AbstractBeforeAfterRule$1.evaluate(AbstractBeforeAfterRule.java:46)
   [junit4]   2> 		at com.carrotsearch.randomizedtesting.rules.SystemPropertiesInvariantRule$1.evaluate(SystemPropertiesInvariantRule.java:55)
   [junit4]   2> 		at org.apache.lucene.util.TestRuleThreadAndTestName$1.evaluate(TestRuleThreadAndTestName.java:49)
   [junit4]   2> 		at org.apache.lucene.util.TestRuleIgnoreAfterMaxFailures$1.evaluate(TestRuleIgnoreAfterMaxFailures.java:70)
   [junit4]   2> 		at org.apache.lucene.util.TestRuleMarkFailure$1.evaluate(TestRuleMarkFailure.java:48)
   [junit4]   2> 		at com.carrotsearch.randomizedtesting.rules.StatementAdapter.evaluate(StatementAdapter.java:36)
   [junit4]   2> 		at com.carrotsearch.randomizedtesting.ThreadLeakControl$StatementRunner.run(ThreadLeakControl.java:358)
   [junit4]   2> 		at com.carrotsearch.randomizedtesting.ThreadLeakControl.forkTimeoutingTask(ThreadLeakControl.java:782)
   [junit4]   2> 		at com.carrotsearch.randomizedtesting.ThreadLeakControl$3.evaluate(ThreadLeakControl.java:442)
   [junit4]   2> 		at com.carrotsearch.randomizedtesting.RandomizedRunner.runSingleTest(RandomizedRunner.java:746)
   [junit4]   2> 		at com.carrotsearch.randomizedtesting.RandomizedRunner$3.evaluate(RandomizedRunner.java:648)
   [junit4]   2> 		at com.carrotsearch.randomizedtesting.RandomizedRunner$4.evaluate(RandomizedRunner.java:682)
   [junit4]   2> 		at com.carrotsearch.randomizedtesting.RandomizedRunner$5.evaluate(RandomizedRunner.java:693)
   [junit4]   2> 		at com.carrotsearch.randomizedtesting.rules.StatementAdapter.evaluate(StatementAdapter.java:36)
   [junit4]   2> 		at com.carrotsearch.randomizedtesting.rules.SystemPropertiesRestoreRule$1.evaluate(SystemPropertiesRestoreRule.java:53)
   [junit4]   2> 		at org.apache.lucene.util.AbstractBeforeAfterRule$1.evaluate(AbstractBeforeAfterRule.java:46)
   [junit4]   2> 		at org.apache.lucene.util.TestRuleStoreClassName$1.evaluate(TestRuleStoreClassName.java:42)
   [junit4]   2> 		at com.carrotsearch.randomizedtesting.rules.SystemPropertiesInvariantRule$1.evaluate(SystemPropertiesInvariantRule.java:55)
   [junit4]   2> 		at com.carrotsearch.randomizedtesting.rules.NoShadowingOrOverridesOnMethodsRule$1.evaluate(NoShadowingOrOverridesOnMethodsRule.java:39)
   [junit4]   2> 		at com.carrotsearch.randomizedtesting.rules.NoShadowingOrOverridesOnMethodsRule$1.evaluate(NoShadowingOrOverridesOnMethodsRule.java:39)
   [junit4]   2> 		at com.carrotsearch.randomizedtesting.rules.StatementAdapter.evaluate(StatementAdapter.java:36)
   [junit4]   2> 		at org.apache.lucene.util.TestRuleAssertionsRequired$1.evaluate(TestRuleAssertionsRequired.java:43)
   [junit4]   2> 		at org.apache.lucene.util.TestRuleMarkFailure$1.evaluate(TestRuleMarkFailure.java:48)
   [junit4]   2> 		at org.apache.lucene.util.TestRuleIgnoreAfterMaxFailures$1.evaluate(TestRuleIgnoreAfterMaxFailures.java:70)
   [junit4]   2> 		at org.apache.lucene.util.TestRuleIgnoreTestSuites$1.evaluate(TestRuleIgnoreTestSuites.java:55)
   [junit4]   2> 		at com.carrotsearch.randomizedtesting.rules.StatementAdapter.evaluate(StatementAdapter.java:36)
   [junit4]   2> 		at com.carrotsearch.randomizedtesting.ThreadLeakControl$StatementRunner.run(ThreadLeakControl.java:358)
   [junit4]   2> 		at java.lang.Thread.run(Thread.java:724)
   [junit4]   2> 	
   [junit4]   2> 731053 T3219 oas.SolrTestCaseJ4.tearDown ###Ending testEstimatedHitCounts
   [junit4]   2> NOTE: reproduce with: ant test  -Dtestcase=SpellCheckCollatorTest -Dtests.method=testEstimatedHitCounts -Dtests.seed=EAD13915CDD8580D -Dtests.multiplier=3 -Dtests.slow=true -Dtests.locale=en_SG -Dtests.timezone=Australia/Lindeman -Dtests.file.encoding=UTF-8
   [junit4] ERROR   0.75s J0 | SpellCheckCollatorTest.testEstimatedHitCounts <<<
   [junit4]    > Throwable #1: java.lang.RuntimeException: Exception during query
   [junit4]    > 	at __randomizedtesting.SeedInfo.seed([EAD13915CDD8580D:DB6A872068E748DD]:0)
   [junit4]    > 	at org.apache.solr.SolrTestCaseJ4.assertQ(SolrTestCaseJ4.java:637)
   [junit4]    > 	at org.apache.solr.SolrTestCaseJ4.assertQ(SolrTestCaseJ4.java:604)
   [junit4]    > 	at org.apache.solr.spelling.SpellCheckCollatorTest.testEstimatedHitCounts(SpellCheckCollatorTest.java:521)
   [junit4]    > 	at java.lang.Thread.run(Thread.java:724)
   [junit4]    > Caused by: java.lang.RuntimeException: REQUEST FAILED: xpath=//lst[@name='spellcheck']/lst[@name='suggestions']/lst[@name='collation']/int[@name='hits' and 6 <= . and . <= 10]
   [junit4]    > 	xml response was: <?xml version="1.0" encoding="UTF-8"?>
   [junit4]    > <response>
   [junit4]    > <lst name="responseHeader"><int name="status">0</int><int name="QTime">18</int></lst><result name="response" numFound="0" start="0"></result><lst name="spellcheck"><lst name="suggestions"><lst name="everother"><int name="numFound">1</int><int name="startOffset">9</int><int name="endOffset">18</int><arr name="suggestion"><str>everyother</str></arr></lst><lst name="collation"><str name="collationQuery">teststop:everyother</str><int name="hits">12</int><lst name="misspellingsAndCorrections"><str name="everother">everyother</str></lst></lst></lst></lst>
   [junit4]    > </response>
   [junit4]    > 	request was:spellcheck=true&spellcheck.dictionary=direct&spellcheck.count=1&spellcheck.collate=true&spellcheck.maxCollationTries=1&spellcheck.maxCollations=1&spellcheck.collateExtendedResults=true&qt=spellCheckCompRH&q=teststop%3Aeverother&spellcheck.collateMaxCollectDocs=5
   [junit4]    > 	at org.apache.solr.SolrTestCaseJ4.assertQ(SolrTestCaseJ4.java:630)
   [junit4]    > 	... 42 more
   [junit4]   2> 731137 T3219 oas.SolrTestCaseJ4.setUp ###Starting testContextSensitiveCollate
   [junit4]   2> 731146 T3219 C2989 oasc.SolrCore.execute [collection1] webapp=null path=null params={spellcheck=true&indent=true&spellcheck.maxResultsForSuggest=0&spellcheck.collateExtendedResults=true&spellcheck.extendedResults=true&spellcheck.maxCollations=1&spellcheck.maxCollationTries=10&spellcheck.collate=true&q=teststop:(flew+AND+form+AND+heathrow)&spellcheck.dictionary=direct&spellcheck.count=10&qt=spellCheckCompRH&spellcheck.build=true&spellcheck.alternativeTermCount=5} hits=0 status=0 QTime=9 
   [junit4]   2> 731154 T3219 C2989 oasc.SolrCore.execute [collection1] webapp=null path=null params={spellcheck=true&indent=true&spellcheck.maxResultsForSuggest=1&spellcheck.collateExtendedResults=true&spellcheck.extendedResults=true&spellcheck.maxCollationTries=10&spellcheck.maxCollations=1&spellcheck.collate=true&q=teststop:(june+AND+customs)&spellcheck.dictionary=direct&spellcheck.count=10&qt=spellCheckCompRH&spellcheck.alternativeTermCount=5} hits=1 status=0 QTime=6 
   [junit4]   2> 731324 T3219 C2989 oasc.SolrCore.execute [collection1] webapp=null path=null params={spellcheck=true&indent=true&spellcheck.maxResultsForSuggest=0&spellcheck.collateExtendedResults=true&spellcheck.extendedResults=true&spellcheck.maxCollations=1&spellcheck.maxCollationTries=10&spellcheck.collate=true&q=teststop:(flew+AND+form+AND+heathrow)&spellcheck.dictionary=default_teststop&spellcheck.count=10&qt=spellCheckCompRH&spellcheck.build=true&spellcheck.alternativeTermCount=5} hits=0 status=0 QTime=152 
   [junit4]   2> 731327 T3219 C2989 oasc.SolrCore.execute [collection1] webapp=null path=null params={spellcheck=true&indent=true&spellcheck.maxResultsForSuggest=1&spellcheck.collateExtendedResults=true&spellcheck.extendedResults=true&spellcheck.maxCollationTries=10&spellcheck.maxCollations=1&spellcheck.collate=true&q=teststop:(june+AND+customs)&spellcheck.dictionary=default_teststop&spellcheck.count=10&qt=spellCheckCompRH&spellcheck.alternativeTermCount=5} hits=1 status=0 QTime=1 
   [junit4]   2> 731329 T3219 oas.SolrTestCaseJ4.tearDown ###Ending testContextSensitiveCollate
   [junit4]   2> 731334 T3219 oas.SolrTestCaseJ4.setUp ###Starting testCollateWithGrouping
   [junit4]   2> 731403 T3219 oas.SolrTestCaseJ4.tearDown ###Ending testCollateWithGrouping
   [junit4]   2> 731408 T3219 oas.SolrTestCaseJ4.setUp ###Starting testCollateWithOverride
   [junit4]   2> 731424 T3219 C2989 oasc.SolrCore.execute [collection1] webapp=null path=null params={mm=1&spellcheck=true&q=partisian+politcal+mashine&spellcheck.maxCollations=10&spellcheck.maxCollationTries=10&qf=teststop&spellcheck.dictionary=direct&spellcheck.count=10&qt=spellCheckCompRH&spellcheck.collate=true&defType=edismax} hits=0 status=0 QTime=16 
   [junit4]   2> 731437 T3219 C2989 oasc.SolrCore.execute [collection1] webapp=null path=null params={mm=1&spellcheck=true&spellcheck.collateParam.mm=100%25&q=partisian+politcal+mashine&spellcheck.maxCollations=10&spellcheck.maxCollationTries=10&qf=teststop&spellcheck.dictionary=direct&spellcheck.count=10&qt=spellCheckCompRH&spellcheck.collate=true&defType=edismax} hits=0 status=0 QTime=12 
   [junit4]   2> 731438 T3219 oas.SolrTestCaseJ4.tearDown ###Ending testCollateWithOverride
   [junit4]   2> 731455 T3219 oas.SolrTestCaseJ4.setUp ###Starting testCollateWithFilter
   [junit4]   2> 731516 T3219 oas.SolrTestCaseJ4.tearDown ###Ending testCollateWithFilter
   [junit4]   2> 731520 T3219 oas.SolrTestCaseJ4.setUp ###Starting testExtendedCollate
   [junit4]   2> 731603 T3219 oas.SolrTestCaseJ4.tearDown ###Ending testExtendedCollate
   [junit4]   2> 731605 T3219 oas.SolrTestCaseJ4.deleteCore ###deleteCore
   [junit4]   2> 731605 T3219 oasc.CoreContainer.shutdown Shutting down CoreContainer instance=773331102
   [junit4]   2> 731605 T3219 oasc.SolrCore.close [collection1]  CLOSING SolrCore org.apache.solr.core.SolrCore@52b353f1
   [junit4]   2> 731607 T3219 oasu.DirectUpdateHandler2.close closing DirectUpdateHandler2{commits=1,autocommits=0,soft autocommits=0,optimizes=0,rollbacks=0,expungeDeletes=0,docsPending=0,adds=0,deletesById=0,deletesByQuery=0,errors=0,cumulative_adds=17,cumulative_deletesById=0,cumulative_deletesByQuery=0,cumulative_errors=0}
   [junit4]   2> 731607 T3219 oasu.SolrCoreState.decrefSolrCoreState Closing SolrCoreState
   [junit4]   2> 731608 T3219 oasu.DefaultSolrCoreState.closeIndexWriter SolrCoreState ref count has reached 0 - closing IndexWriter
   [junit4]   2> 731608 T3219 oasu.DefaultSolrCoreState.closeIndexWriter closing IndexWriter with IndexWriterCloser
   [junit4]   2> 731608 T3219 oasc.SolrCore.closeSearcher [collection1] Closing main searcher on request.
   [junit4]   2> 731609 T3219 oasc.CachingDirectoryFactory.close Closing MockDirectoryFactory - 2 directories currently being tracked
   [junit4]   2> 731609 T3219 oasc.CachingDirectoryFactory.closeCacheValue looking to close /mnt/ssd/jenkins/workspace/Lucene-Solr-trunk-Linux/solr/build/solr-core/test/J0/./solrtest-SpellCheckCollatorTest-1378632037958 [CachedDir<<refCount=0;path=/mnt/ssd/jenkins/workspace/Lucene-Solr-trunk-Linux/solr/build/solr-core/test/J0/./solrtest-SpellCheckCollatorTest-1378632037958;done=false>>]
   [junit4]   2> 731609 T3219 oasc.CachingDirectoryFactory.close Closing directory: /mnt/ssd/jenkins/workspace/Lucene-Solr-trunk-Linux/solr/build/solr-core/test/J0/./solrtest-SpellCheckCollatorTest-1378632037958
   [junit4]   2> 731610 T3219 oasc.CachingDirectoryFactory.closeCacheValue looking to close /mnt/ssd/jenkins/workspace/Lucene-Solr-trunk-Linux/solr/build/solr-core/test/J0/./solrtest-SpellCheckCollatorTest-1378632037958/index [CachedDir<<refCount=0;path=/mnt/ssd/jenkins/workspace/Lucene-Solr-trunk-Linux/solr/build/solr-core/test/J0/./solrtest-SpellCheckCollatorTest-1378632037958/index;done=false>>]
   [junit4]   2> 731610 T3219 oasc.CachingDirectoryFactory.close Closing directory: /mnt/ssd/jenkins/workspace/Lucene-Solr-trunk-Linux/solr/build/solr-core/test/J0/./solrtest-SpellCheckCollatorTest-1378632037958/index
   [junit4]   2> NOTE: test params are: codec=HighCompressionCompressingStoredFields(storedFieldsFormat=CompressingStoredFieldsFormat(compressionMode=HIGH_COMPRESSION, chunkSize=237), termVectorsFormat=CompressingTermVectorsFormat(compressionMode=HIGH_COMPRESSION, chunkSize=237)), sim=DefaultSimilarity, locale=en_SG, timezone=Australia/Lindeman
   [junit4]   2> NOTE: Linux 3.2.0-52-generic amd64/Oracle Corporation 1.8.0-ea (64-bit)/cpus=8,threads=1,free=54078840,total=183742464
   [junit4]   2> NOTE: All tests run in this JVM: [TestCoreContainer, TestJmxMonitoredMap, SolrTestCaseJ4Test, ZkControllerTest, TestLMDirichletSimilarityFactory, ClusterStateTest, DistributedTermsComponentTest, TestJoin, CacheHeaderTest, CopyFieldTest, FileBasedSpellCheckerTest, SystemInfoHandlerTest, HdfsCollectionsAPIDistributedZkTest, SearchHandlerTest, ZkCLITest, ResponseLogComponentTest, HdfsBasicDistributedZk2Test, TestSchemaVersionResource, TestSchemaSimilarityResource, MBeansHandlerTest, LeaderElectionTest, DOMUtilTest, TestQueryUtils, StatelessScriptUpdateProcessorFactoryTest, TestSearchPerf, ResourceLoaderTest, URLClassifyProcessorTest, LoggingHandlerTest, TestSolrXmlPersistor, DistributedQueryElevationComponentTest, UnloadDistributedZkTest, SliceStateTest, MoreLikeThisHandlerTest, TestFunctionQuery, TestElisionMultitermQuery, DateMathParserTest, SuggesterFSTTest, HdfsLockFactoryTest, BinaryUpdateRequestHandlerTest, PolyFieldTest, WordBreakSolrSpellCheckerTest, TestSort, DocumentBuilderTest, FastVectorHighlighterTest, DocValuesMissingTest, ExternalFileFieldSortTest, UpdateParamsTest, SolrCoreTest, TestPostingsSolrHighlighter, CachingDirectoryFactoryTest, ScriptEngineTest, TestMergePolicyConfig, TestSolrXml, QueryParsingTest, DirectUpdateHandlerOptimizeTest, OverseerCollectionProcessorTest, OverseerTest, SyncSliceTest, TestShardHandlerFactory, TestSolrDeletionPolicy1, SpatialFilterTest, PrimitiveFieldTypeTest, PreAnalyzedUpdateProcessorTest, AutoCommitTest, SpellPossibilityIteratorTest, TestDynamicFieldResource, RegexBoostProcessorTest, TestPerFieldSimilarity, TestBM25SimilarityFactory, SoftAutoCommitTest, ShowFileRequestHandlerTest, TestImplicitCoreProperties, TestReversedWildcardFilterFactory, CircularListTest, TestFieldTypeResource, SimpleFacetsTest, TestGroupingSearch, SliceStateUpdateTest, TestReplicationHandler, BasicDistributedZkTest, BasicZkTest, TestRandomFaceting, TestDistributedGrouping, TestHashPartitioner, TestStressReorder, StatsComponentTest, QueryElevationComponentTest, BadIndexSchemaTest, ConvertedLegacyTest, TestIndexSearcher, CurrencyFieldOpenExchangeTest, SolrIndexSplitterTest, SignatureUpdateProcessorFactoryTest, SpellCheckCollatorTest]
   [junit4] Completed on J0 in 2.32s, 8 tests, 1 error <<< FAILURES!

[...truncated 394 lines...]
BUILD FAILED
/mnt/ssd/jenkins/workspace/Lucene-Solr-trunk-Linux/build.xml:396: The following error occurred while executing this line:
/mnt/ssd/jenkins/workspace/Lucene-Solr-trunk-Linux/build.xml:376: The following error occurred while executing this line:
/mnt/ssd/jenkins/workspace/Lucene-Solr-trunk-Linux/build.xml:39: The following error occurred while executing this line:
/mnt/ssd/jenkins/workspace/Lucene-Solr-trunk-Linux/solr/build.xml:189: The following error occurred while executing this line:
/mnt/ssd/jenkins/workspace/Lucene-Solr-trunk-Linux/solr/common-build.xml:455: The following error occurred while executing this line:
/mnt/ssd/jenkins/workspace/Lucene-Solr-trunk-Linux/lucene/common-build.xml:1230: The following error occurred while executing this line:
/mnt/ssd/jenkins/workspace/Lucene-Solr-trunk-Linux/lucene/common-build.xml:873: There were test failures: 324 suites, 1413 tests, 1 error, 38 ignored (6 assumptions)

Total time: 35 minutes 51 seconds
Build step 'Invoke Ant' marked build as failure
Description set: Java: 64bit/jdk1.8.0-ea-b102 -XX:+UseCompressedOops -XX:+UseSerialGC
Archiving artifacts
Recording test results
Email was triggered for: Failure
Sending email for trigger: Failure



Mime
View raw message