lucene-dev mailing list archives

Site index · List index
Message view « Date » · « Thread »
Top « Date » · « Thread »
From Policeman Jenkins Server <jenk...@thetaphi.de>
Subject [JENKINS] Lucene-Solr-4.x-Windows (32bit/jdk1.8.0-ea-b102) - Build # 3141 - Failure!
Date Sun, 01 Sep 2013 08:43:24 GMT
Build: http://jenkins.thetaphi.de/job/Lucene-Solr-4.x-Windows/3141/
Java: 32bit/jdk1.8.0-ea-b102 -client -XX:+UseParallelGC

1 tests failed.
REGRESSION:  org.apache.solr.cloud.SliceStateUpdateTest.testSliceStateUpdate

Error Message:
expected:<[in]active> but was:<[]active>

Stack Trace:
org.junit.ComparisonFailure: expected:<[in]active> but was:<[]active>
	at __randomizedtesting.SeedInfo.seed([C96834B6E6CD6E50:190AB9FAB818B4D4]:0)
	at org.junit.Assert.assertEquals(Assert.java:125)
	at org.junit.Assert.assertEquals(Assert.java:147)
	at org.apache.solr.cloud.SliceStateUpdateTest.testSliceStateUpdate(SliceStateUpdateTest.java:183)
	at sun.reflect.NativeMethodAccessorImpl.invoke0(Native Method)
	at sun.reflect.NativeMethodAccessorImpl.invoke(NativeMethodAccessorImpl.java:57)
	at sun.reflect.DelegatingMethodAccessorImpl.invoke(DelegatingMethodAccessorImpl.java:43)
	at java.lang.reflect.Method.invoke(Method.java:491)
	at com.carrotsearch.randomizedtesting.RandomizedRunner.invoke(RandomizedRunner.java:1559)
	at com.carrotsearch.randomizedtesting.RandomizedRunner.access$600(RandomizedRunner.java:79)
	at com.carrotsearch.randomizedtesting.RandomizedRunner$6.evaluate(RandomizedRunner.java:737)
	at com.carrotsearch.randomizedtesting.RandomizedRunner$7.evaluate(RandomizedRunner.java:773)
	at com.carrotsearch.randomizedtesting.RandomizedRunner$8.evaluate(RandomizedRunner.java:787)
	at com.carrotsearch.randomizedtesting.rules.SystemPropertiesRestoreRule$1.evaluate(SystemPropertiesRestoreRule.java:53)
	at org.apache.lucene.util.TestRuleSetupTeardownChained$1.evaluate(TestRuleSetupTeardownChained.java:50)
	at org.apache.lucene.util.TestRuleFieldCacheSanity$1.evaluate(TestRuleFieldCacheSanity.java:51)
	at org.apache.lucene.util.AbstractBeforeAfterRule$1.evaluate(AbstractBeforeAfterRule.java:46)
	at com.carrotsearch.randomizedtesting.rules.SystemPropertiesInvariantRule$1.evaluate(SystemPropertiesInvariantRule.java:55)
	at org.apache.lucene.util.TestRuleThreadAndTestName$1.evaluate(TestRuleThreadAndTestName.java:49)
	at org.apache.lucene.util.TestRuleIgnoreAfterMaxFailures$1.evaluate(TestRuleIgnoreAfterMaxFailures.java:70)
	at org.apache.lucene.util.TestRuleMarkFailure$1.evaluate(TestRuleMarkFailure.java:48)
	at com.carrotsearch.randomizedtesting.rules.StatementAdapter.evaluate(StatementAdapter.java:36)
	at com.carrotsearch.randomizedtesting.ThreadLeakControl$StatementRunner.run(ThreadLeakControl.java:358)
	at com.carrotsearch.randomizedtesting.ThreadLeakControl.forkTimeoutingTask(ThreadLeakControl.java:782)
	at com.carrotsearch.randomizedtesting.ThreadLeakControl$3.evaluate(ThreadLeakControl.java:442)
	at com.carrotsearch.randomizedtesting.RandomizedRunner.runSingleTest(RandomizedRunner.java:746)
	at com.carrotsearch.randomizedtesting.RandomizedRunner$3.evaluate(RandomizedRunner.java:648)
	at com.carrotsearch.randomizedtesting.RandomizedRunner$4.evaluate(RandomizedRunner.java:682)
	at com.carrotsearch.randomizedtesting.RandomizedRunner$5.evaluate(RandomizedRunner.java:693)
	at com.carrotsearch.randomizedtesting.rules.StatementAdapter.evaluate(StatementAdapter.java:36)
	at com.carrotsearch.randomizedtesting.rules.SystemPropertiesRestoreRule$1.evaluate(SystemPropertiesRestoreRule.java:53)
	at org.apache.lucene.util.AbstractBeforeAfterRule$1.evaluate(AbstractBeforeAfterRule.java:46)
	at org.apache.lucene.util.TestRuleStoreClassName$1.evaluate(TestRuleStoreClassName.java:42)
	at com.carrotsearch.randomizedtesting.rules.SystemPropertiesInvariantRule$1.evaluate(SystemPropertiesInvariantRule.java:55)
	at com.carrotsearch.randomizedtesting.rules.NoShadowingOrOverridesOnMethodsRule$1.evaluate(NoShadowingOrOverridesOnMethodsRule.java:39)
	at com.carrotsearch.randomizedtesting.rules.NoShadowingOrOverridesOnMethodsRule$1.evaluate(NoShadowingOrOverridesOnMethodsRule.java:39)
	at com.carrotsearch.randomizedtesting.rules.StatementAdapter.evaluate(StatementAdapter.java:36)
	at org.apache.lucene.util.TestRuleAssertionsRequired$1.evaluate(TestRuleAssertionsRequired.java:43)
	at org.apache.lucene.util.TestRuleMarkFailure$1.evaluate(TestRuleMarkFailure.java:48)
	at org.apache.lucene.util.TestRuleIgnoreAfterMaxFailures$1.evaluate(TestRuleIgnoreAfterMaxFailures.java:70)
	at org.apache.lucene.util.TestRuleIgnoreTestSuites$1.evaluate(TestRuleIgnoreTestSuites.java:55)
	at com.carrotsearch.randomizedtesting.rules.StatementAdapter.evaluate(StatementAdapter.java:36)
	at com.carrotsearch.randomizedtesting.ThreadLeakControl$StatementRunner.run(ThreadLeakControl.java:358)
	at java.lang.Thread.run(Thread.java:724)




Build Log:
[...truncated 9850 lines...]
   [junit4] Suite: org.apache.solr.cloud.SliceStateUpdateTest
   [junit4]   2> 554793 T2080 oas.SolrTestCaseJ4.setUp ###Starting testSliceStateUpdate
   [junit4]   2> Creating dataDir: C:\Users\JenkinsSlave\workspace\Lucene-Solr-4.x-Windows\solr\build\solr-core\test\J0\.\solrtest-SliceStateUpdateTest-1378023350247
   [junit4]   2> 554795 T2080 oasc.ZkTestServer.run STARTING ZK TEST SERVER
   [junit4]   2> 554796 T2081 oasc.ZkTestServer$ZKServerMain.runFromConfig Starting server
   [junit4]   2> 554894 T2080 oasc.ZkTestServer.run start zk server on port:53937
   [junit4]   2> 554896 T2080 oascc.ConnectionManager.waitForConnected Waiting for client to connect to ZooKeeper
   [junit4]   2> 554904 T2087 oascc.ConnectionManager.process Watcher org.apache.solr.common.cloud.ConnectionManager@15c5db4 name:ZooKeeperConnection Watcher:127.0.0.1:53937 got event WatchedEvent state:SyncConnected type:None path:null path:null type:None
   [junit4]   2> 554905 T2080 oascc.ConnectionManager.waitForConnected Client is connected to ZooKeeper
   [junit4]   2> 554905 T2080 oascc.SolrZkClient.makePath makePath: /solr
   [junit4]   2> 554915 T2080 oascc.ConnectionManager.waitForConnected Waiting for client to connect to ZooKeeper
   [junit4]   2> 554918 T2089 oascc.ConnectionManager.process Watcher org.apache.solr.common.cloud.ConnectionManager@19bb7af name:ZooKeeperConnection Watcher:127.0.0.1:53937/solr got event WatchedEvent state:SyncConnected type:None path:null path:null type:None
   [junit4]   2> 554918 T2080 oascc.ConnectionManager.waitForConnected Client is connected to ZooKeeper
   [junit4]   2> 554918 T2080 oascc.SolrZkClient.makePath makePath: /collections/collection1
   [junit4]   2> 554924 T2080 oascc.SolrZkClient.makePath makePath: /collections/collection1/shards
   [junit4]   2> 554929 T2080 oascc.SolrZkClient.makePath makePath: /collections/control_collection
   [junit4]   2> 554933 T2080 oascc.SolrZkClient.makePath makePath: /collections/control_collection/shards
   [junit4]   2> 554943 T2080 oasc.AbstractZkTestCase.putConfig put C:\Users\JenkinsSlave\workspace\Lucene-Solr-4.x-Windows\solr\build\solr-core\test-files\solr\collection1\conf\solrconfig.xml to /configs/conf1/solrconfig.xml
   [junit4]   2> 554944 T2080 oascc.SolrZkClient.makePath makePath: /configs/conf1/solrconfig.xml
   [junit4]   2> 554961 T2080 oasc.AbstractZkTestCase.putConfig put C:\Users\JenkinsSlave\workspace\Lucene-Solr-4.x-Windows\solr\build\solr-core\test-files\solr\collection1\conf\schema.xml to /configs/conf1/schema.xml
   [junit4]   2> 554962 T2080 oascc.SolrZkClient.makePath makePath: /configs/conf1/schema.xml
   [junit4]   2> 554967 T2080 oasc.AbstractZkTestCase.putConfig put C:\Users\JenkinsSlave\workspace\Lucene-Solr-4.x-Windows\solr\build\solr-core\test-files\solr\collection1\conf\solrconfig.snippet.randomindexconfig.xml to /configs/conf1/solrconfig.snippet.randomindexconfig.xml
   [junit4]   2> 554968 T2080 oascc.SolrZkClient.makePath makePath: /configs/conf1/solrconfig.snippet.randomindexconfig.xml
   [junit4]   2> 554972 T2080 oasc.AbstractZkTestCase.putConfig put C:\Users\JenkinsSlave\workspace\Lucene-Solr-4.x-Windows\solr\build\solr-core\test-files\solr\collection1\conf\stopwords.txt to /configs/conf1/stopwords.txt
   [junit4]   2> 554972 T2080 oascc.SolrZkClient.makePath makePath: /configs/conf1/stopwords.txt
   [junit4]   2> 554976 T2080 oasc.AbstractZkTestCase.putConfig put C:\Users\JenkinsSlave\workspace\Lucene-Solr-4.x-Windows\solr\build\solr-core\test-files\solr\collection1\conf\protwords.txt to /configs/conf1/protwords.txt
   [junit4]   2> 554977 T2080 oascc.SolrZkClient.makePath makePath: /configs/conf1/protwords.txt
   [junit4]   2> 554980 T2080 oasc.AbstractZkTestCase.putConfig put C:\Users\JenkinsSlave\workspace\Lucene-Solr-4.x-Windows\solr\build\solr-core\test-files\solr\collection1\conf\currency.xml to /configs/conf1/currency.xml
   [junit4]   2> 554980 T2080 oascc.SolrZkClient.makePath makePath: /configs/conf1/currency.xml
   [junit4]   2> 554984 T2080 oasc.AbstractZkTestCase.putConfig put C:\Users\JenkinsSlave\workspace\Lucene-Solr-4.x-Windows\solr\build\solr-core\test-files\solr\collection1\conf\open-exchange-rates.json to /configs/conf1/open-exchange-rates.json
   [junit4]   2> 554985 T2080 oascc.SolrZkClient.makePath makePath: /configs/conf1/open-exchange-rates.json
   [junit4]   2> 554989 T2080 oasc.AbstractZkTestCase.putConfig put C:\Users\JenkinsSlave\workspace\Lucene-Solr-4.x-Windows\solr\build\solr-core\test-files\solr\collection1\conf\mapping-ISOLatin1Accent.txt to /configs/conf1/mapping-ISOLatin1Accent.txt
   [junit4]   2> 554989 T2080 oascc.SolrZkClient.makePath makePath: /configs/conf1/mapping-ISOLatin1Accent.txt
   [junit4]   2> 554994 T2080 oasc.AbstractZkTestCase.putConfig put C:\Users\JenkinsSlave\workspace\Lucene-Solr-4.x-Windows\solr\build\solr-core\test-files\solr\collection1\conf\old_synonyms.txt to /configs/conf1/old_synonyms.txt
   [junit4]   2> 554995 T2080 oascc.SolrZkClient.makePath makePath: /configs/conf1/old_synonyms.txt
   [junit4]   2> 554999 T2080 oasc.AbstractZkTestCase.putConfig put C:\Users\JenkinsSlave\workspace\Lucene-Solr-4.x-Windows\solr\build\solr-core\test-files\solr\collection1\conf\synonyms.txt to /configs/conf1/synonyms.txt
   [junit4]   2> 554999 T2080 oascc.SolrZkClient.makePath makePath: /configs/conf1/synonyms.txt
   [junit4]   2> 555003 T2080 oasc.SliceStateUpdateTest.setUp ####SETUP_START testSliceStateUpdate
   [junit4]   2> 555003 T2082 oazs.NIOServerCnxn.doIO WARN caught end of stream exception EndOfStreamException: Unable to read additional data from client sessionid 0x140d8979ff10001, likely client has closed socket
   [junit4]   2> 	at org.apache.zookeeper.server.NIOServerCnxn.doIO(NIOServerCnxn.java:220)
   [junit4]   2> 	at org.apache.zookeeper.server.NIOServerCnxnFactory.run(NIOServerCnxnFactory.java:208)
   [junit4]   2> 	at java.lang.Thread.run(Thread.java:724)
   [junit4]   2> 
   [junit4]   2> 555006 T2080 oascc.ConnectionManager.waitForConnected Waiting for client to connect to ZooKeeper
   [junit4]   2> 555009 T2091 oascc.ConnectionManager.process Watcher org.apache.solr.common.cloud.ConnectionManager@1a436c4 name:ZooKeeperConnection Watcher:127.0.0.1:53937/solr got event WatchedEvent state:SyncConnected type:None path:null path:null type:None
   [junit4]   2> 555010 T2080 oascc.ConnectionManager.waitForConnected Client is connected to ZooKeeper
   [junit4]   2> 555010 T2080 oascc.SolrZkClient.makePath makePath: /collections/testcore
   [junit4]   2> 555013 T2080 oascc.SolrZkClient.makePath makePath: /collections/testcore/shards
   [junit4]   2> 555024 T2080 oasc.SolrResourceLoader.locateSolrHome JNDI not configured for solr (NoInitialContextEx)
   [junit4]   2> 555024 T2080 oasc.SolrResourceLoader.locateSolrHome using system property solr.solr.home: C:\Users\JenkinsSlave\workspace\Lucene-Solr-4.x-Windows\solr\build\solr-core\test-files\solr
   [junit4]   2> 555024 T2080 oasc.SolrResourceLoader.<init> new SolrResourceLoader for directory: 'C:\Users\JenkinsSlave\workspace\Lucene-Solr-4.x-Windows\solr\build\solr-core\test-files\solr\'
   [junit4]   2> 555063 T2080 oasc.ConfigSolr.fromFile Loading container configuration from C:\Users\JenkinsSlave\workspace\Lucene-Solr-4.x-Windows\solr\build\solr-core\test-files\solr\solr.xml
   [junit4]   2> 555077 T2080 oasc.CoreContainer.<init> New CoreContainer 14408005
   [junit4]   2> 555077 T2080 oasc.SolrResourceLoader.locateSolrHome JNDI not configured for solr (NoInitialContextEx)
   [junit4]   2> 555077 T2080 oasc.SolrResourceLoader.locateSolrHome using system property solr.solr.home: C:\Users\JenkinsSlave\workspace\Lucene-Solr-4.x-Windows\solr\build\solr-core\test-files\solr
   [junit4]   2> 555077 T2080 oasc.SolrResourceLoader.<init> new SolrResourceLoader for directory: 'C:\Users\JenkinsSlave\workspace\Lucene-Solr-4.x-Windows\solr\build\solr-core\test-files\solr\'
   [junit4]   2> 555096 T2080 oasc.ConfigSolr.fromFile Loading container configuration from C:\Users\JenkinsSlave\workspace\Lucene-Solr-4.x-Windows\solr\build\solr-core\test-files\solr\solr.xml
   [junit4]   2> 555106 T2080 oasc.CoreContainer.<init> New CoreContainer 11411135
   [junit4]   2> 555107 T2080 oasc.CoreContainer.load Loading cores into CoreContainer [instanceDir=C:\Users\JenkinsSlave\workspace\Lucene-Solr-4.x-Windows\solr\build\solr-core\test-files\solr\]
   [junit4]   2> 555108 T2080 oashc.HttpShardHandlerFactory.getParameter Setting socketTimeout to: 120000
   [junit4]   2> 555108 T2080 oashc.HttpShardHandlerFactory.getParameter Setting urlScheme to: http://
   [junit4]   2> 555108 T2080 oashc.HttpShardHandlerFactory.getParameter Setting connTimeout to: 15000
   [junit4]   2> 555109 T2080 oashc.HttpShardHandlerFactory.getParameter Setting maxConnectionsPerHost to: 20
   [junit4]   2> 555109 T2080 oashc.HttpShardHandlerFactory.getParameter Setting corePoolSize to: 0
   [junit4]   2> 555110 T2080 oashc.HttpShardHandlerFactory.getParameter Setting maximumPoolSize to: 2147483647
   [junit4]   2> 555110 T2080 oashc.HttpShardHandlerFactory.getParameter Setting maxThreadIdleTime to: 5
   [junit4]   2> 555110 T2080 oashc.HttpShardHandlerFactory.getParameter Setting sizeOfQueue to: -1
   [junit4]   2> 555110 T2080 oashc.HttpShardHandlerFactory.getParameter Setting fairnessPolicy to: false
   [junit4]   2> 555110 T2080 oascsi.HttpClientUtil.createClient Creating new http client, config:maxConnectionsPerHost=20&maxConnections=10000&socketTimeout=120000&connTimeout=15000&retry=false
   [junit4]   2> 555119 T2080 oasl.LogWatcher.createWatcher SLF4J impl is org.slf4j.impl.Log4jLoggerFactory
   [junit4]   2> 555120 T2080 oasl.LogWatcher.newRegisteredLogWatcher Registering Log Listener [Log4j (org.slf4j.impl.Log4jLoggerFactory)]
   [junit4]   2> 555120 T2080 oasc.ZkContainer.initZooKeeper Zookeeper client=127.0.0.1:53937/solr
   [junit4]   2> 555120 T2080 oasc.ZkController.checkChrootPath zkHost includes chroot
   [junit4]   2> 555122 T2080 oascc.ConnectionManager.waitForConnected Waiting for client to connect to ZooKeeper
   [junit4]   2> 555125 T2093 oascc.ConnectionManager.process Watcher org.apache.solr.common.cloud.ConnectionManager@862428 name:ZooKeeperConnection Watcher:127.0.0.1:53937 got event WatchedEvent state:SyncConnected type:None path:null path:null type:None
   [junit4]   2> 555126 T2080 oascc.ConnectionManager.waitForConnected Client is connected to ZooKeeper
   [junit4]   2> 555128 T2080 oascsi.HttpClientUtil.createClient Creating new http client, config:maxConnections=500&maxConnectionsPerHost=16&socketTimeout=120000&connTimeout=15000
   [junit4]   2> 555136 T2080 oascc.ConnectionManager.waitForConnected Waiting for client to connect to ZooKeeper
   [junit4]   2> 555137 T2095 oascc.ConnectionManager.process Watcher org.apache.solr.common.cloud.ConnectionManager@9e51f5 name:ZooKeeperConnection Watcher:127.0.0.1:53937/solr got event WatchedEvent state:SyncConnected type:None path:null path:null type:None
   [junit4]   2> 555137 T2080 oascc.ConnectionManager.waitForConnected Client is connected to ZooKeeper
   [junit4]   2> 555139 T2080 oascc.SolrZkClient.makePath makePath: /overseer/queue
   [junit4]   2> 555144 T2080 oascc.SolrZkClient.makePath makePath: /overseer/collection-queue-work
   [junit4]   2> 555149 T2080 oascc.SolrZkClient.makePath makePath: /live_nodes
   [junit4]   2> 555151 T2080 oasc.ZkController.createEphemeralLiveNode Register node as live in ZooKeeper:/live_nodes/127.0.0.1:8983_solr
   [junit4]   2> 555153 T2080 oascc.SolrZkClient.makePath makePath: /live_nodes/127.0.0.1:8983_solr
   [junit4]   2> 555157 T2080 oascc.SolrZkClient.makePath makePath: /overseer_elect/election
   [junit4]   2> 555164 T2080 oascc.SolrZkClient.makePath makePath: /overseer_elect/leader
   [junit4]   2> 555168 T2080 oasc.Overseer.start Overseer (id=90310138282442756-127.0.0.1:8983_solr-n_0000000000) starting
   [junit4]   2> 555172 T2080 oascc.SolrZkClient.makePath makePath: /overseer/queue-work
   [junit4]   2> 555178 T2097 oasc.OverseerCollectionProcessor.run Process current queue of collection creations
   [junit4]   2> 555179 T2080 oascc.SolrZkClient.makePath makePath: /clusterstate.json
   [junit4]   2> 555181 T2080 oascc.SolrZkClient.makePath makePath: /aliases.json
   [junit4]   2> 555184 T2080 oascc.ZkStateReader.createClusterStateWatchersAndUpdate Updating cluster state from ZooKeeper... 
   [junit4]   2> 555189 T2096 oasc.Overseer$ClusterStateUpdater.run Starting to work on the main queue
   [junit4]   2> 555192 T2098 oasc.ZkController.publish publishing core=collection1 state=down
   [junit4]   2> 555192 T2098 oasc.ZkController.publish numShards not found on descriptor - reading it from system property
   [junit4]   2> 555193 T2098 oasc.ZkController.waitForCoreNodeName look for our core node name
   [junit4]   2> 556663 T2096 oascc.ZkStateReader.updateClusterState Updating cloud state from ZooKeeper... 
   [junit4]   2> 556665 T2096 oasc.Overseer$ClusterStateUpdater.updateState Update state numShards=null message={
   [junit4]   2> 	  "operation":"state",
   [junit4]   2> 	  "core_node_name":"core_node1",
   [junit4]   2> 	  "numShards":null,
   [junit4]   2> 	  "shard":null,
   [junit4]   2> 	  "roles":null,
   [junit4]   2> 	  "state":"down",
   [junit4]   2> 	  "shard_state":"active",
   [junit4]   2> 	  "core":"collection1",
   [junit4]   2> 	  "collection":"collection1",
   [junit4]   2> 	  "shard_range":null,
   [junit4]   2> 	  "node_name":"127.0.0.1:8983_solr",
   [junit4]   2> 	  "base_url":"http://127.0.0.1:8983/solr"}
   [junit4]   2> 556665 T2096 oasc.Overseer$ClusterStateUpdater.updateState Assigning new node to shard shard=shard1
   [junit4]   2> 556671 T2095 oascc.ZkStateReader$2.process A cluster state change: WatchedEvent state:SyncConnected type:NodeDataChanged path:/clusterstate.json, has occurred - updating... (live nodes size: 1)
   [junit4]   2> 557201 T2098 oasc.ZkController.waitForShardId waiting to find shard id in clusterstate for collection1
   [junit4]   2> 557201 T2098 oasc.CoreContainer.create Creating SolrCore 'collection1' using instanceDir: C:\Users\JenkinsSlave\workspace\Lucene-Solr-4.x-Windows\solr\build\solr-core\test-files\solr\collection1
   [junit4]   2> 557201 T2098 oasc.ZkController.createCollectionZkNode Check for collection zkNode:collection1
   [junit4]   2> 557203 T2098 oasc.ZkController.createCollectionZkNode Collection zkNode exists
   [junit4]   2> 557204 T2098 oasc.ZkController.readConfigName Load collection config from:/collections/collection1
   [junit4]   2> 557206 T2098 oasc.SolrResourceLoader.<init> new SolrResourceLoader for directory: 'C:\Users\JenkinsSlave\workspace\Lucene-Solr-4.x-Windows\solr\build\solr-core\test-files\solr\collection1\'
   [junit4]   2> 557210 T2098 oasc.SolrResourceLoader.replaceClassLoader Adding 'file:/C:/Users/JenkinsSlave/workspace/Lucene-Solr-4.x-Windows/solr/build/solr-core/test-files/solr/collection1/lib/classes/' to classloader
   [junit4]   2> 557212 T2098 oasc.SolrResourceLoader.replaceClassLoader Adding 'file:/C:/Users/JenkinsSlave/workspace/Lucene-Solr-4.x-Windows/solr/build/solr-core/test-files/solr/collection1/lib/README' to classloader
   [junit4]   2> 557265 T2098 oasc.SolrConfig.<init> Using Lucene MatchVersion: LUCENE_45
   [junit4]   2> 557300 T2098 oasc.SolrConfig.<init> Loaded SolrConfig: solrconfig.xml
   [junit4]   2> 557303 T2098 oass.IndexSchema.readSchema Reading Solr Schema from schema.xml
   [junit4]   2> 557313 T2098 oass.IndexSchema.readSchema [null] Schema name=test
   [junit4]   2> 557461 T2098 oass.ByteField.init WARN ByteField is deprecated and will be removed in 5.0. You should use TrieIntField instead.
   [junit4]   2> 557462 T2098 oass.ShortField.init WARN ShortField is deprecated and will be removed in 5.0. You should use TrieIntField instead.
   [junit4]   2> 557464 T2098 oass.OpenExchangeRatesOrgProvider.init Initialized with rates=open-exchange-rates.json, refreshInterval=1440.
   [junit4]   2> 557471 T2098 oass.IndexSchema.readSchema default search field in schema is text
   [junit4]   2> 557475 T2098 oass.IndexSchema.readSchema unique key field: id
   [junit4]   2> 557496 T2098 oass.FileExchangeRateProvider.reload Reloading exchange rates from file currency.xml
   [junit4]   2> 557500 T2098 oass.FileExchangeRateProvider.reload Reloading exchange rates from file currency.xml
   [junit4]   2> 557504 T2098 oass.OpenExchangeRatesOrgProvider.reload Reloading exchange rates from open-exchange-rates.json
   [junit4]   2> 557506 T2098 oass.OpenExchangeRatesOrgProvider$OpenExchangeRates.<init> WARN Unknown key IMPORTANT NOTE
   [junit4]   2> 557506 T2098 oass.OpenExchangeRatesOrgProvider$OpenExchangeRates.<init> WARN Expected key, got STRING
   [junit4]   2> 557506 T2098 oass.OpenExchangeRatesOrgProvider.reload Reloading exchange rates from open-exchange-rates.json
   [junit4]   2> 557508 T2098 oass.OpenExchangeRatesOrgProvider$OpenExchangeRates.<init> WARN Unknown key IMPORTANT NOTE
   [junit4]   2> 557508 T2098 oass.OpenExchangeRatesOrgProvider$OpenExchangeRates.<init> WARN Expected key, got STRING
   [junit4]   2> 557509 T2098 oasc.SolrCore.initDirectoryFactory org.apache.solr.core.MockDirectoryFactory
   [junit4]   2> 557509 T2098 oasc.SolrCore.<init> [collection1] Opening new SolrCore at C:\Users\JenkinsSlave\workspace\Lucene-Solr-4.x-Windows\solr\build\solr-core\test-files\solr\collection1\, dataDir=C:\Users\JenkinsSlave\workspace\Lucene-Solr-4.x-Windows\solr\build\solr-core\test\J0\.\solrtest-SliceStateUpdateTest-1378023350247\data2\
   [junit4]   2> 557509 T2098 oasc.JmxMonitoredMap.<init> JMX monitoring is enabled. Adding Solr mbeans to JMX Server: com.sun.jmx.mbeanserver.JmxMBeanServer@18c5e94
   [junit4]   2> 557510 T2098 oasc.CachingDirectoryFactory.get return new directory for C:\Users\JenkinsSlave\workspace\Lucene-Solr-4.x-Windows\solr\build\solr-core\test\J0\.\solrtest-SliceStateUpdateTest-1378023350247\data2\
   [junit4]   2> 557510 T2098 oasc.SolrCore.getNewIndexDir New index directory detected: old=null new=C:\Users\JenkinsSlave\workspace\Lucene-Solr-4.x-Windows\solr\build\solr-core\test\J0\.\solrtest-SliceStateUpdateTest-1378023350247\data2\index/
   [junit4]   2> 557511 T2098 oasc.SolrCore.initIndex WARN [collection1] Solr index directory 'C:\Users\JenkinsSlave\workspace\Lucene-Solr-4.x-Windows\solr\build\solr-core\test\J0\.\solrtest-SliceStateUpdateTest-1378023350247\data2\index' doesn't exist. Creating new index...
   [junit4]   2> 557511 T2098 oasc.CachingDirectoryFactory.get return new directory for C:\Users\JenkinsSlave\workspace\Lucene-Solr-4.x-Windows\solr\build\solr-core\test\J0\.\solrtest-SliceStateUpdateTest-1378023350247\data2\index
   [junit4]   2> 557511 T2098 oasu.RandomMergePolicy.<init> RandomMergePolicy wrapping class org.apache.lucene.index.LogByteSizeMergePolicy: [LogByteSizeMergePolicy: minMergeSize=1677721, mergeFactor=29, maxMergeSize=2147483648, maxMergeSizeForForcedMerge=9223372036854775807, calibrateSizeByDeletes=false, maxMergeDocs=2147483647, maxCFSSegmentSizeMB=8.796093022207999E12, noCFSRatio=0.5339552311074649]
   [junit4]   2> 557512 T2098 oasc.SolrDeletionPolicy.onCommit SolrDeletionPolicy.onCommit: commits: num=1
   [junit4]   2> 		commit{dir=RateLimitedDirectoryWrapper(MockDirWrapper(org.apache.lucene.store.RAMDirectory@dc7308 lockFactory=org.apache.lucene.store.SingleInstanceLockFactory@15b7c6f)),segFN=segments_1,generation=1}
   [junit4]   2> 557514 T2098 oasc.SolrDeletionPolicy.updateCommits newest commit generation = 1
   [junit4]   2> 557514 T2098 oasc.SolrCore.initWriters created xml: solr.XMLResponseWriter
   [junit4]   2> 557517 T2098 oasup.UpdateRequestProcessorChain.init creating updateRequestProcessorChain "dedupe"
   [junit4]   2> 557517 T2098 oasup.UpdateRequestProcessorChain.init inserting DistributedUpdateProcessorFactory into updateRequestProcessorChain "dedupe"
   [junit4]   2> 557518 T2098 oasup.UpdateRequestProcessorChain.init creating updateRequestProcessorChain "dedupe-allfields"
   [junit4]   2> 557518 T2098 oasup.UpdateRequestProcessorChain.init inserting DistributedUpdateProcessorFactory into updateRequestProcessorChain "dedupe-allfields"
   [junit4]   2> 557518 T2098 oasup.UpdateRequestProcessorChain.init creating updateRequestProcessorChain "stored_sig"
   [junit4]   2> 557519 T2098 oasup.UpdateRequestProcessorChain.init inserting DistributedUpdateProcessorFactory into updateRequestProcessorChain "stored_sig"
   [junit4]   2> 557519 T2098 oasup.UpdateRequestProcessorChain.init creating updateRequestProcessorChain "uniq-fields"
   [junit4]   2> 557519 T2098 oasup.UniqFieldsUpdateProcessorFactory.init WARN Use of the 'fields' init param in UniqFieldsUpdateProcessorFactory is deprecated, please use 'fieldName' (or another FieldMutatingUpdateProcessorFactory selector option) instead
   [junit4]   2> 557520 T2098 oasup.UniqFieldsUpdateProcessorFactory.init Replacing 'fields' init param with (individual) 'fieldName' params
   [junit4]   2> 557520 T2098 oasup.UpdateRequestProcessorChain.init inserting DistributedUpdateProcessorFactory into updateRequestProcessorChain "uniq-fields"
   [junit4]   2> 557521 T2098 oasup.UpdateRequestProcessorChain.init creating updateRequestProcessorChain "distrib-dup-test-chain-explicit"
   [junit4]   2> 557521 T2098 oasup.UpdateRequestProcessorChain.init creating updateRequestProcessorChain "distrib-dup-test-chain-implicit"
   [junit4]   2> 557521 T2098 oasup.UpdateRequestProcessorChain.init inserting DistributedUpdateProcessorFactory into updateRequestProcessorChain "distrib-dup-test-chain-implicit"
   [junit4]   2> 557522 T2098 oasc.SolrCore.loadUpdateProcessorChains no updateRequestProcessorChain defined as default, creating implicit default
   [junit4]   2> 557522 T2098 oasc.RequestHandlers.initHandlersFromConfig adding lazy requestHandler: solr.ReplicationHandler
   [junit4]   2> 557522 T2098 oasc.RequestHandlers.initHandlersFromConfig created /replication: solr.ReplicationHandler
   [junit4]   2> 557523 T2098 oasc.RequestHandlers.initHandlersFromConfig created standard: solr.StandardRequestHandler
   [junit4]   2> 557523 T2098 oasc.RequestHandlers.initHandlersFromConfig created /get: solr.RealTimeGetHandler
   [junit4]   2> 557524 T2098 oasc.RequestHandlers.initHandlersFromConfig created dismax: solr.SearchHandler
   [junit4]   2> 557524 T2098 oasc.RequestHandlers.initHandlersFromConfig created mock: org.apache.solr.core.MockQuerySenderListenerReqHandler
   [junit4]   2> 557525 T2098 oasc.RequestHandlers.initHandlersFromConfig created /admin/: org.apache.solr.handler.admin.AdminHandlers
   [junit4]   2> 557525 T2098 oasc.RequestHandlers.initHandlersFromConfig created defaults: solr.StandardRequestHandler
   [junit4]   2> 557525 T2098 oasc.RequestHandlers.initHandlersFromConfig adding lazy requestHandler: solr.StandardRequestHandler
   [junit4]   2> 557525 T2098 oasc.RequestHandlers.initHandlersFromConfig created lazy: solr.StandardRequestHandler
   [junit4]   2> 557526 T2098 oasc.RequestHandlers.initHandlersFromConfig created /update: solr.UpdateRequestHandler
   [junit4]   2> 557526 T2098 oasc.RequestHandlers.initHandlersFromConfig created /terms: org.apache.solr.handler.component.SearchHandler
   [junit4]   2> 557527 T2098 oasc.RequestHandlers.initHandlersFromConfig created spellCheckCompRH: org.apache.solr.handler.component.SearchHandler
   [junit4]   2> 557527 T2098 oasc.RequestHandlers.initHandlersFromConfig created spellCheckCompRH_Direct: org.apache.solr.handler.component.SearchHandler
   [junit4]   2> 557528 T2098 oasc.RequestHandlers.initHandlersFromConfig created spellCheckWithWordbreak: org.apache.solr.handler.component.SearchHandler
   [junit4]   2> 557528 T2098 oasc.RequestHandlers.initHandlersFromConfig created spellCheckWithWordbreak_Direct: org.apache.solr.handler.component.SearchHandler
   [junit4]   2> 557529 T2098 oasc.RequestHandlers.initHandlersFromConfig created spellCheckCompRH1: org.apache.solr.handler.component.SearchHandler
   [junit4]   2> 557529 T2098 oasc.RequestHandlers.initHandlersFromConfig created mltrh: org.apache.solr.handler.component.SearchHandler
   [junit4]   2> 557530 T2098 oasc.RequestHandlers.initHandlersFromConfig created tvrh: org.apache.solr.handler.component.SearchHandler
   [junit4]   2> 557530 T2098 oasc.RequestHandlers.initHandlersFromConfig created /mlt: solr.MoreLikeThisHandler
   [junit4]   2> 557531 T2098 oasc.RequestHandlers.initHandlersFromConfig created /debug/dump: solr.DumpRequestHandler
   [junit4]   2> 557539 T2098 oashl.XMLLoader.init xsltCacheLifetimeSeconds=60
   [junit4]   2> 557540 T2098 oasc.SolrCore.initDeprecatedSupport WARN solrconfig.xml uses deprecated <admin/gettableFiles>, Please update your config to use the ShowFileRequestHandler.
   [junit4]   2> 557541 T2098 oasc.SolrCore.initDeprecatedSupport WARN adding ShowFileRequestHandler with hidden files: [OLD_SYNONYMS.TXT, STOPWORDS.TXT, PROTWORDS.TXT, OPEN-EXCHANGE-RATES.JSON, SYNONYMS.TXT, CURRENCY.XML, MAPPING-ISOLATIN1ACCENT.TXT, SOLRCONFIG.SNIPPET.RANDOMINDEXCONFIG.XML]
   [junit4]   2> 557544 T2098 oasu.CommitTracker.<init> Hard AutoCommit: disabled
   [junit4]   2> 557544 T2098 oasu.CommitTracker.<init> Soft AutoCommit: disabled
   [junit4]   2> 557545 T2098 oasu.RandomMergePolicy.<init> RandomMergePolicy wrapping class org.apache.lucene.index.TieredMergePolicy: [TieredMergePolicy: maxMergeAtOnce=47, maxMergeAtOnceExplicit=44, maxMergedSegmentMB=37.3115234375, floorSegmentMB=1.0810546875, forceMergeDeletesPctAllowed=21.13786552685683, segmentsPerTier=10.0, maxCFSSegmentSizeMB=8.796093022207999E12, noCFSRatio=1.0
   [junit4]   2> 557545 T2098 oasc.SolrDeletionPolicy.onInit SolrDeletionPolicy.onInit: commits: num=1
   [junit4]   2> 		commit{dir=RateLimitedDirectoryWrapper(MockDirWrapper(org.apache.lucene.store.RAMDirectory@dc7308 lockFactory=org.apache.lucene.store.SingleInstanceLockFactory@15b7c6f)),segFN=segments_1,generation=1}
   [junit4]   2> 557546 T2098 oasc.SolrDeletionPolicy.updateCommits newest commit generation = 1
   [junit4]   2> 557546 T2098 oass.SolrIndexSearcher.<init> Opening Searcher@75978c main
   [junit4]   2> 557546 T2098 oashc.SpellCheckComponent.inform Initializing spell checkers
   [junit4]   2> 557556 T2098 oass.DirectSolrSpellChecker.init init: {name=direct,classname=DirectSolrSpellChecker,field=lowerfilt,minQueryLength=3}
   [junit4]   2> 557611 T2099 oasc.SolrCore.registerSearcher [collection1] Registered new searcher Searcher@75978c main{StandardDirectoryReader(segments_1:1:nrt)}
   [junit4]   2> 557617 T2098 oasc.CoreContainer.registerCore registering core: collection1
   [junit4]   2> 557618 T2098 oasc.ZkController.register Register replica - core:collection1 address:http://127.0.0.1:8983/solr collection:collection1 shard:shard1
   [junit4]   2> 557618 T2098 oascsi.HttpClientUtil.createClient Creating new http client, config:maxConnections=10000&maxConnectionsPerHost=20&connTimeout=15000&socketTimeout=30000&retry=false
   [junit4]   2> 557628 T2098 oascc.SolrZkClient.makePath makePath: /collections/collection1/leader_elect/shard1/election
   [junit4]   2> 557640 T2098 oasc.ShardLeaderElectionContext.runLeaderProcess Running the leader process for shard shard1
   [junit4]   2> 557643 T2098 oasc.ShardLeaderElectionContext.waitForReplicasToComeUp Enough replicas found to continue.
   [junit4]   2> 557644 T2098 oasc.ShardLeaderElectionContext.runLeaderProcess I may be the new leader - try and sync
   [junit4]   2> 557644 T2098 oasc.ShardLeaderElectionContext.runLeaderProcess I am the new leader: http://127.0.0.1:8983/solr/collection1/ shard1
   [junit4]   2> 557644 T2098 oascc.SolrZkClient.makePath makePath: /collections/collection1/leaders/shard1
   [junit4]   2> 558295 T2096 oascc.ZkStateReader.updateClusterState Updating cloud state from ZooKeeper... 
   [junit4]   2> 558308 T2095 oascc.ZkStateReader$2.process A cluster state change: WatchedEvent state:SyncConnected type:NodeDataChanged path:/clusterstate.json, has occurred - updating... (live nodes size: 1)
   [junit4]   2> 558368 T2098 oasc.ZkController.register We are http://127.0.0.1:8983/solr/collection1/ and leader is http://127.0.0.1:8983/solr/collection1/
   [junit4]   2> 558368 T2098 oasc.ZkController.register No LogReplay needed for core=collection1 baseURL=http://127.0.0.1:8983/solr
   [junit4]   2> 558368 T2098 oasc.ZkController.checkRecovery WARN Skipping recovery according to sys prop solrcloud.skip.autorecovery
   [junit4]   2> 558368 T2098 oasc.ZkController.publish publishing core=collection1 state=active
   [junit4]   2> 558369 T2098 oasc.ZkController.publish numShards not found on descriptor - reading it from system property
   [junit4]   2> 558372 T2098 oascc.ZkStateReader.updateClusterState Updating cloud state from ZooKeeper... 
   [junit4]   2> 558376 T2080 oasc.CoreContainer.load Loading cores into CoreContainer [instanceDir=C:\Users\JenkinsSlave\workspace\Lucene-Solr-4.x-Windows\solr\build\solr-core\test-files\solr\]
   [junit4]   2> 558378 T2080 oashc.HttpShardHandlerFactory.getParameter Setting socketTimeout to: 120000
   [junit4]   2> 558378 T2080 oashc.HttpShardHandlerFactory.getParameter Setting urlScheme to: http://
   [junit4]   2> 558379 T2080 oashc.HttpShardHandlerFactory.getParameter Setting connTimeout to: 15000
   [junit4]   2> 558380 T2080 oashc.HttpShardHandlerFactory.getParameter Setting maxConnectionsPerHost to: 20
   [junit4]   2> 558380 T2080 oashc.HttpShardHandlerFactory.getParameter Setting corePoolSize to: 0
   [junit4]   2> 558381 T2080 oashc.HttpShardHandlerFactory.getParameter Setting maximumPoolSize to: 2147483647
   [junit4]   2> 558382 T2080 oashc.HttpShardHandlerFactory.getParameter Setting maxThreadIdleTime to: 5
   [junit4]   2> 558382 T2080 oashc.HttpShardHandlerFactory.getParameter Setting sizeOfQueue to: -1
   [junit4]   2> 558383 T2080 oashc.HttpShardHandlerFactory.getParameter Setting fairnessPolicy to: false
   [junit4]   2> 558383 T2080 oascsi.HttpClientUtil.createClient Creating new http client, config:maxConnectionsPerHost=20&maxConnections=10000&socketTimeout=120000&connTimeout=15000&retry=false
   [junit4]   2> 558393 T2080 oasl.LogWatcher.createWatcher SLF4J impl is org.slf4j.impl.Log4jLoggerFactory
   [junit4]   2> 558394 T2080 oasl.LogWatcher.newRegisteredLogWatcher Registering Log Listener [Log4j (org.slf4j.impl.Log4jLoggerFactory)]
   [junit4]   2> 558395 T2080 oasc.ZkContainer.initZooKeeper Zookeeper client=127.0.0.1:53937/solr
   [junit4]   2> 558395 T2080 oasc.ZkController.checkChrootPath zkHost includes chroot
   [junit4]   2> 558399 T2080 oascc.ConnectionManager.waitForConnected Waiting for client to connect to ZooKeeper
   [junit4]   2> 558405 T2102 oascc.ConnectionManager.process Watcher org.apache.solr.common.cloud.ConnectionManager@1be0670 name:ZooKeeperConnection Watcher:127.0.0.1:53937 got event WatchedEvent state:SyncConnected type:None path:null path:null type:None
   [junit4]   2> 558406 T2080 oascc.ConnectionManager.waitForConnected Client is connected to ZooKeeper
   [junit4]   2> 558409 T2080 oascsi.HttpClientUtil.createClient Creating new http client, config:maxConnections=500&maxConnectionsPerHost=16&socketTimeout=120000&connTimeout=15000
   [junit4]   2> 558416 T2080 oascc.ConnectionManager.waitForConnected Waiting for client to connect to ZooKeeper
   [junit4]   2> 558419 T2104 oascc.ConnectionManager.process Watcher org.apache.solr.common.cloud.ConnectionManager@140b449 name:ZooKeeperConnection Watcher:127.0.0.1:53937/solr got event WatchedEvent state:SyncConnected type:None path:null path:null type:None
   [junit4]   2> 558419 T2080 oascc.ConnectionManager.waitForConnected Client is connected to ZooKeeper
   [junit4]   2> 558427 T2080 oascc.ZkStateReader.createClusterStateWatchersAndUpdate Updating cluster state from ZooKeeper... 
   [junit4]   2> 559510 T2080 oasc.ZkController.createEphemeralLiveNode Register node as live in ZooKeeper:/live_nodes/127.0.0.1:8983_solr
   [junit4]   2> 559514 T2080 oasc.ZkController.createEphemeralLiveNode Found a previous node that still exists while trying to register a new live node /live_nodes/127.0.0.1:8983_solr - removing existing node to create another.
   [junit4]   2> 559514 T2080 oascc.SolrZkClient.makePath makePath: /live_nodes/127.0.0.1:8983_solr
   [junit4]   2> 559515 T2104 oascc.ZkStateReader$3.process Updating live nodes... (0)
   [junit4]   2> 559515 T2095 oascc.ZkStateReader$3.process Updating live nodes... (0)
   [junit4]   2> 559516 T2095 oascc.ZkStateReader$2.process A cluster state change: WatchedEvent state:SyncConnected type:NodeChildrenChanged path:/live_nodes, has occurred - updating... (live nodes size: 0)
   [junit4]   2> 559520 T2104 oascc.ZkStateReader$3.process Updating live nodes... (1)
   [junit4]   2> 559521 T2095 oascc.ZkStateReader$3.process Updating live nodes... (1)
   [junit4]   2> 559531 T2105 oasc.ZkController.publish publishing core=collection1 state=down
   [junit4]   2> 559531 T2105 oasc.ZkController.publish numShards not found on descriptor - reading it from system property
   [junit4]   2> 559533 T2105 oasc.ZkController.waitForCoreNodeName look for our core node name
   [junit4]   2> 559533 T2105 oasc.ZkController.waitForShardId waiting to find shard id in clusterstate for collection1
   [junit4]   2> 559534 T2105 oasc.CoreContainer.create Creating SolrCore 'collection1' using instanceDir: C:\Users\JenkinsSlave\workspace\Lucene-Solr-4.x-Windows\solr\build\solr-core\test-files\solr\collection1
   [junit4]   2> 559534 T2105 oasc.ZkController.createCollectionZkNode Check for collection zkNode:collection1
   [junit4]   2> 559535 T2105 oasc.ZkController.createCollectionZkNode Collection zkNode exists
   [junit4]   2> 559535 T2105 oasc.ZkController.readConfigName Load collection config from:/collections/collection1
   [junit4]   2> 559537 T2105 oasc.SolrResourceLoader.<init> new SolrResourceLoader for directory: 'C:\Users\JenkinsSlave\workspace\Lucene-Solr-4.x-Windows\solr\build\solr-core\test-files\solr\collection1\'
   [junit4]   2> 559541 T2105 oasc.SolrResourceLoader.replaceClassLoader Adding 'file:/C:/Users/JenkinsSlave/workspace/Lucene-Solr-4.x-Windows/solr/build/solr-core/test-files/solr/collection1/lib/classes/' to classloader
   [junit4]   2> 559542 T2105 oasc.SolrResourceLoader.replaceClassLoader Adding 'file:/C:/Users/JenkinsSlave/workspace/Lucene-Solr-4.x-Windows/solr/build/solr-core/test-files/solr/collection1/lib/README' to classloader
   [junit4]   2> 559615 T2105 oasc.SolrConfig.<init> Using Lucene MatchVersion: LUCENE_45
   [junit4]   2> 559645 T2105 oasc.SolrConfig.<init> Loaded SolrConfig: solrconfig.xml
   [junit4]   2> 559648 T2105 oass.IndexSchema.readSchema Reading Solr Schema from schema.xml
   [junit4]   2> 559658 T2105 oass.IndexSchema.readSchema [null] Schema name=test
   [junit4]   2> 559816 T2105 oass.ByteField.init WARN ByteField is deprecated and will be removed in 5.0. You should use TrieIntField instead.
   [junit4]   2> 559816 T2105 oass.ShortField.init WARN ShortField is deprecated and will be removed in 5.0. You should use TrieIntField instead.
   [junit4]   2> 559818 T2105 oass.OpenExchangeRatesOrgProvider.init Initialized with rates=open-exchange-rates.json, refreshInterval=1440.
   [junit4]   2> 559828 T2105 oass.IndexSchema.readSchema default search field in schema is text
   [junit4]   2> 559830 T2105 oass.IndexSchema.readSchema unique key field: id
   [junit4]   2> 559850 T2105 oass.FileExchangeRateProvider.reload Reloading exchange rates from file currency.xml
   [junit4]   2> 559853 T2105 oass.FileExchangeRateProvider.reload Reloading exchange rates from file currency.xml
   [junit4]   2> 559857 T2105 oass.OpenExchangeRatesOrgProvider.reload Reloading exchange rates from open-exchange-rates.json
   [junit4]   2> 559858 T2105 oass.OpenExchangeRatesOrgProvider$OpenExchangeRates.<init> WARN Unknown key IMPORTANT NOTE
   [junit4]   2> 559859 T2105 oass.OpenExchangeRatesOrgProvider$OpenExchangeRates.<init> WARN Expected key, got STRING
   [junit4]   2> 559859 T2105 oass.OpenExchangeRatesOrgProvider.reload Reloading exchange rates from open-exchange-rates.json
   [junit4]   2> 559861 T2105 oass.OpenExchangeRatesOrgProvider$OpenExchangeRates.<init> WARN Unknown key IMPORTANT NOTE
   [junit4]   2> 559861 T2105 oass.OpenExchangeRatesOrgProvider$OpenExchangeRates.<init> WARN Expected key, got STRING
   [junit4]   2> 559861 T2105 oasc.SolrCore.initDirectoryFactory org.apache.solr.core.MockDirectoryFactory
   [junit4]   2> 559861 T2105 oasc.SolrCore.<init> [collection1] Opening new SolrCore at C:\Users\JenkinsSlave\workspace\Lucene-Solr-4.x-Windows\solr\build\solr-core\test-files\solr\collection1\, dataDir=C:\Users\JenkinsSlave\workspace\Lucene-Solr-4.x-Windows\solr\build\solr-core\test\J0\.\solrtest-SliceStateUpdateTest-1378023350247\data2\
   [junit4]   2> 559862 T2105 oasc.JmxMonitoredMap.<init> JMX monitoring is enabled. Adding Solr mbeans to JMX Server: com.sun.jmx.mbeanserver.JmxMBeanServer@18c5e94
   [junit4]   2> 559862 T2105 oasc.CachingDirectoryFactory.get return new directory for C:\Users\JenkinsSlave\workspace\Lucene-Solr-4.x-Windows\solr\build\solr-core\test\J0\.\solrtest-SliceStateUpdateTest-1378023350247\data2\
   [junit4]   2> 559863 T2105 oasc.SolrCore.getNewIndexDir New index directory detected: old=null new=C:\Users\JenkinsSlave\workspace\Lucene-Solr-4.x-Windows\solr\build\solr-core\test\J0\.\solrtest-SliceStateUpdateTest-1378023350247\data2\index/
   [junit4]   2> 559863 T2105 oasc.SolrCore.initIndex WARN [collection1] Solr index directory 'C:\Users\JenkinsSlave\workspace\Lucene-Solr-4.x-Windows\solr\build\solr-core\test\J0\.\solrtest-SliceStateUpdateTest-1378023350247\data2\index' doesn't exist. Creating new index...
   [junit4]   2> 559863 T2105 oasc.CachingDirectoryFactory.get return new directory for C:\Users\JenkinsSlave\workspace\Lucene-Solr-4.x-Windows\solr\build\solr-core\test\J0\.\solrtest-SliceStateUpdateTest-1378023350247\data2\index
   [junit4]   2> 559864 T2105 oasu.RandomMergePolicy.<init> RandomMergePolicy wrapping class org.apache.lucene.index.LogByteSizeMergePolicy: [LogByteSizeMergePolicy: minMergeSize=1677721, mergeFactor=29, maxMergeSize=2147483648, maxMergeSizeForForcedMerge=9223372036854775807, calibrateSizeByDeletes=false, maxMergeDocs=2147483647, maxCFSSegmentSizeMB=8.796093022207999E12, noCFSRatio=0.5339552311074649]
   [junit4]   2> 559865 T2105 oasc.SolrDeletionPolicy.onCommit SolrDeletionPolicy.onCommit: commits: num=1
   [junit4]   2> 		commit{dir=RateLimitedDirectoryWrapper(MockDirWrapper(org.apache.lucene.store.RAMDirectory@faa14 lockFactory=org.apache.lucene.store.SingleInstanceLockFactory@6da77f)),segFN=segments_1,generation=1}
   [junit4]   2> 559865 T2105 oasc.SolrDeletionPolicy.updateCommits newest commit generation = 1
   [junit4]   2> 559865 T2105 oasc.SolrCore.initWriters created xml: solr.XMLResponseWriter
   [junit4]   2> 559869 T2105 oasup.UpdateRequestProcessorChain.init creating updateRequestProcessorChain "dedupe"
   [junit4]   2> 559870 T2105 oasup.UpdateRequestProcessorChain.init inserting DistributedUpdateProcessorFactory into updateRequestProcessorChain "dedupe"
   [junit4]   2> 559870 T2105 oasup.UpdateRequestProcessorChain.init creating updateRequestProcessorChain "dedupe-allfields"
   [junit4]   2> 559871 T2105 oasup.UpdateRequestProcessorChain.init inserting DistributedUpdateProcessorFactory into updateRequestProcessorChain "dedupe-allfields"
   [junit4]   2> 559871 T2105 oasup.UpdateRequestProcessorChain.init creating updateRequestProcessorChain "stored_sig"
   [junit4]   2> 559871 T2105 oasup.UpdateRequestProcessorChain.init inserting DistributedUpdateProcessorFactory into updateRequestProcessorChain "stored_sig"
   [junit4]   2> 559871 T2105 oasup.UpdateRequestProcessorChain.init creating updateRequestProcessorChain "uniq-fields"
   [junit4]   2> 559872 T2105 oasup.UniqFieldsUpdateProcessorFactory.init WARN Use of the 'fields' init param in UniqFieldsUpdateProcessorFactory is deprecated, please use 'fieldName' (or another FieldMutatingUpdateProcessorFactory selector option) instead
   [junit4]   2> 559872 T2105 oasup.UniqFieldsUpdateProcessorFactory.init Replacing 'fields' init param with (individual) 'fieldName' params
   [junit4]   2> 559873 T2105 oasup.UpdateRequestProcessorChain.init inserting DistributedUpdateProcessorFactory into updateRequestProcessorChain "uniq-fields"
   [junit4]   2> 559873 T2105 oasup.UpdateRequestProcessorChain.init creating updateRequestProcessorChain "distrib-dup-test-chain-explicit"
   [junit4]   2> 559873 T2105 oasup.UpdateRequestProcessorChain.init creating updateRequestProcessorChain "distrib-dup-test-chain-implicit"
   [junit4]   2> 559874 T2105 oasup.UpdateRequestProcessorChain.init inserting DistributedUpdateProcessorFactory into updateRequestProcessorChain "distrib-dup-test-chain-implicit"
   [junit4]   2> 559874 T2105 oasc.SolrCore.loadUpdateProcessorChains no updateRequestProcessorChain defined as default, creating implicit default
   [junit4]   2> 559874 T2105 oasc.RequestHandlers.initHandlersFromConfig adding lazy requestHandler: solr.ReplicationHandler
   [junit4]   2> 559875 T2105 oasc.RequestHandlers.initHandlersFromConfig created /replication: solr.ReplicationHandler
   [junit4]   2> 559875 T2105 oasc.RequestHandlers.initHandlersFromConfig created standard: solr.StandardRequestHandler
   [junit4]   2> 559876 T2105 oasc.RequestHandlers.initHandlersFromConfig created /get: solr.RealTimeGetHandler
   [junit4]   2> 559877 T2105 oasc.RequestHandlers.initHandlersFromConfig created dismax: solr.SearchHandler
   [junit4]   2> 559878 T2105 oasc.RequestHandlers.initHandlersFromConfig created mock: org.apache.solr.core.MockQuerySenderListenerReqHandler
   [junit4]   2> 559878 T2105 oasc.RequestHandlers.initHandlersFromConfig created /admin/: org.apache.solr.handler.admin.AdminHandlers
   [junit4]   2> 559879 T2105 oasc.RequestHandlers.initHandlersFromConfig created defaults: solr.StandardRequestHandler
   [junit4]   2> 559879 T2105 oasc.RequestHandlers.initHandlersFromConfig adding lazy requestHandler: solr.StandardRequestHandler
   [junit4]   2> 559879 T2105 oasc.RequestHandlers.initHandlersFromConfig created lazy: solr.StandardRequestHandler
   [junit4]   2> 559880 T2105 oasc.RequestHandlers.initHandlersFromConfig created /update: solr.UpdateRequestHandler
   [junit4]   2> 559881 T2105 oasc.RequestHandlers.initHandlersFromConfig created /terms: org.apache.solr.handler.component.SearchHandler
   [junit4]   2> 559881 T2105 oasc.RequestHandlers.initHandlersFromConfig created spellCheckCompRH: org.apache.solr.handler.component.SearchHandler
   [junit4]   2> 559882 T2105 oasc.RequestHandlers.initHandlersFromConfig created spellCheckCompRH_Direct: org.apache.solr.handler.component.SearchHandler
   [junit4]   2> 559883 T2105 oasc.RequestHandlers.initHandlersFromConfig created spellCheckWithWordbreak: org.apache.solr.handler.component.SearchHandler
   [junit4]   2> 559883 T2105 oasc.RequestHandlers.initHandlersFromConfig created spellCheckWithWordbreak_Direct: org.apache.solr.handler.component.SearchHandler
   [junit4]   2> 559884 T2105 oasc.RequestHandlers.initHandlersFromConfig created spellCheckCompRH1: org.apache.solr.handler.component.SearchHandler
   [junit4]   2> 559885 T2105 oasc.RequestHandlers.initHandlersFromConfig created mltrh: org.apache.solr.handler.component.SearchHandler
   [junit4]   2> 559885 T2105 oasc.RequestHandlers.initHandlersFromConfig created tvrh: org.apache.solr.handler.component.SearchHandler
   [junit4]   2> 559887 T2105 oasc.RequestHandlers.initHandlersFromConfig created /mlt: solr.MoreLikeThisHandler
   [junit4]   2> 559888 T2105 oasc.RequestHandlers.initHandlersFromConfig created /debug/dump: solr.DumpRequestHandler
   [junit4]   2> 559895 T2105 oashl.XMLLoader.init xsltCacheLifetimeSeconds=60
   [junit4]   2> 559896 T2105 oasc.SolrCore.initDeprecatedSupport WARN solrconfig.xml uses deprecated <admin/gettableFiles>, Please update your config to use the ShowFileRequestHandler.
   [junit4]   2> 559897 T2105 oasc.SolrCore.initDeprecatedSupport WARN adding ShowFileRequestHandler with hidden files: [OLD_SYNONYMS.TXT, STOPWORDS.TXT, PROTWORDS.TXT, OPEN-EXCHANGE-RATES.JSON, SYNONYMS.TXT, CURRENCY.XML, MAPPING-ISOLATIN1ACCENT.TXT, SOLRCONFIG.SNIPPET.RANDOMINDEXCONFIG.XML]
   [junit4]   2> 559900 T2105 oasu.CommitTracker.<init> Hard AutoCommit: disabled
   [junit4]   2> 559901 T2105 oasu.CommitTracker.<init> Soft AutoCommit: disabled
   [junit4]   2> 559902 T2105 oasu.RandomMergePolicy.<init> RandomMergePolicy wrapping class org.apache.lucene.index.TieredMergePolicy: [TieredMergePolicy: maxMergeAtOnce=47, maxMergeAtOnceExplicit=44, maxMergedSegmentMB=37.3115234375, floorSegmentMB=1.0810546875, forceMergeDeletesPctAllowed=21.13786552685683, segmentsPerTier=10.0, maxCFSSegmentSizeMB=8.796093022207999E12, noCFSRatio=1.0
   [junit4]   2> 559902 T2105 oasc.SolrDeletionPolicy.onInit SolrDeletionPolicy.onInit: commits: num=1
   [junit4]   2> 		commit{dir=RateLimitedDirectoryWrapper(MockDirWrapper(org.apache.lucene.store.RAMDirectory@faa14 lockFactory=org.apache.lucene.store.SingleInstanceLockFactory@6da77f)),segFN=segments_1,generation=1}
   [junit4]   2> 559902 T2105 oasc.SolrDeletionPolicy.updateCommits newest commit generation = 1
   [junit4]   2> 559903 T2105 oass.SolrIndexSearcher.<init> Opening Searcher@13167d7 main
   [junit4]   2> 559903 T2105 oashc.SpellCheckComponent.inform Initializing spell checkers
   [junit4]   2> 559907 T2105 oass.DirectSolrSpellChecker.init init: {name=direct,classname=DirectSolrSpellChecker,field=lowerfilt,minQueryLength=3}
   [junit4]   2> 559937 T2105 oasc.CoreContainer.registerCore registering core: collection1
   [junit4]   2> 559937 T2105 oasc.ZkController.register Register replica - core:collection1 address:http://127.0.0.1:8983/solr collection:collection1 shard:shard1
   [junit4]   2> 559937 T2105 oascsi.HttpClientUtil.createClient Creating new http client, config:maxConnections=10000&maxConnectionsPerHost=20&connTimeout=15000&socketTimeout=30000&retry=false
   [junit4]   2> 559938 T2106 oasc.SolrCore.registerSearcher [collection1] Registered new searcher Searcher@13167d7 main{StandardDirectoryReader(segments_1:1:nrt)}
   [junit4]   2> 559944 T2096 oascc.ZkStateReader.updateClusterState Updating cloud state from ZooKeeper... 
   [junit4]   2> 559945 T2096 oasc.Overseer$ClusterStateUpdater.updateState Update state numShards=null message={
   [junit4]   2> 	  "operation":"state",
   [junit4]   2> 	  "core_node_name":"core_node1",
   [junit4]   2> 	  "numShards":null,
   [junit4]   2> 	  "shard":"shard1",
   [junit4]   2> 	  "roles":null,
   [junit4]   2> 	  "state":"active",
   [junit4]   2> 	  "shard_state":"active",
   [junit4]   2> 	  "core":"collection1",
   [junit4]   2> 	  "collection":"collection1",
   [junit4]   2> 	  "shard_range":null,
   [junit4]   2> 	  "node_name":"127.0.0.1:8983_solr",
   [junit4]   2> 	  "base_url":"http://127.0.0.1:8983/solr"}
   [junit4]   2> 559949 T2105 oasc.ZkController.register We are http://127.0.0.1:8983/solr/collection1/ and leader is http://127.0.0.1:8983/solr/collection1/
   [junit4]   2> 559949 T2105 oasc.ZkController.register No LogReplay needed for core=collection1 baseURL=http://127.0.0.1:8983/solr
   [junit4]   2> 559949 T2105 oasc.ZkController.checkRecovery WARN Skipping recovery according to sys prop solrcloud.skip.autorecovery
   [junit4]   2> 559949 T2105 oasc.ZkController.publish publishing core=collection1 state=active
   [junit4]   2> 559951 T2105 oasc.ZkController.publish numShards not found on descriptor - reading it from system property
   [junit4]   2> 559953 T2105 oascc.ZkStateReader.updateClusterState Updating cloud state from ZooKeeper... 
   [junit4]   2> 559954 T2096 oasc.Overseer$ClusterStateUpdater.updateState node=core_node1 is already registered
   [junit4]   2> 559954 T2096 oasc.Overseer$ClusterStateUpdater.updateState Update state numShards=null message={
   [junit4]   2> 	  "operation":"state",
   [junit4]   2> 	  "core_node_name":"core_node1",
   [junit4]   2> 	  "numShards":null,
   [junit4]   2> 	  "shard":null,
   [junit4]   2> 	  "roles":null,
   [junit4]   2> 	  "state":"down",
   [junit4]   2> 	  "shard_state":"active",
   [junit4]   2> 	  "core":"collection1",
   [junit4]   2> 	  "collection":"collection1",
   [junit4]   2> 	  "shard_range":null,
   [junit4]   2> 	  "node_name":"127.0.0.1:8983_solr",
   [junit4]   2> 	  "base_url":"http://127.0.0.1:8983/solr"}
   [junit4]   2> 559954 T2096 oasc.Overseer$ClusterStateUpdater.updateState shard=shard1 is already registered
   [junit4]   2> 559956 T2080 oasc.SliceStateUpdateTest.setUp ####SETUP_END testSliceStateUpdate
   [junit4]   2> 559958 T2080 oascc.ConnectionManager.waitForConnected Waiting for client to connect to ZooKeeper
   [junit4]   2> 559961 T2109 oascc.ConnectionManager.process Watcher org.apache.solr.common.cloud.ConnectionManager@d10954 name:ZooKeeperConnection Watcher:127.0.0.1:53937/solr got event WatchedEvent state:SyncConnected type:None path:null path:null type:None
   [junit4]   2> 559961 T2080 oascc.ConnectionManager.waitForConnected Client is connected to ZooKeeper
   [junit4]   2> 559961 T2096 oasc.Overseer$ClusterStateUpdater.updateState Update state numShards=null message={
   [junit4]   2> 	  "operation":"state",
   [junit4]   2> 	  "core_node_name":"core_node1",
   [junit4]   2> 	  "numShards":null,
   [junit4]   2> 	  "shard":"shard1",
   [junit4]   2> 	  "roles":null,
   [junit4]   2> 	  "state":"active",
   [junit4]   2> 	  "shard_state":"active",
   [junit4]   2> 	  "core":"collection1",
   [junit4]   2> 	  "collection":"collection1",
   [junit4]   2> 	  "shard_range":null,
   [junit4]   2> 	  "node_name":"127.0.0.1:8983_solr",
   [junit4]   2> 	  "base_url":"http://127.0.0.1:8983/solr"}
   [junit4]   2> 559962 T2104 oascc.ZkStateReader$2.process A cluster state change: WatchedEvent state:SyncConnected type:NodeDataChanged path:/clusterstate.json, has occurred - updating... (live nodes size: 1)
   [junit4]   2> 559962 T2095 oascc.ZkStateReader$2.process A cluster state change: WatchedEvent state:SyncConnected type:NodeDataChanged path:/clusterstate.json, has occurred - updating... (live nodes size: 1)
   [junit4]   2> 559970 T2104 oascc.ZkStateReader$2.process A cluster state change: WatchedEvent state:SyncConnected type:NodeDataChanged path:/clusterstate.json, has occurred - updating... (live nodes size: 1)
   [junit4]   2> 597663 T993 oasc.OverseerCollectionProcessor.run WARN Overseer cannot talk to ZK
   [junit4]   2> 599006 T2080 oasc.CoreContainer.shutdown Shutting down CoreContainer instance=14408005
   [junit4]   2> 599075 T2096 oascc.ZkStateReader.updateClusterState Updating cloud state from ZooKeeper... 
   [junit4]   2> 599075 T2096 oasc.Overseer$ClusterStateUpdater.updateState Update state numShards=null message={
   [junit4]   2> 	  "operation":"state",
   [junit4]   2> 	  "core_node_name":"core_node1",
   [junit4]   2> 	  "shard":null,
   [junit4]   2> 	  "roles":null,
   [junit4]   2> 	  "state":"down",
   [junit4]   2> 	  "core":"collection1",
   [junit4]   2> 	  "collection":"collection1",
   [junit4]   2> 	  "node_name":"127.0.0.1:8983_solr",
   [junit4]   2> 	  "base_url":"http://127.0.0.1:8983/solr"}
   [junit4]   2> 599076 T2096 oasc.Overseer$ClusterStateUpdater.updateState shard=shard1 is already registered
   [junit4]   2> 599081 T2095 oascc.ZkStateReader$2.process A cluster state change: WatchedEvent state:SyncConnected type:NodeDataChanged path:/clusterstate.json, has occurred - updating... (live nodes size: 1)
   [junit4]   2> 599082 T2104 oascc.ZkStateReader$2.process A cluster state change: WatchedEvent state:SyncConnected type:NodeDataChanged path:/clusterstate.json, has occurred - updating... (live nodes size: 1)
   [junit4]   2> 600988 T2080 oasc.ZkController.publish publishing core=collection1 state=down
   [junit4]   2> 600988 T2080 oasc.ZkController.publish numShards not found on descriptor - reading it from system property
   [junit4]   2> 600991 T2080 oasc.SolrCore.close [collection1]  CLOSING SolrCore org.apache.solr.core.SolrCore@1f39ef3
   [junit4]   2> 600999 T2080 oasu.DirectUpdateHandler2.close closing DirectUpdateHandler2{commits=0,autocommits=0,soft autocommits=0,optimizes=0,rollbacks=0,expungeDeletes=0,docsPending=0,adds=0,deletesById=0,deletesByQuery=0,errors=0,cumulative_adds=0,cumulative_deletesById=0,cumulative_deletesByQuery=0,cumulative_errors=0}
   [junit4]   2> 601000 T2080 oasu.SolrCoreState.decrefSolrCoreState Closing SolrCoreState
   [junit4]   2> 601000 T2080 oasu.DefaultSolrCoreState.closeIndexWriter SolrCoreState ref count has reached 0 - closing IndexWriter
   [junit4]   2> 601001 T2080 oasu.DefaultSolrCoreState.closeIndexWriter closing IndexWriter with IndexWriterCloser
   [junit4]   2> 601003 T2080 oasc.SolrCore.closeSearcher [collection1] Closing main searcher on request.
   [junit4]   2> 601003 T2080 oasc.CachingDirectoryFactory.close Closing MockDirectoryFactory - 2 directories currently being tracked
   [junit4]   2> 601003 T2080 oasc.CachingDirectoryFactory.closeCacheValue looking to close C:\Users\JenkinsSlave\workspace\Lucene-Solr-4.x-Windows\solr\build\solr-core\test\J0\.\solrtest-SliceStateUpdateTest-1378023350247\data2\ [CachedDir<<refCount=0;path=C:\Users\JenkinsSlave\workspace\Lucene-Solr-4.x-Windows\solr\build\solr-core\test\J0\.\solrtest-SliceStateUpdateTest-1378023350247\data2\;done=false>>]
   [junit4]   2> 601004 T2080 oasc.CachingDirectoryFactory.close Closing directory: C:\Users\JenkinsSlave\workspace\Lucene-Solr-4.x-Windows\solr\build\solr-core\test\J0\.\solrtest-SliceStateUpdateTest-1378023350247\data2\
   [junit4]   2> 601004 T2080 oasc.CachingDirectoryFactory.closeCacheValue looking to close C:\Users\JenkinsSlave\workspace\Lucene-Solr-4.x-Windows\solr\build\solr-core\test\J0\.\solrtest-SliceStateUpdateTest-1378023350247\data2\index [CachedDir<<refCount=0;path=C:\Users\JenkinsSlave\workspace\Lucene-Solr-4.x-Windows\solr\build\solr-core\test\J0\.\solrtest-SliceStateUpdateTest-1378023350247\data2\index;done=false>>]
   [junit4]   2> 601004 T2080 oasc.CachingDirectoryFactory.close Closing directory: C:\Users\JenkinsSlave\workspace\Lucene-Solr-4.x-Windows\solr\build\solr-core\test\J0\.\solrtest-SliceStateUpdateTest-1378023350247\data2\index
   [junit4]   2> 601005 T2096 oasc.Overseer$ClusterStateUpdater.amILeader According to ZK I (id=90310138282442756-127.0.0.1:8983_solr-n_0000000000) am no longer a leader.
   [junit4]   2> 601008 T2080 oasc.CoreContainer.shutdown Shutting down CoreContainer instance=11411135
   [junit4]   2> 601010 T2104 oascc.SolrZkClient.makePath makePath: /overseer_elect/leader
   [junit4]   2> 601013 T2104 oasc.Overseer.start Overseer (id=90310138282442758-127.0.0.1:8983_solr-n_0000000001) starting
   [junit4]   2> 601020 T2111 oasc.OverseerCollectionProcessor.run Process current queue of collection creations
   [junit4]   2> 601021 T2110 oasc.Overseer$ClusterStateUpdater.run Starting to work on the main queue
   [junit4]   2> 601022 T2104 oasc.ShardLeaderElectionContext.runLeaderProcess Running the leader process for shard shard1
   [junit4]   2> 601025 T2104 oasc.ShardLeaderElectionContext.shouldIBeLeader Checking if I should try and be the leader.
   [junit4]   2> 601026 T2104 oasc.ShardLeaderElectionContext.shouldIBeLeader My last published State was Active, it's okay to be the leader.
   [junit4]   2> 601026 T2110 oascc.ZkStateReader.updateClusterState Updating cloud state from ZooKeeper... 
   [junit4]   2> 601026 T2104 oasc.ShardLeaderElectionContext.runLeaderProcess I may be the new leader - try and sync
   [junit4]   2> 601026 T2104 oasc.ShardLeaderElectionContext.runLeaderProcess I am the new leader: http://127.0.0.1:8983/solr/collection1/ shard1
   [junit4]   2> 601027 T2104 oascc.SolrZkClient.makePath makePath: /collections/collection1/leaders/shard1
   [junit4]   2> 601027 T2110 oasc.Overseer$ClusterStateUpdater.updateState Update state numShards=null message={
   [junit4]   2> 	  "operation":"state",
   [junit4]   2> 	  "core_node_name":"core_node1",
   [junit4]   2> 	  "numShards":null,
   [junit4]   2> 	  "shard":"shard1",
   [junit4]   2> 	  "roles":null,
   [junit4]   2> 	  "state":"down",
   [junit4]   2> 	  "shard_state":"active",
   [junit4]   2> 	  "core":"collection1",
   [junit4]   2> 	  "collection":"collection1",
   [junit4]   2> 	  "shard_range":null,
   [junit4]   2> 	  "node_name":"127.0.0.1:8983_solr",
   [junit4]   2> 	  "base_url":"http://127.0.0.1:8983/solr"}
   [junit4]   2> 601042 T2104 oascc.ZkStateReader$2.process A cluster state change: WatchedEvent state:SyncConnected type:NodeDataChanged path:/clusterstate.json, has occurred - updating... (live nodes size: 1)
   [junit4]   2> 601820 T997 oasc.OverseerCollectionProcessor.run WARN Overseer cannot talk to ZK
   [junit4]   2> 601998 T2080 oasc.ZkController.publish publishing core=collection1 state=down
   [junit4]   2> 601998 T2080 oasc.ZkController.publish numShards not found on descriptor - reading it from system property
   [junit4]   2> 602001 T2080 oasc.SolrCore.close [collection1]  CLOSING SolrCore org.apache.solr.core.SolrCore@8bf0d6
   [junit4]   2> 602019 T2080 oasu.DirectUpdateHandler2.close closing DirectUpdateHandler2{commits=0,autocommits=0,soft autocommits=0,optimizes=0,rollbacks=0,expungeDeletes=0,docsPending=0,adds=0,deletesById=0,deletesByQuery=0,errors=0,cumulative_adds=0,cumulative_deletesById=0,cumulative_deletesByQuery=0,cumulative_errors=0}
   [junit4]   2> 602020 T2080 oasu.SolrCoreState.decrefSolrCoreState Closing SolrCoreState
   [junit4]   2> 602020 T2080 oasu.DefaultSolrCoreState.closeIndexWriter SolrCoreState ref count has reached 0 - closing IndexWriter
   [junit4]   2> 602020 T2080 oasu.DefaultSolrCoreState.closeIndexWriter closing IndexWriter with IndexWriterCloser
   [junit4]   2> 602021 T2080 oasc.SolrCore.closeSearcher [collection1] Closing main searcher on request.
   [junit4]   2> 602022 T2080 oasc.CachingDirectoryFactory.close Closing MockDirectoryFactory - 2 directories currently being tracked
   [junit4]   2> 602022 T2080 oasc.CachingDirectoryFactory.closeCacheValue looking to close C:\Users\JenkinsSlave\workspace\Lucene-Solr-4.x-Windows\solr\build\solr-core\test\J0\.\solrtest-SliceStateUpdateTest-1378023350247\data2\index [CachedDir<<refCount=0;path=C:\Users\JenkinsSlave\workspace\Lucene-Solr-4.x-Windows\solr\build\solr-core\test\J0\.\solrtest-SliceStateUpdateTest-1378023350247\data2\index;done=false>>]
   [junit4]   2> 602022 T2080 oasc.CachingDirectoryFactory.close Closing directory: C:\Users\JenkinsSlave\workspace\Lucene-Solr-4.x-Windows\solr\build\solr-core\test\J0\.\solrtest-SliceStateUpdateTest-1378023350247\data2\index
   [junit4]   2> 602023 T2080 oasc.CachingDirectoryFactory.closeCacheValue looking to close C:\Users\JenkinsSlave\workspace\Lucene-Solr-4.x-Windows\solr\build\solr-core\test\J0\.\solrtest-SliceStateUpdateTest-1378023350247\data2\ [CachedDir<<refCount=0;path=C:\Users\JenkinsSlave\workspace\Lucene-Solr-4.x-Windows\solr\build\solr-core\test\J0\.\solrtest-SliceStateUpdateTest-1378023350247\data2\;done=false>>]
   [junit4]   2> 602023 T2080 oasc.CachingDirectoryFactory.close Closing directory: C:\Users\JenkinsSlave\workspace\Lucene-Solr-4.x-Windows\solr\build\solr-core\test\J0\.\solrtest-SliceStateUpdateTest-1378023350247\data2\
   [junit4]   2> 602023 T2110 oasc.Overseer$ClusterStateUpdater.amILeader According to ZK I (id=90310138282442758-127.0.0.1:8983_solr-n_0000000001) am no longer a leader.
   [junit4]   2> 602027 T2082 oazs.NIOServerCnxn.doIO WARN caught end of stream exception EndOfStreamException: Unable to read additional data from client sessionid 0x140d8979ff10006, likely client has closed socket
   [junit4]   2> 	at org.apache.zookeeper.server.NIOServerCnxn.doIO(NIOServerCnxn.java:220)
   [junit4]   2> 	at org.apache.zookeeper.server.NIOServerCnxnFactory.run(NIOServerCnxnFactory.java:208)
   [junit4]   2> 	at java.lang.Thread.run(Thread.java:724)
   [junit4]   2> 
   [junit4]   2> 602029 T2080 oasc.ZkTestServer.send4LetterWord connecting to 127.0.0.1:53937 53937
   [junit4]   2> 603314 T2104 oascc.ZkStateReader$3.process WARN ZooKeeper watch triggered, but Solr cannot talk to ZK
   [junit4]   2> 604257 T2104 oascc.ZkStateReader$2.process A cluster state change: WatchedEvent state:SyncConnected type:NodeChildrenChanged path:/live_nodes, has occurred - updating... (live nodes size: 1)
   [junit4]   2> 604257 T2104 oascc.ZkStateReader$2.process WARN ZooKeeper watch triggered, but Solr cannot talk to ZK
   [junit4]   2> 604260 T2080 oas.SolrTestCaseJ4.tearDown ###Ending testSliceStateUpdate
   [junit4]   1> client port:0.0.0.0/0.0.0.0:0
   [junit4]   2> NOTE: reproduce with: ant test  -Dtestcase=SliceStateUpdateTest -Dtests.method=testSliceStateUpdate -Dtests.seed=C96834B6E6CD6E50 -Dtests.slow=true -Dtests.locale=sr_RS_#Latn -Dtests.timezone=Indian/Maldives -Dtests.file.encoding=Cp1252
   [junit4] FAILURE 49.5s | SliceStateUpdateTest.testSliceStateUpdate <<<
   [junit4]    > Throwable #1: org.junit.ComparisonFailure: expected:<[in]active> but was:<[]active>
   [junit4]    > 	at __randomizedtesting.SeedInfo.seed([C96834B6E6CD6E50:190AB9FAB818B4D4]:0)
   [junit4]    > 	at org.apache.solr.cloud.SliceStateUpdateTest.testSliceStateUpdate(SliceStateUpdateTest.java:183)
   [junit4]    > 	at java.lang.Thread.run(Thread.java:724)
   [junit4]   2> 604284 T2080 oas.SolrTestCaseJ4.deleteCore ###deleteCore
   [junit4]   2> NOTE: test params are: codec=Lucene42, sim=RandomSimilarityProvider(queryNorm=false,coord=no): {}, locale=sr_RS_#Latn, timezone=Indian/Maldives
   [junit4]   2> NOTE: Windows 7 6.1 x86/Oracle Corporation 1.8.0-ea (32-bit)/cpus=2,threads=1,free=144626392,total=286785536
   [junit4]   2> NOTE: All tests run in this JVM: [TestManagedSchemaFieldResource, TestSolrIndexConfig, TestBinaryField, MBeansHandlerTest, TestFieldTypeCollectionResource, TestFieldResource, TestDocSet, TestFieldTypeResource, ClusterStateTest, TestXIncludeConfig, TestCodecSupport, OpenCloseCoreStressTest, PreAnalyzedFieldTest, FieldMutatingUpdateProcessorTest, AssignTest, CoreAdminCreateDiscoverTest, TestFuzzyAnalyzedSuggestions, RequiredFieldsTest, TestDocumentBuilder, DefaultValueUpdateProcessorTest, PathHierarchyTokenizerFactoryTest, AddBlockUpdateTest, TestTrie, TestSchemaVersionResource, RAMDirectoryFactoryTest, SuggesterTest, BasicFunctionalityTest, TestUtils, AliasIntegrationTest, JsonLoaderTest, CollectionsAPIDistributedZkTest, AutoCommitTest, ZkControllerTest, OverseerCollectionProcessorTest, HighlighterTest, TestFiltering, SoftAutoCommitTest, CurrencyFieldOpenExchangeTest, ReturnFieldsTest, TestConfig, SimpleFacetsTest, TestSolrCoreProperties, SyncSliceTest, TestPostingsSolrHighlighter, IndexSchemaTest, BasicDistributedZk2Test, OverseerTest, SOLR749Test, TestUpdate, TestSerializedLuceneMatchVersion, ZkCLITest, TestSuggestSpellingConverter, TestJmxIntegration, TestWordDelimiterFilterFactory, TestRangeQuery, TestRecovery, AnalysisAfterCoreReloadTest, ResourceLoaderTest, TestReversedWildcardFilterFactory, ResponseLogComponentTest, TestQuerySenderListener, DocumentBuilderTest, StatsComponentTest, CachingDirectoryFactoryTest, TestAnalyzedSuggestions, TestFastLRUCache, TestSolrQueryParserResource, TestWriterPerf, DistanceFunctionTest, TestCloudManagedSchema, ChaosMonkeyNothingIsSafeTest, TestValueSourceCache, DateMathParserTest, CoreMergeIndexesAdminHandlerTest, PeerSyncTest, FileUtilsTest, TestFoldingMultitermQuery, SliceStateUpdateTest]
   [junit4] Completed in 49.58s, 1 test, 1 failure <<< FAILURES!

[...truncated 749 lines...]
BUILD FAILED
C:\Users\JenkinsSlave\workspace\Lucene-Solr-4.x-Windows\build.xml:402: The following error occurred while executing this line:
C:\Users\JenkinsSlave\workspace\Lucene-Solr-4.x-Windows\build.xml:382: The following error occurred while executing this line:
C:\Users\JenkinsSlave\workspace\Lucene-Solr-4.x-Windows\build.xml:39: The following error occurred while executing this line:
C:\Users\JenkinsSlave\workspace\Lucene-Solr-4.x-Windows\solr\build.xml:189: The following error occurred while executing this line:
C:\Users\JenkinsSlave\workspace\Lucene-Solr-4.x-Windows\solr\common-build.xml:455: The following error occurred while executing this line:
C:\Users\JenkinsSlave\workspace\Lucene-Solr-4.x-Windows\lucene\common-build.xml:1233: The following error occurred while executing this line:
C:\Users\JenkinsSlave\workspace\Lucene-Solr-4.x-Windows\lucene\common-build.xml:876: There were test failures: 325 suites, 1415 tests, 1 failure, 44 ignored (11 assumptions)

Total time: 58 minutes 20 seconds
Build step 'Invoke Ant' marked build as failure
Description set: Java: 32bit/jdk1.8.0-ea-b102 -client -XX:+UseParallelGC
Archiving artifacts
Recording test results
Email was triggered for: Failure
Sending email for trigger: Failure



Mime
View raw message