lucene-dev mailing list archives

Site index · List index
Message view « Date » · « Thread »
Top « Date » · « Thread »
From Policeman Jenkins Server <jenk...@thetaphi.de>
Subject [JENKINS] Lucene-Solr-trunk-MacOSX (64bit/jdk1.7.0) - Build # 812 - Failure!
Date Wed, 11 Sep 2013 03:52:50 GMT
Build: http://jenkins.thetaphi.de/job/Lucene-Solr-trunk-MacOSX/812/
Java: 64bit/jdk1.7.0 -XX:-UseCompressedOops -XX:+UseConcMarkSweepGC

1 tests failed.
FAILED:  org.apache.solr.core.TestNonNRTOpen.testReaderIsNotNRT

Error Message:
expected:<3> but was:<2>

Stack Trace:
java.lang.AssertionError: expected:<3> but was:<2>
	at __randomizedtesting.SeedInfo.seed([443356F463A7D8C6:F1B53773DC666A32]:0)
	at org.junit.Assert.fail(Assert.java:93)
	at org.junit.Assert.failNotEquals(Assert.java:647)
	at org.junit.Assert.assertEquals(Assert.java:128)
	at org.junit.Assert.assertEquals(Assert.java:472)
	at org.junit.Assert.assertEquals(Assert.java:456)
	at org.apache.solr.core.TestNonNRTOpen.assertNotNRT(TestNonNRTOpen.java:133)
	at org.apache.solr.core.TestNonNRTOpen.testReaderIsNotNRT(TestNonNRTOpen.java:94)
	at sun.reflect.NativeMethodAccessorImpl.invoke0(Native Method)
	at sun.reflect.NativeMethodAccessorImpl.invoke(NativeMethodAccessorImpl.java:57)
	at sun.reflect.DelegatingMethodAccessorImpl.invoke(DelegatingMethodAccessorImpl.java:43)
	at java.lang.reflect.Method.invoke(Method.java:606)
	at com.carrotsearch.randomizedtesting.RandomizedRunner.invoke(RandomizedRunner.java:1559)
	at com.carrotsearch.randomizedtesting.RandomizedRunner.access$600(RandomizedRunner.java:79)
	at com.carrotsearch.randomizedtesting.RandomizedRunner$6.evaluate(RandomizedRunner.java:737)
	at com.carrotsearch.randomizedtesting.RandomizedRunner$7.evaluate(RandomizedRunner.java:773)
	at com.carrotsearch.randomizedtesting.RandomizedRunner$8.evaluate(RandomizedRunner.java:787)
	at com.carrotsearch.randomizedtesting.rules.SystemPropertiesRestoreRule$1.evaluate(SystemPropertiesRestoreRule.java:53)
	at org.apache.lucene.util.TestRuleSetupTeardownChained$1.evaluate(TestRuleSetupTeardownChained.java:50)
	at org.apache.lucene.util.TestRuleFieldCacheSanity$1.evaluate(TestRuleFieldCacheSanity.java:51)
	at org.apache.lucene.util.AbstractBeforeAfterRule$1.evaluate(AbstractBeforeAfterRule.java:46)
	at com.carrotsearch.randomizedtesting.rules.SystemPropertiesInvariantRule$1.evaluate(SystemPropertiesInvariantRule.java:55)
	at org.apache.lucene.util.TestRuleThreadAndTestName$1.evaluate(TestRuleThreadAndTestName.java:49)
	at org.apache.lucene.util.TestRuleIgnoreAfterMaxFailures$1.evaluate(TestRuleIgnoreAfterMaxFailures.java:70)
	at org.apache.lucene.util.TestRuleMarkFailure$1.evaluate(TestRuleMarkFailure.java:48)
	at com.carrotsearch.randomizedtesting.rules.StatementAdapter.evaluate(StatementAdapter.java:36)
	at com.carrotsearch.randomizedtesting.ThreadLeakControl$StatementRunner.run(ThreadLeakControl.java:358)
	at com.carrotsearch.randomizedtesting.ThreadLeakControl.forkTimeoutingTask(ThreadLeakControl.java:782)
	at com.carrotsearch.randomizedtesting.ThreadLeakControl$3.evaluate(ThreadLeakControl.java:442)
	at com.carrotsearch.randomizedtesting.RandomizedRunner.runSingleTest(RandomizedRunner.java:746)
	at com.carrotsearch.randomizedtesting.RandomizedRunner$3.evaluate(RandomizedRunner.java:648)
	at com.carrotsearch.randomizedtesting.RandomizedRunner$4.evaluate(RandomizedRunner.java:682)
	at com.carrotsearch.randomizedtesting.RandomizedRunner$5.evaluate(RandomizedRunner.java:693)
	at com.carrotsearch.randomizedtesting.rules.StatementAdapter.evaluate(StatementAdapter.java:36)
	at com.carrotsearch.randomizedtesting.rules.SystemPropertiesRestoreRule$1.evaluate(SystemPropertiesRestoreRule.java:53)
	at org.apache.lucene.util.AbstractBeforeAfterRule$1.evaluate(AbstractBeforeAfterRule.java:46)
	at org.apache.lucene.util.TestRuleStoreClassName$1.evaluate(TestRuleStoreClassName.java:42)
	at com.carrotsearch.randomizedtesting.rules.SystemPropertiesInvariantRule$1.evaluate(SystemPropertiesInvariantRule.java:55)
	at com.carrotsearch.randomizedtesting.rules.NoShadowingOrOverridesOnMethodsRule$1.evaluate(NoShadowingOrOverridesOnMethodsRule.java:39)
	at com.carrotsearch.randomizedtesting.rules.NoShadowingOrOverridesOnMethodsRule$1.evaluate(NoShadowingOrOverridesOnMethodsRule.java:39)
	at com.carrotsearch.randomizedtesting.rules.StatementAdapter.evaluate(StatementAdapter.java:36)
	at org.apache.lucene.util.TestRuleAssertionsRequired$1.evaluate(TestRuleAssertionsRequired.java:43)
	at org.apache.lucene.util.TestRuleMarkFailure$1.evaluate(TestRuleMarkFailure.java:48)
	at org.apache.lucene.util.TestRuleIgnoreAfterMaxFailures$1.evaluate(TestRuleIgnoreAfterMaxFailures.java:70)
	at org.apache.lucene.util.TestRuleIgnoreTestSuites$1.evaluate(TestRuleIgnoreTestSuites.java:55)
	at com.carrotsearch.randomizedtesting.rules.StatementAdapter.evaluate(StatementAdapter.java:36)
	at com.carrotsearch.randomizedtesting.ThreadLeakControl$StatementRunner.run(ThreadLeakControl.java:358)
	at java.lang.Thread.run(Thread.java:724)




Build Log:
[...truncated 10344 lines...]
   [junit4] Suite: org.apache.solr.core.TestNonNRTOpen
   [junit4]   2> 3433146 T8423 oas.SolrTestCaseJ4.initCore ####initCore
   [junit4]   2> Creating dataDir: /Users/jenkins/workspace/Lucene-Solr-trunk-MacOSX/solr/build/solr-core/test/J0/./solrtest-TestNonNRTOpen-1378871324917
   [junit4]   2> 3433148 T8423 oasc.SolrResourceLoader.<init> new SolrResourceLoader for directory: '/Users/jenkins/workspace/Lucene-Solr-trunk-MacOSX/solr/build/solr-core/test-files/solr/collection1/'
   [junit4]   2> 3433150 T8423 oasc.SolrResourceLoader.replaceClassLoader Adding 'file:/Users/jenkins/workspace/Lucene-Solr-trunk-MacOSX/solr/build/solr-core/test-files/solr/collection1/lib/classes/' to classloader
   [junit4]   2> 3433151 T8423 oasc.SolrResourceLoader.replaceClassLoader Adding 'file:/Users/jenkins/workspace/Lucene-Solr-trunk-MacOSX/solr/build/solr-core/test-files/solr/collection1/lib/README' to classloader
   [junit4]   2> 3433368 T8423 oasc.SolrConfig.<init> Using Lucene MatchVersion: LUCENE_50
   [junit4]   2> 3433471 T8423 oasc.SolrConfig.<init> Loaded SolrConfig: solrconfig-basic.xml
   [junit4]   2> 3433473 T8423 oass.IndexSchema.readSchema Reading Solr Schema from schema-minimal.xml
   [junit4]   2> 3433489 T8423 oass.IndexSchema.readSchema [null] Schema name=minimal
   [junit4]   2> 3433528 T8423 oass.IndexSchema.readSchema WARN no uniqueKey specified in schema.
   [junit4]   2> 3433532 T8423 oasc.SolrResourceLoader.locateSolrHome JNDI not configured for solr (NoInitialContextEx)
   [junit4]   2> 3433533 T8423 oasc.SolrResourceLoader.locateSolrHome using system property solr.solr.home: /Users/jenkins/workspace/Lucene-Solr-trunk-MacOSX/solr/build/solr-core/test-files/solr
   [junit4]   2> 3433534 T8423 oasc.SolrResourceLoader.<init> new SolrResourceLoader for directory: '/Users/jenkins/workspace/Lucene-Solr-trunk-MacOSX/solr/build/solr-core/test-files/solr/'
   [junit4]   2> 3433577 T8423 oasc.SolrResourceLoader.locateSolrHome JNDI not configured for solr (NoInitialContextEx)
   [junit4]   2> 3433578 T8423 oasc.SolrResourceLoader.locateSolrHome using system property solr.solr.home: /Users/jenkins/workspace/Lucene-Solr-trunk-MacOSX/solr/build/solr-core/test-files/solr
   [junit4]   2> 3433579 T8423 oasc.SolrResourceLoader.<init> new SolrResourceLoader for deduced Solr Home: '/Users/jenkins/workspace/Lucene-Solr-trunk-MacOSX/solr/build/solr-core/test-files/solr/'
   [junit4]   2> 3433694 T8423 oasc.CoreContainer.<init> New CoreContainer 1235876603
   [junit4]   2> 3433695 T8423 oasc.CoreContainer.load Loading cores into CoreContainer [instanceDir=/Users/jenkins/workspace/Lucene-Solr-trunk-MacOSX/solr/build/solr-core/test-files/solr/]
   [junit4]   2> 3433697 T8423 oashc.HttpShardHandlerFactory.getParameter Setting socketTimeout to: 0
   [junit4]   2> 3433698 T8423 oashc.HttpShardHandlerFactory.getParameter Setting urlScheme to: http://
   [junit4]   2> 3433698 T8423 oashc.HttpShardHandlerFactory.getParameter Setting connTimeout to: 0
   [junit4]   2> 3433699 T8423 oashc.HttpShardHandlerFactory.getParameter Setting maxConnectionsPerHost to: 20
   [junit4]   2> 3433699 T8423 oashc.HttpShardHandlerFactory.getParameter Setting corePoolSize to: 0
   [junit4]   2> 3433699 T8423 oashc.HttpShardHandlerFactory.getParameter Setting maximumPoolSize to: 2147483647
   [junit4]   2> 3433700 T8423 oashc.HttpShardHandlerFactory.getParameter Setting maxThreadIdleTime to: 5
   [junit4]   2> 3433700 T8423 oashc.HttpShardHandlerFactory.getParameter Setting sizeOfQueue to: -1
   [junit4]   2> 3433701 T8423 oashc.HttpShardHandlerFactory.getParameter Setting fairnessPolicy to: false
   [junit4]   2> 3433702 T8423 oascsi.HttpClientUtil.createClient Creating new http client, config:maxConnectionsPerHost=20&maxConnections=10000&socketTimeout=0&connTimeout=0&retry=false
   [junit4]   2> 3433720 T8423 oasl.LogWatcher.createWatcher SLF4J impl is org.slf4j.impl.Log4jLoggerFactory
   [junit4]   2> 3433721 T8423 oasl.LogWatcher.newRegisteredLogWatcher Registering Log Listener [Log4j (org.slf4j.impl.Log4jLoggerFactory)]
   [junit4]   2> 3433729 T8424 oasc.CoreContainer.create Creating SolrCore 'collection1' using instanceDir: /Users/jenkins/workspace/Lucene-Solr-trunk-MacOSX/solr/build/solr-core/test-files/solr/collection1
   [junit4]   2> 3433729 T8424 oasc.SolrResourceLoader.<init> new SolrResourceLoader for directory: '/Users/jenkins/workspace/Lucene-Solr-trunk-MacOSX/solr/build/solr-core/test-files/solr/collection1/'
   [junit4]   2> 3433731 T8424 oasc.SolrResourceLoader.replaceClassLoader Adding 'file:/Users/jenkins/workspace/Lucene-Solr-trunk-MacOSX/solr/build/solr-core/test-files/solr/collection1/lib/classes/' to classloader
   [junit4]   2> 3433732 T8424 oasc.SolrResourceLoader.replaceClassLoader Adding 'file:/Users/jenkins/workspace/Lucene-Solr-trunk-MacOSX/solr/build/solr-core/test-files/solr/collection1/lib/README' to classloader
   [junit4]   2> 3433830 T8424 oasc.SolrConfig.<init> Using Lucene MatchVersion: LUCENE_50
   [junit4]   2> 3433945 T8424 oasc.SolrConfig.<init> Loaded SolrConfig: solrconfig-basic.xml
   [junit4]   2> 3433946 T8424 oass.IndexSchema.readSchema Reading Solr Schema from schema-minimal.xml
   [junit4]   2> 3433955 T8424 oass.IndexSchema.readSchema [null] Schema name=minimal
   [junit4]   2> 3433973 T8424 oass.IndexSchema.readSchema WARN no uniqueKey specified in schema.
   [junit4]   2> 3433976 T8424 oasc.SolrCore.initDirectoryFactory solr.StandardDirectoryFactory
   [junit4]   2> 3433977 T8424 oasc.SolrCore.<init> [collection1] Opening new SolrCore at /Users/jenkins/workspace/Lucene-Solr-trunk-MacOSX/solr/build/solr-core/test-files/solr/collection1/, dataDir=/Users/jenkins/workspace/Lucene-Solr-trunk-MacOSX/solr/build/solr-core/test/J0/./solrtest-TestNonNRTOpen-1378871324917/
   [junit4]   2> 3433977 T8424 oasc.SolrCore.<init> JMX monitoring not detected for core: collection1
   [junit4]   2> 3433978 T8424 oasc.CachingDirectoryFactory.get return new directory for /Users/jenkins/workspace/Lucene-Solr-trunk-MacOSX/solr/build/solr-core/test/J0/solrtest-TestNonNRTOpen-1378871324917
   [junit4]   2> 3433979 T8424 oasc.SolrCore.getNewIndexDir New index directory detected: old=null new=/Users/jenkins/workspace/Lucene-Solr-trunk-MacOSX/solr/build/solr-core/test/J0/./solrtest-TestNonNRTOpen-1378871324917/index/
   [junit4]   2> 3433979 T8424 oasc.SolrCore.initIndex WARN [collection1] Solr index directory '/Users/jenkins/workspace/Lucene-Solr-trunk-MacOSX/solr/build/solr-core/test/J0/./solrtest-TestNonNRTOpen-1378871324917/index' doesn't exist. Creating new index...
   [junit4]   2> 3433980 T8424 oasc.CachingDirectoryFactory.get return new directory for /Users/jenkins/workspace/Lucene-Solr-trunk-MacOSX/solr/build/solr-core/test/J0/solrtest-TestNonNRTOpen-1378871324917/index
   [junit4]   2> 3433984 T8424 oasc.SolrDeletionPolicy.onCommit SolrDeletionPolicy.onCommit: commits: num=1
   [junit4]   2> 		commit{dir=/Users/jenkins/workspace/Lucene-Solr-trunk-MacOSX/solr/build/solr-core/test/J0/solrtest-TestNonNRTOpen-1378871324917/index,segFN=segments_1,generation=1}
   [junit4]   2> 3433984 T8424 oasc.SolrDeletionPolicy.updateCommits newest commit generation = 1
   [junit4]   2> 3433986 T8424 oasc.SolrCore.loadUpdateProcessorChains no updateRequestProcessorChain defined as default, creating implicit default
   [junit4]   2> 3433987 T8424 oasc.RequestHandlers.initHandlersFromConfig created standard: solr.StandardRequestHandler
   [junit4]   2> 3433988 T8424 oasc.RequestHandlers.initHandlersFromConfig created /update: solr.UpdateRequestHandler
   [junit4]   2> 3434005 T8424 oashl.XMLLoader.init xsltCacheLifetimeSeconds=60
   [junit4]   2> 3434012 T8424 oasu.CommitTracker.<init> Hard AutoCommit: disabled
   [junit4]   2> 3434013 T8424 oasu.CommitTracker.<init> Soft AutoCommit: disabled
   [junit4]   2> 3434015 T8424 oass.SolrIndexSearcher.<init> Opening Searcher@5f53f2af main
   [junit4]   2> 3434017 T8424 oasc.CoreContainer.registerCore registering core: collection1
   [junit4]   2> 3434017 T8425 oasc.SolrCore.registerSearcher [collection1] Registered new searcher Searcher@5f53f2af main{StandardDirectoryReader(segments_1:1)}
   [junit4]   2> 3434021 T8423 oas.SolrTestCaseJ4.initCore ####initCore end
   [junit4]   2> ASYNC  NEW_CORE C6502 name=collection1 org.apache.solr.core.SolrCore@5b58e8b1
   [junit4]   2> 3434034 T8423 C6502 oasc.SolrDeletionPolicy.onInit SolrDeletionPolicy.onInit: commits: num=1
   [junit4]   2> 		commit{dir=/Users/jenkins/workspace/Lucene-Solr-trunk-MacOSX/solr/build/solr-core/test/J0/solrtest-TestNonNRTOpen-1378871324917/index,segFN=segments_1,generation=1}
   [junit4]   2> 3434037 T8423 C6502 oasc.SolrDeletionPolicy.updateCommits newest commit generation = 1
   [junit4]   2> 3434039 T8423 C6502 oasup.LogUpdateProcessor.finish [collection1] webapp=null path=null params={} {add=[(null)]} 0 10
   [junit4]   2> 3434060 T8423 C6502 oasu.DirectUpdateHandler2.commit start commit{,optimize=false,openSearcher=true,waitSearcher=true,expungeDeletes=false,softCommit=false,prepareCommit=false}
   [junit4]   2> 3434097 T8423 C6502 oasc.SolrDeletionPolicy.onCommit SolrDeletionPolicy.onCommit: commits: num=2
   [junit4]   2> 		commit{dir=/Users/jenkins/workspace/Lucene-Solr-trunk-MacOSX/solr/build/solr-core/test/J0/solrtest-TestNonNRTOpen-1378871324917/index,segFN=segments_1,generation=1}
   [junit4]   2> 		commit{dir=/Users/jenkins/workspace/Lucene-Solr-trunk-MacOSX/solr/build/solr-core/test/J0/solrtest-TestNonNRTOpen-1378871324917/index,segFN=segments_2,generation=2}
   [junit4]   2> 3434098 T8423 C6502 oasc.SolrDeletionPolicy.updateCommits newest commit generation = 2
   [junit4]   2> 3434106 T8423 C6502 oass.SolrIndexSearcher.<init> Opening Searcher@5330bf54 main
   [junit4]   2> 3434108 T8423 C6502 oasu.DirectUpdateHandler2.commit end_commit_flush
   [junit4]   2> 3434108 T8425 oasc.SolrCore.registerSearcher [collection1] Registered new searcher Searcher@5330bf54 main{StandardDirectoryReader(segments_2:3 _0(5.0):c1)}
   [junit4]   2> 3434110 T8423 C6502 oasup.LogUpdateProcessor.finish [collection1] webapp=null path=null params={} {commit=} 0 50
   [junit4]   2> 3434120 T8423 oas.SolrTestCaseJ4.deleteCore ###deleteCore
   [junit4]   2> 3434121 T8423 oasc.CoreContainer.shutdown Shutting down CoreContainer instance=1235876603
   [junit4]   2> 3434122 T8423 oasc.SolrCore.close [collection1]  CLOSING SolrCore org.apache.solr.core.SolrCore@5b58e8b1
   [junit4]   2> 3434123 T8423 oasu.DirectUpdateHandler2.close closing DirectUpdateHandler2{commits=1,autocommits=0,soft autocommits=0,optimizes=0,rollbacks=0,expungeDeletes=0,docsPending=0,adds=0,deletesById=0,deletesByQuery=0,errors=0,cumulative_adds=1,cumulative_deletesById=0,cumulative_deletesByQuery=0,cumulative_errors=0}
   [junit4]   2> 3434124 T8423 oasu.SolrCoreState.decrefSolrCoreState Closing SolrCoreState
   [junit4]   2> 3434124 T8423 oasu.DefaultSolrCoreState.closeIndexWriter SolrCoreState ref count has reached 0 - closing IndexWriter
   [junit4]   2> 3434125 T8423 oasu.DefaultSolrCoreState.closeIndexWriter closing IndexWriter with IndexWriterCloser
   [junit4]   2> 3434126 T8423 oasc.SolrCore.closeSearcher [collection1] Closing main searcher on request.
   [junit4]   2> 3434127 T8423 oasc.CachingDirectoryFactory.close Closing StandardDirectoryFactory - 2 directories currently being tracked
   [junit4]   2> 3434128 T8423 oasc.CachingDirectoryFactory.closeCacheValue looking to close /Users/jenkins/workspace/Lucene-Solr-trunk-MacOSX/solr/build/solr-core/test/J0/solrtest-TestNonNRTOpen-1378871324917/index [CachedDir<<refCount=0;path=/Users/jenkins/workspace/Lucene-Solr-trunk-MacOSX/solr/build/solr-core/test/J0/solrtest-TestNonNRTOpen-1378871324917/index;done=false>>]
   [junit4]   2> 3434129 T8423 oasc.CachingDirectoryFactory.close Closing directory: /Users/jenkins/workspace/Lucene-Solr-trunk-MacOSX/solr/build/solr-core/test/J0/solrtest-TestNonNRTOpen-1378871324917/index
   [junit4]   2> 3434130 T8423 oasc.CachingDirectoryFactory.closeCacheValue looking to close /Users/jenkins/workspace/Lucene-Solr-trunk-MacOSX/solr/build/solr-core/test/J0/solrtest-TestNonNRTOpen-1378871324917 [CachedDir<<refCount=0;path=/Users/jenkins/workspace/Lucene-Solr-trunk-MacOSX/solr/build/solr-core/test/J0/solrtest-TestNonNRTOpen-1378871324917;done=false>>]
   [junit4]   2> 3434130 T8423 oasc.CachingDirectoryFactory.close Closing directory: /Users/jenkins/workspace/Lucene-Solr-trunk-MacOSX/solr/build/solr-core/test/J0/solrtest-TestNonNRTOpen-1378871324917
   [junit4]   2> NOTE: per solr.test.leavedatadir, dataDir will not be removed: /Users/jenkins/workspace/Lucene-Solr-trunk-MacOSX/solr/build/solr-core/test/J0/./solrtest-TestNonNRTOpen-1378871324917
   [junit4]   2> 3434134 T8423 oas.SolrTestCaseJ4.initCore ####initCore
   [junit4]   2> 3434135 T8423 oasc.SolrResourceLoader.<init> new SolrResourceLoader for directory: '/Users/jenkins/workspace/Lucene-Solr-trunk-MacOSX/solr/build/solr-core/test-files/solr/collection1/'
   [junit4]   2> 3434137 T8423 oasc.SolrResourceLoader.replaceClassLoader Adding 'file:/Users/jenkins/workspace/Lucene-Solr-trunk-MacOSX/solr/build/solr-core/test-files/solr/collection1/lib/classes/' to classloader
   [junit4]   2> 3434139 T8423 oasc.SolrResourceLoader.replaceClassLoader Adding 'file:/Users/jenkins/workspace/Lucene-Solr-trunk-MacOSX/solr/build/solr-core/test-files/solr/collection1/lib/README' to classloader
   [junit4]   2> 3434310 T8423 oasc.SolrConfig.<init> Using Lucene MatchVersion: LUCENE_50
   [junit4]   2> 3434387 T8423 oasc.SolrConfig.<init> Loaded SolrConfig: solrconfig-basic.xml
   [junit4]   2> 3434389 T8423 oass.IndexSchema.readSchema Reading Solr Schema from schema-minimal.xml
   [junit4]   2> 3434397 T8423 oass.IndexSchema.readSchema [null] Schema name=minimal
   [junit4]   2> 3434421 T8423 oass.IndexSchema.readSchema WARN no uniqueKey specified in schema.
   [junit4]   2> 3434425 T8423 oasc.SolrResourceLoader.locateSolrHome JNDI not configured for solr (NoInitialContextEx)
   [junit4]   2> 3434426 T8423 oasc.SolrResourceLoader.locateSolrHome using system property solr.solr.home: /Users/jenkins/workspace/Lucene-Solr-trunk-MacOSX/solr/build/solr-core/test-files/solr
   [junit4]   2> 3434426 T8423 oasc.SolrResourceLoader.<init> new SolrResourceLoader for directory: '/Users/jenkins/workspace/Lucene-Solr-trunk-MacOSX/solr/build/solr-core/test-files/solr/'
   [junit4]   2> 3434455 T8423 oasc.SolrResourceLoader.locateSolrHome JNDI not configured for solr (NoInitialContextEx)
   [junit4]   2> 3434456 T8423 oasc.SolrResourceLoader.locateSolrHome using system property solr.solr.home: /Users/jenkins/workspace/Lucene-Solr-trunk-MacOSX/solr/build/solr-core/test-files/solr
   [junit4]   2> 3434456 T8423 oasc.SolrResourceLoader.<init> new SolrResourceLoader for deduced Solr Home: '/Users/jenkins/workspace/Lucene-Solr-trunk-MacOSX/solr/build/solr-core/test-files/solr/'
   [junit4]   2> 3434570 T8423 oasc.CoreContainer.<init> New CoreContainer 2112623819
   [junit4]   2> 3434571 T8423 oasc.CoreContainer.load Loading cores into CoreContainer [instanceDir=/Users/jenkins/workspace/Lucene-Solr-trunk-MacOSX/solr/build/solr-core/test-files/solr/]
   [junit4]   2> 3434573 T8423 oashc.HttpShardHandlerFactory.getParameter Setting socketTimeout to: 0
   [junit4]   2> 3434574 T8423 oashc.HttpShardHandlerFactory.getParameter Setting urlScheme to: http://
   [junit4]   2> 3434574 T8423 oashc.HttpShardHandlerFactory.getParameter Setting connTimeout to: 0
   [junit4]   2> 3434575 T8423 oashc.HttpShardHandlerFactory.getParameter Setting maxConnectionsPerHost to: 20
   [junit4]   2> 3434575 T8423 oashc.HttpShardHandlerFactory.getParameter Setting corePoolSize to: 0
   [junit4]   2> 3434576 T8423 oashc.HttpShardHandlerFactory.getParameter Setting maximumPoolSize to: 2147483647
   [junit4]   2> 3434576 T8423 oashc.HttpShardHandlerFactory.getParameter Setting maxThreadIdleTime to: 5
   [junit4]   2> 3434577 T8423 oashc.HttpShardHandlerFactory.getParameter Setting sizeOfQueue to: -1
   [junit4]   2> 3434577 T8423 oashc.HttpShardHandlerFactory.getParameter Setting fairnessPolicy to: false
   [junit4]   2> 3434578 T8423 oascsi.HttpClientUtil.createClient Creating new http client, config:maxConnectionsPerHost=20&maxConnections=10000&socketTimeout=0&connTimeout=0&retry=false
   [junit4]   2> 3434596 T8423 oasl.LogWatcher.createWatcher SLF4J impl is org.slf4j.impl.Log4jLoggerFactory
   [junit4]   2> 3434597 T8423 oasl.LogWatcher.newRegisteredLogWatcher Registering Log Listener [Log4j (org.slf4j.impl.Log4jLoggerFactory)]
   [junit4]   2> 3434611 T8427 oasc.CoreContainer.create Creating SolrCore 'collection1' using instanceDir: /Users/jenkins/workspace/Lucene-Solr-trunk-MacOSX/solr/build/solr-core/test-files/solr/collection1
   [junit4]   2> 3434611 T8427 oasc.SolrResourceLoader.<init> new SolrResourceLoader for directory: '/Users/jenkins/workspace/Lucene-Solr-trunk-MacOSX/solr/build/solr-core/test-files/solr/collection1/'
   [junit4]   2> 3434615 T8427 oasc.SolrResourceLoader.replaceClassLoader Adding 'file:/Users/jenkins/workspace/Lucene-Solr-trunk-MacOSX/solr/build/solr-core/test-files/solr/collection1/lib/classes/' to classloader
   [junit4]   2> 3434616 T8427 oasc.SolrResourceLoader.replaceClassLoader Adding 'file:/Users/jenkins/workspace/Lucene-Solr-trunk-MacOSX/solr/build/solr-core/test-files/solr/collection1/lib/README' to classloader
   [junit4]   2> 3434717 T8427 oasc.SolrConfig.<init> Using Lucene MatchVersion: LUCENE_50
   [junit4]   2> 3434784 T8427 oasc.SolrConfig.<init> Loaded SolrConfig: solrconfig-basic.xml
   [junit4]   2> 3434785 T8427 oass.IndexSchema.readSchema Reading Solr Schema from schema-minimal.xml
   [junit4]   2> 3434793 T8427 oass.IndexSchema.readSchema [null] Schema name=minimal
   [junit4]   2> 3434811 T8427 oass.IndexSchema.readSchema WARN no uniqueKey specified in schema.
   [junit4]   2> 3434814 T8427 oasc.SolrCore.initDirectoryFactory solr.StandardDirectoryFactory
   [junit4]   2> 3434816 T8427 oasc.SolrCore.<init> [collection1] Opening new SolrCore at /Users/jenkins/workspace/Lucene-Solr-trunk-MacOSX/solr/build/solr-core/test-files/solr/collection1/, dataDir=/Users/jenkins/workspace/Lucene-Solr-trunk-MacOSX/solr/build/solr-core/test/J0/./solrtest-TestNonNRTOpen-1378871324917/
   [junit4]   2> 3434816 T8427 oasc.SolrCore.<init> JMX monitoring not detected for core: collection1
   [junit4]   2> 3434818 T8427 oasc.CachingDirectoryFactory.get return new directory for /Users/jenkins/workspace/Lucene-Solr-trunk-MacOSX/solr/build/solr-core/test/J0/solrtest-TestNonNRTOpen-1378871324917
   [junit4]   2> 3434819 T8427 oasc.SolrCore.getNewIndexDir New index directory detected: old=null new=/Users/jenkins/workspace/Lucene-Solr-trunk-MacOSX/solr/build/solr-core/test/J0/./solrtest-TestNonNRTOpen-1378871324917/index/
   [junit4]   2> 3434822 T8427 oasc.SolrCore.loadUpdateProcessorChains no updateRequestProcessorChain defined as default, creating implicit default
   [junit4]   2> 3434823 T8427 oasc.RequestHandlers.initHandlersFromConfig created standard: solr.StandardRequestHandler
   [junit4]   2> 3434823 T8427 oasc.RequestHandlers.initHandlersFromConfig created /update: solr.UpdateRequestHandler
   [junit4]   2> 3434843 T8427 oashl.XMLLoader.init xsltCacheLifetimeSeconds=60
   [junit4]   2> 3434850 T8427 oasu.CommitTracker.<init> Hard AutoCommit: disabled
   [junit4]   2> 3434851 T8427 oasu.CommitTracker.<init> Soft AutoCommit: disabled
   [junit4]   2> 3434852 T8427 oasc.CachingDirectoryFactory.get return new directory for /Users/jenkins/workspace/Lucene-Solr-trunk-MacOSX/solr/build/solr-core/test/J0/solrtest-TestNonNRTOpen-1378871324917/index
   [junit4]   2> 3434855 T8427 oass.SolrIndexSearcher.<init> Opening Searcher@2b77f32 main
   [junit4]   2> 3434856 T8427 oasc.CoreContainer.registerCore registering core: collection1
   [junit4]   2> 3434856 T8428 oasc.SolrCore.registerSearcher [collection1] Registered new searcher Searcher@2b77f32 main{StandardDirectoryReader(segments_2:3 _0(5.0):c1)}
   [junit4]   2> 3434860 T8423 oas.SolrTestCaseJ4.initCore ####initCore end
   [junit4]   2> 3434871 T8423 oas.SolrTestCaseJ4.setUp ###Starting testSharedCores
   [junit4]   2> ASYNC  NEW_CORE C6503 name=collection1 org.apache.solr.core.SolrCore@3b7bc659
   [junit4]   2> 3434888 T8423 C6503 oasu.DirectUpdateHandler2.deleteAll [collection1] REMOVING ALL DOCUMENTS FROM INDEX
   [junit4]   2> 3434894 T8423 C6503 oasc.SolrDeletionPolicy.onInit SolrDeletionPolicy.onInit: commits: num=1
   [junit4]   2> 		commit{dir=/Users/jenkins/workspace/Lucene-Solr-trunk-MacOSX/solr/build/solr-core/test/J0/solrtest-TestNonNRTOpen-1378871324917/index,segFN=segments_2,generation=2}
   [junit4]   2> 3434895 T8423 C6503 oasc.SolrDeletionPolicy.updateCommits newest commit generation = 2
   [junit4]   2> 3434896 T8423 C6503 oasup.LogUpdateProcessor.finish [collection1] webapp=null path=null params={} {deleteByQuery=*:*} 0 8
   [junit4]   2> 3434910 T8423 C6503 oasup.LogUpdateProcessor.finish [collection1] webapp=null path=null params={} {add=[(null)]} 0 2
   [junit4]   2> 3434923 T8423 C6503 oasu.DirectUpdateHandler2.commit start commit{,optimize=false,openSearcher=true,waitSearcher=true,expungeDeletes=false,softCommit=false,prepareCommit=false}
   [junit4]   2> 3434952 T8423 C6503 oasc.SolrDeletionPolicy.onCommit SolrDeletionPolicy.onCommit: commits: num=2
   [junit4]   2> 		commit{dir=/Users/jenkins/workspace/Lucene-Solr-trunk-MacOSX/solr/build/solr-core/test/J0/solrtest-TestNonNRTOpen-1378871324917/index,segFN=segments_2,generation=2}
   [junit4]   2> 		commit{dir=/Users/jenkins/workspace/Lucene-Solr-trunk-MacOSX/solr/build/solr-core/test/J0/solrtest-TestNonNRTOpen-1378871324917/index,segFN=segments_3,generation=3}
   [junit4]   2> 3434954 T8423 C6503 oasc.SolrDeletionPolicy.updateCommits newest commit generation = 3
   [junit4]   2> 3434964 T8423 C6503 oass.SolrIndexSearcher.<init> Opening Searcher@56b8496d main
   [junit4]   2> 3434965 T8423 C6503 oasu.DirectUpdateHandler2.commit end_commit_flush
   [junit4]   2> 3434965 T8428 oasc.SolrCore.registerSearcher [collection1] Registered new searcher Searcher@56b8496d main{StandardDirectoryReader(segments_3:6 _1(5.0):c1)}
   [junit4]   2> 3434968 T8423 C6503 oasup.LogUpdateProcessor.finish [collection1] webapp=null path=null params={} {commit=} 0 45
   [junit4]   2> 3434987 T8423 C6503 oasu.DirectUpdateHandler2.commit start commit{,optimize=true,openSearcher=true,waitSearcher=true,expungeDeletes=false,softCommit=false,prepareCommit=false}
   [junit4]   2> 3435030 T8423 C6503 oasc.SolrDeletionPolicy.onCommit SolrDeletionPolicy.onCommit: commits: num=2
   [junit4]   2> 		commit{dir=/Users/jenkins/workspace/Lucene-Solr-trunk-MacOSX/solr/build/solr-core/test/J0/solrtest-TestNonNRTOpen-1378871324917/index,segFN=segments_3,generation=3}
   [junit4]   2> 		commit{dir=/Users/jenkins/workspace/Lucene-Solr-trunk-MacOSX/solr/build/solr-core/test/J0/solrtest-TestNonNRTOpen-1378871324917/index,segFN=segments_4,generation=4}
   [junit4]   2> 3435032 T8423 C6503 oasc.SolrDeletionPolicy.updateCommits newest commit generation = 4
   [junit4]   2> 3435043 T8423 C6503 oass.SolrIndexSearcher.<init> Opening Searcher@543d1e74 main
   [junit4]   2> 3435045 T8423 C6503 oasu.DirectUpdateHandler2.commit end_commit_flush
   [junit4]   2> 3435045 T8428 oasc.SolrCore.registerSearcher [collection1] Registered new searcher Searcher@543d1e74 main{StandardDirectoryReader(segments_4:8 _2(5.0):c1)}
   [junit4]   2> 3435047 T8423 C6503 oasup.LogUpdateProcessor.finish [collection1] webapp=null path=null params={} {optimize=} 0 60
   [junit4]   2> 3435070 T8423 C6503 oasup.LogUpdateProcessor.finish [collection1] webapp=null path=null params={} {add=[(null)]} 0 3
   [junit4]   2> 3435088 T8423 C6503 oasu.DirectUpdateHandler2.commit start commit{,optimize=false,openSearcher=true,waitSearcher=true,expungeDeletes=false,softCommit=false,prepareCommit=false}
   [junit4]   2> 3435122 T8423 C6503 oasc.SolrDeletionPolicy.onCommit SolrDeletionPolicy.onCommit: commits: num=2
   [junit4]   2> 		commit{dir=/Users/jenkins/workspace/Lucene-Solr-trunk-MacOSX/solr/build/solr-core/test/J0/solrtest-TestNonNRTOpen-1378871324917/index,segFN=segments_4,generation=4}
   [junit4]   2> 		commit{dir=/Users/jenkins/workspace/Lucene-Solr-trunk-MacOSX/solr/build/solr-core/test/J0/solrtest-TestNonNRTOpen-1378871324917/index,segFN=segments_5,generation=5}
   [junit4]   2> 3435124 T8423 C6503 oasc.SolrDeletionPolicy.updateCommits newest commit generation = 5
   [junit4]   2> 3435132 T8423 C6503 oass.SolrIndexSearcher.<init> Opening Searcher@29aa177a main
   [junit4]   2> 3435133 T8423 C6503 oasu.DirectUpdateHandler2.commit end_commit_flush
   [junit4]   2> 3435133 T8428 oasc.SolrCore.registerSearcher [collection1] Registered new searcher Searcher@29aa177a main{StandardDirectoryReader(segments_5:10 _2(5.0):c1 _3(5.0):c1)}
   [junit4]   2> 3435135 T8423 C6503 oasup.LogUpdateProcessor.finish [collection1] webapp=null path=null params={} {commit=} 0 48
   [junit4]   2> 3435167 T8423 C6503 oasup.LogUpdateProcessor.finish [collection1] webapp=null path=null params={} {add=[(null)]} 0 3
   [junit4]   2> 3435190 T8423 C6503 oasup.LogUpdateProcessor.finish [collection1] webapp=null path=null params={} {add=[(null)]} 0 1
   [junit4]   2> 3435201 T8423 C6503 oasu.DirectUpdateHandler2.commit start commit{,optimize=false,openSearcher=true,waitSearcher=true,expungeDeletes=false,softCommit=false,prepareCommit=false}
   [junit4]   2> 3435240 T8423 C6503 oasc.SolrDeletionPolicy.onCommit SolrDeletionPolicy.onCommit: commits: num=2
   [junit4]   2> 		commit{dir=/Users/jenkins/workspace/Lucene-Solr-trunk-MacOSX/solr/build/solr-core/test/J0/solrtest-TestNonNRTOpen-1378871324917/index,segFN=segments_5,generation=5}
   [junit4]   2> 		commit{dir=/Users/jenkins/workspace/Lucene-Solr-trunk-MacOSX/solr/build/solr-core/test/J0/solrtest-TestNonNRTOpen-1378871324917/index,segFN=segments_6,generation=6}
   [junit4]   2> 3435242 T8423 C6503 oasc.SolrDeletionPolicy.updateCommits newest commit generation = 6
   [junit4]   2> 3435253 T8423 C6503 oass.SolrIndexSearcher.<init> Opening Searcher@2eefaff main
   [junit4]   2> 3435254 T8423 C6503 oasu.DirectUpdateHandler2.commit end_commit_flush
   [junit4]   2> 3435255 T8428 oasc.SolrCore.registerSearcher [collection1] Registered new searcher Searcher@2eefaff main{StandardDirectoryReader(segments_6:12 _2(5.0):c1 _3(5.0):c1 _4(5.0):c2)}
   [junit4]   2> 3435256 T8423 C6503 oasup.LogUpdateProcessor.finish [collection1] webapp=null path=null params={} {commit=} 0 55
   [junit4]   2> 3435278 T8423 C6503 oasup.LogUpdateProcessor.finish [collection1] webapp=null path=null params={} {deleteByQuery=foo2:doc} 0 1
   [junit4]   2> 3435293 T8423 C6503 oasu.DirectUpdateHandler2.commit start commit{,optimize=false,openSearcher=true,waitSearcher=true,expungeDeletes=false,softCommit=false,prepareCommit=false}
   [junit4]   2> 3435295 T8423 C6503 oasu.DirectUpdateHandler2.commit No uncommitted changes. Skipping IW.commit.
   [junit4]   2> 3435299 T8423 C6503 oass.SolrIndexSearcher.<init> Opening Searcher@1bb68807 main
   [junit4]   2> 3435300 T8423 C6503 oasu.DirectUpdateHandler2.commit end_commit_flush
   [junit4]   2> 3435301 T8428 oasc.SolrCore.registerSearcher [collection1] Registered new searcher Searcher@1bb68807 main{StandardDirectoryReader(segments_6:12 _2(5.0):c1 _3(5.0):c1 _4(5.0):c2)}
   [junit4]   2> 3435302 T8423 C6503 oasup.LogUpdateProcessor.finish [collection1] webapp=null path=null params={} {commit=} 0 9
   [junit4]   2> 3435306 T8423 oas.SolrTestCaseJ4.tearDown ###Ending testSharedCores
   [junit4]   2> 3435319 T8423 oas.SolrTestCaseJ4.setUp ###Starting testReaderIsNotNRT
   [junit4]   2> 3435332 T8423 C6503 oasu.DirectUpdateHandler2.deleteAll [collection1] REMOVING ALL DOCUMENTS FROM INDEX
   [junit4]   2> 3435333 T8423 C6503 oasup.LogUpdateProcessor.finish [collection1] webapp=null path=null params={} {deleteByQuery=*:*} 0 2
   [junit4]   2> 3435350 T8423 C6503 oasup.LogUpdateProcessor.finish [collection1] webapp=null path=null params={} {add=[(null)]} 0 2
   [junit4]   2> 3435366 T8423 C6503 oasu.DirectUpdateHandler2.commit start commit{,optimize=false,openSearcher=true,waitSearcher=true,expungeDeletes=false,softCommit=false,prepareCommit=false}
   [junit4]   2> 3435400 T8423 C6503 oasc.SolrDeletionPolicy.onCommit SolrDeletionPolicy.onCommit: commits: num=2
   [junit4]   2> 		commit{dir=/Users/jenkins/workspace/Lucene-Solr-trunk-MacOSX/solr/build/solr-core/test/J0/solrtest-TestNonNRTOpen-1378871324917/index,segFN=segments_6,generation=6}
   [junit4]   2> 		commit{dir=/Users/jenkins/workspace/Lucene-Solr-trunk-MacOSX/solr/build/solr-core/test/J0/solrtest-TestNonNRTOpen-1378871324917/index,segFN=segments_7,generation=7}
   [junit4]   2> 3435401 T8423 C6503 oasc.SolrDeletionPolicy.updateCommits newest commit generation = 7
   [junit4]   2> 3435413 T8423 C6503 oass.SolrIndexSearcher.<init> Opening Searcher@4f372cfb main
   [junit4]   2> 3435415 T8423 C6503 oasu.DirectUpdateHandler2.commit end_commit_flush
   [junit4]   2> 3435419 T8428 oasc.SolrCore.registerSearcher [collection1] Registered new searcher Searcher@4f372cfb main{StandardDirectoryReader(segments_7:15 _5(5.0):c1)}
   [junit4]   2> 3435421 T8423 C6503 oasup.LogUpdateProcessor.finish [collection1] webapp=null path=null params={} {commit=} 0 55
   [junit4]   2> 3435430 T8423 oasc.CoreContainer.reload Reloading SolrCore 'collection1' using instanceDir: /Users/jenkins/workspace/Lucene-Solr-trunk-MacOSX/solr/build/solr-core/test-files/solr/collection1
   [junit4]   2> 3435432 T8423 oasc.SolrResourceLoader.<init> new SolrResourceLoader for directory: '/Users/jenkins/workspace/Lucene-Solr-trunk-MacOSX/solr/build/solr-core/test-files/solr/collection1/'
   [junit4]   2> 3435434 T8423 oasc.SolrResourceLoader.replaceClassLoader Adding 'file:/Users/jenkins/workspace/Lucene-Solr-trunk-MacOSX/solr/build/solr-core/test-files/solr/collection1/lib/classes/' to classloader
   [junit4]   2> 3435437 T8423 oasc.SolrResourceLoader.replaceClassLoader Adding 'file:/Users/jenkins/workspace/Lucene-Solr-trunk-MacOSX/solr/build/solr-core/test-files/solr/collection1/lib/README' to classloader
   [junit4]   2> 3435632 T8423 oasc.SolrConfig.<init> Using Lucene MatchVersion: LUCENE_50
   [junit4]   2> 3435731 T8423 oasc.SolrConfig.<init> Loaded SolrConfig: solrconfig-basic.xml
   [junit4]   2> 3435733 T8423 oass.IndexSchema.readSchema Reading Solr Schema from schema-minimal.xml
   [junit4]   2> 3435748 T8423 oass.IndexSchema.readSchema [null] Schema name=minimal
   [junit4]   2> 3435782 T8423 oass.IndexSchema.readSchema WARN no uniqueKey specified in schema.
   [junit4]   2> 3435786 T8423 oasc.SolrCore.<init> [collection1] Opening new SolrCore at /Users/jenkins/workspace/Lucene-Solr-trunk-MacOSX/solr/build/solr-core/test-files/solr/collection1/, dataDir=/Users/jenkins/workspace/Lucene-Solr-trunk-MacOSX/solr/build/solr-core/test/J0/./solrtest-TestNonNRTOpen-1378871324917/
   [junit4]   2> 3435788 T8423 oasc.SolrCore.<init> JMX monitoring not detected for core: collection1
   [junit4]   2> 3435789 T8423 oasc.SolrCore.getNewIndexDir New index directory detected: old=null new=/Users/jenkins/workspace/Lucene-Solr-trunk-MacOSX/solr/build/solr-core/test/J0/./solrtest-TestNonNRTOpen-1378871324917/index/
   [junit4]   2> 3435794 T8423 oasc.SolrCore.loadUpdateProcessorChains no updateRequestProcessorChain defined as default, creating implicit default
   [junit4]   2> 3435796 T8423 oasc.RequestHandlers.initHandlersFromConfig created standard: solr.StandardRequestHandler
   [junit4]   2> 3435798 T8423 oasc.RequestHandlers.initHandlersFromConfig created /update: solr.UpdateRequestHandler
   [junit4]   2> 3435818 T8423 oashl.XMLLoader.init xsltCacheLifetimeSeconds=60
   [junit4]   2> 3435826 T8423 oasu.CommitTracker.<init> Hard AutoCommit: disabled
   [junit4]   2> 3435827 T8423 oasu.CommitTracker.<init> Soft AutoCommit: disabled
   [junit4]   2> 3435831 T8423 oass.SolrIndexSearcher.<init> Opening Searcher@70ade2a0 main
   [junit4]   2> 3435832 T8423 oasu.DefaultSolrCoreState.newIndexWriter Creating new IndexWriter...
   [junit4]   2> 3435833 T8423 oasu.DefaultSolrCoreState.newIndexWriter Waiting until IndexWriter is unused... core=collection1
   [junit4]   2> 3435834 T8423 oasu.DefaultSolrCoreState.newIndexWriter Closing old IndexWriter... core=collection1
   [junit4]   2> 3435832 T8431 oasc.SolrCore.registerSearcher [collection1] Registered new searcher Searcher@70ade2a0 main{StandardDirectoryReader(segments_7:15 _5(5.0):c1)}
   [junit4]   2> 3435839 T8423 oasc.SolrDeletionPolicy.onInit SolrDeletionPolicy.onInit: commits: num=1
   [junit4]   2> 		commit{dir=/Users/jenkins/workspace/Lucene-Solr-trunk-MacOSX/solr/build/solr-core/test/J0/solrtest-TestNonNRTOpen-1378871324917/index,segFN=segments_7,generation=7}
   [junit4]   2> 3435839 T8423 oasc.SolrDeletionPolicy.updateCommits newest commit generation = 7
   [junit4]   2> 3435840 T8423 oasu.DefaultSolrCoreState.newIndexWriter New IndexWriter is ready to be used.
   [junit4]   2> 3435842 T8423 oass.SolrIndexSearcher.<init> Opening Searcher@2f1ceee7 main
   [junit4]   2> 3435844 T8423 oasc.CoreContainer.registerCore replacing core: collection1
   [junit4]   2> 3435845 T8423 oasc.SolrCore.close [collection1]  CLOSING SolrCore org.apache.solr.core.SolrCore@3b7bc659
   [junit4]   2> 3435846 T8423 oasu.DirectUpdateHandler2.close closing DirectUpdateHandler2{commits=5,autocommits=0,soft autocommits=0,optimizes=1,rollbacks=0,expungeDeletes=0,docsPending=0,adds=0,deletesById=0,deletesByQuery=0,errors=0,cumulative_adds=5,cumulative_deletesById=0,cumulative_deletesByQuery=3,cumulative_errors=0}
   [junit4]   2> 3435845 T8431 oasc.SolrCore.registerSearcher [collection1] Registered new searcher Searcher@2f1ceee7 main{StandardDirectoryReader(segments_7:15 _5(5.0):c1)}
   [junit4]   2> 3435847 T8423 oasc.SolrCore.closeSearcher [collection1] Closing main searcher on request.
   [junit4]   2> ASYNC  NEW_CORE C6504 name=collection1 org.apache.solr.core.SolrCore@148897db
   [junit4]   2> 3435860 T8423 C6504 oasup.LogUpdateProcessor.finish [collection1] webapp=null path=null params={} {add=[(null)]} 0 4
   [junit4]   2> 3435878 T8423 C6504 oasu.DirectUpdateHandler2.commit start commit{,optimize=false,openSearcher=true,waitSearcher=true,expungeDeletes=false,softCommit=false,prepareCommit=false}
   [junit4]   2> 3435911 T8423 C6504 oasc.SolrDeletionPolicy.onCommit SolrDeletionPolicy.onCommit: commits: num=2
   [junit4]   2> 		commit{dir=/Users/jenkins/workspace/Lucene-Solr-trunk-MacOSX/solr/build/solr-core/test/J0/solrtest-TestNonNRTOpen-1378871324917/index,segFN=segments_7,generation=7}
   [junit4]   2> 		commit{dir=/Users/jenkins/workspace/Lucene-Solr-trunk-MacOSX/solr/build/solr-core/test/J0/solrtest-TestNonNRTOpen-1378871324917/index,segFN=segments_8,generation=8}
   [junit4]   2> 3435913 T8423 C6504 oasc.SolrDeletionPolicy.updateCommits newest commit generation = 8
   [junit4]   2> 3435926 T8423 C6504 oass.SolrIndexSearcher.<init> Opening Searcher@3874bc3d main
   [junit4]   2> 3435927 T8423 C6504 oasu.DirectUpdateHandler2.commit end_commit_flush
   [junit4]   2> 3435927 T8431 oasc.SolrCore.registerSearcher [collection1] Registered new searcher Searcher@3874bc3d main{StandardDirectoryReader(segments_8:17 _5(5.0):c1 _6(5.0):c1)}
   [junit4]   2> 3435929 T8423 C6504 oasup.LogUpdateProcessor.finish [collection1] webapp=null path=null params={} {commit=} 0 51
   [junit4]   2> 3435949 T8423 C6504 oasup.LogUpdateProcessor.finish [collection1] webapp=null path=null params={} {add=[(null)]} 0 2
   [junit4]   2> 3435952 T8423 oasc.CoreContainer.reload Reloading SolrCore 'collection1' using instanceDir: /Users/jenkins/workspace/Lucene-Solr-trunk-MacOSX/solr/build/solr-core/test-files/solr/collection1
   [junit4]   2> 3435953 T8423 oasc.SolrResourceLoader.<init> new SolrResourceLoader for directory: '/Users/jenkins/workspace/Lucene-Solr-trunk-MacOSX/solr/build/solr-core/test-files/solr/collection1/'
   [junit4]   2> 3435955 T8423 oasc.SolrResourceLoader.replaceClassLoader Adding 'file:/Users/jenkins/workspace/Lucene-Solr-trunk-MacOSX/solr/build/solr-core/test-files/solr/collection1/lib/classes/' to classloader
   [junit4]   2> 3435956 T8423 oasc.SolrResourceLoader.replaceClassLoader Adding 'file:/Users/jenkins/workspace/Lucene-Solr-trunk-MacOSX/solr/build/solr-core/test-files/solr/collection1/lib/README' to classloader
   [junit4]   2> 3436090 T8423 oasc.SolrConfig.<init> Using Lucene MatchVersion: LUCENE_50
   [junit4]   2> 3436197 T8423 oasc.SolrConfig.<init> Loaded SolrConfig: solrconfig-basic.xml
   [junit4]   2> 3436199 T8423 oass.IndexSchema.readSchema Reading Solr Schema from schema-minimal.xml
   [junit4]   2> 3436215 T8423 oass.IndexSchema.readSchema [null] Schema name=minimal
   [junit4]   2> 3436248 T8423 oass.IndexSchema.readSchema WARN no uniqueKey specified in schema.
   [junit4]   2> 3436251 T8423 oasc.SolrCore.<init> [collection1] Opening new SolrCore at /Users/jenkins/workspace/Lucene-Solr-trunk-MacOSX/solr/build/solr-core/test-files/solr/collection1/, dataDir=/Users/jenkins/workspace/Lucene-Solr-trunk-MacOSX/solr/build/solr-core/test/J0/./solrtest-TestNonNRTOpen-1378871324917/
   [junit4]   2> 3436252 T8423 oasc.SolrCore.<init> JMX monitoring not detected for core: collection1
   [junit4]   2> 3436253 T8423 oasc.SolrCore.getNewIndexDir New index directory detected: old=null new=/Users/jenkins/workspace/Lucene-Solr-trunk-MacOSX/solr/build/solr-core/test/J0/./solrtest-TestNonNRTOpen-1378871324917/index/
   [junit4]   2> 3436257 T8423 oasc.SolrCore.loadUpdateProcessorChains no updateRequestProcessorChain defined as default, creating implicit default
   [junit4]   2> 3436258 T8423 oasc.RequestHandlers.initHandlersFromConfig created standard: solr.StandardRequestHandler
   [junit4]   2> 3436259 T8423 oasc.RequestHandlers.initHandlersFromConfig created /update: solr.UpdateRequestHandler
   [junit4]   2> 3436277 T8423 oashl.XMLLoader.init xsltCacheLifetimeSeconds=60
   [junit4]   2> 3436286 T8423 oasu.CommitTracker.<init> Hard AutoCommit: disabled
   [junit4]   2> 3436287 T8423 oasu.CommitTracker.<init> Soft AutoCommit: disabled
   [junit4]   2> 3436292 T8423 oass.SolrIndexSearcher.<init> Opening Searcher@7a61f4b6 main
   [junit4]   2> 3436295 T8423 oasu.DefaultSolrCoreState.newIndexWriter Creating new IndexWriter...
   [junit4]   2> 3436298 T8423 oasu.DefaultSolrCoreState.newIndexWriter Waiting until IndexWriter is unused... core=collection1
   [junit4]   2> 3436299 T8423 oasu.DefaultSolrCoreState.newIndexWriter Closing old IndexWriter... core=collection1
   [junit4]   2> 3436295 T8432 oasc.SolrCore.registerSearcher [collection1] Registered new searcher Searcher@7a61f4b6 main{StandardDirectoryReader(segments_8:17 _5(5.0):c1 _6(5.0):c1)}
   [junit4]   2> 3436337 T8423 oasc.SolrDeletionPolicy.onCommit SolrDeletionPolicy.onCommit: commits: num=2
   [junit4]   2> 		commit{dir=/Users/jenkins/workspace/Lucene-Solr-trunk-MacOSX/solr/build/solr-core/test/J0/solrtest-TestNonNRTOpen-1378871324917/index,segFN=segments_8,generation=8}
   [junit4]   2> 		commit{dir=/Users/jenkins/workspace/Lucene-Solr-trunk-MacOSX/solr/build/solr-core/test/J0/solrtest-TestNonNRTOpen-1378871324917/index,segFN=segments_9,generation=9}
   [junit4]   2> 3436339 T8423 oasc.SolrDeletionPolicy.updateCommits newest commit generation = 9
   [junit4]   2> 3436356 T8423 oasc.SolrDeletionPolicy.onInit SolrDeletionPolicy.onInit: commits: num=1
   [junit4]   2> 		commit{dir=/Users/jenkins/workspace/Lucene-Solr-trunk-MacOSX/solr/build/solr-core/test/J0/solrtest-TestNonNRTOpen-1378871324917/index,segFN=segments_9,generation=9}
   [junit4]   2> 3436357 T8423 oasc.SolrDeletionPolicy.updateCommits newest commit generation = 9
   [junit4]   2> 3436358 T8423 oasu.DefaultSolrCoreState.newIndexWriter New IndexWriter is ready to be used.
   [junit4]   2> 3436365 T8423 oass.SolrIndexSearcher.<init> Opening Searcher@4b9a3330 main
   [junit4]   2> 3436367 T8423 oasc.CoreContainer.registerCore replacing core: collection1
   [junit4]   2> 3436367 T8423 oasc.SolrCore.close [collection1]  CLOSING SolrCore org.apache.solr.core.SolrCore@148897db
   [junit4]   2> 3436368 T8423 oasu.DirectUpdateHandler2.close closing DirectUpdateHandler2{commits=1,autocommits=0,soft autocommits=0,optimizes=0,rollbacks=0,expungeDeletes=0,docsPending=1,adds=1,deletesById=0,deletesByQuery=0,errors=0,cumulative_adds=2,cumulative_deletesById=0,cumulative_deletesByQuery=0,cumulative_errors=0}
   [junit4]   2> 3436369 T8423 oasc.SolrCore.closeSearcher [collection1] Closing main searcher on request.
   [junit4]   2> 3436370 T8423 oas.SolrTestCaseJ4.tearDown ###Ending testReaderIsNotNRT
   [junit4]   2> 3436371 T8432 oasc.SolrCore.registerSearcher [collection1] Registered new searcher Searcher@4b9a3330 main{StandardDirectoryReader(segments_9:19 _5(5.0):c1 _6(5.0):c1 _7(5.0):c1)}
   [junit4]   2> NOTE: reproduce with: ant test  -Dtestcase=TestNonNRTOpen -Dtests.method=testReaderIsNotNRT -Dtests.seed=443356F463A7D8C6 -Dtests.slow=true -Dtests.locale=nl_BE -Dtests.timezone=US/Hawaii -Dtests.file.encoding=UTF-8
   [junit4] FAILURE 1.08s | TestNonNRTOpen.testReaderIsNotNRT <<<
   [junit4]    > Throwable #1: java.lang.AssertionError: expected:<3> but was:<2>
   [junit4]    > 	at __randomizedtesting.SeedInfo.seed([443356F463A7D8C6:F1B53773DC666A32]:0)
   [junit4]    > 	at org.apache.solr.core.TestNonNRTOpen.assertNotNRT(TestNonNRTOpen.java:133)
   [junit4]    > 	at org.apache.solr.core.TestNonNRTOpen.testReaderIsNotNRT(TestNonNRTOpen.java:94)
   [junit4]    > 	at java.lang.Thread.run(Thread.java:724)
   [junit4]   2> 3436391 T8423 oas.SolrTestCaseJ4.deleteCore ###deleteCore
   [junit4]   2> 3436392 T8423 oasc.CoreContainer.shutdown Shutting down CoreContainer instance=2112623819
   [junit4]   2> 3436393 T8423 oasc.SolrCore.close [collection1]  CLOSING SolrCore org.apache.solr.core.SolrCore@7896bb16
   [junit4]   2> 3436394 T8423 oasu.DirectUpdateHandler2.close closing DirectUpdateHandler2{commits=0,autocommits=0,soft autocommits=0,optimizes=0,rollbacks=0,expungeDeletes=0,docsPending=0,adds=0,deletesById=0,deletesByQuery=0,errors=0,cumulative_adds=0,cumulative_deletesById=0,cumulative_deletesByQuery=0,cumulative_errors=0}
   [junit4]   2> 3436395 T8423 oasu.SolrCoreState.decrefSolrCoreState Closing SolrCoreState
   [junit4]   2> 3436395 T8423 oasu.DefaultSolrCoreState.closeIndexWriter SolrCoreState ref count has reached 0 - closing IndexWriter
   [junit4]   2> 3436396 T8423 oasu.DefaultSolrCoreState.closeIndexWriter closing IndexWriter with IndexWriterCloser
   [junit4]   2> 3436398 T8423 oasc.SolrCore.closeSearcher [collection1] Closing main searcher on request.
   [junit4]   2> 3436399 T8423 oasc.CachingDirectoryFactory.close Closing StandardDirectoryFactory - 2 directories currently being tracked
   [junit4]   2> 3436400 T8423 oasc.CachingDirectoryFactory.closeCacheValue looking to close /Users/jenkins/workspace/Lucene-Solr-trunk-MacOSX/solr/build/solr-core/test/J0/solrtest-TestNonNRTOpen-1378871324917/index [CachedDir<<refCount=0;path=/Users/jenkins/workspace/Lucene-Solr-trunk-MacOSX/solr/build/solr-core/test/J0/solrtest-TestNonNRTOpen-1378871324917/index;done=false>>]
   [junit4]   2> 3436401 T8423 oasc.CachingDirectoryFactory.close Closing directory: /Users/jenkins/workspace/Lucene-Solr-trunk-MacOSX/solr/build/solr-core/test/J0/solrtest-TestNonNRTOpen-1378871324917/index
   [junit4]   2> 3436401 T8423 oasc.CachingDirectoryFactory.closeCacheValue looking to close /Users/jenkins/workspace/Lucene-Solr-trunk-MacOSX/solr/build/solr-core/test/J0/solrtest-TestNonNRTOpen-1378871324917 [CachedDir<<refCount=0;path=/Users/jenkins/workspace/Lucene-Solr-trunk-MacOSX/solr/build/solr-core/test/J0/solrtest-TestNonNRTOpen-1378871324917;done=false>>]
   [junit4]   2> 3436402 T8423 oasc.CachingDirectoryFactory.close Closing directory: /Users/jenkins/workspace/Lucene-Solr-trunk-MacOSX/solr/build/solr-core/test/J0/solrtest-TestNonNRTOpen-1378871324917
   [junit4]   2> NOTE: test params are: codec=Lucene45: {bazz=FST41, foo2=Pulsing41(freqCutoff=20 minBlockSize=94 maxBlockSize=246), baz=FST41, foo=PostingsFormat(name=Direct)}, docValues:{}, sim=DefaultSimilarity, locale=nl_BE, timezone=US/Hawaii
   [junit4]   2> NOTE: Mac OS X 10.8.4 x86_64/Oracle Corporation 1.7.0_25 (64-bit)/cpus=2,threads=1,free=160918344,total=519438336
   [junit4]   2> NOTE: All tests run in this JVM: [OverseerCollectionProcessorTest, TestWriterPerf, SuggesterTSTTest, TestSolrQueryParser, TestCopyFieldCollectionResource, TestQueryTypes, ResourceLoaderTest, TestStressRecovery, SOLR749Test, HdfsBasicDistributedZkTest, TestRTGBase, TestInfoStreamLogging, CurrencyFieldOpenExchangeTest, TestManagedSchema, QueryResultKeyTest, UniqFieldsUpdateProcessorFactoryTest, HdfsSyncSliceTest, DistributedSpellCheckComponentTest, TestNoOpRegenerator, HdfsRecoveryZkTest, TestQuerySenderNoQuery, RAMDirectoryFactoryTest, CopyFieldTest, TestSystemIdResolver, MoreLikeThisHandlerTest, FieldMutatingUpdateProcessorTest, DistributedQueryElevationComponentTest, TestFastLRUCache, TestSweetSpotSimilarityFactory, TestReversedWildcardFilterFactory, TestLRUCache, TestDocumentBuilder, DocValuesTest, ZkCLITest, DeleteShardTest, SuggesterWFSTTest, TestCloudManagedSchema, TestUniqueKeyFieldResource, CSVRequestHandlerTest, SolrIndexSplitterTest, SolrIndexConfigTest, PreAnalyzedFieldTest, TestSuggestSpellingConverter, TestPHPSerializedResponseWriter, OpenCloseCoreStressTest, AlternateDirectoryTest, TestReload, NoCacheHeaderTest, DocumentBuilderTest, UUIDFieldTest, SuggesterFSTTest, TestFastOutputStream, ZkControllerTest, HdfsChaosMonkeySafeLeaderTest, OpenExchangeRatesOrgProviderTest, BJQParserTest, ExternalFileFieldSortTest, TestSchemaSimilarityResource, TestConfig, TestZkChroot, TestSolrJ, ShardRoutingCustomTest, TestXIncludeConfig, SchemaVersionSpecificBehaviorTest, FastVectorHighlighterTest, TestCoreDiscovery, TestFunctionQuery, SpellCheckCollatorTest, SimplePostToolTest, ScriptEngineTest, SampleTest, TestArbitraryIndexDir, BlockCacheTest, SynonymTokenizerTest, LeaderElectionIntegrationTest, TestRecoveryHdfs, WordBreakSolrSpellCheckerTest, TestSolrDeletionPolicy2, TestPartialUpdateDeduplication, TestReplicationHandler, TestUtils, TestMultiCoreConfBootstrap, CoreContainerCoreInitFailuresTest, TestBinaryResponseWriter, CacheHeaderTest, DirectUpdateHandlerTest, SolrRequestParserTest, CustomCollectionTest, SliceStateTest, TestAtomicUpdateErrorCases, UpdateRequestProcessorFactoryTest, CoreAdminCreateDiscoverTest, SoftAutoCommitTest, TestElisionMultitermQuery, ShardSplitTest, TestImplicitCoreProperties, TermsComponentTest, QueryElevationComponentTest, TestDFRSimilarityFactory, LegacyHTMLStripCharFilterTest, ReturnFieldsTest, CachingDirectoryFactoryTest, TestPseudoReturnFields, TestPerFieldSimilarity, TestMaxScoreQueryParser, AddSchemaFieldsUpdateProcessorFactoryTest, NumericFieldsTest, SolrPluginUtilsTest, TestDistributedGrouping, URLClassifyProcessorTest, ChaosMonkeySafeLeaderTest, TestValueSourceCache, AliasIntegrationTest, TestSolrDeletionPolicy1, NotRequiredUniqueKeyTest, TestDistributedSearch, SimpleFacetsTest, LeaderElectionTest, TestDefaultSimilarityFactory, PingRequestHandlerTest, SolrTestCaseJ4Test, ResponseLogComponentTest, IndexBasedSpellCheckerTest, JSONWriterTest, PrimUtilsTest, StatsComponentTest, TestUpdate, DisMaxRequestHandlerTest, TestRemoteStreaming, TestJmxMonitoredMap, BadCopyFieldTest, ZkNodePropsTest, TestFoldingMultitermQuery, TestFastWriter, DistributedTermsComponentTest, SearchHandlerTest, OverseerTest, DistanceFunctionTest, RequiredFieldsTest, SignatureUpdateProcessorFactoryTest, TestMergePolicyConfig, BasicDistributedZk2Test, UpdateParamsTest, RegexBoostProcessorTest, TestSolr4Spatial, TestSolrXml, TestLFUCache, ParsingFieldUpdateProcessorsTest, QueryParsingTest, DirectSolrConnectionTest, EchoParamsTest, TestCodecSupport, TimeZoneUtilsTest, PathHierarchyTokenizerFactoryTest, TestFieldResource, TestAddFieldRealTimeGet, BasicDistributedZkTest, UnloadDistributedZkTest, CollectionsAPIDistributedZkTest, SyncSliceTest, ShardRoutingTest, BasicZkTest, RecoveryZkTest, FullSolrCloudDistribCmdsTest, ClusterStateUpdateTest, TestRandomFaceting, ZkSolrClientTest, TestRandomDVFaceting, SliceStateUpdateTest, AutoCommitTest, TestFaceting, TestRecovery, TestHashPartitioner, TermVectorComponentDistributedTest, TestRealTimeGet, TestStressReorder, TestJoin, TestStressVersions, HardAutoCommitTest, TestRangeQuery, TestCoreContainer, SolrCoreTest, SpellCheckComponentTest, TestGroupingSearch, SolrCmdDistributorTest, PeerSyncTest, BadIndexSchemaTest, ConvertedLegacyTest, TestSort, TestFiltering, BasicFunctionalityTest, TestLazyCores, TestBadConfig, TestIndexSearcher, HighlighterTest, ShowFileRequestHandlerTest, CurrencyFieldXmlFileTest, AnalysisAfterCoreReloadTest, TestExtendedDismaxParser, CoreAdminHandlerTest, SuggesterTest, TestStressLucene, TestTrie, SpatialFilterTest, TestCSVLoader, PolyFieldTest, SolrCoreCheckLockOnStartupTest, TestWordDelimiterFilterFactory, QueryEqualityTest, DirectUpdateHandlerOptimizeTest, DefaultValueUpdateProcessorTest, StatelessScriptUpdateProcessorFactoryTest, SortByFunctionTest, DocValuesMultiTest, SolrInfoMBeanTest, XsltUpdateRequestHandlerTest, DebugComponentTest, TestSurroundQueryParser, LukeRequestHandlerTest, TestQueryUtils, StandardRequestHandlerTest, DirectSolrSpellCheckerTest, DocumentAnalysisRequestHandlerTest, PrimitiveFieldTypeTest, TestOmitPositions, FileBasedSpellCheckerTest, XmlUpdateRequestHandlerTest, RequestHandlersTest, TermVectorComponentTest, TestIndexingPerformance, FieldAnalysisRequestHandlerTest, IndexSchemaRuntimeFieldTest, LoggingHandlerTest, IndexSchemaTest, TestJmxIntegration, TestCollationField, TestCSVResponseWriter, MBeansHandlerTest, TestAnalyzedSuggestions, JsonLoaderTest, BinaryUpdateRequestHandlerTest, TestComponentsName, HighlighterConfigTest, TestQuerySenderListener, TestSolrIndexConfig, BadComponentTest, MultiTermTest, TestDocSet, TestBinaryField, TestSearchPerf, MinimalSchemaTest, OutputWriterTest, TestFuzzyAnalyzedSuggestions, TestSolrCoreProperties, TestPostingsSolrHighlighter, TestLuceneMatchVersion, TestPhraseSuggestions, SpellPossibilityIteratorTest, TestCharFilters, TestNumberUtils, TestLMDirichletSimilarityFactory, TestLMJelinekMercerSimilarityFactory, TestIBSimilarityFactory, TestBM25SimilarityFactory, PluginInfoTest, DateMathParserTest, ChaosMonkeyNothingIsSafeTest, TestSolrXMLSerializer, DateFieldTest, SpellingQueryConverterTest, DOMUtilTest, ClusterStateTest, SystemInfoHandlerTest, FileUtilsTest, CircularListTest, AssignTest, SolrXmlInZkTest, HdfsBasicDistributedZk2Test, HdfsCollectionsAPIDistributedZkTest, HdfsUnloadDistributedZkTest, StressHdfsTest, TestNRTOpen, TestNonNRTOpen]
   [junit4] Completed in 3.33s, 2 tests, 1 failure <<< FAILURES!

[...truncated 94 lines...]
BUILD FAILED
/Users/jenkins/workspace/Lucene-Solr-trunk-MacOSX/build.xml:396: The following error occurred while executing this line:
/Users/jenkins/workspace/Lucene-Solr-trunk-MacOSX/build.xml:376: The following error occurred while executing this line:
/Users/jenkins/workspace/Lucene-Solr-trunk-MacOSX/build.xml:39: The following error occurred while executing this line:
/Users/jenkins/workspace/Lucene-Solr-trunk-MacOSX/solr/build.xml:189: The following error occurred while executing this line:
/Users/jenkins/workspace/Lucene-Solr-trunk-MacOSX/solr/common-build.xml:455: The following error occurred while executing this line:
/Users/jenkins/workspace/Lucene-Solr-trunk-MacOSX/lucene/common-build.xml:1230: The following error occurred while executing this line:
/Users/jenkins/workspace/Lucene-Solr-trunk-MacOSX/lucene/common-build.xml:873: There were test failures: 325 suites, 1445 tests, 1 failure, 39 ignored (5 assumptions)

Total time: 96 minutes 26 seconds
Build step 'Invoke Ant' marked build as failure
Description set: Java: 64bit/jdk1.7.0 -XX:-UseCompressedOops -XX:+UseConcMarkSweepGC
Archiving artifacts
Recording test results
Email was triggered for: Failure
Sending email for trigger: Failure



Mime
View raw message