lucene-dev mailing list archives

Site index · List index
Message view « Date » · « Thread »
Top « Date » · « Thread »
From Policeman Jenkins Server <jenk...@thetaphi.de>
Subject [JENKINS] Lucene-Solr-trunk-Windows (32bit/jdk1.8.0-ea-b102) - Build # 3220 - Failure!
Date Tue, 03 Sep 2013 04:53:12 GMT
Build: http://jenkins.thetaphi.de/job/Lucene-Solr-trunk-Windows/3220/
Java: 32bit/jdk1.8.0-ea-b102 -server -XX:+UseG1GC

1 tests failed.
FAILED:  junit.framework.TestSuite.org.apache.solr.search.similarities.TestDFRSimilarityFactory

Error Message:
Suite timeout exceeded (>= 7200000 msec).

Stack Trace:
java.lang.Exception: Suite timeout exceeded (>= 7200000 msec).
	at __randomizedtesting.SeedInfo.seed([499FBACF20EAC99E]:0)




Build Log:
[...truncated 9815 lines...]
   [junit4] Suite: org.apache.solr.search.similarities.TestDFRSimilarityFactory
   [junit4]   2> 361669 T1481 oas.SolrTestCaseJ4.initCore ####initCore
   [junit4]   2> Creating dataDir: C:\Users\JenkinsSlave\workspace\Lucene-Solr-trunk-Windows\solr\build\solr-core\test\J0\.\solrtest-TestDFRSimilarityFactory-1378174853108
   [junit4]   2> 361672 T1481 oasc.SolrResourceLoader.<init> new SolrResourceLoader
for directory: 'C:\Users\JenkinsSlave\workspace\Lucene-Solr-trunk-Windows\solr\build\solr-core\test-files\solr\collection1\'
   [junit4]   2> 361675 T1481 oasc.SolrResourceLoader.replaceClassLoader Adding 'file:/C:/Users/JenkinsSlave/workspace/Lucene-Solr-trunk-Windows/solr/build/solr-core/test-files/solr/collection1/lib/classes/'
to classloader
   [junit4]   2> 361677 T1481 oasc.SolrResourceLoader.replaceClassLoader Adding 'file:/C:/Users/JenkinsSlave/workspace/Lucene-Solr-trunk-Windows/solr/build/solr-core/test-files/solr/collection1/lib/README'
to classloader
   [junit4]   2> 361725 T1481 oasc.SolrConfig.<init> Using Lucene MatchVersion: LUCENE_50
   [junit4]   2> 361730 T1481 oasc.SolrConfig.<init> Loaded SolrConfig: solrconfig-basic.xml
   [junit4]   2> 361731 T1481 oass.IndexSchema.readSchema Reading Solr Schema from schema-dfr.xml
   [junit4]   2> 361734 T1481 oass.IndexSchema.readSchema [null] Schema name=test
   [junit4]   2> 361753 T1481 oass.IndexSchema.readSchema default search field in schema
is text
   [junit4]   2> 361753 T1481 oass.IndexSchema.readSchema unique key field: id
   [junit4]   2> 361754 T1481 oasc.SolrResourceLoader.locateSolrHome JNDI not configured
for solr (NoInitialContextEx)
   [junit4]   2> 361754 T1481 oasc.SolrResourceLoader.locateSolrHome using system property
solr.solr.home: C:\Users\JenkinsSlave\workspace\Lucene-Solr-trunk-Windows\solr\build\solr-core\test-files\solr
   [junit4]   2> 361754 T1481 oasc.SolrResourceLoader.<init> new SolrResourceLoader
for directory: 'C:\Users\JenkinsSlave\workspace\Lucene-Solr-trunk-Windows\solr\build\solr-core\test-files\solr\'
   [junit4]   2> 361771 T1481 oasc.SolrResourceLoader.locateSolrHome JNDI not configured
for solr (NoInitialContextEx)
   [junit4]   2> 361771 T1481 oasc.SolrResourceLoader.locateSolrHome using system property
solr.solr.home: C:\Users\JenkinsSlave\workspace\Lucene-Solr-trunk-Windows\solr\build\solr-core\test-files\solr
   [junit4]   2> 361772 T1481 oasc.SolrResourceLoader.<init> new SolrResourceLoader
for deduced Solr Home: 'C:\Users\JenkinsSlave\workspace\Lucene-Solr-trunk-Windows\solr\build\solr-core\test-files\solr\'
   [junit4]   2> 361795 T1481 oasc.CoreContainer.<init> New CoreContainer 13672666
   [junit4]   2> 361795 T1481 oasc.CoreContainer.load Loading cores into CoreContainer
[instanceDir=C:\Users\JenkinsSlave\workspace\Lucene-Solr-trunk-Windows\solr\build\solr-core\test-files\solr\]
   [junit4]   2> 361796 T1481 oashc.HttpShardHandlerFactory.getParameter Setting socketTimeout
to: 0
   [junit4]   2> 361796 T1481 oashc.HttpShardHandlerFactory.getParameter Setting urlScheme
to: http://
   [junit4]   2> 361796 T1481 oashc.HttpShardHandlerFactory.getParameter Setting connTimeout
to: 0
   [junit4]   2> 361797 T1481 oashc.HttpShardHandlerFactory.getParameter Setting maxConnectionsPerHost
to: 20
   [junit4]   2> 361797 T1481 oashc.HttpShardHandlerFactory.getParameter Setting corePoolSize
to: 0
   [junit4]   2> 361797 T1481 oashc.HttpShardHandlerFactory.getParameter Setting maximumPoolSize
to: 2147483647
   [junit4]   2> 361797 T1481 oashc.HttpShardHandlerFactory.getParameter Setting maxThreadIdleTime
to: 5
   [junit4]   2> 361797 T1481 oashc.HttpShardHandlerFactory.getParameter Setting sizeOfQueue
to: -1
   [junit4]   2> 361797 T1481 oashc.HttpShardHandlerFactory.getParameter Setting fairnessPolicy
to: false
   [junit4]   2> 361798 T1481 oascsi.HttpClientUtil.createClient Creating new http client,
config:maxConnectionsPerHost=20&maxConnections=10000&socketTimeout=0&connTimeout=0&retry=false
   [junit4]   2> 361806 T1481 oasl.LogWatcher.createWatcher SLF4J impl is org.slf4j.impl.Log4jLoggerFactory
   [junit4]   2> 361806 T1481 oasl.LogWatcher.newRegisteredLogWatcher Registering Log Listener
[Log4j (org.slf4j.impl.Log4jLoggerFactory)]
   [junit4]   2> 361812 T1482 oasc.CoreContainer.create Creating SolrCore 'collection1'
using instanceDir: C:\Users\JenkinsSlave\workspace\Lucene-Solr-trunk-Windows\solr\build\solr-core\test-files\solr\collection1
   [junit4]   2> 361812 T1482 oasc.SolrResourceLoader.<init> new SolrResourceLoader
for directory: 'C:\Users\JenkinsSlave\workspace\Lucene-Solr-trunk-Windows\solr\build\solr-core\test-files\solr\collection1\'
   [junit4]   2> 361812 T1482 oasc.SolrResourceLoader.replaceClassLoader Adding 'file:/C:/Users/JenkinsSlave/workspace/Lucene-Solr-trunk-Windows/solr/build/solr-core/test-files/solr/collection1/lib/classes/'
to classloader
   [junit4]   2> 361813 T1482 oasc.SolrResourceLoader.replaceClassLoader Adding 'file:/C:/Users/JenkinsSlave/workspace/Lucene-Solr-trunk-Windows/solr/build/solr-core/test-files/solr/collection1/lib/README'
to classloader
   [junit4]   2> 361836 T1482 oasc.SolrConfig.<init> Using Lucene MatchVersion: LUCENE_50
   [junit4]   2> 361885 T1482 oasc.SolrConfig.<init> Loaded SolrConfig: solrconfig-basic.xml
   [junit4]   2> 361885 T1482 oass.IndexSchema.readSchema Reading Solr Schema from schema-dfr.xml
   [junit4]   2> 361889 T1482 oass.IndexSchema.readSchema [null] Schema name=test
   [junit4]   2> 361898 T1482 oass.IndexSchema.readSchema default search field in schema
is text
   [junit4]   2> 361898 T1482 oass.IndexSchema.readSchema unique key field: id
   [junit4]   2> 361899 T1482 oasc.SolrCore.initDirectoryFactory org.apache.solr.core.MockDirectoryFactory
   [junit4]   2> 361899 T1482 oasc.SolrCore.<init> [collection1] Opening new SolrCore
at C:\Users\JenkinsSlave\workspace\Lucene-Solr-trunk-Windows\solr\build\solr-core\test-files\solr\collection1\,
dataDir=C:\Users\JenkinsSlave\workspace\Lucene-Solr-trunk-Windows\solr\build\solr-core\test\J0\.\solrtest-TestDFRSimilarityFactory-1378174853108\
   [junit4]   2> 361899 T1482 oasc.SolrCore.<init> JMX monitoring not detected for
core: collection1
   [junit4]   2> 361900 T1482 oasc.CachingDirectoryFactory.get return new directory for
C:\Users\JenkinsSlave\workspace\Lucene-Solr-trunk-Windows\solr\build\solr-core\test\J0\.\solrtest-TestDFRSimilarityFactory-1378174853108\
   [junit4]   2> 361900 T1482 oasc.SolrCore.getNewIndexDir New index directory detected:
old=null new=C:\Users\JenkinsSlave\workspace\Lucene-Solr-trunk-Windows\solr\build\solr-core\test\J0\.\solrtest-TestDFRSimilarityFactory-1378174853108\index/
   [junit4]   2> 361900 T1482 oasc.SolrCore.initIndex WARN [collection1] Solr index directory
'C:\Users\JenkinsSlave\workspace\Lucene-Solr-trunk-Windows\solr\build\solr-core\test\J0\.\solrtest-TestDFRSimilarityFactory-1378174853108\index'
doesn't exist. Creating new index...
   [junit4]   2> 361901 T1482 oasc.CachingDirectoryFactory.get return new directory for
C:\Users\JenkinsSlave\workspace\Lucene-Solr-trunk-Windows\solr\build\solr-core\test\J0\.\solrtest-TestDFRSimilarityFactory-1378174853108\index
   [junit4]   2> 361901 T1482 oasu.RandomMergePolicy.<init> RandomMergePolicy wrapping
class org.apache.lucene.index.LogByteSizeMergePolicy: [LogByteSizeMergePolicy: minMergeSize=1677721,
mergeFactor=15, maxMergeSize=2147483648, maxMergeSizeForForcedMerge=9223372036854775807, calibrateSizeByDeletes=false,
maxMergeDocs=2147483647, maxCFSSegmentSizeMB=8.796093022207999E12, noCFSRatio=0.20362769665565106]
   [junit4]   2> 361901 T1482 oasc.SolrDeletionPolicy.onCommit SolrDeletionPolicy.onCommit:
commits: num=1
   [junit4]   2> 		commit{dir=MockDirWrapper(org.apache.lucene.store.RAMDirectory@1e32bfe
lockFactory=org.apache.lucene.store.SingleInstanceLockFactory@153cb88),segFN=segments_1,generation=1}
   [junit4]   2> 361901 T1482 oasc.SolrDeletionPolicy.updateCommits newest commit generation
= 1
   [junit4]   2> 361903 T1482 oasc.SolrCore.loadUpdateProcessorChains no updateRequestProcessorChain
defined as default, creating implicit default
   [junit4]   2> 361903 T1482 oasc.RequestHandlers.initHandlersFromConfig created standard:
solr.StandardRequestHandler
   [junit4]   2> 361904 T1482 oasc.RequestHandlers.initHandlersFromConfig created /update:
solr.UpdateRequestHandler
   [junit4]   2> 361909 T1482 oashl.XMLLoader.init xsltCacheLifetimeSeconds=60
   [junit4]   2> 361910 T1482 oasu.CommitTracker.<init> Hard AutoCommit: disabled
   [junit4]   2> 361910 T1482 oasu.CommitTracker.<init> Soft AutoCommit: disabled
   [junit4]   2> 361911 T1482 oasu.RandomMergePolicy.<init> RandomMergePolicy wrapping
class org.apache.lucene.index.TieredMergePolicy: [TieredMergePolicy: maxMergeAtOnce=13, maxMergeAtOnceExplicit=17,
maxMergedSegmentMB=19.9169921875, floorSegmentMB=1.74609375, forceMergeDeletesPctAllowed=20.054596293994578,
segmentsPerTier=20.0, maxCFSSegmentSizeMB=8.796093022207999E12, noCFSRatio=0.4063901983975521
   [junit4]   2> 361911 T1482 oasc.SolrDeletionPolicy.onInit SolrDeletionPolicy.onInit:
commits: num=1
   [junit4]   2> 		commit{dir=MockDirWrapper(org.apache.lucene.store.RAMDirectory@1e32bfe
lockFactory=org.apache.lucene.store.SingleInstanceLockFactory@153cb88),segFN=segments_1,generation=1}
   [junit4]   2> 361911 T1482 oasc.SolrDeletionPolicy.updateCommits newest commit generation
= 1
   [junit4]   2> 361911 T1482 oass.SolrIndexSearcher.<init> Opening Searcher@502ea4
main
   [junit4]   2> 361912 T1482 oasc.CoreContainer.registerCore registering core: collection1
   [junit4]   2> 361913 T1483 oasc.SolrCore.registerSearcher [collection1] Registered new
searcher Searcher@502ea4 main{StandardDirectoryReader(segments_1:1:nrt)}
   [junit4]   2> 361915 T1481 oas.SolrTestCaseJ4.initCore ####initCore end
   [junit4]   2> 361919 T1481 oas.SolrTestCaseJ4.setUp ###Starting test
   [junit4]   2> 361919 T1481 oas.SolrTestCaseJ4.tearDown ###Ending test
   [junit4]   2> 361923 T1481 oas.SolrTestCaseJ4.setUp ###Starting testParameterC
   [junit4]   2> 361923 T1481 oas.SolrTestCaseJ4.tearDown ###Ending testParameterC
   [junit4]   2> 361928 T1481 oas.SolrTestCaseJ4.setUp ###Starting testParameters
   [junit4]   2> 361929 T1481 oas.SolrTestCaseJ4.tearDown ###Ending testParameters
   [junit4]   2> 361930 T1481 oas.SolrTestCaseJ4.deleteCore ###deleteCore
   [junit4]   2> 361930 T1481 oasc.CoreContainer.shutdown Shutting down CoreContainer instance=13672666
   [junit4]   2> 7254610 T1480 ccr.ThreadLeakControl$2.evaluate WARNING Suite execution
timed out: org.apache.solr.search.similarities.TestDFRSimilarityFactory
   [junit4]   2> 	==== jstack at approximately timeout time ====
   [junit4]   2> 	"RMI TCP Connection(idle)" ID=1508 TIMED_WAITING on java.util.concurrent.SynchronousQueue$TransferStack@1d1210c
   [junit4]   2> 		at sun.misc.Unsafe.park(Native Method)
   [junit4]   2> 		- timed waiting on java.util.concurrent.SynchronousQueue$TransferStack@1d1210c
   [junit4]   2> 		at java.util.concurrent.locks.LockSupport.parkNanos(LockSupport.java:215)
   [junit4]   2> 		at java.util.concurrent.SynchronousQueue$TransferStack.awaitFulfill(SynchronousQueue.java:458)
   [junit4]   2> 		at java.util.concurrent.SynchronousQueue$TransferStack.transfer(SynchronousQueue.java:360)
   [junit4]   2> 		at java.util.concurrent.SynchronousQueue.poll(SynchronousQueue.java:939)
   [junit4]   2> 		at java.util.concurrent.ThreadPoolExecutor.getTask(ThreadPoolExecutor.java:1066)
   [junit4]   2> 		at java.util.concurrent.ThreadPoolExecutor.runWorker(ThreadPoolExecutor.java:1127)
   [junit4]   2> 		at java.util.concurrent.ThreadPoolExecutor$Worker.run(ThreadPoolExecutor.java:617)
   [junit4]   2> 		at java.lang.Thread.run(Thread.java:724)
   [junit4]   2> 	
   [junit4]   2> 	"Thread-613" ID=1484 WAITING on java.lang.Object@1468f32
   [junit4]   2> 		at java.lang.Object.wait(Native Method)
   [junit4]   2> 		- waiting on java.lang.Object@1468f32
   [junit4]   2> 		at java.lang.Object.wait(Object.java:502)
   [junit4]   2> 		at org.apache.solr.core.CloserThread.run(CoreContainer.java:962)
   [junit4]   2> 	
   [junit4]   2> 	"searcherExecutor-1249-thread-1" ID=1483 WAITING on java.util.concurrent.locks.AbstractQueuedSynchronizer$ConditionObject@174d10b
   [junit4]   2> 		at sun.misc.Unsafe.park(Native Method)
   [junit4]   2> 		- waiting on java.util.concurrent.locks.AbstractQueuedSynchronizer$ConditionObject@174d10b
   [junit4]   2> 		at java.util.concurrent.locks.LockSupport.park(LockSupport.java:175)
   [junit4]   2> 		at java.util.concurrent.locks.AbstractQueuedSynchronizer$ConditionObject.await(AbstractQueuedSynchronizer.java:2037)
   [junit4]   2> 		at java.util.concurrent.LinkedBlockingQueue.take(LinkedBlockingQueue.java:442)
   [junit4]   2> 		at java.util.concurrent.ThreadPoolExecutor.getTask(ThreadPoolExecutor.java:1067)
   [junit4]   2> 		at java.util.concurrent.ThreadPoolExecutor.runWorker(ThreadPoolExecutor.java:1127)
   [junit4]   2> 		at java.util.concurrent.ThreadPoolExecutor$Worker.run(ThreadPoolExecutor.java:617)
   [junit4]   2> 		at java.lang.Thread.run(Thread.java:724)
   [junit4]   2> 	
   [junit4]   2> 	"SUITE-TestDFRSimilarityFactory-seed#[499FBACF20EAC99E]-worker" ID=1481
WAITING on org.apache.solr.core.CloserThread@119b194
   [junit4]   2> 		at java.lang.Object.wait(Native Method)
   [junit4]   2> 		- waiting on org.apache.solr.core.CloserThread@119b194
   [junit4]   2> 		at java.lang.Thread.join(Thread.java:1224)
   [junit4]   2> 		at java.lang.Thread.join(Thread.java:1298)
   [junit4]   2> 		at org.apache.solr.core.CoreContainer.shutdown(CoreContainer.java:357)
   [junit4]   2> 		at org.apache.solr.util.TestHarness.close(TestHarness.java:337)
   [junit4]   2> 		at org.apache.solr.SolrTestCaseJ4.deleteCore(SolrTestCaseJ4.java:537)
   [junit4]   2> 		at org.apache.solr.SolrTestCaseJ4.afterClass(SolrTestCaseJ4.java:132)
   [junit4]   2> 		at sun.reflect.GeneratedMethodAccessor23.invoke(Unknown Source)
   [junit4]   2> 		at sun.reflect.DelegatingMethodAccessorImpl.invoke(DelegatingMethodAccessorImpl.java:43)
   [junit4]   2> 		at java.lang.reflect.Method.invoke(Method.java:491)
   [junit4]   2> 		at com.carrotsearch.randomizedtesting.RandomizedRunner.invoke(RandomizedRunner.java:1559)
   [junit4]   2> 		at com.carrotsearch.randomizedtesting.RandomizedRunner.access$600(RandomizedRunner.java:79)
   [junit4]   2> 		at com.carrotsearch.randomizedtesting.RandomizedRunner$5.evaluate(RandomizedRunner.java:700)
   [junit4]   2> 		at com.carrotsearch.randomizedtesting.rules.StatementAdapter.evaluate(StatementAdapter.java:36)
   [junit4]   2> 		at com.carrotsearch.randomizedtesting.rules.SystemPropertiesRestoreRule$1.evaluate(SystemPropertiesRestoreRule.java:53)
   [junit4]   2> 		at org.apache.lucene.util.AbstractBeforeAfterRule$1.evaluate(AbstractBeforeAfterRule.java:46)
   [junit4]   2> 		at org.apache.lucene.util.TestRuleStoreClassName$1.evaluate(TestRuleStoreClassName.java:42)
   [junit4]   2> 		at com.carrotsearch.randomizedtesting.rules.SystemPropertiesInvariantRule$1.evaluate(SystemPropertiesInvariantRule.java:55)
   [junit4]   2> 		at com.carrotsearch.randomizedtesting.rules.NoShadowingOrOverridesOnMethodsRule$1.evaluate(NoShadowingOrOverridesOnMethodsRule.java:39)
   [junit4]   2> 		at com.carrotsearch.randomizedtesting.rules.NoShadowingOrOverridesOnMethodsRule$1.evaluate(NoShadowingOrOverridesOnMethodsRule.java:39)
   [junit4]   2> 		at com.carrotsearch.randomizedtesting.rules.StatementAdapter.evaluate(StatementAdapter.java:36)
   [junit4]   2> 		at org.apache.lucene.util.TestRuleAssertionsRequired$1.evaluate(TestRuleAssertionsRequired.java:43)
   [junit4]   2> 		at org.apache.lucene.util.TestRuleMarkFailure$1.evaluate(TestRuleMarkFailure.java:48)
   [junit4]   2> 		at org.apache.lucene.util.TestRuleIgnoreAfterMaxFailures$1.evaluate(TestRuleIgnoreAfterMaxFailures.java:70)
   [junit4]   2> 		at org.apache.lucene.util.TestRuleIgnoreTestSuites$1.evaluate(TestRuleIgnoreTestSuites.java:55)
   [junit4]   2> 		at com.carrotsearch.randomizedtesting.rules.StatementAdapter.evaluate(StatementAdapter.java:36)
   [junit4]   2> 		at com.carrotsearch.randomizedtesting.ThreadLeakControl$StatementRunner.run(ThreadLeakControl.java:358)
   [junit4]   2> 		at java.lang.Thread.run(Thread.java:724)
   [junit4]   2> 	
   [junit4]   2> 	"SUITE-TestDFRSimilarityFactory-seed#[499FBACF20EAC99E]" ID=1480 RUNNABLE
   [junit4]   2> 		at sun.management.ThreadImpl.dumpThreads0(Native Method)
   [junit4]   2> 		at sun.management.ThreadImpl.dumpAllThreads(ThreadImpl.java:446)
   [junit4]   2> 		at com.carrotsearch.randomizedtesting.ThreadLeakControl.formatThreadStacksFull(ThreadLeakControl.java:655)
   [junit4]   2> 		at com.carrotsearch.randomizedtesting.ThreadLeakControl.access$800(ThreadLeakControl.java:60)
   [junit4]   2> 		at com.carrotsearch.randomizedtesting.ThreadLeakControl$2.evaluate(ThreadLeakControl.java:396)
   [junit4]   2> 		- locked java.lang.Object@a1770f
   [junit4]   2> 		at com.carrotsearch.randomizedtesting.RandomizedRunner.runSuite(RandomizedRunner.java:556)
   [junit4]   2> 		at com.carrotsearch.randomizedtesting.RandomizedRunner.access$200(RandomizedRunner.java:79)
   [junit4]   2> 		at com.carrotsearch.randomizedtesting.RandomizedRunner$1.run(RandomizedRunner.java:492)
   [junit4]   2> 	
   [junit4]   2> 	"RMI TCP Accept-0" ID=1057 RUNNABLE (in native code)
   [junit4]   2> 		at java.net.DualStackPlainSocketImpl.accept0(Native Method)
   [junit4]   2> 		at java.net.DualStackPlainSocketImpl.socketAccept(DualStackPlainSocketImpl.java:131)
   [junit4]   2> 		at java.net.AbstractPlainSocketImpl.accept(AbstractPlainSocketImpl.java:404)
   [junit4]   2> 		at java.net.PlainSocketImpl.accept(PlainSocketImpl.java:198)
   [junit4]   2> 		- locked java.net.SocksSocketImpl@47abb0
   [junit4]   2> 		at java.net.ServerSocket.implAccept(ServerSocket.java:545)
   [junit4]   2> 		at java.net.ServerSocket.accept(ServerSocket.java:513)
   [junit4]   2> 		at sun.rmi.transport.tcp.TCPTransport$AcceptLoop.executeAcceptLoop(TCPTransport.java:388)
   [junit4]   2> 		at sun.rmi.transport.tcp.TCPTransport$AcceptLoop.run(TCPTransport.java:360)
   [junit4]   2> 		at java.lang.Thread.run(Thread.java:724)
   [junit4]   2> 	
   [junit4]   2> 	"RMI RenewClean-[127.0.0.1:50825]" ID=1053 TIMED_WAITING on java.lang.ref.ReferenceQueue$Lock@81d17b
   [junit4]   2> 		at java.lang.Object.wait(Native Method)
   [junit4]   2> 		- timed waiting on java.lang.ref.ReferenceQueue$Lock@81d17b
   [junit4]   2> 		at java.lang.ref.ReferenceQueue.remove(ReferenceQueue.java:142)
   [junit4]   2> 		at sun.rmi.transport.DGCClient$EndpointEntry$RenewCleanThread.run(DGCClient.java:536)
   [junit4]   2> 		at java.lang.Thread.run(Thread.java:724)
   [junit4]   2> 	
   [junit4]   2> 	"RMI Scheduler(0)" ID=1052 TIMED_WAITING on java.util.concurrent.locks.AbstractQueuedSynchronizer$ConditionObject@13df746
   [junit4]   2> 		at sun.misc.Unsafe.park(Native Method)
   [junit4]   2> 		- timed waiting on java.util.concurrent.locks.AbstractQueuedSynchronizer$ConditionObject@13df746
   [junit4]   2> 		at java.util.concurrent.locks.LockSupport.parkNanos(LockSupport.java:215)
   [junit4]   2> 		at java.util.concurrent.locks.AbstractQueuedSynchronizer$ConditionObject.awaitNanos(AbstractQueuedSynchronizer.java:2076)
   [junit4]   2> 		at java.util.concurrent.ScheduledThreadPoolExecutor$DelayedWorkQueue.take(ScheduledThreadPoolExecutor.java:1093)
   [junit4]   2> 		at java.util.concurrent.ScheduledThreadPoolExecutor$DelayedWorkQueue.take(ScheduledThreadPoolExecutor.java:809)
   [junit4]   2> 		at java.util.concurrent.ThreadPoolExecutor.getTask(ThreadPoolExecutor.java:1067)
   [junit4]   2> 		at java.util.concurrent.ThreadPoolExecutor.runWorker(ThreadPoolExecutor.java:1127)
   [junit4]   2> 		at java.util.concurrent.ThreadPoolExecutor$Worker.run(ThreadPoolExecutor.java:617)
   [junit4]   2> 		at java.lang.Thread.run(Thread.java:724)
   [junit4]   2> 	
   [junit4]   2> 	"GC Daemon" ID=1050 TIMED_WAITING on sun.misc.GC$LatencyLock@eec327
   [junit4]   2> 		at java.lang.Object.wait(Native Method)
   [junit4]   2> 		- timed waiting on sun.misc.GC$LatencyLock@eec327
   [junit4]   2> 		at sun.misc.GC$Daemon.run(GC.java:117)
   [junit4]   2> 	
   [junit4]   2> 	"RMI Reaper" ID=1049 WAITING on java.lang.ref.ReferenceQueue$Lock@a755f7
   [junit4]   2> 		at java.lang.Object.wait(Native Method)
   [junit4]   2> 		- waiting on java.lang.ref.ReferenceQueue$Lock@a755f7
   [junit4]   2> 		at java.lang.ref.ReferenceQueue.remove(ReferenceQueue.java:142)
   [junit4]   2> 		at java.lang.ref.ReferenceQueue.remove(ReferenceQueue.java:158)
   [junit4]   2> 		at sun.rmi.transport.ObjectTable$Reaper.run(ObjectTable.java:351)
   [junit4]   2> 		at java.lang.Thread.run(Thread.java:724)
   [junit4]   2> 	
   [junit4]   2> 	"RMI TCP Accept-0" ID=1048 RUNNABLE (in native code)
   [junit4]   2> 		at java.net.DualStackPlainSocketImpl.accept0(Native Method)
   [junit4]   2> 		at java.net.DualStackPlainSocketImpl.socketAccept(DualStackPlainSocketImpl.java:131)
   [junit4]   2> 		at java.net.AbstractPlainSocketImpl.accept(AbstractPlainSocketImpl.java:404)
   [junit4]   2> 		at java.net.PlainSocketImpl.accept(PlainSocketImpl.java:198)
   [junit4]   2> 		- locked java.net.SocksSocketImpl@785309
   [junit4]   2> 		at java.net.ServerSocket.implAccept(ServerSocket.java:545)
   [junit4]   2> 		at java.net.ServerSocket.accept(ServerSocket.java:513)
   [junit4]   2> 		at sun.rmi.transport.tcp.TCPTransport$AcceptLoop.executeAcceptLoop(TCPTransport.java:388)
   [junit4]   2> 		at sun.rmi.transport.tcp.TCPTransport$AcceptLoop.run(TCPTransport.java:360)
   [junit4]   2> 		at java.lang.Thread.run(Thread.java:724)
   [junit4]   2> 	
   [junit4]   2> 	"RMI TCP Accept-0" ID=1047 RUNNABLE (in native code)
   [junit4]   2> 		at java.net.DualStackPlainSocketImpl.accept0(Native Method)
   [junit4]   2> 		at java.net.DualStackPlainSocketImpl.socketAccept(DualStackPlainSocketImpl.java:131)
   [junit4]   2> 		at java.net.AbstractPlainSocketImpl.accept(AbstractPlainSocketImpl.java:404)
   [junit4]   2> 		at java.net.PlainSocketImpl.accept(PlainSocketImpl.java:198)
   [junit4]   2> 		- locked java.net.SocksSocketImpl@15b2e44
   [junit4]   2> 		at java.net.ServerSocket.implAccept(ServerSocket.java:545)
   [junit4]   2> 		at java.net.ServerSocket.accept(ServerSocket.java:513)
   [junit4]   2> 		at sun.rmi.transport.tcp.TCPTransport$AcceptLoop.executeAcceptLoop(TCPTransport.java:388)
   [junit4]   2> 		at sun.rmi.transport.tcp.TCPTransport$AcceptLoop.run(TCPTransport.java:360)
   [junit4]   2> 		at java.lang.Thread.run(Thread.java:724)
   [junit4]   2> 	
   [junit4]   2> 	"Attach Listener" ID=6 RUNNABLE
   [junit4]   2> 	
   [junit4]   2> 	"Signal Dispatcher" ID=5 RUNNABLE
   [junit4]   2> 	
   [junit4]   2> 	"Finalizer" ID=3 WAITING on java.lang.ref.ReferenceQueue$Lock@934a11
   [junit4]   2> 		at java.lang.Object.wait(Native Method)
   [junit4]   2> 		- waiting on java.lang.ref.ReferenceQueue$Lock@934a11
   [junit4]   2> 		at java.lang.ref.ReferenceQueue.remove(ReferenceQueue.java:142)
   [junit4]   2> 		at java.lang.ref.ReferenceQueue.remove(ReferenceQueue.java:158)
   [junit4]   2> 		at java.lang.ref.Finalizer$FinalizerThread.run(Finalizer.java:189)
   [junit4]   2> 	
   [junit4]   2> 	"Reference Handler" ID=2 WAITING on java.lang.ref.Reference$Lock@4811c2
   [junit4]   2> 		at java.lang.Object.wait(Native Method)
   [junit4]   2> 		- waiting on java.lang.ref.Reference$Lock@4811c2
   [junit4]   2> 		at java.lang.Object.wait(Object.java:502)
   [junit4]   2> 		at java.lang.ref.Reference$ReferenceHandler.run(Reference.java:157)
   [junit4]   2> 	
   [junit4]   2> 	"main" ID=1 WAITING on com.carrotsearch.randomizedtesting.RandomizedRunner$1@49db30
   [junit4]   2> 		at java.lang.Object.wait(Native Method)
   [junit4]   2> 		- waiting on com.carrotsearch.randomizedtesting.RandomizedRunner$1@49db30
   [junit4]   2> 		at java.lang.Thread.join(Thread.java:1224)
   [junit4]   2> 		at java.lang.Thread.join(Thread.java:1298)
   [junit4]   2> 		at com.carrotsearch.randomizedtesting.RandomizedRunner.runSuite(RandomizedRunner.java:502)
   [junit4]   2> 		at com.carrotsearch.randomizedtesting.RandomizedRunner.run(RandomizedRunner.java:399)
   [junit4]   2> 		at com.carrotsearch.ant.tasks.junit4.slave.SlaveMain.execute(SlaveMain.java:180)
   [junit4]   2> 		at com.carrotsearch.ant.tasks.junit4.slave.SlaveMain.main(SlaveMain.java:275)
   [junit4]   2> 		at com.carrotsearch.ant.tasks.junit4.slave.SlaveMainSafe.main(SlaveMainSafe.java:12)
   [junit4]   2> 	
   [junit4]   2> 	^^==============================================
   [junit4]   2> 	
   [junit4]   2> 7254618 T1480 ccr.ThreadLeakControl.checkThreadLeaks WARNING Will linger
awaiting termination of 3 leaked thread(s).
   [junit4]   2> 7274788 T1480 ccr.ThreadLeakControl.checkThreadLeaks SEVERE 3 threads
leaked from SUITE scope at org.apache.solr.search.similarities.TestDFRSimilarityFactory: 
   [junit4]   2> 	   1) Thread[id=1481, name=SUITE-TestDFRSimilarityFactory-seed#[499FBACF20EAC99E]-worker,
state=WAITING, group=TGRP-TestDFRSimilarityFactory]
   [junit4]   2> 	        at java.lang.Object.wait(Native Method)
   [junit4]   2> 	        at java.lang.Thread.join(Thread.java:1224)
   [junit4]   2> 	        at java.lang.Thread.join(Thread.java:1298)
   [junit4]   2> 	        at org.apache.solr.core.CoreContainer.shutdown(CoreContainer.java:357)
   [junit4]   2> 	        at org.apache.solr.util.TestHarness.close(TestHarness.java:337)
   [junit4]   2> 	        at org.apache.solr.SolrTestCaseJ4.deleteCore(SolrTestCaseJ4.java:537)
   [junit4]   2> 	        at org.apache.solr.SolrTestCaseJ4.afterClass(SolrTestCaseJ4.java:132)
   [junit4]   2> 	        at sun.reflect.GeneratedMethodAccessor23.invoke(Unknown Source)
   [junit4]   2> 	        at sun.reflect.DelegatingMethodAccessorImpl.invoke(DelegatingMethodAccessorImpl.java:43)
   [junit4]   2> 	        at java.lang.reflect.Method.invoke(Method.java:491)
   [junit4]   2> 	        at com.carrotsearch.randomizedtesting.RandomizedRunner.invoke(RandomizedRunner.java:1559)
   [junit4]   2> 	        at com.carrotsearch.randomizedtesting.RandomizedRunner.access$600(RandomizedRunner.java:79)
   [junit4]   2> 	        at com.carrotsearch.randomizedtesting.RandomizedRunner$5.evaluate(RandomizedRunner.java:700)
   [junit4]   2> 	        at com.carrotsearch.randomizedtesting.rules.StatementAdapter.evaluate(StatementAdapter.java:36)
   [junit4]   2> 	        at com.carrotsearch.randomizedtesting.rules.SystemPropertiesRestoreRule$1.evaluate(SystemPropertiesRestoreRule.java:53)
   [junit4]   2> 	        at org.apache.lucene.util.AbstractBeforeAfterRule$1.evaluate(AbstractBeforeAfterRule.java:46)
   [junit4]   2> 	        at org.apache.lucene.util.TestRuleStoreClassName$1.evaluate(TestRuleStoreClassName.java:42)
   [junit4]   2> 	        at com.carrotsearch.randomizedtesting.rules.SystemPropertiesInvariantRule$1.evaluate(SystemPropertiesInvariantRule.java:55)
   [junit4]   2> 	        at com.carrotsearch.randomizedtesting.rules.NoShadowingOrOverridesOnMethodsRule$1.evaluate(NoShadowingOrOverridesOnMethodsRule.java:39)
   [junit4]   2> 	        at com.carrotsearch.randomizedtesting.rules.NoShadowingOrOverridesOnMethodsRule$1.evaluate(NoShadowingOrOverridesOnMethodsRule.java:39)
   [junit4]   2> 	        at com.carrotsearch.randomizedtesting.rules.StatementAdapter.evaluate(StatementAdapter.java:36)
   [junit4]   2> 	        at org.apache.lucene.util.TestRuleAssertionsRequired$1.evaluate(TestRuleAssertionsRequired.java:43)
   [junit4]   2> 	        at org.apache.lucene.util.TestRuleMarkFailure$1.evaluate(TestRuleMarkFailure.java:48)
   [junit4]   2> 	        at org.apache.lucene.util.TestRuleIgnoreAfterMaxFailures$1.evaluate(TestRuleIgnoreAfterMaxFailures.java:70)
   [junit4]   2> 	        at org.apache.lucene.util.TestRuleIgnoreTestSuites$1.evaluate(TestRuleIgnoreTestSuites.java:55)
   [junit4]   2> 	        at com.carrotsearch.randomizedtesting.rules.StatementAdapter.evaluate(StatementAdapter.java:36)
   [junit4]   2> 	        at com.carrotsearch.randomizedtesting.ThreadLeakControl$StatementRunner.run(ThreadLeakControl.java:358)
   [junit4]   2> 	        at java.lang.Thread.run(Thread.java:724)
   [junit4]   2> 	   2) Thread[id=1483, name=searcherExecutor-1249-thread-1, state=WAITING,
group=TGRP-TestDFRSimilarityFactory]
   [junit4]   2> 	        at sun.misc.Unsafe.park(Native Method)
   [junit4]   2> 	        at java.util.concurrent.locks.LockSupport.park(LockSupport.java:175)
   [junit4]   2> 	        at java.util.concurrent.locks.AbstractQueuedSynchronizer$ConditionObject.await(AbstractQueuedSynchronizer.java:2037)
   [junit4]   2> 	        at java.util.concurrent.LinkedBlockingQueue.take(LinkedBlockingQueue.java:442)
   [junit4]   2> 	        at java.util.concurrent.ThreadPoolExecutor.getTask(ThreadPoolExecutor.java:1067)
   [junit4]   2> 	        at java.util.concurrent.ThreadPoolExecutor.runWorker(ThreadPoolExecutor.java:1127)
   [junit4]   2> 	        at java.util.concurrent.ThreadPoolExecutor$Worker.run(ThreadPoolExecutor.java:617)
   [junit4]   2> 	        at java.lang.Thread.run(Thread.java:724)
   [junit4]   2> 	   3) Thread[id=1484, name=Thread-613, state=WAITING, group=TGRP-TestDFRSimilarityFactory]
   [junit4]   2> 	        at java.lang.Object.wait(Native Method)
   [junit4]   2> 	        at java.lang.Object.wait(Object.java:502)
   [junit4]   2> 	        at org.apache.solr.core.CloserThread.run(CoreContainer.java:962)
   [junit4]   2> 7274789 T1480 ccr.ThreadLeakControl.tryToInterruptAll Starting to interrupt
leaked threads:
   [junit4]   2> 	   1) Thread[id=1481, name=SUITE-TestDFRSimilarityFactory-seed#[499FBACF20EAC99E]-worker,
state=WAITING, group=TGRP-TestDFRSimilarityFactory]
   [junit4]   2> 	   2) Thread[id=1483, name=searcherExecutor-1249-thread-1, state=WAITING,
group=TGRP-TestDFRSimilarityFactory]
   [junit4]   2> 	   3) Thread[id=1484, name=Thread-613, state=WAITING, group=TGRP-TestDFRSimilarityFactory]
   [junit4]   2> 7636454 T1481 oasc.SolrCore.close [collection1]  CLOSING SolrCore org.apache.solr.core.SolrCore@1a7799e
   [junit4]   2> 7636454 T1481 oasu.DirectUpdateHandler2.close closing DirectUpdateHandler2{commits=0,autocommits=0,soft
autocommits=0,optimizes=0,rollbacks=0,expungeDeletes=0,docsPending=0,adds=0,deletesById=0,deletesByQuery=0,errors=0,cumulative_adds=0,cumulative_deletesById=0,cumulative_deletesByQuery=0,cumulative_errors=0}
   [junit4]   2> 7636455 T1481 oasu.SolrCoreState.decrefSolrCoreState Closing SolrCoreState
   [junit4]   2> 7636455 T1481 oasu.DefaultSolrCoreState.closeIndexWriter SolrCoreState
ref count has reached 0 - closing IndexWriter
   [junit4]   2> 7636455 T1481 oasu.DefaultSolrCoreState.closeIndexWriter closing IndexWriter
with IndexWriterCloser
   [junit4]   2> 7636456 T1481 oasc.SolrCore.closeSearcher [collection1] Closing main searcher
on request.
   [junit4]   2> 7636456 T1481 oasc.CachingDirectoryFactory.close Closing MockDirectoryFactory
- 2 directories currently being tracked
   [junit4]   2> 7636456 T1481 oasc.CachingDirectoryFactory.closeCacheValue looking to
close C:\Users\JenkinsSlave\workspace\Lucene-Solr-trunk-Windows\solr\build\solr-core\test\J0\.\solrtest-TestDFRSimilarityFactory-1378174853108\index
[CachedDir<<refCount=0;path=C:\Users\JenkinsSlave\workspace\Lucene-Solr-trunk-Windows\solr\build\solr-core\test\J0\.\solrtest-TestDFRSimilarityFactory-1378174853108\index;done=false>>]
   [junit4]   2> 7636457 T1481 oasc.CachingDirectoryFactory.close Closing directory: C:\Users\JenkinsSlave\workspace\Lucene-Solr-trunk-Windows\solr\build\solr-core\test\J0\.\solrtest-TestDFRSimilarityFactory-1378174853108\index
   [junit4]   2> 7636457 T1481 oasc.CachingDirectoryFactory.closeCacheValue looking to
close C:\Users\JenkinsSlave\workspace\Lucene-Solr-trunk-Windows\solr\build\solr-core\test\J0\.\solrtest-TestDFRSimilarityFactory-1378174853108\
[CachedDir<<refCount=0;path=C:\Users\JenkinsSlave\workspace\Lucene-Solr-trunk-Windows\solr\build\solr-core\test\J0\.\solrtest-TestDFRSimilarityFactory-1378174853108\;done=false>>]
   [junit4]   2> 7636457 T1481 oasc.CachingDirectoryFactory.close Closing directory: C:\Users\JenkinsSlave\workspace\Lucene-Solr-trunk-Windows\solr\build\solr-core\test\J0\.\solrtest-TestDFRSimilarityFactory-1378174853108\
   [junit4]   2> 7274797 T1480 ccr.ThreadLeakControl.tryToInterruptAll All leaked threads
terminated.
   [junit4]   2> NOTE: test params are: codec=Lucene45: {}, docValues:{}, sim=DefaultSimilarity,
locale=sr_CS, timezone=Pacific/Pohnpei
   [junit4]   2> NOTE: Windows 7 6.1 x86/Oracle Corporation 1.8.0-ea (32-bit)/cpus=2,threads=1,free=172872520,total=283115520
   [junit4]   2> NOTE: All tests run in this JVM: [TestShardHandlerFactory, CollectionsAPIDistributedZkTest,
SolrPluginUtilsTest, TestIndexingPerformance, HdfsLockFactoryTest, TestFieldResource, PluginInfoTest,
TestManagedSchema, TestPostingsSolrHighlighter, QueryResultKeyTest, TestFieldTypeCollectionResource,
TestUniqueKeyFieldResource, TestComponentsName, TermsComponentTest, TestFoldingMultitermQuery,
TestLMJelinekMercerSimilarityFactory, TestNoOpRegenerator, IndexSchemaRuntimeFieldTest, FieldMutatingUpdateProcessorTest,
HighlighterConfigTest, TestFieldCollectionResource, TestNRTOpen, SearchHandlerTest, DocumentAnalysisRequestHandlerTest,
TestMaxScoreQueryParser, SchemaVersionSpecificBehaviorTest, CoreContainerCoreInitFailuresTest,
TimeZoneUtilsTest, DirectSolrConnectionTest, SpellPossibilityIteratorTest, JSONWriterTest,
ParsingFieldUpdateProcessorsTest, TestJmxIntegration, TestReversedWildcardFilterFactory, AnalysisAfterCoreReloadTest,
TestDefaultSearchFieldResource, UniqFieldsUpdateProcessorFactoryTest, TestIndexSearcher, FileUtilsTest,
TestPHPSerializedResponseWriter, TestSchemaNameResource, PreAnalyzedFieldTest, ResponseLogComponentTest,
ShardSplitTest, TestSerializedLuceneMatchVersion, CircularListTest, StatsComponentTest, OpenCloseCoreStressTest,
TestCloudManagedSchema, SpellingQueryConverterTest, QueryElevationComponentTest, TestJoin,
TermVectorComponentDistributedTest, HdfsBasicDistributedZkTest, TestCoreDiscovery, BlockDirectoryTest,
MultiTermTest, TestJmxMonitoredMap, DOMUtilTest, SpatialFilterTest, TestSolrXmlPersistence,
TestIBSimilarityFactory, TestQuerySenderNoQuery, TestLFUCache, TestAtomicUpdateErrorCases,
TestZkChroot, TestFastOutputStream, TestInfoStreamLogging, SynonymTokenizerTest, TestPerFieldSimilarity,
TestSchemaSimilarityResource, ExternalFileFieldSortTest, HighlighterTest, SpellCheckCollatorTest,
TestLMDirichletSimilarityFactory, DeleteShardTest, CopyFieldTest, DocumentBuilderTest, PeerSyncTest,
TestReload, InfoHandlerTest, OutputWriterTest, TestStressLucene, DirectSolrSpellCheckerTest,
SystemInfoHandlerTest, URLClassifyProcessorTest, TestDFRSimilarityFactory]
   [junit4]   2> NOTE: reproduce with: ant test  -Dtestcase=TestDFRSimilarityFactory -Dtests.seed=499FBACF20EAC99E
-Dtests.slow=true -Dtests.locale=sr_CS -Dtests.timezone=Pacific/Pohnpei -Dtests.file.encoding=US-ASCII
   [junit4] ERROR   0.00s | TestDFRSimilarityFactory (suite) <<<
   [junit4]    > Throwable #1: java.lang.Exception: Suite timeout exceeded (>= 7200000
msec).
   [junit4]    > 	at __randomizedtesting.SeedInfo.seed([499FBACF20EAC99E]:0)
   [junit4] Completed in 7274.83s, 3 tests, 1 error <<< FAILURES!

[...truncated 714 lines...]
BUILD FAILED
C:\Users\JenkinsSlave\workspace\Lucene-Solr-trunk-Windows\build.xml:396: The following error
occurred while executing this line:
C:\Users\JenkinsSlave\workspace\Lucene-Solr-trunk-Windows\build.xml:376: The following error
occurred while executing this line:
C:\Users\JenkinsSlave\workspace\Lucene-Solr-trunk-Windows\build.xml:39: The following error
occurred while executing this line:
C:\Users\JenkinsSlave\workspace\Lucene-Solr-trunk-Windows\solr\build.xml:189: The following
error occurred while executing this line:
C:\Users\JenkinsSlave\workspace\Lucene-Solr-trunk-Windows\solr\common-build.xml:455: The following
error occurred while executing this line:
C:\Users\JenkinsSlave\workspace\Lucene-Solr-trunk-Windows\lucene\common-build.xml:1230: The
following error occurred while executing this line:
C:\Users\JenkinsSlave\workspace\Lucene-Solr-trunk-Windows\lucene\common-build.xml:873: There
were test failures: 324 suites, 1410 tests, 1 suite-level error, 44 ignored (11 assumptions)

Total time: 180 minutes 54 seconds
Build step 'Invoke Ant' marked build as failure
Description set: Java: 32bit/jdk1.8.0-ea-b102 -server -XX:+UseG1GC
Archiving artifacts
Recording test results
Email was triggered for: Failure
Sending email for trigger: Failure



Mime
View raw message