lucene-dev mailing list archives

Site index · List index
Message view « Date » · « Thread »
Top « Date » · « Thread »
From Policeman Jenkins Server <jenk...@thetaphi.de>
Subject [JENKINS] Lucene-Solr-4.x-Linux (32bit/ibm-j9-jdk7) - Build # 8422 - Failure!
Date Sat, 30 Nov 2013 12:50:19 GMT
Build: http://jenkins.thetaphi.de/job/Lucene-Solr-4.x-Linux/8422/
Java: 32bit/ibm-j9-jdk7 -Xjit:exclude={org/apache/lucene/util/fst/FST.pack(IIF)Lorg/apache/lucene/util/fst/FST;}

5 tests failed.
REGRESSION:  org.apache.solr.handler.component.DistributedQueryElevationComponentTest.testDistribSearch

Error Message:
.responseHeader.params.forceElevation!=fl (unordered or missing)

Stack Trace:
junit.framework.AssertionFailedError: .responseHeader.params.forceElevation!=fl (unordered or missing)
	at __randomizedtesting.SeedInfo.seed([CC144FF7C066545C:4DF2C1EFB7393460]:0)
	at junit.framework.Assert.fail(Assert.java:50)
	at org.apache.solr.BaseDistributedSearchTestCase.compareSolrResponses(BaseDistributedSearchTestCase.java:816)
	at org.apache.solr.BaseDistributedSearchTestCase.compareResponses(BaseDistributedSearchTestCase.java:835)
	at org.apache.solr.BaseDistributedSearchTestCase.query(BaseDistributedSearchTestCase.java:538)
	at org.apache.solr.BaseDistributedSearchTestCase.query(BaseDistributedSearchTestCase.java:515)
	at org.apache.solr.handler.component.DistributedQueryElevationComponentTest.doTest(DistributedQueryElevationComponentTest.java:83)
	at org.apache.solr.BaseDistributedSearchTestCase.testDistribSearch(BaseDistributedSearchTestCase.java:843)
	at sun.reflect.NativeMethodAccessorImpl.invoke0(Native Method)
	at sun.reflect.NativeMethodAccessorImpl.invoke(NativeMethodAccessorImpl.java:88)
	at sun.reflect.DelegatingMethodAccessorImpl.invoke(DelegatingMethodAccessorImpl.java:55)
	at java.lang.reflect.Method.invoke(Method.java:613)
	at com.carrotsearch.randomizedtesting.RandomizedRunner.invoke(RandomizedRunner.java:1559)
	at com.carrotsearch.randomizedtesting.RandomizedRunner.access$600(RandomizedRunner.java:79)
	at com.carrotsearch.randomizedtesting.RandomizedRunner$6.evaluate(RandomizedRunner.java:737)
	at com.carrotsearch.randomizedtesting.RandomizedRunner$7.evaluate(RandomizedRunner.java:773)
	at com.carrotsearch.randomizedtesting.RandomizedRunner$8.evaluate(RandomizedRunner.java:787)
	at com.carrotsearch.randomizedtesting.rules.SystemPropertiesRestoreRule$1.evaluate(SystemPropertiesRestoreRule.java:53)
	at org.apache.lucene.util.TestRuleSetupTeardownChained$1.evaluate(TestRuleSetupTeardownChained.java:50)
	at org.apache.lucene.util.TestRuleFieldCacheSanity$1.evaluate(TestRuleFieldCacheSanity.java:51)
	at org.apache.lucene.util.AbstractBeforeAfterRule$1.evaluate(AbstractBeforeAfterRule.java:46)
	at com.carrotsearch.randomizedtesting.rules.SystemPropertiesInvariantRule$1.evaluate(SystemPropertiesInvariantRule.java:55)
	at org.apache.lucene.util.TestRuleThreadAndTestName$1.evaluate(TestRuleThreadAndTestName.java:49)
	at org.apache.lucene.util.TestRuleIgnoreAfterMaxFailures$1.evaluate(TestRuleIgnoreAfterMaxFailures.java:70)
	at org.apache.lucene.util.TestRuleMarkFailure$1.evaluate(TestRuleMarkFailure.java:48)
	at com.carrotsearch.randomizedtesting.rules.StatementAdapter.evaluate(StatementAdapter.java:36)
	at com.carrotsearch.randomizedtesting.ThreadLeakControl$StatementRunner.run(ThreadLeakControl.java:358)
	at com.carrotsearch.randomizedtesting.ThreadLeakControl.forkTimeoutingTask(ThreadLeakControl.java:782)
	at com.carrotsearch.randomizedtesting.ThreadLeakControl$3.evaluate(ThreadLeakControl.java:442)
	at com.carrotsearch.randomizedtesting.RandomizedRunner.runSingleTest(RandomizedRunner.java:746)
	at com.carrotsearch.randomizedtesting.RandomizedRunner$3.evaluate(RandomizedRunner.java:648)
	at com.carrotsearch.randomizedtesting.RandomizedRunner$4.evaluate(RandomizedRunner.java:682)
	at com.carrotsearch.randomizedtesting.RandomizedRunner$5.evaluate(RandomizedRunner.java:693)
	at com.carrotsearch.randomizedtesting.rules.StatementAdapter.evaluate(StatementAdapter.java:36)
	at com.carrotsearch.randomizedtesting.rules.SystemPropertiesRestoreRule$1.evaluate(SystemPropertiesRestoreRule.java:53)
	at org.apache.lucene.util.AbstractBeforeAfterRule$1.evaluate(AbstractBeforeAfterRule.java:46)
	at org.apache.lucene.util.TestRuleStoreClassName$1.evaluate(TestRuleStoreClassName.java:42)
	at com.carrotsearch.randomizedtesting.rules.SystemPropertiesInvariantRule$1.evaluate(SystemPropertiesInvariantRule.java:55)
	at com.carrotsearch.randomizedtesting.rules.NoShadowingOrOverridesOnMethodsRule$1.evaluate(NoShadowingOrOverridesOnMethodsRule.java:39)
	at com.carrotsearch.randomizedtesting.rules.NoShadowingOrOverridesOnMethodsRule$1.evaluate(NoShadowingOrOverridesOnMethodsRule.java:39)
	at com.carrotsearch.randomizedtesting.rules.StatementAdapter.evaluate(StatementAdapter.java:36)
	at org.apache.lucene.util.TestRuleAssertionsRequired$1.evaluate(TestRuleAssertionsRequired.java:43)
	at org.apache.lucene.util.TestRuleMarkFailure$1.evaluate(TestRuleMarkFailure.java:48)
	at org.apache.lucene.util.TestRuleIgnoreAfterMaxFailures$1.evaluate(TestRuleIgnoreAfterMaxFailures.java:70)
	at org.apache.lucene.util.TestRuleIgnoreTestSuites$1.evaluate(TestRuleIgnoreTestSuites.java:55)
	at com.carrotsearch.randomizedtesting.rules.StatementAdapter.evaluate(StatementAdapter.java:36)
	at com.carrotsearch.randomizedtesting.ThreadLeakControl$StatementRunner.run(ThreadLeakControl.java:358)
	at java.lang.Thread.run(Thread.java:780)


REGRESSION:  org.apache.solr.handler.component.TermVectorComponentDistributedTest.testDistribSearch

Error Message:
.termVectors.0.test_offtv!=test_postv (unordered or missing)

Stack Trace:
junit.framework.AssertionFailedError: .termVectors.0.test_offtv!=test_postv (unordered or missing)
	at __randomizedtesting.SeedInfo.seed([CC144FF7C066545C:4DF2C1EFB7393460]:0)
	at junit.framework.Assert.fail(Assert.java:50)
	at org.apache.solr.BaseDistributedSearchTestCase.compareSolrResponses(BaseDistributedSearchTestCase.java:816)
	at org.apache.solr.BaseDistributedSearchTestCase.compareResponses(BaseDistributedSearchTestCase.java:835)
	at org.apache.solr.BaseDistributedSearchTestCase.query(BaseDistributedSearchTestCase.java:538)
	at org.apache.solr.BaseDistributedSearchTestCase.query(BaseDistributedSearchTestCase.java:515)
	at org.apache.solr.handler.component.TermVectorComponentDistributedTest.doTest(TermVectorComponentDistributedTest.java:195)
	at org.apache.solr.BaseDistributedSearchTestCase.testDistribSearch(BaseDistributedSearchTestCase.java:849)
	at sun.reflect.NativeMethodAccessorImpl.invoke0(Native Method)
	at sun.reflect.NativeMethodAccessorImpl.invoke(NativeMethodAccessorImpl.java:88)
	at sun.reflect.DelegatingMethodAccessorImpl.invoke(DelegatingMethodAccessorImpl.java:55)
	at java.lang.reflect.Method.invoke(Method.java:613)
	at com.carrotsearch.randomizedtesting.RandomizedRunner.invoke(RandomizedRunner.java:1559)
	at com.carrotsearch.randomizedtesting.RandomizedRunner.access$600(RandomizedRunner.java:79)
	at com.carrotsearch.randomizedtesting.RandomizedRunner$6.evaluate(RandomizedRunner.java:737)
	at com.carrotsearch.randomizedtesting.RandomizedRunner$7.evaluate(RandomizedRunner.java:773)
	at com.carrotsearch.randomizedtesting.RandomizedRunner$8.evaluate(RandomizedRunner.java:787)
	at com.carrotsearch.randomizedtesting.rules.SystemPropertiesRestoreRule$1.evaluate(SystemPropertiesRestoreRule.java:53)
	at org.apache.lucene.util.TestRuleSetupTeardownChained$1.evaluate(TestRuleSetupTeardownChained.java:50)
	at org.apache.lucene.util.TestRuleFieldCacheSanity$1.evaluate(TestRuleFieldCacheSanity.java:51)
	at org.apache.lucene.util.AbstractBeforeAfterRule$1.evaluate(AbstractBeforeAfterRule.java:46)
	at com.carrotsearch.randomizedtesting.rules.SystemPropertiesInvariantRule$1.evaluate(SystemPropertiesInvariantRule.java:55)
	at org.apache.lucene.util.TestRuleThreadAndTestName$1.evaluate(TestRuleThreadAndTestName.java:49)
	at org.apache.lucene.util.TestRuleIgnoreAfterMaxFailures$1.evaluate(TestRuleIgnoreAfterMaxFailures.java:70)
	at org.apache.lucene.util.TestRuleMarkFailure$1.evaluate(TestRuleMarkFailure.java:48)
	at com.carrotsearch.randomizedtesting.rules.StatementAdapter.evaluate(StatementAdapter.java:36)
	at com.carrotsearch.randomizedtesting.ThreadLeakControl$StatementRunner.run(ThreadLeakControl.java:358)
	at com.carrotsearch.randomizedtesting.ThreadLeakControl.forkTimeoutingTask(ThreadLeakControl.java:782)
	at com.carrotsearch.randomizedtesting.ThreadLeakControl$3.evaluate(ThreadLeakControl.java:442)
	at com.carrotsearch.randomizedtesting.RandomizedRunner.runSingleTest(RandomizedRunner.java:746)
	at com.carrotsearch.randomizedtesting.RandomizedRunner$3.evaluate(RandomizedRunner.java:648)
	at com.carrotsearch.randomizedtesting.RandomizedRunner$4.evaluate(RandomizedRunner.java:682)
	at com.carrotsearch.randomizedtesting.RandomizedRunner$5.evaluate(RandomizedRunner.java:693)
	at com.carrotsearch.randomizedtesting.rules.StatementAdapter.evaluate(StatementAdapter.java:36)
	at com.carrotsearch.randomizedtesting.rules.SystemPropertiesRestoreRule$1.evaluate(SystemPropertiesRestoreRule.java:53)
	at org.apache.lucene.util.AbstractBeforeAfterRule$1.evaluate(AbstractBeforeAfterRule.java:46)
	at org.apache.lucene.util.TestRuleStoreClassName$1.evaluate(TestRuleStoreClassName.java:42)
	at com.carrotsearch.randomizedtesting.rules.SystemPropertiesInvariantRule$1.evaluate(SystemPropertiesInvariantRule.java:55)
	at com.carrotsearch.randomizedtesting.rules.NoShadowingOrOverridesOnMethodsRule$1.evaluate(NoShadowingOrOverridesOnMethodsRule.java:39)
	at com.carrotsearch.randomizedtesting.rules.NoShadowingOrOverridesOnMethodsRule$1.evaluate(NoShadowingOrOverridesOnMethodsRule.java:39)
	at com.carrotsearch.randomizedtesting.rules.StatementAdapter.evaluate(StatementAdapter.java:36)
	at org.apache.lucene.util.TestRuleAssertionsRequired$1.evaluate(TestRuleAssertionsRequired.java:43)
	at org.apache.lucene.util.TestRuleMarkFailure$1.evaluate(TestRuleMarkFailure.java:48)
	at org.apache.lucene.util.TestRuleIgnoreAfterMaxFailures$1.evaluate(TestRuleIgnoreAfterMaxFailures.java:70)
	at org.apache.lucene.util.TestRuleIgnoreTestSuites$1.evaluate(TestRuleIgnoreTestSuites.java:55)
	at com.carrotsearch.randomizedtesting.rules.StatementAdapter.evaluate(StatementAdapter.java:36)
	at com.carrotsearch.randomizedtesting.ThreadLeakControl$StatementRunner.run(ThreadLeakControl.java:358)
	at java.lang.Thread.run(Thread.java:780)


REGRESSION:  org.apache.solr.update.HardAutoCommitTest.testCommitWithin

Error Message:
Exception during query

Stack Trace:
java.lang.RuntimeException: Exception during query
	at __randomizedtesting.SeedInfo.seed([CC144FF7C066545C:76C6208F4348BA49]:0)
	at org.apache.solr.SolrTestCaseJ4.assertQ(SolrTestCaseJ4.java:641)
	at org.apache.solr.update.HardAutoCommitTest.testCommitWithin(HardAutoCommitTest.java:79)
	at sun.reflect.NativeMethodAccessorImpl.invoke0(Native Method)
	at sun.reflect.NativeMethodAccessorImpl.invoke(NativeMethodAccessorImpl.java:88)
	at sun.reflect.DelegatingMethodAccessorImpl.invoke(DelegatingMethodAccessorImpl.java:55)
	at java.lang.reflect.Method.invoke(Method.java:613)
	at com.carrotsearch.randomizedtesting.RandomizedRunner.invoke(RandomizedRunner.java:1559)
	at com.carrotsearch.randomizedtesting.RandomizedRunner.access$600(RandomizedRunner.java:79)
	at com.carrotsearch.randomizedtesting.RandomizedRunner$6.evaluate(RandomizedRunner.java:737)
	at com.carrotsearch.randomizedtesting.RandomizedRunner$7.evaluate(RandomizedRunner.java:773)
	at com.carrotsearch.randomizedtesting.RandomizedRunner$8.evaluate(RandomizedRunner.java:787)
	at com.carrotsearch.randomizedtesting.rules.SystemPropertiesRestoreRule$1.evaluate(SystemPropertiesRestoreRule.java:53)
	at org.apache.lucene.util.TestRuleSetupTeardownChained$1.evaluate(TestRuleSetupTeardownChained.java:50)
	at org.apache.lucene.util.TestRuleFieldCacheSanity$1.evaluate(TestRuleFieldCacheSanity.java:51)
	at org.apache.lucene.util.AbstractBeforeAfterRule$1.evaluate(AbstractBeforeAfterRule.java:46)
	at com.carrotsearch.randomizedtesting.rules.SystemPropertiesInvariantRule$1.evaluate(SystemPropertiesInvariantRule.java:55)
	at org.apache.lucene.util.TestRuleThreadAndTestName$1.evaluate(TestRuleThreadAndTestName.java:49)
	at org.apache.lucene.util.TestRuleIgnoreAfterMaxFailures$1.evaluate(TestRuleIgnoreAfterMaxFailures.java:70)
	at org.apache.lucene.util.TestRuleMarkFailure$1.evaluate(TestRuleMarkFailure.java:48)
	at com.carrotsearch.randomizedtesting.rules.StatementAdapter.evaluate(StatementAdapter.java:36)
	at com.carrotsearch.randomizedtesting.ThreadLeakControl$StatementRunner.run(ThreadLeakControl.java:358)
	at com.carrotsearch.randomizedtesting.ThreadLeakControl.forkTimeoutingTask(ThreadLeakControl.java:782)
	at com.carrotsearch.randomizedtesting.ThreadLeakControl$3.evaluate(ThreadLeakControl.java:442)
	at com.carrotsearch.randomizedtesting.RandomizedRunner.runSingleTest(RandomizedRunner.java:746)
	at com.carrotsearch.randomizedtesting.RandomizedRunner$3.evaluate(RandomizedRunner.java:648)
	at com.carrotsearch.randomizedtesting.RandomizedRunner$4.evaluate(RandomizedRunner.java:682)
	at com.carrotsearch.randomizedtesting.RandomizedRunner$5.evaluate(RandomizedRunner.java:693)
	at com.carrotsearch.randomizedtesting.rules.StatementAdapter.evaluate(StatementAdapter.java:36)
	at com.carrotsearch.randomizedtesting.rules.SystemPropertiesRestoreRule$1.evaluate(SystemPropertiesRestoreRule.java:53)
	at org.apache.lucene.util.AbstractBeforeAfterRule$1.evaluate(AbstractBeforeAfterRule.java:46)
	at org.apache.lucene.util.TestRuleStoreClassName$1.evaluate(TestRuleStoreClassName.java:42)
	at com.carrotsearch.randomizedtesting.rules.SystemPropertiesInvariantRule$1.evaluate(SystemPropertiesInvariantRule.java:55)
	at com.carrotsearch.randomizedtesting.rules.NoShadowingOrOverridesOnMethodsRule$1.evaluate(NoShadowingOrOverridesOnMethodsRule.java:39)
	at com.carrotsearch.randomizedtesting.rules.NoShadowingOrOverridesOnMethodsRule$1.evaluate(NoShadowingOrOverridesOnMethodsRule.java:39)
	at com.carrotsearch.randomizedtesting.rules.StatementAdapter.evaluate(StatementAdapter.java:36)
	at org.apache.lucene.util.TestRuleAssertionsRequired$1.evaluate(TestRuleAssertionsRequired.java:43)
	at org.apache.lucene.util.TestRuleMarkFailure$1.evaluate(TestRuleMarkFailure.java:48)
	at org.apache.lucene.util.TestRuleIgnoreAfterMaxFailures$1.evaluate(TestRuleIgnoreAfterMaxFailures.java:70)
	at org.apache.lucene.util.TestRuleIgnoreTestSuites$1.evaluate(TestRuleIgnoreTestSuites.java:55)
	at com.carrotsearch.randomizedtesting.rules.StatementAdapter.evaluate(StatementAdapter.java:36)
	at com.carrotsearch.randomizedtesting.ThreadLeakControl$StatementRunner.run(ThreadLeakControl.java:358)
	at java.lang.Thread.run(Thread.java:780)
Caused by: java.lang.RuntimeException: REQUEST FAILED: xpath=//result[@numFound=0]
	xml response was: <?xml version="1.0" encoding="UTF-8"?>
<response>
<lst name="responseHeader"><int name="status">0</int><int name="QTime">2590</int></lst><result name="response" numFound="1" start="0"><doc><int name="id">529</int><int name="range_facet_si">529</int><arr name="range_facet_l"><long>529</long></arr><arr name="range_facet_sl"><long>529</long></arr><arr name="field_t"><str>what's inside?</str></arr><arr name="subject"><str>info</str></arr><long name="_version_">1453132731426799616</long><int name="intDefault">42</int><date name="timestamp">2013-11-30T12:42:44.292Z</date><arr name="multiDefault"><str>muLti-Default</str></arr></doc></result>
</response>

	request was:q=id:529&start=0&version=2.2&rows=20&qt=standard
	at org.apache.solr.SolrTestCaseJ4.assertQ(SolrTestCaseJ4.java:634)
	... 41 more


REGRESSION:  org.apache.solr.update.processor.SignatureUpdateProcessorFactoryTest.testDupeDetection

Error Message:
expected:<1> but was:<3>

Stack Trace:
java.lang.AssertionError: expected:<1> but was:<3>
	at __randomizedtesting.SeedInfo.seed([CC144FF7C066545C:9724B43FC321F720]:0)
	at org.junit.Assert.fail(Assert.java:93)
	at org.junit.Assert.failNotEquals(Assert.java:647)
	at org.junit.Assert.assertEquals(Assert.java:128)
	at org.junit.Assert.assertEquals(Assert.java:472)
	at org.junit.Assert.assertEquals(Assert.java:456)
	at org.apache.solr.update.processor.SignatureUpdateProcessorFactoryTest.checkNumDocs(SignatureUpdateProcessorFactoryTest.java:71)
	at org.apache.solr.update.processor.SignatureUpdateProcessorFactoryTest.testDupeDetection(SignatureUpdateProcessorFactoryTest.java:119)
	at sun.reflect.NativeMethodAccessorImpl.invoke0(Native Method)
	at sun.reflect.NativeMethodAccessorImpl.invoke(NativeMethodAccessorImpl.java:88)
	at sun.reflect.DelegatingMethodAccessorImpl.invoke(DelegatingMethodAccessorImpl.java:55)
	at java.lang.reflect.Method.invoke(Method.java:613)
	at com.carrotsearch.randomizedtesting.RandomizedRunner.invoke(RandomizedRunner.java:1559)
	at com.carrotsearch.randomizedtesting.RandomizedRunner.access$600(RandomizedRunner.java:79)
	at com.carrotsearch.randomizedtesting.RandomizedRunner$6.evaluate(RandomizedRunner.java:737)
	at com.carrotsearch.randomizedtesting.RandomizedRunner$7.evaluate(RandomizedRunner.java:773)
	at com.carrotsearch.randomizedtesting.RandomizedRunner$8.evaluate(RandomizedRunner.java:787)
	at com.carrotsearch.randomizedtesting.rules.SystemPropertiesRestoreRule$1.evaluate(SystemPropertiesRestoreRule.java:53)
	at org.apache.lucene.util.TestRuleSetupTeardownChained$1.evaluate(TestRuleSetupTeardownChained.java:50)
	at org.apache.lucene.util.TestRuleFieldCacheSanity$1.evaluate(TestRuleFieldCacheSanity.java:51)
	at org.apache.lucene.util.AbstractBeforeAfterRule$1.evaluate(AbstractBeforeAfterRule.java:46)
	at com.carrotsearch.randomizedtesting.rules.SystemPropertiesInvariantRule$1.evaluate(SystemPropertiesInvariantRule.java:55)
	at org.apache.lucene.util.TestRuleThreadAndTestName$1.evaluate(TestRuleThreadAndTestName.java:49)
	at org.apache.lucene.util.TestRuleIgnoreAfterMaxFailures$1.evaluate(TestRuleIgnoreAfterMaxFailures.java:70)
	at org.apache.lucene.util.TestRuleMarkFailure$1.evaluate(TestRuleMarkFailure.java:48)
	at com.carrotsearch.randomizedtesting.rules.StatementAdapter.evaluate(StatementAdapter.java:36)
	at com.carrotsearch.randomizedtesting.ThreadLeakControl$StatementRunner.run(ThreadLeakControl.java:358)
	at com.carrotsearch.randomizedtesting.ThreadLeakControl.forkTimeoutingTask(ThreadLeakControl.java:782)
	at com.carrotsearch.randomizedtesting.ThreadLeakControl$3.evaluate(ThreadLeakControl.java:442)
	at com.carrotsearch.randomizedtesting.RandomizedRunner.runSingleTest(RandomizedRunner.java:746)
	at com.carrotsearch.randomizedtesting.RandomizedRunner$3.evaluate(RandomizedRunner.java:648)
	at com.carrotsearch.randomizedtesting.RandomizedRunner$4.evaluate(RandomizedRunner.java:682)
	at com.carrotsearch.randomizedtesting.RandomizedRunner$5.evaluate(RandomizedRunner.java:693)
	at com.carrotsearch.randomizedtesting.rules.StatementAdapter.evaluate(StatementAdapter.java:36)
	at com.carrotsearch.randomizedtesting.rules.SystemPropertiesRestoreRule$1.evaluate(SystemPropertiesRestoreRule.java:53)
	at org.apache.lucene.util.AbstractBeforeAfterRule$1.evaluate(AbstractBeforeAfterRule.java:46)
	at org.apache.lucene.util.TestRuleStoreClassName$1.evaluate(TestRuleStoreClassName.java:42)
	at com.carrotsearch.randomizedtesting.rules.SystemPropertiesInvariantRule$1.evaluate(SystemPropertiesInvariantRule.java:55)
	at com.carrotsearch.randomizedtesting.rules.NoShadowingOrOverridesOnMethodsRule$1.evaluate(NoShadowingOrOverridesOnMethodsRule.java:39)
	at com.carrotsearch.randomizedtesting.rules.NoShadowingOrOverridesOnMethodsRule$1.evaluate(NoShadowingOrOverridesOnMethodsRule.java:39)
	at com.carrotsearch.randomizedtesting.rules.StatementAdapter.evaluate(StatementAdapter.java:36)
	at org.apache.lucene.util.TestRuleAssertionsRequired$1.evaluate(TestRuleAssertionsRequired.java:43)
	at org.apache.lucene.util.TestRuleMarkFailure$1.evaluate(TestRuleMarkFailure.java:48)
	at org.apache.lucene.util.TestRuleIgnoreAfterMaxFailures$1.evaluate(TestRuleIgnoreAfterMaxFailures.java:70)
	at org.apache.lucene.util.TestRuleIgnoreTestSuites$1.evaluate(TestRuleIgnoreTestSuites.java:55)
	at com.carrotsearch.randomizedtesting.rules.StatementAdapter.evaluate(StatementAdapter.java:36)
	at com.carrotsearch.randomizedtesting.ThreadLeakControl$StatementRunner.run(ThreadLeakControl.java:358)
	at java.lang.Thread.run(Thread.java:780)


REGRESSION:  org.apache.solr.update.processor.SignatureUpdateProcessorFactoryTest.testMultiThreaded

Error Message:
expected:<1> but was:<2>

Stack Trace:
java.lang.AssertionError: expected:<1> but was:<2>
	at __randomizedtesting.SeedInfo.seed([CC144FF7C066545C:AD81951728B75EAA]:0)
	at org.junit.Assert.fail(Assert.java:93)
	at org.junit.Assert.failNotEquals(Assert.java:647)
	at org.junit.Assert.assertEquals(Assert.java:128)
	at org.junit.Assert.assertEquals(Assert.java:472)
	at org.junit.Assert.assertEquals(Assert.java:456)
	at org.apache.solr.update.processor.SignatureUpdateProcessorFactoryTest.checkNumDocs(SignatureUpdateProcessorFactoryTest.java:71)
	at org.apache.solr.update.processor.SignatureUpdateProcessorFactoryTest.testMultiThreaded(SignatureUpdateProcessorFactoryTest.java:222)
	at sun.reflect.NativeMethodAccessorImpl.invoke0(Native Method)
	at sun.reflect.NativeMethodAccessorImpl.invoke(NativeMethodAccessorImpl.java:88)
	at sun.reflect.DelegatingMethodAccessorImpl.invoke(DelegatingMethodAccessorImpl.java:55)
	at java.lang.reflect.Method.invoke(Method.java:613)
	at com.carrotsearch.randomizedtesting.RandomizedRunner.invoke(RandomizedRunner.java:1559)
	at com.carrotsearch.randomizedtesting.RandomizedRunner.access$600(RandomizedRunner.java:79)
	at com.carrotsearch.randomizedtesting.RandomizedRunner$6.evaluate(RandomizedRunner.java:737)
	at com.carrotsearch.randomizedtesting.RandomizedRunner$7.evaluate(RandomizedRunner.java:773)
	at com.carrotsearch.randomizedtesting.RandomizedRunner$8.evaluate(RandomizedRunner.java:787)
	at com.carrotsearch.randomizedtesting.rules.SystemPropertiesRestoreRule$1.evaluate(SystemPropertiesRestoreRule.java:53)
	at org.apache.lucene.util.TestRuleSetupTeardownChained$1.evaluate(TestRuleSetupTeardownChained.java:50)
	at org.apache.lucene.util.TestRuleFieldCacheSanity$1.evaluate(TestRuleFieldCacheSanity.java:51)
	at org.apache.lucene.util.AbstractBeforeAfterRule$1.evaluate(AbstractBeforeAfterRule.java:46)
	at com.carrotsearch.randomizedtesting.rules.SystemPropertiesInvariantRule$1.evaluate(SystemPropertiesInvariantRule.java:55)
	at org.apache.lucene.util.TestRuleThreadAndTestName$1.evaluate(TestRuleThreadAndTestName.java:49)
	at org.apache.lucene.util.TestRuleIgnoreAfterMaxFailures$1.evaluate(TestRuleIgnoreAfterMaxFailures.java:70)
	at org.apache.lucene.util.TestRuleMarkFailure$1.evaluate(TestRuleMarkFailure.java:48)
	at com.carrotsearch.randomizedtesting.rules.StatementAdapter.evaluate(StatementAdapter.java:36)
	at com.carrotsearch.randomizedtesting.ThreadLeakControl$StatementRunner.run(ThreadLeakControl.java:358)
	at com.carrotsearch.randomizedtesting.ThreadLeakControl.forkTimeoutingTask(ThreadLeakControl.java:782)
	at com.carrotsearch.randomizedtesting.ThreadLeakControl$3.evaluate(ThreadLeakControl.java:442)
	at com.carrotsearch.randomizedtesting.RandomizedRunner.runSingleTest(RandomizedRunner.java:746)
	at com.carrotsearch.randomizedtesting.RandomizedRunner$3.evaluate(RandomizedRunner.java:648)
	at com.carrotsearch.randomizedtesting.RandomizedRunner$4.evaluate(RandomizedRunner.java:682)
	at com.carrotsearch.randomizedtesting.RandomizedRunner$5.evaluate(RandomizedRunner.java:693)
	at com.carrotsearch.randomizedtesting.rules.StatementAdapter.evaluate(StatementAdapter.java:36)
	at com.carrotsearch.randomizedtesting.rules.SystemPropertiesRestoreRule$1.evaluate(SystemPropertiesRestoreRule.java:53)
	at org.apache.lucene.util.AbstractBeforeAfterRule$1.evaluate(AbstractBeforeAfterRule.java:46)
	at org.apache.lucene.util.TestRuleStoreClassName$1.evaluate(TestRuleStoreClassName.java:42)
	at com.carrotsearch.randomizedtesting.rules.SystemPropertiesInvariantRule$1.evaluate(SystemPropertiesInvariantRule.java:55)
	at com.carrotsearch.randomizedtesting.rules.NoShadowingOrOverridesOnMethodsRule$1.evaluate(NoShadowingOrOverridesOnMethodsRule.java:39)
	at com.carrotsearch.randomizedtesting.rules.NoShadowingOrOverridesOnMethodsRule$1.evaluate(NoShadowingOrOverridesOnMethodsRule.java:39)
	at com.carrotsearch.randomizedtesting.rules.StatementAdapter.evaluate(StatementAdapter.java:36)
	at org.apache.lucene.util.TestRuleAssertionsRequired$1.evaluate(TestRuleAssertionsRequired.java:43)
	at org.apache.lucene.util.TestRuleMarkFailure$1.evaluate(TestRuleMarkFailure.java:48)
	at org.apache.lucene.util.TestRuleIgnoreAfterMaxFailures$1.evaluate(TestRuleIgnoreAfterMaxFailures.java:70)
	at org.apache.lucene.util.TestRuleIgnoreTestSuites$1.evaluate(TestRuleIgnoreTestSuites.java:55)
	at com.carrotsearch.randomizedtesting.rules.StatementAdapter.evaluate(StatementAdapter.java:36)
	at com.carrotsearch.randomizedtesting.ThreadLeakControl$StatementRunner.run(ThreadLeakControl.java:358)
	at java.lang.Thread.run(Thread.java:780)




Build Log:
[...truncated 10655 lines...]
   [junit4] Suite: org.apache.solr.handler.component.TermVectorComponentDistributedTest
   [junit4]   2> 1157525 T3541 oas.BaseDistributedSearchTestCase.initHostContext Setting hostContext system property: /gi_zb/
   [junit4]   2> 1157528 T3541 oas.SolrTestCaseJ4.setUp ###Starting testDistribSearch
   [junit4]   2> 1157529 T3541 oejs.Server.doStart jetty-8.1.10.v20130312
   [junit4]   2> 1157534 T3541 oejs.AbstractConnector.doStart Started SelectChannelConnector@127.0.0.1:53043
   [junit4]   2> 1157535 T3541 oass.SolrDispatchFilter.init SolrDispatchFilter.init()
   [junit4]   2> 1157535 T3541 oasc.SolrResourceLoader.locateSolrHome JNDI not configured for solr (NoInitialContextEx)
   [junit4]   2> 1157536 T3541 oasc.SolrResourceLoader.locateSolrHome using system property solr.solr.home: /mnt/ssd/jenkins/workspace/Lucene-Solr-4.x-Linux/solr/build/solr-core/test-files/solr
   [junit4]   2> 1157537 T3541 oasc.SolrResourceLoader.<init> new SolrResourceLoader for directory: '/mnt/ssd/jenkins/workspace/Lucene-Solr-4.x-Linux/solr/build/solr-core/test-files/solr/'
   [junit4]   2> 1157544 T3541 oasc.ConfigSolr.fromFile Loading container configuration from /mnt/ssd/jenkins/workspace/Lucene-Solr-4.x-Linux/solr/build/solr-core/test-files/solr/solr.xml
   [junit4]   2> 1157576 T3541 oasc.CoreContainer.<init> New CoreContainer -1594354794
   [junit4]   2> 1157577 T3541 oasc.CoreContainer.load Loading cores into CoreContainer [instanceDir=/mnt/ssd/jenkins/workspace/Lucene-Solr-4.x-Linux/solr/build/solr-core/test-files/solr/]
   [junit4]   2> 1157578 T3541 oashc.HttpShardHandlerFactory.getParameter Setting socketTimeout to: 90000
   [junit4]   2> 1157578 T3541 oashc.HttpShardHandlerFactory.getParameter Setting urlScheme to: http://
   [junit4]   2> 1157579 T3541 oashc.HttpShardHandlerFactory.getParameter Setting connTimeout to: 15000
   [junit4]   2> 1157580 T3541 oashc.HttpShardHandlerFactory.getParameter Setting maxConnectionsPerHost to: 20
   [junit4]   2> 1157580 T3541 oashc.HttpShardHandlerFactory.getParameter Setting corePoolSize to: 0
   [junit4]   2> 1157581 T3541 oashc.HttpShardHandlerFactory.getParameter Setting maximumPoolSize to: 2147483647
   [junit4]   2> 1157581 T3541 oashc.HttpShardHandlerFactory.getParameter Setting maxThreadIdleTime to: 5
   [junit4]   2> 1157582 T3541 oashc.HttpShardHandlerFactory.getParameter Setting sizeOfQueue to: -1
   [junit4]   2> 1157583 T3541 oashc.HttpShardHandlerFactory.getParameter Setting fairnessPolicy to: false
   [junit4]   2> 1157586 T3541 oasl.LogWatcher.createWatcher SLF4J impl is org.slf4j.impl.Log4jLoggerFactory
   [junit4]   2> 1157587 T3541 oasl.LogWatcher.newRegisteredLogWatcher Registering Log Listener [Log4j (org.slf4j.impl.Log4jLoggerFactory)]
   [junit4]   2> 1157588 T3541 oasc.CoreContainer.load Host Name: 127.0.0.1
   [junit4]   2> 1157591 T3551 oasc.CoreContainer.create Creating SolrCore 'collection1' using instanceDir: /mnt/ssd/jenkins/workspace/Lucene-Solr-4.x-Linux/solr/build/solr-core/test-files/solr/collection1
   [junit4]   2> 1157592 T3551 oasc.SolrResourceLoader.<init> new SolrResourceLoader for directory: '/mnt/ssd/jenkins/workspace/Lucene-Solr-4.x-Linux/solr/build/solr-core/test-files/solr/collection1/'
   [junit4]   2> 1157592 T3551 oasc.SolrResourceLoader.replaceClassLoader Adding 'file:/mnt/ssd/jenkins/workspace/Lucene-Solr-4.x-Linux/solr/build/solr-core/test-files/solr/collection1/lib/classes/' to classloader
   [junit4]   2> 1157593 T3551 oasc.SolrResourceLoader.replaceClassLoader Adding 'file:/mnt/ssd/jenkins/workspace/Lucene-Solr-4.x-Linux/solr/build/solr-core/test-files/solr/collection1/lib/README' to classloader
   [junit4]   2> 1157642 T3551 oasc.SolrConfig.<init> Using Lucene MatchVersion: LUCENE_47
   [junit4]   2> 1157708 T3551 oasc.SolrConfig.<init> Loaded SolrConfig: solrconfig.xml
   [junit4]   2> 1157709 T3551 oass.IndexSchema.readSchema Reading Solr Schema from schema.xml
   [junit4]   2> 1157718 T3551 oass.IndexSchema.readSchema [collection1] Schema name=test
   [junit4]   2> 1158081 T3551 oass.ByteField.init WARN ByteField is deprecated and will be removed in 5.0. You should use TrieIntField instead.
   [junit4]   2> 1158081 T3551 oass.ShortField.init WARN ShortField is deprecated and will be removed in 5.0. You should use TrieIntField instead.
   [junit4]   2> 1158082 T3551 oass.OpenExchangeRatesOrgProvider.init Initialized with rates=open-exchange-rates.json, refreshInterval=1440.
   [junit4]   2> 1158087 T3551 oass.IndexSchema.readSchema default search field in schema is text
   [junit4]   2> 1158089 T3551 oass.IndexSchema.readSchema unique key field: id
   [junit4]   2> 1158094 T3551 oass.FileExchangeRateProvider.reload Reloading exchange rates from file currency.xml
   [junit4]   2> 1158097 T3551 oass.FileExchangeRateProvider.reload Reloading exchange rates from file currency.xml
   [junit4]   2> 1158101 T3551 oass.OpenExchangeRatesOrgProvider.reload Reloading exchange rates from open-exchange-rates.json
   [junit4]   2> 1158101 T3551 oass.OpenExchangeRatesOrgProvider$OpenExchangeRates.<init> WARN Unknown key IMPORTANT NOTE
   [junit4]   2> 1158102 T3551 oass.OpenExchangeRatesOrgProvider$OpenExchangeRates.<init> WARN Expected key, got STRING
   [junit4]   2> 1158102 T3551 oass.OpenExchangeRatesOrgProvider.reload Reloading exchange rates from open-exchange-rates.json
   [junit4]   2> 1158103 T3551 oass.OpenExchangeRatesOrgProvider$OpenExchangeRates.<init> WARN Unknown key IMPORTANT NOTE
   [junit4]   2> 1158103 T3551 oass.OpenExchangeRatesOrgProvider$OpenExchangeRates.<init> WARN Expected key, got STRING
   [junit4]   2> 1158103 T3551 oasc.SolrCore.initDirectoryFactory org.apache.solr.core.MockDirectoryFactory
   [junit4]   2> 1158104 T3551 oasc.SolrCore.<init> [collection1] Opening new SolrCore at /mnt/ssd/jenkins/workspace/Lucene-Solr-4.x-Linux/solr/build/solr-core/test-files/solr/collection1/, dataDir=./org.apache.solr.handler.component.TermVectorComponentDistributedTest-1385815304631/control/data/
   [junit4]   2> 1158104 T3551 oasc.JmxMonitoredMap.<init> JMX monitoring is enabled. Adding Solr mbeans to JMX Server: com.sun.jmx.mbeanserver.JmxMBeanServer@2e94e28b
   [junit4]   2> 1158105 T3551 oasc.CachingDirectoryFactory.get return new directory for ./org.apache.solr.handler.component.TermVectorComponentDistributedTest-1385815304631/control/data
   [junit4]   2> 1158105 T3551 oasc.SolrCore.getNewIndexDir New index directory detected: old=null new=./org.apache.solr.handler.component.TermVectorComponentDistributedTest-1385815304631/control/data/index/
   [junit4]   2> 1158106 T3551 oasc.SolrCore.initIndex WARN [collection1] Solr index directory './org.apache.solr.handler.component.TermVectorComponentDistributedTest-1385815304631/control/data/index' doesn't exist. Creating new index...
   [junit4]   2> 1158106 T3551 oasc.CachingDirectoryFactory.get return new directory for ./org.apache.solr.handler.component.TermVectorComponentDistributedTest-1385815304631/control/data/index
   [junit4]   2> 1158106 T3551 oasu.RandomMergePolicy.<init> RandomMergePolicy wrapping class org.apache.lucene.index.TieredMergePolicy: [TieredMergePolicy: maxMergeAtOnce=42, maxMergeAtOnceExplicit=17, maxMergedSegmentMB=10.2177734375, floorSegmentMB=2.1064453125, forceMergeDeletesPctAllowed=5.176949531090288, segmentsPerTier=35.0, maxCFSSegmentSizeMB=8.796093022207999E12, noCFSRatio=0.16299913333947041
   [junit4]   2> 1158107 T3551 oasc.SolrDeletionPolicy.onCommit SolrDeletionPolicy.onCommit: commits: num=1
   [junit4]   2> 		commit{dir=RateLimitedDirectoryWrapper(MockDirectoryWrapper(org.apache.lucene.store.RAMDirectory@a758c02b lockFactory=org.apache.lucene.store.SingleInstanceLockFactory@55a78955)),segFN=segments_1,generation=1}
   [junit4]   2> 1158108 T3551 oasc.SolrDeletionPolicy.updateCommits newest commit generation = 1
   [junit4]   2> 1158108 T3551 oasc.SolrCore.initWriters created xml: solr.XMLResponseWriter
   [junit4]   2> 1158110 T3551 oasup.UpdateRequestProcessorChain.init creating updateRequestProcessorChain "dedupe"
   [junit4]   2> 1158111 T3551 oasup.UpdateRequestProcessorChain.init inserting DistributedUpdateProcessorFactory into updateRequestProcessorChain "dedupe"
   [junit4]   2> 1158111 T3551 oasup.UpdateRequestProcessorChain.init creating updateRequestProcessorChain "dedupe-allfields"
   [junit4]   2> 1158111 T3551 oasup.UpdateRequestProcessorChain.init inserting DistributedUpdateProcessorFactory into updateRequestProcessorChain "dedupe-allfields"
   [junit4]   2> 1158112 T3551 oasup.UpdateRequestProcessorChain.init creating updateRequestProcessorChain "stored_sig"
   [junit4]   2> 1158112 T3551 oasup.UpdateRequestProcessorChain.init inserting DistributedUpdateProcessorFactory into updateRequestProcessorChain "stored_sig"
   [junit4]   2> 1158112 T3551 oasup.UpdateRequestProcessorChain.init creating updateRequestProcessorChain "uniq-fields"
   [junit4]   2> 1158113 T3551 oasup.UniqFieldsUpdateProcessorFactory.init WARN Use of the 'fields' init param in UniqFieldsUpdateProcessorFactory is deprecated, please use 'fieldName' (or another FieldMutatingUpdateProcessorFactory selector option) instead
   [junit4]   2> 1158113 T3551 oasup.UniqFieldsUpdateProcessorFactory.init Replacing 'fields' init param with (individual) 'fieldName' params
   [junit4]   2> 1158114 T3551 oasup.UpdateRequestProcessorChain.init inserting DistributedUpdateProcessorFactory into updateRequestProcessorChain "uniq-fields"
   [junit4]   2> 1158114 T3551 oasup.UpdateRequestProcessorChain.init creating updateRequestProcessorChain "distrib-dup-test-chain-explicit"
   [junit4]   2> 1158114 T3551 oasup.UpdateRequestProcessorChain.init creating updateRequestProcessorChain "distrib-dup-test-chain-implicit"
   [junit4]   2> 1158115 T3551 oasup.UpdateRequestProcessorChain.init inserting DistributedUpdateProcessorFactory into updateRequestProcessorChain "distrib-dup-test-chain-implicit"
   [junit4]   2> 1158115 T3551 oasc.SolrCore.loadUpdateProcessorChains no updateRequestProcessorChain defined as default, creating implicit default
   [junit4]   2> 1158116 T3551 oasc.RequestHandlers.initHandlersFromConfig adding lazy requestHandler: solr.ReplicationHandler
   [junit4]   2> 1158116 T3551 oasc.RequestHandlers.initHandlersFromConfig created /replication: solr.ReplicationHandler
   [junit4]   2> 1158116 T3551 oasc.RequestHandlers.initHandlersFromConfig created standard: solr.StandardRequestHandler
   [junit4]   2> 1158117 T3551 oasc.RequestHandlers.initHandlersFromConfig created /get: solr.RealTimeGetHandler
   [junit4]   2> 1158117 T3551 oasc.RequestHandlers.initHandlersFromConfig created dismax: solr.SearchHandler
   [junit4]   2> 1158118 T3551 oasc.RequestHandlers.initHandlersFromConfig created mock: org.apache.solr.core.MockQuerySenderListenerReqHandler
   [junit4]   2> 1158118 T3551 oasc.RequestHandlers.initHandlersFromConfig created /admin/: org.apache.solr.handler.admin.AdminHandlers
   [junit4]   2> 1158119 T3551 oasc.RequestHandlers.initHandlersFromConfig created /admin/file: solr.admin.ShowFileRequestHandler
   [junit4]   2> 1158119 T3551 oasc.RequestHandlers.initHandlersFromConfig created defaults: solr.StandardRequestHandler
   [junit4]   2> 1158120 T3551 oasc.RequestHandlers.initHandlersFromConfig adding lazy requestHandler: solr.StandardRequestHandler
   [junit4]   2> 1158120 T3551 oasc.RequestHandlers.initHandlersFromConfig created lazy: solr.StandardRequestHandler
   [junit4]   2> 1158120 T3551 oasc.RequestHandlers.initHandlersFromConfig created /update: solr.UpdateRequestHandler
   [junit4]   2> 1158121 T3551 oasc.RequestHandlers.initHandlersFromConfig created /terms: org.apache.solr.handler.component.SearchHandler
   [junit4]   2> 1158121 T3551 oasc.RequestHandlers.initHandlersFromConfig created spellCheckCompRH: org.apache.solr.handler.component.SearchHandler
   [junit4]   2> 1158122 T3551 oasc.RequestHandlers.initHandlersFromConfig created spellCheckCompRH_Direct: org.apache.solr.handler.component.SearchHandler
   [junit4]   2> 1158122 T3551 oasc.RequestHandlers.initHandlersFromConfig created spellCheckWithWordbreak: org.apache.solr.handler.component.SearchHandler
   [junit4]   2> 1158123 T3551 oasc.RequestHandlers.initHandlersFromConfig created spellCheckWithWordbreak_Direct: org.apache.solr.handler.component.SearchHandler
   [junit4]   2> 1158123 T3551 oasc.RequestHandlers.initHandlersFromConfig created spellCheckCompRH1: org.apache.solr.handler.component.SearchHandler
   [junit4]   2> 1158124 T3551 oasc.RequestHandlers.initHandlersFromConfig created mltrh: org.apache.solr.handler.component.SearchHandler
   [junit4]   2> 1158124 T3551 oasc.RequestHandlers.initHandlersFromConfig created tvrh: org.apache.solr.handler.component.SearchHandler
   [junit4]   2> 1158125 T3551 oasc.RequestHandlers.initHandlersFromConfig created /mlt: solr.MoreLikeThisHandler
   [junit4]   2> 1158125 T3551 oasc.RequestHandlers.initHandlersFromConfig created /debug/dump: solr.DumpRequestHandler
   [junit4]   2> 1158127 T3551 oashl.XMLLoader.init xsltCacheLifetimeSeconds=60
   [junit4]   2> 1158128 T3551 oasc.SolrCore.initDeprecatedSupport WARN solrconfig.xml uses deprecated <admin/gettableFiles>, Please update your config to use the ShowFileRequestHandler.
   [junit4]   2> 1158130 T3551 oasu.CommitTracker.<init> Hard AutoCommit: disabled
   [junit4]   2> 1158130 T3551 oasu.CommitTracker.<init> Soft AutoCommit: disabled
   [junit4]   2> 1158131 T3551 oasu.RandomMergePolicy.<init> RandomMergePolicy wrapping class org.apache.lucene.index.TieredMergePolicy: [TieredMergePolicy: maxMergeAtOnce=3, maxMergeAtOnceExplicit=8, maxMergedSegmentMB=92.490234375, floorSegmentMB=2.138671875, forceMergeDeletesPctAllowed=14.409607688429695, segmentsPerTier=47.0, maxCFSSegmentSizeMB=8.796093022207999E12, noCFSRatio=0.0
   [junit4]   2> 1158132 T3551 oasc.SolrDeletionPolicy.onInit SolrDeletionPolicy.onInit: commits: num=1
   [junit4]   2> 		commit{dir=RateLimitedDirectoryWrapper(MockDirectoryWrapper(org.apache.lucene.store.RAMDirectory@a758c02b lockFactory=org.apache.lucene.store.SingleInstanceLockFactory@55a78955)),segFN=segments_1,generation=1}
   [junit4]   2> 1158132 T3551 oasc.SolrDeletionPolicy.updateCommits newest commit generation = 1
   [junit4]   2> 1158133 T3551 oass.SolrIndexSearcher.<init> Opening Searcher@eae9710c main
   [junit4]   2> 1158133 T3551 oashc.SpellCheckComponent.inform Initializing spell checkers
   [junit4]   2> 1158155 T3551 oass.DirectSolrSpellChecker.init init: {name=direct,classname=DirectSolrSpellChecker,field=lowerfilt,minQueryLength=3}
   [junit4]   2> 1158176 T3552 oasc.SolrCore.registerSearcher [collection1] Registered new searcher Searcher@eae9710c main{StandardDirectoryReader(segments_1:1:nrt)}
   [junit4]   2> 1158180 T3551 oasc.CoreContainer.registerCore registering core: collection1
   [junit4]   2> 1158181 T3541 oass.SolrDispatchFilter.init user.dir=/mnt/ssd/jenkins/workspace/Lucene-Solr-4.x-Linux/solr/build/solr-core/test/J1
   [junit4]   2> 1158182 T3541 oass.SolrDispatchFilter.init SolrDispatchFilter.init() done
   [junit4]   2> 1158184 T3541 oejs.Server.doStart jetty-8.1.10.v20130312
   [junit4]   2> 1158188 T3541 oejs.AbstractConnector.doStart Started SelectChannelConnector@127.0.0.1:54072
   [junit4]   2> 1158189 T3541 oass.SolrDispatchFilter.init SolrDispatchFilter.init()
   [junit4]   2> 1158190 T3541 oasc.SolrResourceLoader.locateSolrHome JNDI not configured for solr (NoInitialContextEx)
   [junit4]   2> 1158191 T3541 oasc.SolrResourceLoader.locateSolrHome using system property solr.solr.home: /mnt/ssd/jenkins/workspace/Lucene-Solr-4.x-Linux/solr/build/solr-core/test-files/solr
   [junit4]   2> 1158192 T3541 oasc.SolrResourceLoader.<init> new SolrResourceLoader for directory: '/mnt/ssd/jenkins/workspace/Lucene-Solr-4.x-Linux/solr/build/solr-core/test-files/solr/'
   [junit4]   2> 1158203 T3541 oasc.ConfigSolr.fromFile Loading container configuration from /mnt/ssd/jenkins/workspace/Lucene-Solr-4.x-Linux/solr/build/solr-core/test-files/solr/solr.xml
   [junit4]   2> 1158250 T3541 oasc.CoreContainer.<init> New CoreContainer -952602586
   [junit4]   2> 1158251 T3541 oasc.CoreContainer.load Loading cores into CoreContainer [instanceDir=/mnt/ssd/jenkins/workspace/Lucene-Solr-4.x-Linux/solr/build/solr-core/test-files/solr/]
   [junit4]   2> 1158253 T3541 oashc.HttpShardHandlerFactory.getParameter Setting socketTimeout to: 90000
   [junit4]   2> 1158254 T3541 oashc.HttpShardHandlerFactory.getParameter Setting urlScheme to: http://
   [junit4]   2> 1158255 T3541 oashc.HttpShardHandlerFactory.getParameter Setting connTimeout to: 15000
   [junit4]   2> 1158256 T3541 oashc.HttpShardHandlerFactory.getParameter Setting maxConnectionsPerHost to: 20
   [junit4]   2> 1158257 T3541 oashc.HttpShardHandlerFactory.getParameter Setting corePoolSize to: 0
   [junit4]   2> 1158258 T3541 oashc.HttpShardHandlerFactory.getParameter Setting maximumPoolSize to: 2147483647
   [junit4]   2> 1158259 T3541 oashc.HttpShardHandlerFactory.getParameter Setting maxThreadIdleTime to: 5
   [junit4]   2> 1158260 T3541 oashc.HttpShardHandlerFactory.getParameter Setting sizeOfQueue to: -1
   [junit4]   2> 1158261 T3541 oashc.HttpShardHandlerFactory.getParameter Setting fairnessPolicy to: false
   [junit4]   2> 1158267 T3541 oasl.LogWatcher.createWatcher SLF4J impl is org.slf4j.impl.Log4jLoggerFactory
   [junit4]   2> 1158268 T3541 oasl.LogWatcher.newRegisteredLogWatcher Registering Log Listener [Log4j (org.slf4j.impl.Log4jLoggerFactory)]
   [junit4]   2> 1158269 T3541 oasc.CoreContainer.load Host Name: 127.0.0.1
   [junit4]   2> 1158273 T3563 oasc.CoreContainer.create Creating SolrCore 'collection1' using instanceDir: /mnt/ssd/jenkins/workspace/Lucene-Solr-4.x-Linux/solr/build/solr-core/test-files/solr/collection1
   [junit4]   2> 1158273 T3563 oasc.SolrResourceLoader.<init> new SolrResourceLoader for directory: '/mnt/ssd/jenkins/workspace/Lucene-Solr-4.x-Linux/solr/build/solr-core/test-files/solr/collection1/'
   [junit4]   2> 1158274 T3563 oasc.SolrResourceLoader.replaceClassLoader Adding 'file:/mnt/ssd/jenkins/workspace/Lucene-Solr-4.x-Linux/solr/build/solr-core/test-files/solr/collection1/lib/classes/' to classloader
   [junit4]   2> 1158274 T3563 oasc.SolrResourceLoader.replaceClassLoader Adding 'file:/mnt/ssd/jenkins/workspace/Lucene-Solr-4.x-Linux/solr/build/solr-core/test-files/solr/collection1/lib/README' to classloader
   [junit4]   2> 1158310 T3563 oasc.SolrConfig.<init> Using Lucene MatchVersion: LUCENE_47
   [junit4]   2> 1158353 T3563 oasc.SolrConfig.<init> Loaded SolrConfig: solrconfig.xml
   [junit4]   2> 1158353 T3563 oass.IndexSchema.readSchema Reading Solr Schema from schema.xml
   [junit4]   2> 1158359 T3563 oass.IndexSchema.readSchema [collection1] Schema name=test
   [junit4]   2> 1158753 T3563 oass.ByteField.init WARN ByteField is deprecated and will be removed in 5.0. You should use TrieIntField instead.
   [junit4]   2> 1158753 T3563 oass.ShortField.init WARN ShortField is deprecated and will be removed in 5.0. You should use TrieIntField instead.
   [junit4]   2> 1158754 T3563 oass.OpenExchangeRatesOrgProvider.init Initialized with rates=open-exchange-rates.json, refreshInterval=1440.
   [junit4]   2> 1158758 T3563 oass.IndexSchema.readSchema default search field in schema is text
   [junit4]   2> 1158761 T3563 oass.IndexSchema.readSchema unique key field: id
   [junit4]   2> 1158766 T3563 oass.FileExchangeRateProvider.reload Reloading exchange rates from file currency.xml
   [junit4]   2> 1158769 T3563 oass.FileExchangeRateProvider.reload Reloading exchange rates from file currency.xml
   [junit4]   2> 1158772 T3563 oass.OpenExchangeRatesOrgProvider.reload Reloading exchange rates from open-exchange-rates.json
   [junit4]   2> 1158773 T3563 oass.OpenExchangeRatesOrgProvider$OpenExchangeRates.<init> WARN Unknown key IMPORTANT NOTE
   [junit4]   2> 1158773 T3563 oass.OpenExchangeRatesOrgProvider$OpenExchangeRates.<init> WARN Expected key, got STRING
   [junit4]   2> 1158774 T3563 oass.OpenExchangeRatesOrgProvider.reload Reloading exchange rates from open-exchange-rates.json
   [junit4]   2> 1158774 T3563 oass.OpenExchangeRatesOrgProvider$OpenExchangeRates.<init> WARN Unknown key IMPORTANT NOTE
   [junit4]   2> 1158774 T3563 oass.OpenExchangeRatesOrgProvider$OpenExchangeRates.<init> WARN Expected key, got STRING
   [junit4]   2> 1158775 T3563 oasc.SolrCore.initDirectoryFactory org.apache.solr.core.MockDirectoryFactory
   [junit4]   2> 1158775 T3563 oasc.SolrCore.<init> [collection1] Opening new SolrCore at /mnt/ssd/jenkins/workspace/Lucene-Solr-4.x-Linux/solr/build/solr-core/test-files/solr/collection1/, dataDir=./org.apache.solr.handler.component.TermVectorComponentDistributedTest-1385815304631/shard0/data/
   [junit4]   2> 1158776 T3563 oasc.JmxMonitoredMap.<init> JMX monitoring is enabled. Adding Solr mbeans to JMX Server: com.sun.jmx.mbeanserver.JmxMBeanServer@2e94e28b
   [junit4]   2> 1158777 T3563 oasc.CachingDirectoryFactory.get return new directory for ./org.apache.solr.handler.component.TermVectorComponentDistributedTest-1385815304631/shard0/data
   [junit4]   2> 1158777 T3563 oasc.SolrCore.getNewIndexDir New index directory detected: old=null new=./org.apache.solr.handler.component.TermVectorComponentDistributedTest-1385815304631/shard0/data/index/
   [junit4]   2> 1158777 T3563 oasc.SolrCore.initIndex WARN [collection1] Solr index directory './org.apache.solr.handler.component.TermVectorComponentDistributedTest-1385815304631/shard0/data/index' doesn't exist. Creating new index...
   [junit4]   2> 1158778 T3563 oasc.CachingDirectoryFactory.get return new directory for ./org.apache.solr.handler.component.TermVectorComponentDistributedTest-1385815304631/shard0/data/index
   [junit4]   2> 1158778 T3563 oasu.RandomMergePolicy.<init> RandomMergePolicy wrapping class org.apache.lucene.index.TieredMergePolicy: [TieredMergePolicy: maxMergeAtOnce=42, maxMergeAtOnceExplicit=17, maxMergedSegmentMB=10.2177734375, floorSegmentMB=2.1064453125, forceMergeDeletesPctAllowed=5.176949531090288, segmentsPerTier=35.0, maxCFSSegmentSizeMB=8.796093022207999E12, noCFSRatio=0.16299913333947041
   [junit4]   2> 1158779 T3563 oasc.SolrDeletionPolicy.onCommit SolrDeletionPolicy.onCommit: commits: num=1
   [junit4]   2> 		commit{dir=RateLimitedDirectoryWrapper(MockDirectoryWrapper(org.apache.lucene.store.RAMDirectory@598c52bd lockFactory=org.apache.lucene.store.SingleInstanceLockFactory@5e742a12)),segFN=segments_1,generation=1}
   [junit4]   2> 1158779 T3563 oasc.SolrDeletionPolicy.updateCommits newest commit generation = 1
   [junit4]   2> 1158780 T3563 oasc.SolrCore.initWriters created xml: solr.XMLResponseWriter
   [junit4]   2> 1158782 T3563 oasup.UpdateRequestProcessorChain.init creating updateRequestProcessorChain "dedupe"
   [junit4]   2> 1158782 T3563 oasup.UpdateRequestProcessorChain.init inserting DistributedUpdateProcessorFactory into updateRequestProcessorChain "dedupe"
   [junit4]   2> 1158783 T3563 oasup.UpdateRequestProcessorChain.init creating updateRequestProcessorChain "dedupe-allfields"
   [junit4]   2> 1158783 T3563 oasup.UpdateRequestProcessorChain.init inserting DistributedUpdateProcessorFactory into updateRequestProcessorChain "dedupe-allfields"
   [junit4]   2> 1158784 T3563 oasup.UpdateRequestProcessorChain.init creating updateRequestProcessorChain "stored_sig"
   [junit4]   2> 1158784 T3563 oasup.UpdateRequestProcessorChain.init inserting DistributedUpdateProcessorFactory into updateRequestProcessorChain "stored_sig"
   [junit4]   2> 1158784 T3563 oasup.UpdateRequestProcessorChain.init creating updateRequestProcessorChain "uniq-fields"
   [junit4]   2> 1158785 T3563 oasup.UniqFieldsUpdateProcessorFactory.init WARN Use of the 'fields' init param in UniqFieldsUpdateProcessorFactory is deprecated, please use 'fieldName' (or another FieldMutatingUpdateProcessorFactory selector option) instead
   [junit4]   2> 1158785 T3563 oasup.UniqFieldsUpdateProcessorFactory.init Replacing 'fields' init param with (individual) 'fieldName' params
   [junit4]   2> 1158785 T3563 oasup.UpdateRequestProcessorChain.init inserting DistributedUpdateProcessorFactory into updateRequestProcessorChain "uniq-fields"
   [junit4]   2> 1158786 T3563 oasup.UpdateRequestProcessorChain.init creating updateRequestProcessorChain "distrib-dup-test-chain-explicit"
   [junit4]   2> 1158786 T3563 oasup.UpdateRequestProcessorChain.init creating updateRequestProcessorChain "distrib-dup-test-chain-implicit"
   [junit4]   2> 1158787 T3563 oasup.UpdateRequestProcessorChain.init inserting DistributedUpdateProcessorFactory into updateRequestProcessorChain "distrib-dup-test-chain-implicit"
   [junit4]   2> 1158787 T3563 oasc.SolrCore.loadUpdateProcessorChains no updateRequestProcessorChain defined as default, creating implicit default
   [junit4]   2> 1158787 T3563 oasc.RequestHandlers.initHandlersFromConfig adding lazy requestHandler: solr.ReplicationHandler
   [junit4]   2> 1158788 T3563 oasc.RequestHandlers.initHandlersFromConfig created /replication: solr.ReplicationHandler
   [junit4]   2> 1158788 T3563 oasc.RequestHandlers.initHandlersFromConfig created standard: solr.StandardRequestHandler
   [junit4]   2> 1158789 T3563 oasc.RequestHandlers.initHandlersFromConfig created /get: solr.RealTimeGetHandler
   [junit4]   2> 1158789 T3563 oasc.RequestHandlers.initHandlersFromConfig created dismax: solr.SearchHandler
   [junit4]   2> 1158790 T3563 oasc.RequestHandlers.initHandlersFromConfig created mock: org.apache.solr.core.MockQuerySenderListenerReqHandler
   [junit4]   2> 1158791 T3563 oasc.RequestHandlers.initHandlersFromConfig created /admin/: org.apache.solr.handler.admin.AdminHandlers
   [junit4]   2> 1158791 T3563 oasc.RequestHandlers.initHandlersFromConfig created /admin/file: solr.admin.ShowFileRequestHandler
   [junit4]   2> 1158792 T3563 oasc.RequestHandlers.initHandlersFromConfig created defaults: solr.StandardRequestHandler
   [junit4]   2> 1158792 T3563 oasc.RequestHandlers.initHandlersFromConfig adding lazy requestHandler: solr.StandardRequestHandler
   [junit4]   2> 1158792 T3563 oasc.RequestHandlers.initHandlersFromConfig created lazy: solr.StandardRequestHandler
   [junit4]   2> 1158793 T3563 oasc.RequestHandlers.initHandlersFromConfig created /update: solr.UpdateRequestHandler
   [junit4]   2> 1158794 T3563 oasc.RequestHandlers.initHandlersFromConfig created /terms: org.apache.solr.handler.component.SearchHandler
   [junit4]   2> 1158794 T3563 oasc.RequestHandlers.initHandlersFromConfig created spellCheckCompRH: org.apache.solr.handler.component.SearchHandler
   [junit4]   2> 1158795 T3563 oasc.RequestHandlers.initHandlersFromConfig created spellCheckCompRH_Direct: org.apache.solr.handler.component.SearchHandler
   [junit4]   2> 1158795 T3563 oasc.RequestHandlers.initHandlersFromConfig created spellCheckWithWordbreak: org.apache.solr.handler.component.SearchHandler
   [junit4]   2> 1158796 T3563 oasc.RequestHandlers.initHandlersFromConfig created spellCheckWithWordbreak_Direct: org.apache.solr.handler.component.SearchHandler
   [junit4]   2> 1158796 T3563 oasc.RequestHandlers.initHandlersFromConfig created spellCheckCompRH1: org.apache.solr.handler.component.SearchHandler
   [junit4]   2> 1158797 T3563 oasc.RequestHandlers.initHandlersFromConfig created mltrh: org.apache.solr.handler.component.SearchHandler
   [junit4]   2> 1158797 T3563 oasc.RequestHandlers.initHandlersFromConfig created tvrh: org.apache.solr.handler.component.SearchHandler
   [junit4]   2> 1158798 T3563 oasc.RequestHandlers.initHandlersFromConfig created /mlt: solr.MoreLikeThisHandler
   [junit4]   2> 1158799 T3563 oasc.RequestHandlers.initHandlersFromConfig created /debug/dump: solr.DumpRequestHandler
   [junit4]   2> 1158800 T3563 oashl.XMLLoader.init xsltCacheLifetimeSeconds=60
   [junit4]   2> 1158801 T3563 oasc.SolrCore.initDeprecatedSupport WARN solrconfig.xml uses deprecated <admin/gettableFiles>, Please update your config to use the ShowFileRequestHandler.
   [junit4]   2> 1158804 T3563 oasu.CommitTracker.<init> Hard AutoCommit: disabled
   [junit4]   2> 1158804 T3563 oasu.CommitTracker.<init> Soft AutoCommit: disabled
   [junit4]   2> 1158805 T3563 oasu.RandomMergePolicy.<init> RandomMergePolicy wrapping class org.apache.lucene.index.TieredMergePolicy: [TieredMergePolicy: maxMergeAtOnce=3, maxMergeAtOnceExplicit=8, maxMergedSegmentMB=92.490234375, floorSegmentMB=2.138671875, forceMergeDeletesPctAllowed=14.409607688429695, segmentsPerTier=47.0, maxCFSSegmentSizeMB=8.796093022207999E12, noCFSRatio=0.0
   [junit4]   2> 1158805 T3563 oasc.SolrDeletionPolicy.onInit SolrDeletionPolicy.onInit: commits: num=1
   [junit4]   2> 		commit{dir=RateLimitedDirectoryWrapper(MockDirectoryWrapper(org.apache.lucene.store.RAMDirectory@598c52bd lockFactory=org.apache.lucene.store.SingleInstanceLockFactory@5e742a12)),segFN=segments_1,generation=1}
   [junit4]   2> 1158806 T3563 oasc.SolrDeletionPolicy.updateCommits newest commit generation = 1
   [junit4]   2> 1158806 T3563 oass.SolrIndexSearcher.<init> Opening Searcher@6fdcfae0 main
   [junit4]   2> 1158807 T3563 oashc.SpellCheckComponent.inform Initializing spell checkers
   [junit4]   2> 1158810 T3563 oass.DirectSolrSpellChecker.init init: {name=direct,classname=DirectSolrSpellChecker,field=lowerfilt,minQueryLength=3}
   [junit4]   2> 1158830 T3564 oasc.SolrCore.registerSearcher [collection1] Registered new searcher Searcher@6fdcfae0 main{StandardDirectoryReader(segments_1:1:nrt)}
   [junit4]   2> 1158835 T3563 oasc.CoreContainer.registerCore registering core: collection1
   [junit4]   2> 1158835 T3541 oass.SolrDispatchFilter.init user.dir=/mnt/ssd/jenkins/workspace/Lucene-Solr-4.x-Linux/solr/build/solr-core/test/J1
   [junit4]   2> 1158836 T3541 oass.SolrDispatchFilter.init SolrDispatchFilter.init() done
   [junit4]   2> ASYNC  NEW_CORE C1385 name=collection1 org.apache.solr.core.SolrCore@ad2c892a
   [junit4]   2> 1158849 T3547 C1385 oasup.LogUpdateProcessor.finish [collection1] webapp=/gi_zb path=/update params={wt=javabin&version=2} {add=[0 (1453132670250778624)]} 0 2
   [junit4]   2> ASYNC  NEW_CORE C1386 name=collection1 org.apache.solr.core.SolrCore@53bbc577
   [junit4]   2> 1158857 T3561 C1386 oasup.LogUpdateProcessor.finish [collection1] webapp=/gi_zb path=/update params={wt=javabin&version=2} {add=[0 (1453132670260215808)]} 0 1
   [junit4]   2> 1158860 T3548 C1385 oasup.LogUpdateProcessor.finish [collection1] webapp=/gi_zb path=/update params={wt=javabin&version=2} {add=[1 (1453132670264410112)]} 0 0
   [junit4]   2> 1158864 T3562 C1386 oasup.LogUpdateProcessor.finish [collection1] webapp=/gi_zb path=/update params={wt=javabin&version=2} {add=[1 (1453132670266507264)]} 0 2
   [junit4]   2> 1158868 T3549 C1385 oasup.LogUpdateProcessor.finish [collection1] webapp=/gi_zb path=/update params={wt=javabin&version=2} {add=[2 (1453132670271750144)]} 0 1
   [junit4]   2> 1158870 T3560 C1386 oasup.LogUpdateProcessor.finish [collection1] webapp=/gi_zb path=/update params={wt=javabin&version=2} {add=[2 (1453132670274895872)]} 0 0
   [junit4]   2> 1158873 T3550 C1385 oasup.LogUpdateProcessor.finish [collection1] webapp=/gi_zb path=/update params={version=2&wt=javabin} {add=[3 (1453132670276993024)]} 0 1
   [junit4]   2> 1158876 T3559 C1386 oasup.LogUpdateProcessor.finish [collection1] webapp=/gi_zb path=/update params={version=2&wt=javabin} {add=[3 (1453132670280138752)]} 0 1
   [junit4]   2> 1158878 T3547 C1385 oasup.LogUpdateProcessor.finish [collection1] webapp=/gi_zb path=/update params={wt=javabin&version=2} {add=[4 (1453132670283284480)]} 0 0
   [junit4]   2> 1158880 T3561 C1386 oasup.LogUpdateProcessor.finish [collection1] webapp=/gi_zb path=/update params={wt=javabin&version=2} {add=[4 (1453132670285381632)]} 0 0
   [junit4]   2> 1158883 T3548 C1385 oasup.LogUpdateProcessor.finish [collection1] webapp=/gi_zb path=/update params={version=2&wt=javabin} {add=[5 (1453132670287478784)]} 0 1
   [junit4]   2> 1158885 T3562 C1386 oasup.LogUpdateProcessor.finish [collection1] webapp=/gi_zb path=/update params={wt=javabin&version=2} {add=[5 (1453132670290624512)]} 0 1
   [junit4]   2> 1158887 T3549 C1385 oasup.LogUpdateProcessor.finish [collection1] webapp=/gi_zb path=/update params={version=2&wt=javabin} {add=[6 (1453132670292721664)]} 0 0
   [junit4]   2> 1158890 T3560 C1386 oasup.LogUpdateProcessor.finish [collection1] webapp=/gi_zb path=/update params={version=2&wt=javabin} {add=[6 (1453132670294818816)]} 0 1
   [junit4]   2> 1158892 T3550 C1385 oasup.LogUpdateProcessor.finish [collection1] webapp=/gi_zb path=/update params={wt=javabin&version=2} {add=[7 (1453132670297964544)]} 0 0
   [junit4]   2> 1158895 T3559 C1386 oasup.LogUpdateProcessor.finish [collection1] webapp=/gi_zb path=/update params={version=2&wt=javabin} {add=[7 (1453132670300061696)]} 0 1
   [junit4]   2> 1158897 T3547 C1385 oasup.LogUpdateProcessor.finish [collection1] webapp=/gi_zb path=/update params={version=2&wt=javabin} {add=[8 (1453132670302158848)]} 0 1
   [junit4]   2> 1158899 T3561 C1386 oasup.LogUpdateProcessor.finish [collection1] webapp=/gi_zb path=/update params={version=2&wt=javabin} {add=[8 (1453132670305304576)]} 0 0
   [junit4]   2> 1158901 T3548 C1385 oasup.LogUpdateProcessor.finish [collection1] webapp=/gi_zb path=/update params={wt=javabin&version=2} {add=[9 (1453132670307401728)]} 0 0
   [junit4]   2> 1158904 T3562 C1386 oasup.LogUpdateProcessor.finish [collection1] webapp=/gi_zb path=/update params={wt=javabin&version=2} {add=[9 (1453132670309498880)]} 0 1
   [junit4]   2> 1158906 T3549 C1385 oasu.DirectUpdateHandler2.commit start commit{,optimize=false,openSearcher=true,waitSearcher=true,expungeDeletes=false,softCommit=false,prepareCommit=false}
   [junit4]   2> 1158908 T3549 C1385 oasc.SolrDeletionPolicy.onCommit SolrDeletionPolicy.onCommit: commits: num=2
   [junit4]   2> 		commit{dir=RateLimitedDirectoryWrapper(MockDirectoryWrapper(org.apache.lucene.store.RAMDirectory@a758c02b lockFactory=org.apache.lucene.store.SingleInstanceLockFactory@55a78955)),segFN=segments_1,generation=1}
   [junit4]   2> 		commit{dir=RateLimitedDirectoryWrapper(MockDirectoryWrapper(org.apache.lucene.store.RAMDirectory@a758c02b lockFactory=org.apache.lucene.store.SingleInstanceLockFactory@55a78955)),segFN=segments_2,generation=2}
   [junit4]   2> 1158909 T3549 C1385 oasc.SolrDeletionPolicy.updateCommits newest commit generation = 2
   [junit4]   2> 1158911 T3549 C1385 oass.SolrIndexSearcher.<init> Opening Searcher@aefb70f5 main
   [junit4]   2> 1158912 T3549 C1385 oasu.DirectUpdateHandler2.commit end_commit_flush
   [junit4]   2> 1158914 T3552 oasc.SolrCore.registerSearcher [collection1] Registered new searcher Searcher@aefb70f5 main{StandardDirectoryReader(segments_2:3:nrt _0(4.7):C10)}
   [junit4]   2> 1158915 T3549 C1385 oasup.LogUpdateProcessor.finish [collection1] webapp=/gi_zb path=/update params={commit=true&version=2&waitSearcher=true&wt=javabin&softCommit=false} {commit=} 0 9
   [junit4]   2> 1158917 T3560 C1386 oasu.DirectUpdateHandler2.commit start commit{,optimize=false,openSearcher=true,waitSearcher=true,expungeDeletes=false,softCommit=false,prepareCommit=false}
   [junit4]   2> 1158920 T3560 C1386 oasc.SolrDeletionPolicy.onCommit SolrDeletionPolicy.onCommit: commits: num=2
   [junit4]   2> 		commit{dir=RateLimitedDirectoryWrapper(MockDirectoryWrapper(org.apache.lucene.store.RAMDirectory@598c52bd lockFactory=org.apache.lucene.store.SingleInstanceLockFactory@5e742a12)),segFN=segments_1,generation=1}
   [junit4]   2> 		commit{dir=RateLimitedDirectoryWrapper(MockDirectoryWrapper(org.apache.lucene.store.RAMDirectory@598c52bd lockFactory=org.apache.lucene.store.SingleInstanceLockFactory@5e742a12)),segFN=segments_2,generation=2}
   [junit4]   2> 1158921 T3560 C1386 oasc.SolrDeletionPolicy.updateCommits newest commit generation = 2
   [junit4]   2> 1158923 T3560 C1386 oass.SolrIndexSearcher.<init> Opening Searcher@be6848fd main
   [junit4]   2> 1158925 T3560 C1386 oasu.DirectUpdateHandler2.commit end_commit_flush
   [junit4]   2> 1158926 T3564 oasc.SolrCore.registerSearcher [collection1] Registered new searcher Searcher@be6848fd main{StandardDirectoryReader(segments_2:3:nrt _0(4.7):C10)}
   [junit4]   2> 1158927 T3560 C1386 oasup.LogUpdateProcessor.finish [collection1] webapp=/gi_zb path=/update params={softCommit=false&wt=javabin&version=2&waitSearcher=true&commit=true} {commit=} 0 10
   [junit4]   2> 1158932 T3550 C1385 oasc.SolrCore.execute [collection1] webapp=/gi_zb path=/select params={qt=tvrh&version=2&shards.qt=tvrh&q=id:0&tv=true&distrib=false&tv.tf=true&wt=javabin&sort=id+desc} hits=1 status=0 QTime=3 
   [junit4]   2> 1158936 T3561 C1386 oasc.SolrCore.execute [collection1] webapp=/gi_zb path=/select params={tv=true&rows=10&tv.tf=true&version=2&shards.qt=tvrh&q=id:0&isShard=true&NOW=1385815306037&fsv=true&start=0&distrib=false&sort=id+desc&wt=javabin&shard.url=[ff01::213]:33332/gi_zb|[ff01::114]:33332/gi_zb|[ff01::083]:33332/gi_zb|127.0.0.1:54072/gi_zb&qt=tvrh&fl=id} hits=1 status=0 QTime=0 
   [junit4]   2> 1158939 T3562 C1386 oasc.SolrCore.execute [collection1] webapp=/gi_zb path=/select params={wt=javabin&shard.url=[ff01::213]:33332/gi_zb|[ff01::114]:33332/gi_zb|[ff01::083]:33332/gi_zb|127.0.0.1:54072/gi_zb&distrib=false&tv.tf=true&NOW=1385815306037&tv=true&isShard=true&ids=0&q=id:0&shards.qt=tvrh&version=2&qt=tvrh} status=0 QTime=1 
   [junit4]   2> 1158940 T3559 C1386 oasc.SolrCore.execute [collection1] webapp=/gi_zb path=/select params={version=2&qt=tvrh&shards.qt=tvrh&q=id:0&shards=[ff01::213]:33332/gi_zb|[ff01::114]:33332/gi_zb|[ff01::083]:33332/gi_zb|127.0.0.1:54072/gi_zb&tv=true&tv.tf=true&sort=id+desc&wt=javabin} hits=1 status=0 QTime=5 
   [junit4]   2> 1158942 T3547 C1385 oasc.SolrCore.execute [collection1] webapp=/gi_zb path=/select params={tv.fl=test_basictv,test_offtv&sort=id+asc&wt=javabin&distrib=false&tv.tf=true&tv=true&q=id:0&shards.qt=tvrh&version=2&fl=*,score&qt=tvrh} hits=1 status=0 QTime=0 
   [junit4]   2> 1158946 T3561 C1386 oasc.SolrCore.execute [collection1] webapp=/gi_zb path=/select params={version=2&shards.qt=tvrh&q=id:0&isShard=true&tv=true&rows=10&tv.tf=true&tv.fl=test_basictv,test_offtv&fl=id,score&qt=tvrh&NOW=1385815306046&fsv=true&start=0&distrib=false&sort=id+asc&wt=javabin&shard.url=127.0.0.1:54072/gi_zb} hits=1 status=0 QTime=0 
   [junit4]   2> 1158949 T3559 C1386 oasc.SolrCore.execute [collection1] webapp=/gi_zb path=/select params={tv.fl=test_basictv,test_offtv&tv.tf=true&tv=true&q=id:0&isShard=true&shards.qt=tvrh&version=2&shard.url=127.0.0.1:54072/gi_zb&wt=javabin&distrib=false&NOW=1385815306046&ids=0&fl=*,score&qt=tvrh} status=0 QTime=1 
   [junit4]   2> 1158949 T3560 C1386 oasc.SolrCore.execute [collection1] webapp=/gi_zb path=/select params={tv=true&tv.fl=test_basictv,test_offtv&sort=id+asc&wt=javabin&tv.tf=true&shards.qt=tvrh&version=2&fl=*,score&qt=tvrh&shards=127.0.0.1:54072/gi_zb&q=id:0} hits=1 status=0 QTime=5 
   [junit4]   2> 1158952 T3548 C1385 oasc.SolrCore.execute [collection1] webapp=/gi_zb path=/select params={shards.qt=tvrh&fl=*,score&qt=tvrh&version=2&q=id:0&tv=true&wt=javabin&tv.fl=test_basictv&tv.fl=test_offtv&sort=id+asc&distrib=false&tv.tf=true} hits=1 status=0 QTime=1 
   [junit4]   2> 1158960 T3561 C1386 oasc.SolrCore.execute [collection1] webapp=/gi_zb path=/select params={fl=id,score&qt=tvrh&start=0&distrib=false&fsv=true&wt=javabin&shard.url=[ff01::213]:33332/gi_zb|[ff01::114]:33332/gi_zb|[ff01::083]:33332/gi_zb|127.0.0.1:54072/gi_zb&sort=id+asc&NOW=1385815306056&q=id:0&isShard=true&version=2&shards.qt=tvrh&tv.tf=true&tv.fl=test_basictv&tv.fl=test_offtv&tv=true&rows=10} hits=1 status=0 QTime=0 
   [junit4]   2> 1158962 T3559 C1386 oasc.SolrCore.execute [collection1] webapp=/gi_zb path=/select params={shards.qt=tvrh&version=2&q=id:0&isShard=true&tv=true&tv.fl=test_basictv&tv.fl=test_offtv&tv.tf=true&fl=*,score&qt=tvrh&ids=0&NOW=1385815306056&shard.url=[ff01::213]:33332/gi_zb|[ff01::114]:33332/gi_zb|[ff01::083]:33332/gi_zb|127.0.0.1:54072/gi_zb&wt=javabin&distrib=false} status=0 QTime=0 
   [junit4]   2> 1158963 T3562 C1386 oasc.SolrCore.execute [collection1] webapp=/gi_zb path=/select params={q=id:0&shards=[ff01::213]:33332/gi_zb|[ff01::114]:33332/gi_zb|[ff01::083]:33332/gi_zb|127.0.0.1:54072/gi_zb&fl=*,score&qt=tvrh&version=2&shards.qt=tvrh&tv.tf=true&wt=javabin&tv.fl=test_basictv&tv.fl=test_offtv&sort=id+asc&tv=true} hits=1 status=0 QTime=9 
   [junit4]   2> 1158966 T3549 C1385 oasc.SolrCore.execute [collection1] webapp=/gi_zb path=/select params={distrib=false&tv.tf=true&wt=javabin&sort=id+desc&tv=true&q=id:0&fl=*,score&qt=tvrh&version=2&shards.qt=tvrh} hits=1 status=0 QTime=1 
   [junit4]   2> 1158970 T3561 C1386 oasc.SolrCore.execute [collection1] webapp=/gi_zb path=/select params={tv.tf=true&tv=true&rows=10&q=id:0&isShard=true&version=2&shards.qt=tvrh&start=0&distrib=false&fsv=true&wt=javabin&shard.url=[ff01::083]:33332/gi_zb|127.0.0.1:54072/gi_zb|[ff01::114]:33332/gi_zb&sort=id+desc&NOW=1385815306070&fl=id,score&qt=tvrh} hits=1 status=0 QTime=1 
   [junit4]   2> 1158972 T3559 C1386 oasc.SolrCore.execute [collection1] webapp=/gi_zb path=/select params={shards.qt=tvrh&version=2&q=id:0&isShard=true&tv=true&tv.tf=true&fl=*,score&qt=tvrh&ids=0&NOW=1385815306070&shard.url=[ff01::083]:33332/gi_zb|127.0.0.1:54072/gi_zb|[ff01::114]:33332/gi_zb&wt=javabin&distrib=false} status=0 QTime=0 
   [junit4]   2> 1158973 T3560 C1386 oasc.SolrCore.execute [collection1] webapp=/gi_zb path=/select params={tv=true&tv.tf=true&sort=id+desc&wt=javabin&version=2&fl=*,score&qt=tvrh&shards.qt=tvrh&q=id:0&shards=[ff01::083]:33332/gi_zb|127.0.0.1:54072/gi_zb|[ff01::114]:33332/gi_zb} hits=1 status=0 QTime=5 
   [junit4]   2> 1158975 T3550 C1385 oasc.SolrCore.execute [collection1] webapp=/gi_zb path=/select params={fl=score,test_basictv,[docid],test_postv,val:sum(3,4)&qt=tvrh&version=2&shards.qt=tvrh&q=id:0&tv=true&distrib=false&tv.tf=true&wt=javabin&sort=id+desc} hits=1 status=0 QTime=0 
   [junit4]   2> 1158979 T3561 C1386 oasc.SolrCore.execute [collection1] webapp=/gi_zb path=/select params={fl=id,score&qt=tvrh&start=0&distrib=false&fsv=true&wt=javabin&shard.url=[ff01::114]:33332/gi_zb|[ff01::213]:33332/gi_zb|[ff01::083]:33332/gi_zb|127.0.0.1:54072/gi_zb&sort=id+desc&NOW=1385815306080&q=id:0&isShard=true&version=2&shards.qt=tvrh&tv.tf=true&tv=true&rows=10} hits=1 status=0 QTime=0 
   [junit4]   2> 1158982 T3559 C1386 oasc.SolrCore.execute [collection1] webapp=/gi_zb path=/select params={distrib=false&shard.url=[ff01::114]:33332/gi_zb|[ff01::213]:33332/gi_zb|[ff01::083]:33332/gi_zb|127.0.0.1:54072/gi_zb&wt=javabin&NOW=1385815306080&ids=0&fl=score,test_basictv,[docid],test_postv,val:sum(3,4)&fl=id&qt=tvrh&tv.tf=true&tv=true&q=id:0&isShard=true&version=2&shards.qt=tvrh} status=0 QTime=0 
   [junit4]   2> 1158985 T3562 C1386 oasc.SolrCore.execute [collection1] webapp=/gi_zb path=/select params={tv.tf=true&sort=id+desc&wt=javabin&tv=true&q=id:0&shards=[ff01::114]:33332/gi_zb|[ff01::213]:33332/gi_zb|[ff01::083]:33332/gi_zb|127.0.0.1:54072/gi_zb&version=2&fl=score,test_basictv,[docid],test_postv,val:sum(3,4)&qt=tvrh&shards.qt=tvrh} hits=1 status=0 QTime=7 
   [junit4]   2> 1158988 T3547 C1385 oasc.SolrCore.execute [collection1] webapp=/gi_zb path=/select params={sort=id+desc&wt=javabin&distrib=false&tv.tf=true&tv=true&q=id:0&shards.qt=tvrh&version=2&fl=score,test_basictv&fl=[docid],test_postv,val:sum(3,4)&qt=tvrh} hits=1 status=0 QTime=0 
   [junit4]   2> 1158994 T3561 C1386 oasc.SolrCore.execute [collection1] webapp=/gi_zb path=/select params={tv=true&rows=10&tv.tf=true&version=2&shards.qt=tvrh&q=id:0&isShard=true&NOW=1385815306092&fsv=true&start=0&distrib=false&sort=id+desc&wt=javabin&shard.url=[ff01::083]:33332/gi_zb|[ff01::213]:33332/gi_zb|127.0.0.1:54072/gi_zb&fl=id,score&qt=tvrh} hits=1 status=0 QTime=0 
   [junit4]   2> 1158997 T3559 C1386 oasc.SolrCore.execute [collection1] webapp=/gi_zb path=/select params={ids=0&fl=score,test_basictv&fl=[docid],test_postv,val:sum(3,4)&fl=id&qt=tvrh&shard.url=[ff01::083]:33332/gi_zb|[ff01::213]:33332/gi_zb|127.0.0.1:54072/gi_zb&wt=javabin&distrib=false&NOW=1385815306092&q=id:0&isShard=true&shards.qt=tvrh&version=2&tv.tf=true&tv=true} status=0 QTime=0 
   [junit4]   2> 1158997 T3560 C1386 oasc.SolrCore.execute [collection1] webapp=/gi_zb path=/select params={tv=true&tv.tf=true&wt=javabin&sort=id+desc&fl=score,test_basictv&fl=[docid],test_postv,val:sum(3,4)&qt=tvrh&version=2&shards.qt=tvrh&q=id:0&shards=[ff01::083]:33332/gi_zb|[ff01::213]:33332/gi_zb|127.0.0.1:54072/gi_zb} hits=1 status=0 QTime=7 
   [junit4]   2> 1159000 T3548 C1385 oasc.SolrCore.execute [collection1] webapp=/gi_zb path=/select params={distrib=false&sort=id+asc&wt=javabin&tv.positions=true&tv.df=true&tv.tf_idf=true&tv.offsets=true&qt=tvrh&tv.tf=true&tv=true&q=id:0&version=2&shards.qt=tvrh} hits=1 status=0 QTime=0 
   [junit4]   2> 1159004 T3561 C1386 oasc.SolrCore.execute [collection1] webapp=/gi_zb path=/select params={tv.tf_idf=true&tv.offsets=true&fl=id&qt=tvrh&fsv=true&distrib=false&start=0&sort=id+asc&wt=javabin&shard.url=127.0.0.1:54072/gi_zb&tv.positions=true&NOW=1385815306104&tv.df=true&isShard=true&q=id:0&version=2&shards.qt=tvrh&tv.tf=true&tv=true&rows=10} hits=1 status=0 QTime=0 
   [junit4]   2> 1159006 T3559 C1386 oasc.SolrCore.execute [collection1] webapp=/gi_zb path=/select params={tv=true&tv.tf=true&shards.qt=tvrh&version=2&q=id:0&isShard=true&tv.df=true&NOW=1385815306104&tv.positions=true&wt=javabin&shard.url=127.0.0.1:54072/gi_zb&distrib=false&qt=tvrh&tv.offsets=true&tv.tf_idf=true&ids=0} status=0 QTime=0 
   [junit4]   2> 1159007 T3562 C1386 oasc.SolrCore.execute [collection1] webapp=/gi_zb path=/select params={version=2&shards.qt=tvrh&q=id:0&tv=true&tv.tf=true&qt=tvrh&tv.offsets=true&tv.tf_idf=true&shards=127.0.0.1:54072/gi_zb&tv.positions=true&tv.df=true&wt=javabin&sort=id+asc} hits=1 status=0 QTime=5 
   [junit4]   2> 1159009 T3549 C1385 oasc.SolrCore.execute [collection1] webapp=/gi_zb path=/select params={wt=javabin&sort=id+desc&distrib=false&tv=true&tv.all=true&q=id:0&shards.qt=tvrh&qt=tvrh&version=2} hits=1 status=0 QTime=0 
   [junit4]   2> 1159013 T3561 C1386 oasc.SolrCore.execute [collection1] webapp=/gi_zb path=/select params={version=2&shards.qt=tvrh&tv.all=true&q=id:0&isShard=true&tv=true&rows=10&qt=tvrh&fl=id&NOW=1385815306113&fsv=true&start=0&distrib=false&sort=id+desc&wt=javabin&shard.url=[ff01::114]:33332/gi_zb|[ff01::083]:33332/gi_zb|127.0.0.1:54072/gi_zb} hits=1 status=0 QTime=0 
   [junit4]   2> 1159016 T3559 C1386 oasc.SolrCore.execute [collection1] webapp=/gi_zb path=/select params={isShard=true&ids=0&q=id:0&tv.all=true&shards.qt=tvrh&qt=tvrh&version=2&wt=javabin&shard.url=[ff01::114]:33332/gi_zb|[ff01::083]:33332/gi_zb|127.0.0.1:54072/gi_zb&distrib=false&tv=true&NOW=1385815306113} status=0 QTime=1 
   [junit4]   2> 1159016 T3560 C1386 oasc.SolrCore.execute [collection1] webapp=/gi_zb path=/select params={sort=id+desc&wt=javabin&tv=true&shards=[ff01::114]:33332/gi_zb|[ff01::083]:33332/gi_zb|127.0.0.1:54072/gi_zb&tv.all=true&q=id:0&shards.qt=tvrh&version=2&qt=tvrh} hits=1 status=0 QTime=5 
   [junit4]   2> 1159019 T3550 C1385 oasc.SolrCore.execute [collection1] webapp=/gi_zb path=/select params={tv=true&tv.fl=test_basictv,test_notv,test_postv,test_offtv,test_posofftv&tv.tf=true&shards.qt=tvrh&version=2&f.test_offtv.tv.offsets=false&q=id:0&tv.df=true&tv.positions=true&wt=javabin&sort=id+desc&distrib=false&f.test_basictv.tv.tf_idf=false&qt=tvrh&tv.offsets=true&f.test_basictv.tv.tf=false&f.test_basictv.tv.df=false&tv.tf_idf=true&f.test_posofftv.tv.positions=false} hits=1 status=0 QTime=0 
   [junit4]   2> 1159023 T3561 C1386 oasc.SolrCore.execute [collection1] webapp=/gi_zb path=/select params={tv.fl=test_basictv,test_notv,test_postv,test_offtv,test_posofftv&tv.tf=true&tv=true&rows=10&q=id:0&isShard=true&f.test_offtv.tv.offsets=false&shard.url=127.0.0.1:54072/gi_zb|[ff01::083]:33332/gi_zb|[ff01::114]:33332/gi_zb|[ff01::213]:33332/gi_zb&sort=id+desc&start=0&distrib=false&NOW=1385815306123&tv.positions=true&tv.tf_idf=true&f.test_basictv.tv.df=false&fl=id&shards.qt=tvrh&version=2&wt=javabin&fsv=true&tv.df=true&f.test_posofftv.tv.positions=false&f.test_basictv.tv.tf=false&f.test_basictv.tv.tf_idf=false&qt=tvrh&tv.offsets=true} hits=1 status=0 QTime=0 
   [junit4]   2> 1159026 T3559 C1386 oasc.SolrCore.execute [collection1] webapp=/gi_zb path=/select params={tv.tf=true&tv.fl=test_basictv,test_notv,test_postv,test_offtv,test_posofftv&tv=true&isShard=true&q=id:0&version=2&f.test_offtv.tv.offsets=false&shards.qt=tvrh&distrib=false&wt=javabin&shard.url=127.0.0.1:54072/gi_zb|[ff01::083]:33332/gi_zb|[ff01::114]:33332/gi_zb|[ff01::213]:33332/gi_zb&tv.positions=true&NOW=1385815306123&tv.df=true&ids=0&f.test_basictv.tv.tf=false&f.test_basictv.tv.df=false&tv.tf_idf=true&f.test_posofftv.tv.positions=false&tv.offsets=true&qt=tvrh&f.test_basictv.tv.tf_idf=false} status=0 QTime=0 
   [junit4]   2> 1159027 T3562 C1386 oasc.SolrCore.execute [collection1] webapp=/gi_zb path=/select params={q=id:0&shards.qt=tvrh&version=2&f.test_offtv.tv.offsets=false&tv.fl=test_basictv,test_notv,test_postv,test_offtv,test_posofftv&tv.tf=true&tv=true&shards=127.0.0.1:54072/gi_zb|[ff01::083]:33332/gi_zb|[ff01::114]:33332/gi_zb|[ff01::213]:33332/gi_zb&f.test_basictv.tv.tf=false&f.test_basictv.tv.df=false&tv.tf_idf=true&f.test_posofftv.tv.positions=false&f.test_basictv.tv.tf_idf=false&tv.offsets=true&qt=tvrh&sort=id+desc&wt=javabin&tv.df=true&tv.positions=true} hits=1 status=0 QTime=6 
   [junit4]   2> 1159028 T3541 oas.BaseDistributedSearchTestCase.compareSolrResponses ERROR Mismatched responses:
   [junit4]   2> 	{responseHeader={status=0,QTime=6},response={numFound=1,start=0,docs=[SolrDocument{id=0, range_facet_si=0, range_facet_l=[0], range_facet_sl=[0], test_posofftv=[This is a title and another title], test_basictv=[This is a title and another title], test_notv=[This is a title and another title], test_postv=[This is a title and another title], test_offtv=[This is a title and another title], _version_=1453132670260215808, intDefault=42, timestamp=Sat Nov 30 21:41:45 JST 2013, multiDefault=[muLti-Default]}]},termVectors={uniqueKeyFieldName=id,warnings={noTermVectors=[test_notv],noPositions=[test_basictv, test_offtv],noOffsets=[test_basictv, test_postv]},0={uniqueKey=0,test_offtv={anoth={tf=1,df=2,tf-idf=0.5},titl={tf=2,df=1,tf-idf=2.0}},test_basictv={anoth={},titl={}},test_postv={anoth={tf=1,positions={position=5},df=2,tf-idf=0.5},titl={tf=2,positions={position=3,position=6},df=1,tf-idf=2.0}},test_posofftv={anoth={tf=1,offsets={start=20,end=27},df=2,tf-idf=0.5},titl={tf=2,offsets={start=10,end=15,start=28,end=33},df=1,tf-idf=2.0}}}}}
   [junit4]   2> 	{responseHeader={status=0,QTime=0},response={numFound=1,start=0,docs=[SolrDocument{id=0, range_facet_si=0, range_facet_l=[0], range_facet_sl=[0], test_posofftv=[This is a title and another title], test_basictv=[This is a title and another title], test_notv=[This is a title and another title], test_postv=[This is a title and another title], test_offtv=[This is a title and another title], _version_=1453132670250778624, intDefault=42, timestamp=Sat Nov 30 21:41:45 JST 2013, multiDefault=[muLti-Default]}]},termVectors={uniqueKeyFieldName=id,warnings={noTermVectors=[test_notv],noPositions=[test_basictv, test_offtv],noOffsets=[test_basictv, test_postv]},0={uniqueKey=0,test_postv={anoth={tf=1,positions={position=5},df=2,tf-idf=0.5},titl={tf=2,positions={position=3,position=6},df=1,tf-idf=2.0}},test_basictv={anoth={},titl={}},test_offtv={anoth={tf=1,df=2,tf-idf=0.5},titl={tf=2,df=1,tf-idf=2.0}},test_posofftv={anoth={tf=1,offsets={start=20,end=27},df=2,tf-idf=0.5},titl={tf=2,offsets={start=10,end=15,start=28,end=33},df=1,tf-idf=2.0}}}}}
   [junit4]   2> 1159049 T3541 oasc.CoreContainer.shutdown Shutting down CoreContainer instance=-1594354794
   [junit4]   2> 1159050 T3541 oasc.SolrCore.close [collection1]  CLOSING SolrCore org.apache.solr.core.SolrCore@ad2c892a
   [junit4]   2> 1159056 T3541 oasu.DirectUpdateHandler2.close closing DirectUpdateHandler2{commits=1,autocommits=0,soft autocommits=0,optimizes=0,rollbacks=0,expungeDeletes=0,docsPending=0,adds=0,deletesById=0,deletesByQuery=0,errors=0,cumulative_adds=10,cumulative_deletesById=0,cumulative_deletesByQuery=0,cumulative_errors=0,transaction_logs_total_size=1285,transaction_logs_total_number=1}
   [junit4]   2> 1159057 T3541 oasu.SolrCoreState.decrefSolrCoreState Closing SolrCoreState
   [junit4]   2> 1159058 T3541 oasu.DefaultSolrCoreState.closeIndexWriter SolrCoreState ref count has reached 0 - closing IndexWriter
   [junit4]   2> 1159058 T3541 oasu.DefaultSolrCoreState.closeIndexWriter closing IndexWriter with IndexWriterCloser
   [junit4]   2> 1159059 T3541 oasc.SolrCore.closeSearcher [collection1] Closing main searcher on request.
   [junit4]   2> 1159060 T3541 oasc.CachingDirectoryFactory.close Closing MockDirectoryFactory - 2 directories currently being tracked
   [junit4]   2> 1159061 T3541 oasc.CachingDirectoryFactory.closeCacheValue looking to close ./org.apache.solr.handler.component.TermVectorComponentDistributedTest-1385815304631/control/data/index [CachedDir<<refCount=0;path=./org.apache.solr.handler.component.TermVectorComponentDistributedTest-1385815304631/control/data/index;done=false>>]
   [junit4]   2> 1159062 T3541 oasc.CachingDirectoryFactory.close Closing directory: ./org.apache.solr.handler.component.TermVectorComponentDistributedTest-1385815304631/control/data/index
   [junit4]   2> 1159063 T3541 oasc.CachingDirectoryFactory.closeCacheValue looking to close ./org.apache.solr.handler.component.TermVectorComponentDistributedTest-1385815304631/control/data [CachedDir<<refCount=0;path=./org.apache.solr.handler.component.TermVectorComponentDistributedTest-1385815304631/control/data;done=false>>]
   [junit4]   2> 1159064 T3541 oasc.CachingDirectoryFactory.close Closing directory: ./org.apache.solr.handler.component.TermVectorComponentDistributedTest-1385815304631/control/data
   [junit4]   2> 1159066 T3541 oejsh.ContextHandler.doStop stopped o.e.j.s.ServletContextHandler{/gi_zb,null}
   [junit4]   2> 1159140 T3541 oasc.CoreContainer.shutdown Shutting down CoreContainer instance=-952602586
   [junit4]   2> 1159141 T3541 oasc.SolrCore.close [collection1]  CLOSING SolrCore org.apache.solr.core.SolrCore@53bbc577
   [junit4]   2> 1159158 T3541 oasu.DirectUpdateHandler2.close closing DirectUpdateHandler2{commits=1,autocommits=0,soft autocommits=0,optimizes=0,rollbacks=0,expungeDeletes=0,docsPending=0,adds=0,deletesById=0,deletesByQuery=0,errors=0,cumulative_adds=10,cumulative_deletesById=0,cumulative_deletesByQuery=0,cumulative_errors=0,transaction_logs_total_size=1285,transaction_logs_total_number=1}
   [junit4]   2> 1159159 T3541 oasu.SolrCoreState.decrefSolrCoreState Closing SolrCoreState
   [junit4]   2> 1159160 T3541 oasu.DefaultSolrCoreState.closeIndexWriter SolrCoreState ref count has reached 0 - closing IndexWriter
   [junit4]   2> 1159161 T3541 oasu.DefaultSolrCoreState.closeIndexWriter closing IndexWriter with IndexWriterCloser
   [junit4]   2> 1159162 T3541 oasc.SolrCore.closeSearcher [collection1] Closing main searcher on request.
   [junit4]   2> 1159163 T3541 oasc.CachingDirectoryFactory.close Closing MockDirectoryFactory - 2 directories currently being tracked
   [junit4]   2> 1159164 T3541 oasc.CachingDirectoryFactory.closeCacheValue looking to close ./org.apache.solr.handler.component.TermVectorComponentDistributedTest-1385815304631/shard0/data/index [CachedDir<<refCount=0;path=./org.apache.solr.handler.component.TermVectorComponentDistributedTest-1385815304631/shard0/data/index;done=false>>]
   [junit4]   2> 1159165 T3541 oasc.CachingDirectoryFactory.close Closing directory: ./org.apache.solr.handler.component.TermVectorComponentDistributedTest-1385815304631/shard0/data/index
   [junit4]   2> 1159166 T3541 oasc.CachingDirectoryFactory.closeCacheValue looking to close ./org.apache.solr.handler.component.TermVectorComponentDistributedTest-1385815304631/shard0/data [CachedDir<<refCount=0;path=./org.apache.solr.handler.component.TermVectorComponentDistributedTest-1385815304631/shard0/data;done=false>>]
   [junit4]   2> 1159167 T3541 oasc.CachingDirectoryFactory.close Closing directory: ./org.apache.solr.handler.component.TermVectorComponentDistributedTest-1385815304631/shard0/data
   [junit4]   2> 1159168 T3541 oejsh.ContextHandler.doStop stopped o.e.j.s.ServletContextHandler{/gi_zb,null}
   [junit4]   2> 1159226 T3541 oas.SolrTestCaseJ4.tearDown ###Ending testDistribSearch
   [junit4]   2> NOTE: reproduce with: ant test  -Dtestcase=TermVectorComponentDistributedTest -Dtests.method=testDistribSearch -Dtests.seed=CC144FF7C066545C -Dtests.multiplier=3 -Dtests.slow=true -Dtests.locale=fi_FI -Dtests.timezone=Asia/Tokyo -Dtests.file.encoding=UTF-8
   [junit4] FAILURE 1.71s J1 | TermVectorComponentDistributedTest.testDistribSearch <<<
   [junit4]    > Throwable #1: junit.framework.AssertionFailedError: .termVectors.0.test_offtv!=test_postv (unordered or missing)
   [junit4]    > 	at __randomizedtesting.SeedInfo.seed([CC144FF7C066545C:4DF2C1EFB7393460]:0)
   [junit4]    > 	at junit.framework.Assert.fail(Assert.java:50)
   [junit4]    > 	at org.apache.solr.BaseDistributedSearchTestCase.compareSolrResponses(BaseDistributedSearchTestCase.java:816)
   [junit4]    > 	at org.apache.solr.BaseDistributedSearchTestCase.compareResponses(BaseDistributedSearchTestCase.java:835)
   [junit4]    > 	at org.apache.solr.BaseDistributedSearchTestCase.query(BaseDistributedSearchTestCase.java:538)
   [junit4]    > 	at org.apache.solr.BaseDistributedSearchTestCase.query(BaseDistributedSearchTestCase.java:515)
   [junit4]    > 	at org.apache.solr.handler.component.TermVectorComponentDistributedTest.doTest(TermVectorComponentDistributedTest.java:195)
   [junit4]    > 	at org.apache.solr.BaseDistributedSearchTestCase.testDistribSearch(BaseDistributedSearchTestCase.java:849)
   [junit4]    > 	at java.lang.Thread.run(Thread.java:780)
   [junit4]   2> 1159233 T3541 oas.SolrTestCaseJ4.deleteCore ###deleteCore
   [junit4]   2> NOTE: test params are: codec=Asserting, sim=DefaultSimilarity, locale=fi_FI, timezone=Asia/Tokyo
   [junit4]   2> NOTE: Linux 3.8.0-33-generic x86/IBM Corporation 1.7.0 (32-bit)/cpus=8,threads=1,free=28494376,total=187564032
   [junit4]   2> NOTE: All tests run in this JVM: [TestRecovery, CollectionsAPIDistributedZkTest, TestQuerySenderNoQuery, CurrencyFieldXmlFileTest, TestInfoStreamLogging, TestCustomSort, TestPhraseSuggestions, OpenExchangeRatesOrgProviderTest, SolrCmdDistributorTest, DisMaxRequestHandlerTest, TestDistributedMissingSort, TestSolr4Spatial, LeaderElectionIntegrationTest, SolrTestCaseJ4Test, PrimUtilsTest, DirectUpdateHandlerTest, TestSolrCoreProperties, SortByFunctionTest, TestFieldResource, ZkSolrClientTest, HdfsChaosMonkeySafeLeaderTest, StandardRequestHandlerTest, DistributedDebugComponentTest, SolrRequestParserTest, HdfsRecoveryZkTest, DistanceFunctionTest, TestIBSimilarityFactory, TestCodecSupport, HighlighterConfigTest, TimeZoneUtilsTest, TestFileDictionaryLookup, FileUtilsTest, TestNoOpRegenerator, PathHierarchyTokenizerFactoryTest, TestJmxIntegration, NumericFieldsTest, ChaosMonkeySafeLeaderTest, XsltUpdateRequestHandlerTest, OpenCloseCoreStressTest, TestOmitPositions, TestDynamicFieldCollectionResource, TestCollationField, TestDistributedGrouping, DocumentAnalysisRequestHandlerTest, DebugComponentTest, HdfsLockFactoryTest, SimplePostToolTest, SuggesterTSTTest, TestXIncludeConfig, TestAnalyzeInfixSuggestions, TestIndexingPerformance, TestSolrDeletionPolicy2, IndexBasedSpellCheckerTest, QueryResultKeyTest, TestUtils, SolrIndexConfigTest, TestReload, TestSolrQueryParserResource, TestFastWriter, TestSolrXml, AliasIntegrationTest, TestFastOutputStream, TestSchemaNameResource, TestRangeQuery, TestAtomicUpdateErrorCases, TestAddFieldRealTimeGet, TestSolrXmlPersistence, CoreContainerCoreInitFailuresTest, IndexSchemaRuntimeFieldTest, MigrateRouteKeyTest, CachingDirectoryFactoryTest, DirectSolrConnectionTest, SpellingQueryConverterTest, TestLazyCores, TestStressRecovery, DistributedQueryComponentCustomSortTest, SuggesterWFSTTest, HighlighterTest, HdfsUnloadDistributedZkTest, TestWordDelimiterFilterFactory, TriLevelCompositeIdRoutingTest, StatsComponentTest, BasicZkTest, FullSolrCloudDistribCmdsTest, ClusterStateUpdateTest, LeaderElectionTest, TestZkChroot, TestRandomDVFaceting, TermVectorComponentDistributedTest]
   [junit4] Completed on J1 in 1.73s, 1 test, 1 failure <<< FAILURES!

[...truncated 13 lines...]
   [junit4] Suite: org.apache.solr.update.HardAutoCommitTest
   [junit4]   2> 1212924 T4034 oas.SolrTestCaseJ4.initCore ####initCore
   [junit4]   2> Creating dataDir: /mnt/ssd/jenkins/workspace/Lucene-Solr-4.x-Linux/solr/build/solr-core/test/J0/./solrtest-HardAutoCommitTest-1385815360432
   [junit4]   2> 1212925 T4034 oasc.SolrResourceLoader.<init> new SolrResourceLoader for directory: '/mnt/ssd/jenkins/workspace/Lucene-Solr-4.x-Linux/solr/build/solr-core/test-files/solr/collection1/'
   [junit4]   2> 1212926 T4034 oasc.SolrResourceLoader.replaceClassLoader Adding 'file:/mnt/ssd/jenkins/workspace/Lucene-Solr-4.x-Linux/solr/build/solr-core/test-files/solr/collection1/lib/classes/' to classloader
   [junit4]   2> 1212928 T4034 oasc.SolrResourceLoader.replaceClassLoader Adding 'file:/mnt/ssd/jenkins/workspace/Lucene-Solr-4.x-Linux/solr/build/solr-core/test-files/solr/collection1/lib/README' to classloader
   [junit4]   2> 1212981 T4034 oasc.SolrConfig.<init> Using Lucene MatchVersion: LUCENE_47
   [junit4]   2> 1213037 T4034 oasc.SolrConfig.<init> Loaded SolrConfig: solrconfig.xml
   [junit4]   2> 1213038 T4034 oass.IndexSchema.readSchema Reading Solr Schema from schema.xml
   [junit4]   2> 1213046 T4034 oass.IndexSchema.readSchema [null] Schema name=test
   [junit4]   2> 1213508 T4034 oass.ByteField.init WARN ByteField is deprecated and will be removed in 5.0. You should use TrieIntField instead.
   [junit4]   2> 1213509 T4034 oass.ShortField.init WARN ShortField is deprecated and will be removed in 5.0. You should use TrieIntField instead.
   [junit4]   2> 1213510 T4034 oass.OpenExchangeRatesOrgProvider.init Initialized with rates=open-exchange-rates.json, refreshInterval=1440.
   [junit4]   2> 1213523 T4034 oass.IndexSchema.readSchema default search field in schema is text
   [junit4]   2> 1213527 T4034 oass.IndexSchema.readSchema unique key field: id
   [junit4]   2> 1213549 T4034 oass.FileExchangeRateProvider.reload Reloading exchange rates from file currency.xml
   [junit4]   2> 1213565 T4034 oass.FileExchangeRateProvider.reload Reloading exchange rates from file currency.xml
   [junit4]   2> 1213582 T4034 oass.OpenExchangeRatesOrgProvider.reload Reloading exchange rates from open-exchange-rates.json
   [junit4]   2> 1213588 T4034 oass.OpenExchangeRatesOrgProvider$OpenExchangeRates.<init> WARN Unknown key IMPORTANT NOTE
   [junit4]   2> 1213590 T4034 oass.OpenExchangeRatesOrgProvider$OpenExchangeRates.<init> WARN Expected key, got STRING
   [junit4]   2> 1213591 T4034 oass.OpenExchangeRatesOrgProvider.reload Reloading exchange rates from open-exchange-rates.json
   [junit4]   2> 1213593 T4034 oass.OpenExchangeRatesOrgProvider$OpenExchangeRates.<init> WARN Unknown key IMPORTANT NOTE
   [junit4]   2> 1213594 T4034 oass.OpenExchangeRatesOrgProvider$OpenExchangeRates.<init> WARN Expected key, got STRING
   [junit4]   2> 1213594 T4034 oasc.SolrResourceLoader.locateSolrHome JNDI not configured for solr (NoInitialContextEx)
   [junit4]   2> 1213597 T4034 oasc.SolrResourceLoader.locateSolrHome using system property solr.solr.home: /mnt/ssd/jenkins/workspace/Lucene-Solr-4.x-Linux/solr/build/solr-core/test-files/solr
   [junit4]   2> 1213598 T4034 oasc.SolrResourceLoader.<init> new SolrResourceLoader for directory: '/mnt/ssd/jenkins/workspace/Lucene-Solr-4.x-Linux/solr/build/solr-core/test-files/solr/'
   [junit4]   2> 1213613 T4034 oasc.SolrResourceLoader.locateSolrHome JNDI not configured for solr (NoInitialContextEx)
   [junit4]   2> 1213614 T4034 oasc.SolrResourceLoader.locateSolrHome using system property solr.solr.home: /mnt/ssd/jenkins/workspace/Lucene-Solr-4.x-Linux/solr/build/solr-core/test-files/solr
   [junit4]   2> 1213615 T4034 oasc.SolrResourceLoader.<init> new SolrResourceLoader for deduced Solr Home: '/mnt/ssd/jenkins/workspace/Lucene-Solr-4.x-Linux/solr/build/solr-core/test-files/solr/'
   [junit4]   2> 1213660 T4034 oasc.CoreContainer.<init> New CoreContainer -1719875433
   [junit4]   2> 1213660 T4034 oasc.CoreContainer.load Loading cores into CoreContainer [instanceDir=/mnt/ssd/jenkins/workspace/Lucene-Solr-4.x-Linux/solr/build/solr-core/test-files/solr/]
   [junit4]   2> 1213662 T4034 oashc.HttpShardHandlerFactory.getParameter Setting socketTimeout to: 0
   [junit4]   2> 1213662 T4034 oashc.HttpShardHandlerFactory.getParameter Setting urlScheme to: http://
   [junit4]   2> 1213662 T4034 oashc.HttpShardHandlerFactory.getParameter Setting connTimeout to: 0
   [junit4]   2> 1213663 T4034 oashc.HttpShardHandlerFactory.getParameter Setting maxConnectionsPerHost to: 20
   [

[...truncated too long message...]

t4]   2> 1298043 T4376 C1249 oasu.DirectUpdateHandler2.deleteAll [collection1] REMOVING ALL DOCUMENTS FROM INDEX
   [junit4]   2> 1298044 T4376 C1249 oasup.LogUpdateProcessor.finish [collection1] webapp=null path=null params={} {deleteByQuery=*:*} 0 1
   [junit4]   2> 1298050 T4376 C1249 oasu.DirectUpdateHandler2.commit start commit{,optimize=false,openSearcher=true,waitSearcher=true,expungeDeletes=false,softCommit=false,prepareCommit=false}
   [junit4]   2> 1298051 T4376 C1249 oasc.SolrDeletionPolicy.onCommit SolrDeletionPolicy.onCommit: commits: num=2
   [junit4]   2> 		commit{dir=RateLimitedDirectoryWrapper(MockDirectoryWrapper(org.apache.lucene.store.RAMDirectory@4e49e280 lockFactory=org.apache.lucene.store.SingleInstanceLockFactory@a18527e6)),segFN=segments_z,generation=35}
   [junit4]   2> 		commit{dir=RateLimitedDirectoryWrapper(MockDirectoryWrapper(org.apache.lucene.store.RAMDirectory@4e49e280 lockFactory=org.apache.lucene.store.SingleInstanceLockFactory@a18527e6)),segFN=segments_10,generation=36}
   [junit4]   2> 1298052 T4376 C1249 oasc.SolrDeletionPolicy.updateCommits newest commit generation = 36
   [junit4]   2> 1298052 T4376 C1249 oass.SolrIndexSearcher.<init> Opening Searcher@90e142e5 main
   [junit4]   2> 1298053 T4376 C1249 oasu.DirectUpdateHandler2.commit end_commit_flush
   [junit4]   2> 1298055 T4378 oasc.SolrCore.registerSearcher [collection1] Registered new searcher Searcher@90e142e5 main{StandardDirectoryReader(segments_10:149:nrt)}
   [junit4]   2> 1298056 T4376 C1249 oasup.LogUpdateProcessor.finish [collection1] webapp=null path=null params={} {commit=} 0 6
   [junit4]   2> 1298061 T4376 oasu.DirectUpdateHandler2.commit start commit{,optimize=false,openSearcher=true,waitSearcher=true,expungeDeletes=false,softCommit=false,prepareCommit=false}
   [junit4]   2> 1298062 T4376 oasc.SolrDeletionPolicy.onCommit SolrDeletionPolicy.onCommit: commits: num=2
   [junit4]   2> 		commit{dir=RateLimitedDirectoryWrapper(MockDirectoryWrapper(org.apache.lucene.store.RAMDirectory@4e49e280 lockFactory=org.apache.lucene.store.SingleInstanceLockFactory@a18527e6)),segFN=segments_10,generation=36}
   [junit4]   2> 		commit{dir=RateLimitedDirectoryWrapper(MockDirectoryWrapper(org.apache.lucene.store.RAMDirectory@4e49e280 lockFactory=org.apache.lucene.store.SingleInstanceLockFactory@a18527e6)),segFN=segments_11,generation=37}
   [junit4]   2> 1298063 T4376 oasc.SolrDeletionPolicy.updateCommits newest commit generation = 37
   [junit4]   2> 1298063 T4376 oass.SolrIndexSearcher.<init> Opening Searcher@6eb4a1f5 main
   [junit4]   2> 1298064 T4376 oasu.DirectUpdateHandler2.commit end_commit_flush
   [junit4]   2> 1298066 T4378 oasc.SolrCore.registerSearcher [collection1] Registered new searcher Searcher@6eb4a1f5 main{StandardDirectoryReader(segments_11:151:nrt _13(4.7):C2)}
   [junit4]   2> 1298067 T4376 oas.SolrTestCaseJ4.tearDown ###Ending testNonIndexedSignatureField
   [junit4]   2> 1298070 T4376 oas.SolrTestCaseJ4.deleteCore ###deleteCore
   [junit4]   2> 1298070 T4376 oasc.CoreContainer.shutdown Shutting down CoreContainer instance=-433506903
   [junit4]   2> 1298071 T4376 oasc.SolrCore.close [collection1]  CLOSING SolrCore org.apache.solr.core.SolrCore@434bfc5b
   [junit4]   2> 1298081 T4376 oasu.DirectUpdateHandler2.close closing DirectUpdateHandler2{commits=42,autocommits=0,soft autocommits=0,optimizes=0,rollbacks=0,expungeDeletes=0,docsPending=0,adds=0,deletesById=0,deletesByQuery=0,errors=0,cumulative_adds=253,cumulative_deletesById=0,cumulative_deletesByQuery=6,cumulative_errors=0}
   [junit4]   2> 1298082 T4376 oasu.SolrCoreState.decrefSolrCoreState Closing SolrCoreState
   [junit4]   2> 1298082 T4376 oasu.DefaultSolrCoreState.closeIndexWriter SolrCoreState ref count has reached 0 - closing IndexWriter
   [junit4]   2> 1298083 T4376 oasu.DefaultSolrCoreState.closeIndexWriter closing IndexWriter with IndexWriterCloser
   [junit4]   2> 1298083 T4376 oasc.SolrCore.closeSearcher [collection1] Closing main searcher on request.
   [junit4]   2> 1298084 T4376 oasc.CachingDirectoryFactory.close Closing MockDirectoryFactory - 2 directories currently being tracked
   [junit4]   2> 1298084 T4376 oasc.CachingDirectoryFactory.closeCacheValue looking to close /mnt/ssd/jenkins/workspace/Lucene-Solr-4.x-Linux/solr/build/solr-core/test/J0/./solrtest-SignatureUpdateProcessorFactoryTest-1385815443944/index [CachedDir<<refCount=0;path=/mnt/ssd/jenkins/workspace/Lucene-Solr-4.x-Linux/solr/build/solr-core/test/J0/./solrtest-SignatureUpdateProcessorFactoryTest-1385815443944/index;done=false>>]
   [junit4]   2> 1298085 T4376 oasc.CachingDirectoryFactory.close Closing directory: /mnt/ssd/jenkins/workspace/Lucene-Solr-4.x-Linux/solr/build/solr-core/test/J0/./solrtest-SignatureUpdateProcessorFactoryTest-1385815443944/index
   [junit4]   2> 1298085 T4376 oasc.CachingDirectoryFactory.closeCacheValue looking to close /mnt/ssd/jenkins/workspace/Lucene-Solr-4.x-Linux/solr/build/solr-core/test/J0/./solrtest-SignatureUpdateProcessorFactoryTest-1385815443944 [CachedDir<<refCount=0;path=/mnt/ssd/jenkins/workspace/Lucene-Solr-4.x-Linux/solr/build/solr-core/test/J0/./solrtest-SignatureUpdateProcessorFactoryTest-1385815443944;done=false>>]
   [junit4]   2> 1298086 T4376 oasc.CachingDirectoryFactory.close Closing directory: /mnt/ssd/jenkins/workspace/Lucene-Solr-4.x-Linux/solr/build/solr-core/test/J0/./solrtest-SignatureUpdateProcessorFactoryTest-1385815443944
   [junit4]   2> NOTE: test params are: codec=Lucene46: {weight=Lucene41(blocksize=128), signatureField=PostingsFormat(name=Lucene41WithOrds), name=PostingsFormat(name=SimpleText), ints_is=PostingsFormat(name=MockRandom), v_t=PostingsFormat(name=SimpleText), id=PostingsFormat(name=SimpleText)}, docValues:{}, sim=RandomSimilarityProvider(queryNorm=true,coord=no): {}, locale=ro_RO, timezone=Europe/Sarajevo
   [junit4]   2> NOTE: Linux 3.8.0-33-generic x86/IBM Corporation 1.7.0 (32-bit)/cpus=8,threads=1,free=15694320,total=200605696
   [junit4]   2> NOTE: All tests run in this JVM: [TestDocumentBuilder, TestImplicitCoreProperties, TestLMDirichletSimilarityFactory, CopyFieldTest, TestManagedSchema, DirectUpdateHandlerOptimizeTest, TestHighFrequencyDictionaryFactory, TestUniqueKeyFieldResource, SolrXmlInZkTest, AutoCommitTest, TestDistribDocBasedVersion, ZkControllerTest, HdfsCollectionsAPIDistributedZkTest, SpellPossibilityIteratorTest, MBeansHandlerTest, SearchHandlerTest, TestPostingsSolrHighlighter, ShardRoutingTest, SystemInfoHandlerTest, ResponseLogComponentTest, TestSolrIndexConfig, TestLuceneMatchVersion, FieldMutatingUpdateProcessorTest, MoreLikeThisHandlerTest, DistributedSuggesterComponentTest, OverseerCollectionProcessorTest, SuggesterFSTTest, RecoveryZkTest, SolrIndexSplitterTest, OverseerTest, PeerSyncTest, URLClassifyProcessorTest, DateMathParserTest, JsonLoaderTest, LegacyHTMLStripCharFilterTest, TestReloadAndDeleteDocs, BadCopyFieldTest, SoftAutoCommitTest, TestFieldCollectionResource, SliceStateUpdateTest, BinaryUpdateRequestHandlerTest, TestExtendedDismaxParser, TestConfig, BadComponentTest, TestLRUCache, TestSuggestSpellingConverter, DocValuesTest, IndexSchemaTest, TestRecoveryHdfs, LoggingHandlerTest, TestSerializedLuceneMatchVersion, TestSort, HdfsBasicDistributedZkTest, CoreAdminCreateDiscoverTest, SOLR749Test, TestSolrXMLSerializer, TestSolrQueryParserDefaultOperatorResource, TestElisionMultitermQuery, ModifyConfFileTest, CoreAdminHandlerTest, AnalysisAfterCoreReloadTest, TermVectorComponentTest, HdfsBasicDistributedZk2Test, CSVRequestHandlerTest, TestFaceting, TestStressUserVersions, TestJoin, PreAnalyzedUpdateProcessorTest, TestMergePolicyConfig, SpatialFilterTest, TestCopyFieldCollectionResource, PolyFieldTest, TestLFUCache, CacheHeaderTest, FileBasedSpellCheckerTest, DocValuesMissingTest, TestRemoteStreaming, TestSchemaVersionResource, TestLMJelinekMercerSimilarityFactory, StressHdfsTest, DistributedSpellCheckComponentTest, TestFunctionQuery, ClusterStateTest, BasicDistributedZkTest, BasicDistributedZk2Test, UnloadDistributedZkTest, SyncSliceTest, TestReplicationHandler, TestRandomFaceting, ZkCLITest, ShardRoutingCustomTest, TestDistributedSearch, TestHashPartitioner, TestStressReorder, HardAutoCommitTest, DistributedTermsComponentTest, TestCoreContainer, SolrCoreTest, TestGroupingSearch, BasicFunctionalityTest, TestBadConfig, TestIndexSearcher, ShowFileRequestHandlerTest, CurrencyFieldOpenExchangeTest, DistributedQueryElevationComponentTest, TestCoreDiscovery, SignatureUpdateProcessorFactoryTest]
   [junit4] Completed on J0 in 1.67s, 6 tests, 2 failures <<< FAILURES!

[...truncated 425 lines...]
BUILD FAILED
/mnt/ssd/jenkins/workspace/Lucene-Solr-4.x-Linux/build.xml:426: The following error occurred while executing this line:
/mnt/ssd/jenkins/workspace/Lucene-Solr-4.x-Linux/build.xml:419: The following error occurred while executing this line:
/mnt/ssd/jenkins/workspace/Lucene-Solr-4.x-Linux/build.xml:39: The following error occurred while executing this line:
/mnt/ssd/jenkins/workspace/Lucene-Solr-4.x-Linux/extra-targets.xml:37: The following error occurred while executing this line:
/mnt/ssd/jenkins/workspace/Lucene-Solr-4.x-Linux/solr/build.xml:189: The following error occurred while executing this line:
/mnt/ssd/jenkins/workspace/Lucene-Solr-4.x-Linux/solr/common-build.xml:491: The following error occurred while executing this line:
/mnt/ssd/jenkins/workspace/Lucene-Solr-4.x-Linux/lucene/common-build.xml:1279: The following error occurred while executing this line:
/mnt/ssd/jenkins/workspace/Lucene-Solr-4.x-Linux/lucene/common-build.xml:912: There were test failures: 349 suites, 1516 tests, 1 error, 4 failures, 34 ignored (6 assumptions)

Total time: 54 minutes 43 seconds
Build step 'Invoke Ant' marked build as failure
Description set: Java: 32bit/ibm-j9-jdk7 -Xjit:exclude={org/apache/lucene/util/fst/FST.pack(IIF)Lorg/apache/lucene/util/fst/FST;}
Archiving artifacts
Recording test results
Email was triggered for: Failure
Sending email for trigger: Failure



Mime
View raw message