lucene-dev mailing list archives

Site index · List index
Message view « Date » · « Thread »
Top « Date » · « Thread »
From Policeman Jenkins Server <jenk...@thetaphi.de>
Subject [JENKINS] Lucene-Solr-trunk-Linux (32bit/ibm-j9-jdk7) - Build # 8468 - Still Failing!
Date Tue, 26 Nov 2013 09:47:44 GMT
Build: http://jenkins.thetaphi.de/job/Lucene-Solr-trunk-Linux/8468/
Java: 32bit/ibm-j9-jdk7 -Xjit:exclude={org/apache/lucene/util/fst/FST.pack(IIF)Lorg/apache/lucene/util/fst/FST;}

7 tests failed.
REGRESSION:  org.apache.solr.analytics.expression.ExpressionTest.multiplyTest

Error Message:
For input string: "" encoding="UTF-8"?> <response>  <lst name="responseHeader">   <int name="status">0</int>   <int name="QTime">48</int> </lst> <result name="response" numFound="100" start="0"> </result> <lst name="stats">   <lst name="stats_fields"/> </lst> <lst name="stats">   <lst name="cnr">     <double name="c10">10.0"

Stack Trace:
java.lang.NumberFormatException: For input string: "" encoding="UTF-8"?>
<response>

<lst name="responseHeader">
  <int name="status">0</int>
  <int name="QTime">48</int>
</lst>
<result name="response" numFound="100" start="0">
</result>
<lst name="stats">
  <lst name="stats_fields"/>
</lst>
<lst name="stats">
  <lst name="cnr">
    <double name="c10">10.0"
	at __randomizedtesting.SeedInfo.seed([9740471648477CBB:FCC159687D494AD5]:0)
	at sun.misc.FloatingDecimal.readJavaFormatString(FloatingDecimal.java:1312)
	at java.lang.Double.parseDouble(Double.java:551)
	at org.apache.solr.analytics.expression.ExpressionTest.getStatResult(ExpressionTest.java:240)
	at org.apache.solr.analytics.expression.ExpressionTest.multiplyTest(ExpressionTest.java:96)
	at sun.reflect.NativeMethodAccessorImpl.invoke0(Native Method)
	at sun.reflect.NativeMethodAccessorImpl.invoke(NativeMethodAccessorImpl.java:88)
	at sun.reflect.DelegatingMethodAccessorImpl.invoke(DelegatingMethodAccessorImpl.java:55)
	at java.lang.reflect.Method.invoke(Method.java:613)
	at com.carrotsearch.randomizedtesting.RandomizedRunner.invoke(RandomizedRunner.java:1559)
	at com.carrotsearch.randomizedtesting.RandomizedRunner.access$600(RandomizedRunner.java:79)
	at com.carrotsearch.randomizedtesting.RandomizedRunner$6.evaluate(RandomizedRunner.java:737)
	at com.carrotsearch.randomizedtesting.RandomizedRunner$7.evaluate(RandomizedRunner.java:773)
	at com.carrotsearch.randomizedtesting.RandomizedRunner$8.evaluate(RandomizedRunner.java:787)
	at com.carrotsearch.randomizedtesting.rules.SystemPropertiesRestoreRule$1.evaluate(SystemPropertiesRestoreRule.java:53)
	at org.apache.lucene.util.TestRuleSetupTeardownChained$1.evaluate(TestRuleSetupTeardownChained.java:50)
	at org.apache.lucene.util.TestRuleFieldCacheSanity$1.evaluate(TestRuleFieldCacheSanity.java:51)
	at org.apache.lucene.util.AbstractBeforeAfterRule$1.evaluate(AbstractBeforeAfterRule.java:46)
	at com.carrotsearch.randomizedtesting.rules.SystemPropertiesInvariantRule$1.evaluate(SystemPropertiesInvariantRule.java:55)
	at org.apache.lucene.util.TestRuleThreadAndTestName$1.evaluate(TestRuleThreadAndTestName.java:49)
	at org.apache.lucene.util.TestRuleIgnoreAfterMaxFailures$1.evaluate(TestRuleIgnoreAfterMaxFailures.java:70)
	at org.apache.lucene.util.TestRuleMarkFailure$1.evaluate(TestRuleMarkFailure.java:48)
	at com.carrotsearch.randomizedtesting.rules.StatementAdapter.evaluate(StatementAdapter.java:36)
	at com.carrotsearch.randomizedtesting.ThreadLeakControl$StatementRunner.run(ThreadLeakControl.java:358)
	at com.carrotsearch.randomizedtesting.ThreadLeakControl.forkTimeoutingTask(ThreadLeakControl.java:782)
	at com.carrotsearch.randomizedtesting.ThreadLeakControl$3.evaluate(ThreadLeakControl.java:442)
	at com.carrotsearch.randomizedtesting.RandomizedRunner.runSingleTest(RandomizedRunner.java:746)
	at com.carrotsearch.randomizedtesting.RandomizedRunner$3.evaluate(RandomizedRunner.java:648)
	at com.carrotsearch.randomizedtesting.RandomizedRunner$4.evaluate(RandomizedRunner.java:682)
	at com.carrotsearch.randomizedtesting.RandomizedRunner$5.evaluate(RandomizedRunner.java:693)
	at com.carrotsearch.randomizedtesting.rules.StatementAdapter.evaluate(StatementAdapter.java:36)
	at com.carrotsearch.randomizedtesting.rules.SystemPropertiesRestoreRule$1.evaluate(SystemPropertiesRestoreRule.java:53)
	at org.apache.lucene.util.AbstractBeforeAfterRule$1.evaluate(AbstractBeforeAfterRule.java:46)
	at org.apache.lucene.util.TestRuleStoreClassName$1.evaluate(TestRuleStoreClassName.java:42)
	at com.carrotsearch.randomizedtesting.rules.SystemPropertiesInvariantRule$1.evaluate(SystemPropertiesInvariantRule.java:55)
	at com.carrotsearch.randomizedtesting.rules.NoShadowingOrOverridesOnMethodsRule$1.evaluate(NoShadowingOrOverridesOnMethodsRule.java:39)
	at com.carrotsearch.randomizedtesting.rules.NoShadowingOrOverridesOnMethodsRule$1.evaluate(NoShadowingOrOverridesOnMethodsRule.java:39)
	at com.carrotsearch.randomizedtesting.rules.StatementAdapter.evaluate(StatementAdapter.java:36)
	at org.apache.lucene.util.TestRuleAssertionsRequired$1.evaluate(TestRuleAssertionsRequired.java:43)
	at org.apache.lucene.util.TestRuleMarkFailure$1.evaluate(TestRuleMarkFailure.java:48)
	at org.apache.lucene.util.TestRuleIgnoreAfterMaxFailures$1.evaluate(TestRuleIgnoreAfterMaxFailures.java:70)
	at org.apache.lucene.util.TestRuleIgnoreTestSuites$1.evaluate(TestRuleIgnoreTestSuites.java:55)
	at com.carrotsearch.randomizedtesting.rules.StatementAdapter.evaluate(StatementAdapter.java:36)
	at com.carrotsearch.randomizedtesting.ThreadLeakControl$StatementRunner.run(ThreadLeakControl.java:358)
	at java.lang.Thread.run(Thread.java:780)


REGRESSION:  org.apache.solr.analytics.expression.ExpressionTest.negateTest

Error Message:
For input string: ".0" encoding="UTF-8"?> <response>  <lst name="responseHeader">   <int name="status">0</int>   <int name="QTime">48</int> </lst> <result name="response" numFound="100" start="0"> </result> <lst name="stats">   <lst name="stats_fields"/> </lst> <lst name="stats">   <lst name="cnr">     <double name="c10">10.0"

Stack Trace:
java.lang.NumberFormatException: For input string: ".0" encoding="UTF-8"?>
<response>

<lst name="responseHeader">
  <int name="status">0</int>
  <int name="QTime">48</int>
</lst>
<result name="response" numFound="100" start="0">
</result>
<lst name="stats">
  <lst name="stats_fields"/>
</lst>
<lst name="stats">
  <lst name="cnr">
    <double name="c10">10.0"
	at __randomizedtesting.SeedInfo.seed([9740471648477CBB:9F482FB3EC6A2C0B]:0)
	at sun.misc.FloatingDecimal.readJavaFormatString(FloatingDecimal.java:1312)
	at java.lang.Double.parseDouble(Double.java:551)
	at org.apache.solr.analytics.expression.ExpressionTest.getStatResult(ExpressionTest.java:240)
	at org.apache.solr.analytics.expression.ExpressionTest.negateTest(ExpressionTest.java:137)
	at sun.reflect.NativeMethodAccessorImpl.invoke0(Native Method)
	at sun.reflect.NativeMethodAccessorImpl.invoke(NativeMethodAccessorImpl.java:88)
	at sun.reflect.DelegatingMethodAccessorImpl.invoke(DelegatingMethodAccessorImpl.java:55)
	at java.lang.reflect.Method.invoke(Method.java:613)
	at com.carrotsearch.randomizedtesting.RandomizedRunner.invoke(RandomizedRunner.java:1559)
	at com.carrotsearch.randomizedtesting.RandomizedRunner.access$600(RandomizedRunner.java:79)
	at com.carrotsearch.randomizedtesting.RandomizedRunner$6.evaluate(RandomizedRunner.java:737)
	at com.carrotsearch.randomizedtesting.RandomizedRunner$7.evaluate(RandomizedRunner.java:773)
	at com.carrotsearch.randomizedtesting.RandomizedRunner$8.evaluate(RandomizedRunner.java:787)
	at com.carrotsearch.randomizedtesting.rules.SystemPropertiesRestoreRule$1.evaluate(SystemPropertiesRestoreRule.java:53)
	at org.apache.lucene.util.TestRuleSetupTeardownChained$1.evaluate(TestRuleSetupTeardownChained.java:50)
	at org.apache.lucene.util.TestRuleFieldCacheSanity$1.evaluate(TestRuleFieldCacheSanity.java:51)
	at org.apache.lucene.util.AbstractBeforeAfterRule$1.evaluate(AbstractBeforeAfterRule.java:46)
	at com.carrotsearch.randomizedtesting.rules.SystemPropertiesInvariantRule$1.evaluate(SystemPropertiesInvariantRule.java:55)
	at org.apache.lucene.util.TestRuleThreadAndTestName$1.evaluate(TestRuleThreadAndTestName.java:49)
	at org.apache.lucene.util.TestRuleIgnoreAfterMaxFailures$1.evaluate(TestRuleIgnoreAfterMaxFailures.java:70)
	at org.apache.lucene.util.TestRuleMarkFailure$1.evaluate(TestRuleMarkFailure.java:48)
	at com.carrotsearch.randomizedtesting.rules.StatementAdapter.evaluate(StatementAdapter.java:36)
	at com.carrotsearch.randomizedtesting.ThreadLeakControl$StatementRunner.run(ThreadLeakControl.java:358)
	at com.carrotsearch.randomizedtesting.ThreadLeakControl.forkTimeoutingTask(ThreadLeakControl.java:782)
	at com.carrotsearch.randomizedtesting.ThreadLeakControl$3.evaluate(ThreadLeakControl.java:442)
	at com.carrotsearch.randomizedtesting.RandomizedRunner.runSingleTest(RandomizedRunner.java:746)
	at com.carrotsearch.randomizedtesting.RandomizedRunner$3.evaluate(RandomizedRunner.java:648)
	at com.carrotsearch.randomizedtesting.RandomizedRunner$4.evaluate(RandomizedRunner.java:682)
	at com.carrotsearch.randomizedtesting.RandomizedRunner$5.evaluate(RandomizedRunner.java:693)
	at com.carrotsearch.randomizedtesting.rules.StatementAdapter.evaluate(StatementAdapter.java:36)
	at com.carrotsearch.randomizedtesting.rules.SystemPropertiesRestoreRule$1.evaluate(SystemPropertiesRestoreRule.java:53)
	at org.apache.lucene.util.AbstractBeforeAfterRule$1.evaluate(AbstractBeforeAfterRule.java:46)
	at org.apache.lucene.util.TestRuleStoreClassName$1.evaluate(TestRuleStoreClassName.java:42)
	at com.carrotsearch.randomizedtesting.rules.SystemPropertiesInvariantRule$1.evaluate(SystemPropertiesInvariantRule.java:55)
	at com.carrotsearch.randomizedtesting.rules.NoShadowingOrOverridesOnMethodsRule$1.evaluate(NoShadowingOrOverridesOnMethodsRule.java:39)
	at com.carrotsearch.randomizedtesting.rules.NoShadowingOrOverridesOnMethodsRule$1.evaluate(NoShadowingOrOverridesOnMethodsRule.java:39)
	at com.carrotsearch.randomizedtesting.rules.StatementAdapter.evaluate(StatementAdapter.java:36)
	at org.apache.lucene.util.TestRuleAssertionsRequired$1.evaluate(TestRuleAssertionsRequired.java:43)
	at org.apache.lucene.util.TestRuleMarkFailure$1.evaluate(TestRuleMarkFailure.java:48)
	at org.apache.lucene.util.TestRuleIgnoreAfterMaxFailures$1.evaluate(TestRuleIgnoreAfterMaxFailures.java:70)
	at org.apache.lucene.util.TestRuleIgnoreTestSuites$1.evaluate(TestRuleIgnoreTestSuites.java:55)
	at com.carrotsearch.randomizedtesting.rules.StatementAdapter.evaluate(StatementAdapter.java:36)
	at com.carrotsearch.randomizedtesting.ThreadLeakControl$StatementRunner.run(ThreadLeakControl.java:358)
	at java.lang.Thread.run(Thread.java:780)


REGRESSION:  org.apache.solr.analytics.expression.ExpressionTest.absoluteValueTest

Error Message:
For input string: ".0" encoding="UTF-8"?> <response>  <lst name="responseHeader">   <int name="status">0</int>   <int name="QTime">48</int> </lst> <result name="response" numFound="100" start="0"> </result> <lst name="stats">   <lst name="stats_fields"/> </lst> <lst name="stats">   <lst name="cnr">     <double name="c10">10.0"

Stack Trace:
java.lang.NumberFormatException: For input string: ".0" encoding="UTF-8"?>
<response>

<lst name="responseHeader">
  <int name="status">0</int>
  <int name="QTime">48</int>
</lst>
<result name="response" numFound="100" start="0">
</result>
<lst name="stats">
  <lst name="stats_fields"/>
</lst>
<lst name="stats">
  <lst name="cnr">
    <double name="c10">10.0"
	at __randomizedtesting.SeedInfo.seed([9740471648477CBB:B6EC670385DA24DD]:0)
	at sun.misc.FloatingDecimal.readJavaFormatString(FloatingDecimal.java:1312)
	at java.lang.Double.parseDouble(Double.java:551)
	at org.apache.solr.analytics.expression.ExpressionTest.getStatResult(ExpressionTest.java:240)
	at org.apache.solr.analytics.expression.ExpressionTest.absoluteValueTest(ExpressionTest.java:148)
	at sun.reflect.NativeMethodAccessorImpl.invoke0(Native Method)
	at sun.reflect.NativeMethodAccessorImpl.invoke(NativeMethodAccessorImpl.java:88)
	at sun.reflect.DelegatingMethodAccessorImpl.invoke(DelegatingMethodAccessorImpl.java:55)
	at java.lang.reflect.Method.invoke(Method.java:613)
	at com.carrotsearch.randomizedtesting.RandomizedRunner.invoke(RandomizedRunner.java:1559)
	at com.carrotsearch.randomizedtesting.RandomizedRunner.access$600(RandomizedRunner.java:79)
	at com.carrotsearch.randomizedtesting.RandomizedRunner$6.evaluate(RandomizedRunner.java:737)
	at com.carrotsearch.randomizedtesting.RandomizedRunner$7.evaluate(RandomizedRunner.java:773)
	at com.carrotsearch.randomizedtesting.RandomizedRunner$8.evaluate(RandomizedRunner.java:787)
	at com.carrotsearch.randomizedtesting.rules.SystemPropertiesRestoreRule$1.evaluate(SystemPropertiesRestoreRule.java:53)
	at org.apache.lucene.util.TestRuleSetupTeardownChained$1.evaluate(TestRuleSetupTeardownChained.java:50)
	at org.apache.lucene.util.TestRuleFieldCacheSanity$1.evaluate(TestRuleFieldCacheSanity.java:51)
	at org.apache.lucene.util.AbstractBeforeAfterRule$1.evaluate(AbstractBeforeAfterRule.java:46)
	at com.carrotsearch.randomizedtesting.rules.SystemPropertiesInvariantRule$1.evaluate(SystemPropertiesInvariantRule.java:55)
	at org.apache.lucene.util.TestRuleThreadAndTestName$1.evaluate(TestRuleThreadAndTestName.java:49)
	at org.apache.lucene.util.TestRuleIgnoreAfterMaxFailures$1.evaluate(TestRuleIgnoreAfterMaxFailures.java:70)
	at org.apache.lucene.util.TestRuleMarkFailure$1.evaluate(TestRuleMarkFailure.java:48)
	at com.carrotsearch.randomizedtesting.rules.StatementAdapter.evaluate(StatementAdapter.java:36)
	at com.carrotsearch.randomizedtesting.ThreadLeakControl$StatementRunner.run(ThreadLeakControl.java:358)
	at com.carrotsearch.randomizedtesting.ThreadLeakControl.forkTimeoutingTask(ThreadLeakControl.java:782)
	at com.carrotsearch.randomizedtesting.ThreadLeakControl$3.evaluate(ThreadLeakControl.java:442)
	at com.carrotsearch.randomizedtesting.RandomizedRunner.runSingleTest(RandomizedRunner.java:746)
	at com.carrotsearch.randomizedtesting.RandomizedRunner$3.evaluate(RandomizedRunner.java:648)
	at com.carrotsearch.randomizedtesting.RandomizedRunner$4.evaluate(RandomizedRunner.java:682)
	at com.carrotsearch.randomizedtesting.RandomizedRunner$5.evaluate(RandomizedRunner.java:693)
	at com.carrotsearch.randomizedtesting.rules.StatementAdapter.evaluate(StatementAdapter.java:36)
	at com.carrotsearch.randomizedtesting.rules.SystemPropertiesRestoreRule$1.evaluate(SystemPropertiesRestoreRule.java:53)
	at org.apache.lucene.util.AbstractBeforeAfterRule$1.evaluate(AbstractBeforeAfterRule.java:46)
	at org.apache.lucene.util.TestRuleStoreClassName$1.evaluate(TestRuleStoreClassName.java:42)
	at com.carrotsearch.randomizedtesting.rules.SystemPropertiesInvariantRule$1.evaluate(SystemPropertiesInvariantRule.java:55)
	at com.carrotsearch.randomizedtesting.rules.NoShadowingOrOverridesOnMethodsRule$1.evaluate(NoShadowingOrOverridesOnMethodsRule.java:39)
	at com.carrotsearch.randomizedtesting.rules.NoShadowingOrOverridesOnMethodsRule$1.evaluate(NoShadowingOrOverridesOnMethodsRule.java:39)
	at com.carrotsearch.randomizedtesting.rules.StatementAdapter.evaluate(StatementAdapter.java:36)
	at org.apache.lucene.util.TestRuleAssertionsRequired$1.evaluate(TestRuleAssertionsRequired.java:43)
	at org.apache.lucene.util.TestRuleMarkFailure$1.evaluate(TestRuleMarkFailure.java:48)
	at org.apache.lucene.util.TestRuleIgnoreAfterMaxFailures$1.evaluate(TestRuleIgnoreAfterMaxFailures.java:70)
	at org.apache.lucene.util.TestRuleIgnoreTestSuites$1.evaluate(TestRuleIgnoreTestSuites.java:55)
	at com.carrotsearch.randomizedtesting.rules.StatementAdapter.evaluate(StatementAdapter.java:36)
	at com.carrotsearch.randomizedtesting.ThreadLeakControl$StatementRunner.run(ThreadLeakControl.java:358)
	at java.lang.Thread.run(Thread.java:780)


REGRESSION:  org.apache.solr.handler.component.DistributedQueryElevationComponentTest.testDistribSearch

Error Message:
.responseHeader.params.version!=rows (unordered or missing)

Stack Trace:
junit.framework.AssertionFailedError: .responseHeader.params.version!=rows (unordered or missing)
	at __randomizedtesting.SeedInfo.seed([9740471648477CBB:16A6C90E3F181C87]:0)
	at junit.framework.Assert.fail(Assert.java:50)
	at org.apache.solr.BaseDistributedSearchTestCase.compareSolrResponses(BaseDistributedSearchTestCase.java:808)
	at org.apache.solr.BaseDistributedSearchTestCase.compareResponses(BaseDistributedSearchTestCase.java:827)
	at org.apache.solr.BaseDistributedSearchTestCase.query(BaseDistributedSearchTestCase.java:531)
	at org.apache.solr.BaseDistributedSearchTestCase.query(BaseDistributedSearchTestCase.java:511)
	at org.apache.solr.handler.component.DistributedQueryElevationComponentTest.doTest(DistributedQueryElevationComponentTest.java:81)
	at org.apache.solr.BaseDistributedSearchTestCase.testDistribSearch(BaseDistributedSearchTestCase.java:835)
	at sun.reflect.NativeMethodAccessorImpl.invoke0(Native Method)
	at sun.reflect.NativeMethodAccessorImpl.invoke(NativeMethodAccessorImpl.java:88)
	at sun.reflect.DelegatingMethodAccessorImpl.invoke(DelegatingMethodAccessorImpl.java:55)
	at java.lang.reflect.Method.invoke(Method.java:613)
	at com.carrotsearch.randomizedtesting.RandomizedRunner.invoke(RandomizedRunner.java:1559)
	at com.carrotsearch.randomizedtesting.RandomizedRunner.access$600(RandomizedRunner.java:79)
	at com.carrotsearch.randomizedtesting.RandomizedRunner$6.evaluate(RandomizedRunner.java:737)
	at com.carrotsearch.randomizedtesting.RandomizedRunner$7.evaluate(RandomizedRunner.java:773)
	at com.carrotsearch.randomizedtesting.RandomizedRunner$8.evaluate(RandomizedRunner.java:787)
	at com.carrotsearch.randomizedtesting.rules.SystemPropertiesRestoreRule$1.evaluate(SystemPropertiesRestoreRule.java:53)
	at org.apache.lucene.util.TestRuleSetupTeardownChained$1.evaluate(TestRuleSetupTeardownChained.java:50)
	at org.apache.lucene.util.TestRuleFieldCacheSanity$1.evaluate(TestRuleFieldCacheSanity.java:51)
	at org.apache.lucene.util.AbstractBeforeAfterRule$1.evaluate(AbstractBeforeAfterRule.java:46)
	at com.carrotsearch.randomizedtesting.rules.SystemPropertiesInvariantRule$1.evaluate(SystemPropertiesInvariantRule.java:55)
	at org.apache.lucene.util.TestRuleThreadAndTestName$1.evaluate(TestRuleThreadAndTestName.java:49)
	at org.apache.lucene.util.TestRuleIgnoreAfterMaxFailures$1.evaluate(TestRuleIgnoreAfterMaxFailures.java:70)
	at org.apache.lucene.util.TestRuleMarkFailure$1.evaluate(TestRuleMarkFailure.java:48)
	at com.carrotsearch.randomizedtesting.rules.StatementAdapter.evaluate(StatementAdapter.java:36)
	at com.carrotsearch.randomizedtesting.ThreadLeakControl$StatementRunner.run(ThreadLeakControl.java:358)
	at com.carrotsearch.randomizedtesting.ThreadLeakControl.forkTimeoutingTask(ThreadLeakControl.java:782)
	at com.carrotsearch.randomizedtesting.ThreadLeakControl$3.evaluate(ThreadLeakControl.java:442)
	at com.carrotsearch.randomizedtesting.RandomizedRunner.runSingleTest(RandomizedRunner.java:746)
	at com.carrotsearch.randomizedtesting.RandomizedRunner$3.evaluate(RandomizedRunner.java:648)
	at com.carrotsearch.randomizedtesting.RandomizedRunner$4.evaluate(RandomizedRunner.java:682)
	at com.carrotsearch.randomizedtesting.RandomizedRunner$5.evaluate(RandomizedRunner.java:693)
	at com.carrotsearch.randomizedtesting.rules.StatementAdapter.evaluate(StatementAdapter.java:36)
	at com.carrotsearch.randomizedtesting.rules.SystemPropertiesRestoreRule$1.evaluate(SystemPropertiesRestoreRule.java:53)
	at org.apache.lucene.util.AbstractBeforeAfterRule$1.evaluate(AbstractBeforeAfterRule.java:46)
	at org.apache.lucene.util.TestRuleStoreClassName$1.evaluate(TestRuleStoreClassName.java:42)
	at com.carrotsearch.randomizedtesting.rules.SystemPropertiesInvariantRule$1.evaluate(SystemPropertiesInvariantRule.java:55)
	at com.carrotsearch.randomizedtesting.rules.NoShadowingOrOverridesOnMethodsRule$1.evaluate(NoShadowingOrOverridesOnMethodsRule.java:39)
	at com.carrotsearch.randomizedtesting.rules.NoShadowingOrOverridesOnMethodsRule$1.evaluate(NoShadowingOrOverridesOnMethodsRule.java:39)
	at com.carrotsearch.randomizedtesting.rules.StatementAdapter.evaluate(StatementAdapter.java:36)
	at org.apache.lucene.util.TestRuleAssertionsRequired$1.evaluate(TestRuleAssertionsRequired.java:43)
	at org.apache.lucene.util.TestRuleMarkFailure$1.evaluate(TestRuleMarkFailure.java:48)
	at org.apache.lucene.util.TestRuleIgnoreAfterMaxFailures$1.evaluate(TestRuleIgnoreAfterMaxFailures.java:70)
	at org.apache.lucene.util.TestRuleIgnoreTestSuites$1.evaluate(TestRuleIgnoreTestSuites.java:55)
	at com.carrotsearch.randomizedtesting.rules.StatementAdapter.evaluate(StatementAdapter.java:36)
	at com.carrotsearch.randomizedtesting.ThreadLeakControl$StatementRunner.run(ThreadLeakControl.java:358)
	at java.lang.Thread.run(Thread.java:780)


REGRESSION:  org.apache.solr.handler.component.TermVectorComponentDistributedTest.testDistribSearch

Error Message:
.termVectors.0.test_basictv!=test_offtv (unordered or missing)

Stack Trace:
junit.framework.AssertionFailedError: .termVectors.0.test_basictv!=test_offtv (unordered or missing)
	at __randomizedtesting.SeedInfo.seed([9740471648477CBB:16A6C90E3F181C87]:0)
	at junit.framework.Assert.fail(Assert.java:50)
	at org.apache.solr.BaseDistributedSearchTestCase.compareSolrResponses(BaseDistributedSearchTestCase.java:808)
	at org.apache.solr.BaseDistributedSearchTestCase.compareResponses(BaseDistributedSearchTestCase.java:827)
	at org.apache.solr.BaseDistributedSearchTestCase.query(BaseDistributedSearchTestCase.java:531)
	at org.apache.solr.BaseDistributedSearchTestCase.query(BaseDistributedSearchTestCase.java:511)
	at org.apache.solr.handler.component.TermVectorComponentDistributedTest.doTest(TermVectorComponentDistributedTest.java:127)
	at org.apache.solr.BaseDistributedSearchTestCase.testDistribSearch(BaseDistributedSearchTestCase.java:841)
	at sun.reflect.NativeMethodAccessorImpl.invoke0(Native Method)
	at sun.reflect.NativeMethodAccessorImpl.invoke(NativeMethodAccessorImpl.java:88)
	at sun.reflect.DelegatingMethodAccessorImpl.invoke(DelegatingMethodAccessorImpl.java:55)
	at java.lang.reflect.Method.invoke(Method.java:613)
	at com.carrotsearch.randomizedtesting.RandomizedRunner.invoke(RandomizedRunner.java:1559)
	at com.carrotsearch.randomizedtesting.RandomizedRunner.access$600(RandomizedRunner.java:79)
	at com.carrotsearch.randomizedtesting.RandomizedRunner$6.evaluate(RandomizedRunner.java:737)
	at com.carrotsearch.randomizedtesting.RandomizedRunner$7.evaluate(RandomizedRunner.java:773)
	at com.carrotsearch.randomizedtesting.RandomizedRunner$8.evaluate(RandomizedRunner.java:787)
	at com.carrotsearch.randomizedtesting.rules.SystemPropertiesRestoreRule$1.evaluate(SystemPropertiesRestoreRule.java:53)
	at org.apache.lucene.util.TestRuleSetupTeardownChained$1.evaluate(TestRuleSetupTeardownChained.java:50)
	at org.apache.lucene.util.TestRuleFieldCacheSanity$1.evaluate(TestRuleFieldCacheSanity.java:51)
	at org.apache.lucene.util.AbstractBeforeAfterRule$1.evaluate(AbstractBeforeAfterRule.java:46)
	at com.carrotsearch.randomizedtesting.rules.SystemPropertiesInvariantRule$1.evaluate(SystemPropertiesInvariantRule.java:55)
	at org.apache.lucene.util.TestRuleThreadAndTestName$1.evaluate(TestRuleThreadAndTestName.java:49)
	at org.apache.lucene.util.TestRuleIgnoreAfterMaxFailures$1.evaluate(TestRuleIgnoreAfterMaxFailures.java:70)
	at org.apache.lucene.util.TestRuleMarkFailure$1.evaluate(TestRuleMarkFailure.java:48)
	at com.carrotsearch.randomizedtesting.rules.StatementAdapter.evaluate(StatementAdapter.java:36)
	at com.carrotsearch.randomizedtesting.ThreadLeakControl$StatementRunner.run(ThreadLeakControl.java:358)
	at com.carrotsearch.randomizedtesting.ThreadLeakControl.forkTimeoutingTask(ThreadLeakControl.java:782)
	at com.carrotsearch.randomizedtesting.ThreadLeakControl$3.evaluate(ThreadLeakControl.java:442)
	at com.carrotsearch.randomizedtesting.RandomizedRunner.runSingleTest(RandomizedRunner.java:746)
	at com.carrotsearch.randomizedtesting.RandomizedRunner$3.evaluate(RandomizedRunner.java:648)
	at com.carrotsearch.randomizedtesting.RandomizedRunner$4.evaluate(RandomizedRunner.java:682)
	at com.carrotsearch.randomizedtesting.RandomizedRunner$5.evaluate(RandomizedRunner.java:693)
	at com.carrotsearch.randomizedtesting.rules.StatementAdapter.evaluate(StatementAdapter.java:36)
	at com.carrotsearch.randomizedtesting.rules.SystemPropertiesRestoreRule$1.evaluate(SystemPropertiesRestoreRule.java:53)
	at org.apache.lucene.util.AbstractBeforeAfterRule$1.evaluate(AbstractBeforeAfterRule.java:46)
	at org.apache.lucene.util.TestRuleStoreClassName$1.evaluate(TestRuleStoreClassName.java:42)
	at com.carrotsearch.randomizedtesting.rules.SystemPropertiesInvariantRule$1.evaluate(SystemPropertiesInvariantRule.java:55)
	at com.carrotsearch.randomizedtesting.rules.NoShadowingOrOverridesOnMethodsRule$1.evaluate(NoShadowingOrOverridesOnMethodsRule.java:39)
	at com.carrotsearch.randomizedtesting.rules.NoShadowingOrOverridesOnMethodsRule$1.evaluate(NoShadowingOrOverridesOnMethodsRule.java:39)
	at com.carrotsearch.randomizedtesting.rules.StatementAdapter.evaluate(StatementAdapter.java:36)
	at org.apache.lucene.util.TestRuleAssertionsRequired$1.evaluate(TestRuleAssertionsRequired.java:43)
	at org.apache.lucene.util.TestRuleMarkFailure$1.evaluate(TestRuleMarkFailure.java:48)
	at org.apache.lucene.util.TestRuleIgnoreAfterMaxFailures$1.evaluate(TestRuleIgnoreAfterMaxFailures.java:70)
	at org.apache.lucene.util.TestRuleIgnoreTestSuites$1.evaluate(TestRuleIgnoreTestSuites.java:55)
	at com.carrotsearch.randomizedtesting.rules.StatementAdapter.evaluate(StatementAdapter.java:36)
	at com.carrotsearch.randomizedtesting.ThreadLeakControl$StatementRunner.run(ThreadLeakControl.java:358)
	at java.lang.Thread.run(Thread.java:780)


REGRESSION:  org.apache.solr.update.AutoCommitTest.testMaxTime

Error Message:
Exception during query

Stack Trace:
java.lang.RuntimeException: Exception during query
	at __randomizedtesting.SeedInfo.seed([9740471648477CBB:DB43AF4D6DDE087]:0)
	at org.apache.solr.SolrTestCaseJ4.assertQ(SolrTestCaseJ4.java:639)
	at org.apache.solr.update.AutoCommitTest.testMaxTime(AutoCommitTest.java:227)
	at sun.reflect.NativeMethodAccessorImpl.invoke0(Native Method)
	at sun.reflect.NativeMethodAccessorImpl.invoke(NativeMethodAccessorImpl.java:88)
	at sun.reflect.DelegatingMethodAccessorImpl.invoke(DelegatingMethodAccessorImpl.java:55)
	at java.lang.reflect.Method.invoke(Method.java:613)
	at com.carrotsearch.randomizedtesting.RandomizedRunner.invoke(RandomizedRunner.java:1559)
	at com.carrotsearch.randomizedtesting.RandomizedRunner.access$600(RandomizedRunner.java:79)
	at com.carrotsearch.randomizedtesting.RandomizedRunner$6.evaluate(RandomizedRunner.java:737)
	at com.carrotsearch.randomizedtesting.RandomizedRunner$7.evaluate(RandomizedRunner.java:773)
	at com.carrotsearch.randomizedtesting.RandomizedRunner$8.evaluate(RandomizedRunner.java:787)
	at com.carrotsearch.randomizedtesting.rules.SystemPropertiesRestoreRule$1.evaluate(SystemPropertiesRestoreRule.java:53)
	at org.apache.lucene.util.TestRuleSetupTeardownChained$1.evaluate(TestRuleSetupTeardownChained.java:50)
	at org.apache.lucene.util.TestRuleFieldCacheSanity$1.evaluate(TestRuleFieldCacheSanity.java:51)
	at org.apache.lucene.util.AbstractBeforeAfterRule$1.evaluate(AbstractBeforeAfterRule.java:46)
	at com.carrotsearch.randomizedtesting.rules.SystemPropertiesInvariantRule$1.evaluate(SystemPropertiesInvariantRule.java:55)
	at org.apache.lucene.util.TestRuleThreadAndTestName$1.evaluate(TestRuleThreadAndTestName.java:49)
	at org.apache.lucene.util.TestRuleIgnoreAfterMaxFailures$1.evaluate(TestRuleIgnoreAfterMaxFailures.java:70)
	at org.apache.lucene.util.TestRuleMarkFailure$1.evaluate(TestRuleMarkFailure.java:48)
	at com.carrotsearch.randomizedtesting.rules.StatementAdapter.evaluate(StatementAdapter.java:36)
	at com.carrotsearch.randomizedtesting.ThreadLeakControl$StatementRunner.run(ThreadLeakControl.java:358)
	at com.carrotsearch.randomizedtesting.ThreadLeakControl.forkTimeoutingTask(ThreadLeakControl.java:782)
	at com.carrotsearch.randomizedtesting.ThreadLeakControl$3.evaluate(ThreadLeakControl.java:442)
	at com.carrotsearch.randomizedtesting.RandomizedRunner.runSingleTest(RandomizedRunner.java:746)
	at com.carrotsearch.randomizedtesting.RandomizedRunner$3.evaluate(RandomizedRunner.java:648)
	at com.carrotsearch.randomizedtesting.RandomizedRunner$4.evaluate(RandomizedRunner.java:682)
	at com.carrotsearch.randomizedtesting.RandomizedRunner$5.evaluate(RandomizedRunner.java:693)
	at com.carrotsearch.randomizedtesting.rules.StatementAdapter.evaluate(StatementAdapter.java:36)
	at com.carrotsearch.randomizedtesting.rules.SystemPropertiesRestoreRule$1.evaluate(SystemPropertiesRestoreRule.java:53)
	at org.apache.lucene.util.AbstractBeforeAfterRule$1.evaluate(AbstractBeforeAfterRule.java:46)
	at org.apache.lucene.util.TestRuleStoreClassName$1.evaluate(TestRuleStoreClassName.java:42)
	at com.carrotsearch.randomizedtesting.rules.SystemPropertiesInvariantRule$1.evaluate(SystemPropertiesInvariantRule.java:55)
	at com.carrotsearch.randomizedtesting.rules.NoShadowingOrOverridesOnMethodsRule$1.evaluate(NoShadowingOrOverridesOnMethodsRule.java:39)
	at com.carrotsearch.randomizedtesting.rules.NoShadowingOrOverridesOnMethodsRule$1.evaluate(NoShadowingOrOverridesOnMethodsRule.java:39)
	at com.carrotsearch.randomizedtesting.rules.StatementAdapter.evaluate(StatementAdapter.java:36)
	at org.apache.lucene.util.TestRuleAssertionsRequired$1.evaluate(TestRuleAssertionsRequired.java:43)
	at org.apache.lucene.util.TestRuleMarkFailure$1.evaluate(TestRuleMarkFailure.java:48)
	at org.apache.lucene.util.TestRuleIgnoreAfterMaxFailures$1.evaluate(TestRuleIgnoreAfterMaxFailures.java:70)
	at org.apache.lucene.util.TestRuleIgnoreTestSuites$1.evaluate(TestRuleIgnoreTestSuites.java:55)
	at com.carrotsearch.randomizedtesting.rules.StatementAdapter.evaluate(StatementAdapter.java:36)
	at com.carrotsearch.randomizedtesting.ThreadLeakControl$StatementRunner.run(ThreadLeakControl.java:358)
	at java.lang.Thread.run(Thread.java:780)
Caused by: java.lang.RuntimeException: REQUEST FAILED: xpath=//result[@numFound=0]
	xml response was: <?xml version="1.0" encoding="UTF-8"?>
<response>
<lst name="responseHeader"><int name="status">0</int><int name="QTime">1112</int></lst><result name="response" numFound="1" start="0"><doc><int name="id">529</int><int name="range_facet_si">529</int><arr name="range_facet_l"><long>529</long></arr><arr name="range_facet_sl"><long>529</long></arr><arr name="field_t"><str>what's inside?</str></arr><arr name="subject"><str>info</str></arr><long name="_version_">1452758968144232448</long><int name="intDefault">42</int><date name="timestamp">2013-11-26T09:41:55.848Z</date><arr name="multiDefault"><str>muLti-Default</str></arr></doc></result>
</response>

	request was:start=0&version=2.2&rows=20&qt=standard&q=id:529
	at org.apache.solr.SolrTestCaseJ4.assertQ(SolrTestCaseJ4.java:632)
	... 41 more


REGRESSION:  org.apache.solr.update.processor.SignatureUpdateProcessorFactoryTest.testDupeDetection

Error Message:
expected:<1> but was:<2>

Stack Trace:
java.lang.AssertionError: expected:<1> but was:<2>
	at __randomizedtesting.SeedInfo.seed([9740471648477CBB:CC70BCDE4B00DFC7]:0)
	at org.junit.Assert.fail(Assert.java:93)
	at org.junit.Assert.failNotEquals(Assert.java:647)
	at org.junit.Assert.assertEquals(Assert.java:128)
	at org.junit.Assert.assertEquals(Assert.java:472)
	at org.junit.Assert.assertEquals(Assert.java:456)
	at org.apache.solr.update.processor.SignatureUpdateProcessorFactoryTest.checkNumDocs(SignatureUpdateProcessorFactoryTest.java:71)
	at org.apache.solr.update.processor.SignatureUpdateProcessorFactoryTest.testDupeDetection(SignatureUpdateProcessorFactoryTest.java:119)
	at sun.reflect.NativeMethodAccessorImpl.invoke0(Native Method)
	at sun.reflect.NativeMethodAccessorImpl.invoke(NativeMethodAccessorImpl.java:88)
	at sun.reflect.DelegatingMethodAccessorImpl.invoke(DelegatingMethodAccessorImpl.java:55)
	at java.lang.reflect.Method.invoke(Method.java:613)
	at com.carrotsearch.randomizedtesting.RandomizedRunner.invoke(RandomizedRunner.java:1559)
	at com.carrotsearch.randomizedtesting.RandomizedRunner.access$600(RandomizedRunner.java:79)
	at com.carrotsearch.randomizedtesting.RandomizedRunner$6.evaluate(RandomizedRunner.java:737)
	at com.carrotsearch.randomizedtesting.RandomizedRunner$7.evaluate(RandomizedRunner.java:773)
	at com.carrotsearch.randomizedtesting.RandomizedRunner$8.evaluate(RandomizedRunner.java:787)
	at com.carrotsearch.randomizedtesting.rules.SystemPropertiesRestoreRule$1.evaluate(SystemPropertiesRestoreRule.java:53)
	at org.apache.lucene.util.TestRuleSetupTeardownChained$1.evaluate(TestRuleSetupTeardownChained.java:50)
	at org.apache.lucene.util.TestRuleFieldCacheSanity$1.evaluate(TestRuleFieldCacheSanity.java:51)
	at org.apache.lucene.util.AbstractBeforeAfterRule$1.evaluate(AbstractBeforeAfterRule.java:46)
	at com.carrotsearch.randomizedtesting.rules.SystemPropertiesInvariantRule$1.evaluate(SystemPropertiesInvariantRule.java:55)
	at org.apache.lucene.util.TestRuleThreadAndTestName$1.evaluate(TestRuleThreadAndTestName.java:49)
	at org.apache.lucene.util.TestRuleIgnoreAfterMaxFailures$1.evaluate(TestRuleIgnoreAfterMaxFailures.java:70)
	at org.apache.lucene.util.TestRuleMarkFailure$1.evaluate(TestRuleMarkFailure.java:48)
	at com.carrotsearch.randomizedtesting.rules.StatementAdapter.evaluate(StatementAdapter.java:36)
	at com.carrotsearch.randomizedtesting.ThreadLeakControl$StatementRunner.run(ThreadLeakControl.java:358)
	at com.carrotsearch.randomizedtesting.ThreadLeakControl.forkTimeoutingTask(ThreadLeakControl.java:782)
	at com.carrotsearch.randomizedtesting.ThreadLeakControl$3.evaluate(ThreadLeakControl.java:442)
	at com.carrotsearch.randomizedtesting.RandomizedRunner.runSingleTest(RandomizedRunner.java:746)
	at com.carrotsearch.randomizedtesting.RandomizedRunner$3.evaluate(RandomizedRunner.java:648)
	at com.carrotsearch.randomizedtesting.RandomizedRunner$4.evaluate(RandomizedRunner.java:682)
	at com.carrotsearch.randomizedtesting.RandomizedRunner$5.evaluate(RandomizedRunner.java:693)
	at com.carrotsearch.randomizedtesting.rules.StatementAdapter.evaluate(StatementAdapter.java:36)
	at com.carrotsearch.randomizedtesting.rules.SystemPropertiesRestoreRule$1.evaluate(SystemPropertiesRestoreRule.java:53)
	at org.apache.lucene.util.AbstractBeforeAfterRule$1.evaluate(AbstractBeforeAfterRule.java:46)
	at org.apache.lucene.util.TestRuleStoreClassName$1.evaluate(TestRuleStoreClassName.java:42)
	at com.carrotsearch.randomizedtesting.rules.SystemPropertiesInvariantRule$1.evaluate(SystemPropertiesInvariantRule.java:55)
	at com.carrotsearch.randomizedtesting.rules.NoShadowingOrOverridesOnMethodsRule$1.evaluate(NoShadowingOrOverridesOnMethodsRule.java:39)
	at com.carrotsearch.randomizedtesting.rules.NoShadowingOrOverridesOnMethodsRule$1.evaluate(NoShadowingOrOverridesOnMethodsRule.java:39)
	at com.carrotsearch.randomizedtesting.rules.StatementAdapter.evaluate(StatementAdapter.java:36)
	at org.apache.lucene.util.TestRuleAssertionsRequired$1.evaluate(TestRuleAssertionsRequired.java:43)
	at org.apache.lucene.util.TestRuleMarkFailure$1.evaluate(TestRuleMarkFailure.java:48)
	at org.apache.lucene.util.TestRuleIgnoreAfterMaxFailures$1.evaluate(TestRuleIgnoreAfterMaxFailures.java:70)
	at org.apache.lucene.util.TestRuleIgnoreTestSuites$1.evaluate(TestRuleIgnoreTestSuites.java:55)
	at com.carrotsearch.randomizedtesting.rules.StatementAdapter.evaluate(StatementAdapter.java:36)
	at com.carrotsearch.randomizedtesting.ThreadLeakControl$StatementRunner.run(ThreadLeakControl.java:358)
	at java.lang.Thread.run(Thread.java:780)




Build Log:
[...truncated 10119 lines...]
   [junit4] Suite: org.apache.solr.handler.component.TermVectorComponentDistributedTest
   [junit4]   2> 296017 T1061 oas.BaseDistributedSearchTestCase.initHostContext Setting hostContext system property: /e/wc
   [junit4]   2> 296020 T1061 oas.SolrTestCaseJ4.setUp ###Starting testDistribSearch
   [junit4]   2> 296022 T1061 oejs.Server.doStart jetty-8.1.10.v20130312
   [junit4]   2> 296031 T1061 oejs.AbstractConnector.doStart Started SelectChannelConnector@127.0.0.1:52274
   [junit4]   2> 296032 T1061 oass.SolrDispatchFilter.init SolrDispatchFilter.init()
   [junit4]   2> 296032 T1061 oasc.SolrResourceLoader.locateSolrHome JNDI not configured for solr (NoInitialContextEx)
   [junit4]   2> 296033 T1061 oasc.SolrResourceLoader.locateSolrHome using system property solr.solr.home: /mnt/ssd/jenkins/workspace/Lucene-Solr-trunk-Linux/solr/build/solr-core/test-files/solr
   [junit4]   2> 296033 T1061 oasc.SolrResourceLoader.<init> new SolrResourceLoader for directory: '/mnt/ssd/jenkins/workspace/Lucene-Solr-trunk-Linux/solr/build/solr-core/test-files/solr/'
   [junit4]   2> 296041 T1061 oasc.ConfigSolr.fromFile Loading container configuration from /mnt/ssd/jenkins/workspace/Lucene-Solr-trunk-Linux/solr/build/solr-core/test-files/solr/solr.xml
   [junit4]   2> 296074 T1061 oasc.CoreContainer.<init> New CoreContainer 403942612
   [junit4]   2> 296075 T1061 oasc.CoreContainer.load Loading cores into CoreContainer [instanceDir=/mnt/ssd/jenkins/workspace/Lucene-Solr-trunk-Linux/solr/build/solr-core/test-files/solr/]
   [junit4]   2> 296076 T1061 oashc.HttpShardHandlerFactory.getParameter Setting socketTimeout to: 90000
   [junit4]   2> 296077 T1061 oashc.HttpShardHandlerFactory.getParameter Setting urlScheme to: http://
   [junit4]   2> 296077 T1061 oashc.HttpShardHandlerFactory.getParameter Setting connTimeout to: 15000
   [junit4]   2> 296078 T1061 oashc.HttpShardHandlerFactory.getParameter Setting maxConnectionsPerHost to: 20
   [junit4]   2> 296079 T1061 oashc.HttpShardHandlerFactory.getParameter Setting corePoolSize to: 0
   [junit4]   2> 296079 T1061 oashc.HttpShardHandlerFactory.getParameter Setting maximumPoolSize to: 2147483647
   [junit4]   2> 296080 T1061 oashc.HttpShardHandlerFactory.getParameter Setting maxThreadIdleTime to: 5
   [junit4]   2> 296080 T1061 oashc.HttpShardHandlerFactory.getParameter Setting sizeOfQueue to: -1
   [junit4]   2> 296081 T1061 oashc.HttpShardHandlerFactory.getParameter Setting fairnessPolicy to: false
   [junit4]   2> 296086 T1061 oasl.LogWatcher.createWatcher SLF4J impl is org.slf4j.impl.Log4jLoggerFactory
   [junit4]   2> 296086 T1061 oasl.LogWatcher.newRegisteredLogWatcher Registering Log Listener [Log4j (org.slf4j.impl.Log4jLoggerFactory)]
   [junit4]   2> 296087 T1061 oasc.CoreContainer.load Host Name: 127.0.0.1
   [junit4]   2> 296090 T1071 oasc.CoreContainer.create Creating SolrCore 'collection1' using instanceDir: /mnt/ssd/jenkins/workspace/Lucene-Solr-trunk-Linux/solr/build/solr-core/test-files/solr/collection1
   [junit4]   2> 296090 T1071 oasc.SolrResourceLoader.<init> new SolrResourceLoader for directory: '/mnt/ssd/jenkins/workspace/Lucene-Solr-trunk-Linux/solr/build/solr-core/test-files/solr/collection1/'
   [junit4]   2> 296091 T1071 oasc.SolrResourceLoader.replaceClassLoader Adding 'file:/mnt/ssd/jenkins/workspace/Lucene-Solr-trunk-Linux/solr/build/solr-core/test-files/solr/collection1/lib/classes/' to classloader
   [junit4]   2> 296091 T1071 oasc.SolrResourceLoader.replaceClassLoader Adding 'file:/mnt/ssd/jenkins/workspace/Lucene-Solr-trunk-Linux/solr/build/solr-core/test-files/solr/collection1/lib/README' to classloader
   [junit4]   2> 296128 T1071 oasc.SolrConfig.<init> Using Lucene MatchVersion: LUCENE_50
   [junit4]   2> 296171 T1071 oasc.SolrConfig.<init> Loaded SolrConfig: solrconfig.xml
   [junit4]   2> 296172 T1071 oass.IndexSchema.readSchema Reading Solr Schema from schema.xml
   [junit4]   2> 296178 T1071 oass.IndexSchema.readSchema [collection1] Schema name=test
   [junit4]   2> 296498 T1071 oass.OpenExchangeRatesOrgProvider.init Initialized with rates=open-exchange-rates.json, refreshInterval=1440.
   [junit4]   2> 296503 T1071 oass.IndexSchema.readSchema default search field in schema is text
   [junit4]   2> 296505 T1071 oass.IndexSchema.readSchema unique key field: id
   [junit4]   2> 296511 T1071 oass.FileExchangeRateProvider.reload Reloading exchange rates from file currency.xml
   [junit4]   2> 296515 T1071 oass.FileExchangeRateProvider.reload Reloading exchange rates from file currency.xml
   [junit4]   2> 296518 T1071 oass.OpenExchangeRatesOrgProvider.reload Reloading exchange rates from open-exchange-rates.json
   [junit4]   2> 296518 T1071 oass.OpenExchangeRatesOrgProvider$OpenExchangeRates.<init> WARN Unknown key IMPORTANT NOTE
   [junit4]   2> 296519 T1071 oass.OpenExchangeRatesOrgProvider$OpenExchangeRates.<init> WARN Expected key, got STRING
   [junit4]   2> 296519 T1071 oass.OpenExchangeRatesOrgProvider.reload Reloading exchange rates from open-exchange-rates.json
   [junit4]   2> 296520 T1071 oass.OpenExchangeRatesOrgProvider$OpenExchangeRates.<init> WARN Unknown key IMPORTANT NOTE
   [junit4]   2> 296520 T1071 oass.OpenExchangeRatesOrgProvider$OpenExchangeRates.<init> WARN Expected key, got STRING
   [junit4]   2> 296520 T1071 oasc.SolrCore.initDirectoryFactory org.apache.solr.core.MockDirectoryFactory
   [junit4]   2> 296521 T1071 oasc.SolrCore.<init> [collection1] Opening new SolrCore at /mnt/ssd/jenkins/workspace/Lucene-Solr-trunk-Linux/solr/build/solr-core/test-files/solr/collection1/, dataDir=./org.apache.solr.handler.component.TermVectorComponentDistributedTest-1385458007969/control/data/
   [junit4]   2> 296521 T1071 oasc.JmxMonitoredMap.<init> JMX monitoring is enabled. Adding Solr mbeans to JMX Server: com.sun.jmx.mbeanserver.JmxMBeanServer@16a4edec
   [junit4]   2> 296522 T1071 oasc.CachingDirectoryFactory.get return new directory for ./org.apache.solr.handler.component.TermVectorComponentDistributedTest-1385458007969/control/data
   [junit4]   2> 296522 T1071 oasc.SolrCore.getNewIndexDir New index directory detected: old=null new=./org.apache.solr.handler.component.TermVectorComponentDistributedTest-1385458007969/control/data/index/
   [junit4]   2> 296523 T1071 oasc.SolrCore.initIndex WARN [collection1] Solr index directory './org.apache.solr.handler.component.TermVectorComponentDistributedTest-1385458007969/control/data/index' doesn't exist. Creating new index...
   [junit4]   2> 296523 T1071 oasc.CachingDirectoryFactory.get return new directory for ./org.apache.solr.handler.component.TermVectorComponentDistributedTest-1385458007969/control/data/index
   [junit4]   2> 296524 T1071 oasu.RandomMergePolicy.<init> RandomMergePolicy wrapping class org.apache.lucene.index.TieredMergePolicy: [TieredMergePolicy: maxMergeAtOnce=48, maxMergeAtOnceExplicit=26, maxMergedSegmentMB=9.1435546875, floorSegmentMB=1.4150390625, forceMergeDeletesPctAllowed=2.951092152536723, segmentsPerTier=41.0, maxCFSSegmentSizeMB=8.796093022207999E12, noCFSRatio=0.27170328666538757
   [junit4]   2> 296524 T1071 oasc.SolrDeletionPolicy.onCommit SolrDeletionPolicy.onCommit: commits: num=1
   [junit4]   2> 		commit{dir=RateLimitedDirectoryWrapper(MockDirectoryWrapper(org.apache.lucene.store.RAMDirectory@6cba9349 lockFactory=org.apache.lucene.store.SingleInstanceLockFactory@af0027e0)),segFN=segments_1,generation=1}
   [junit4]   2> 296525 T1071 oasc.SolrDeletionPolicy.updateCommits newest commit generation = 1
   [junit4]   2> 296525 T1071 oasc.SolrCore.initWriters created xml: solr.XMLResponseWriter
   [junit4]   2> 296527 T1071 oasup.UpdateRequestProcessorChain.init creating updateRequestProcessorChain "dedupe"
   [junit4]   2> 296528 T1071 oasup.UpdateRequestProcessorChain.init inserting DistributedUpdateProcessorFactory into updateRequestProcessorChain "dedupe"
   [junit4]   2> 296528 T1071 oasup.UpdateRequestProcessorChain.init creating updateRequestProcessorChain "dedupe-allfields"
   [junit4]   2> 296529 T1071 oasup.UpdateRequestProcessorChain.init inserting DistributedUpdateProcessorFactory into updateRequestProcessorChain "dedupe-allfields"
   [junit4]   2> 296529 T1071 oasup.UpdateRequestProcessorChain.init creating updateRequestProcessorChain "stored_sig"
   [junit4]   2> 296529 T1071 oasup.UpdateRequestProcessorChain.init inserting DistributedUpdateProcessorFactory into updateRequestProcessorChain "stored_sig"
   [junit4]   2> 296530 T1071 oasup.UpdateRequestProcessorChain.init creating updateRequestProcessorChain "uniq-fields"
   [junit4]   2> 296530 T1071 oasup.UpdateRequestProcessorChain.init inserting DistributedUpdateProcessorFactory into updateRequestProcessorChain "uniq-fields"
   [junit4]   2> 296530 T1071 oasup.UpdateRequestProcessorChain.init creating updateRequestProcessorChain "distrib-dup-test-chain-explicit"
   [junit4]   2> 296531 T1071 oasup.UpdateRequestProcessorChain.init creating updateRequestProcessorChain "distrib-dup-test-chain-implicit"
   [junit4]   2> 296531 T1071 oasup.UpdateRequestProcessorChain.init inserting DistributedUpdateProcessorFactory into updateRequestProcessorChain "distrib-dup-test-chain-implicit"
   [junit4]   2> 296532 T1071 oasc.SolrCore.loadUpdateProcessorChains no updateRequestProcessorChain defined as default, creating implicit default
   [junit4]   2> 296532 T1071 oasc.RequestHandlers.initHandlersFromConfig adding lazy requestHandler: solr.ReplicationHandler
   [junit4]   2> 296532 T1071 oasc.RequestHandlers.initHandlersFromConfig created /replication: solr.ReplicationHandler
   [junit4]   2> 296533 T1071 oasc.RequestHandlers.initHandlersFromConfig created standard: solr.StandardRequestHandler
   [junit4]   2> 296533 T1071 oasc.RequestHandlers.initHandlersFromConfig created /get: solr.RealTimeGetHandler
   [junit4]   2> 296534 T1071 oasc.RequestHandlers.initHandlersFromConfig created dismax: solr.SearchHandler
   [junit4]   2> 296534 T1071 oasc.RequestHandlers.initHandlersFromConfig created mock: org.apache.solr.core.MockQuerySenderListenerReqHandler
   [junit4]   2> 296534 T1071 oasc.RequestHandlers.initHandlersFromConfig created /admin/: org.apache.solr.handler.admin.AdminHandlers
   [junit4]   2> 296535 T1071 oasc.RequestHandlers.initHandlersFromConfig created /admin/file: solr.admin.ShowFileRequestHandler
   [junit4]   2> 296535 T1071 oasc.RequestHandlers.initHandlersFromConfig created defaults: solr.StandardRequestHandler
   [junit4]   2> 296536 T1071 oasc.RequestHandlers.initHandlersFromConfig adding lazy requestHandler: solr.StandardRequestHandler
   [junit4]   2> 296536 T1071 oasc.RequestHandlers.initHandlersFromConfig created lazy: solr.StandardRequestHandler
   [junit4]   2> 296536 T1071 oasc.RequestHandlers.initHandlersFromConfig created /update: solr.UpdateRequestHandler
   [junit4]   2> 296537 T1071 oasc.RequestHandlers.initHandlersFromConfig created /terms: org.apache.solr.handler.component.SearchHandler
   [junit4]   2> 296537 T1071 oasc.RequestHandlers.initHandlersFromConfig created spellCheckCompRH: org.apache.solr.handler.component.SearchHandler
   [junit4]   2> 296538 T1071 oasc.RequestHandlers.initHandlersFromConfig created spellCheckCompRH_Direct: org.apache.solr.handler.component.SearchHandler
   [junit4]   2> 296538 T1071 oasc.RequestHandlers.initHandlersFromConfig created spellCheckWithWordbreak: org.apache.solr.handler.component.SearchHandler
   [junit4]   2> 296539 T1071 oasc.RequestHandlers.initHandlersFromConfig created spellCheckWithWordbreak_Direct: org.apache.solr.handler.component.SearchHandler
   [junit4]   2> 296539 T1071 oasc.RequestHandlers.initHandlersFromConfig created spellCheckCompRH1: org.apache.solr.handler.component.SearchHandler
   [junit4]   2> 296540 T1071 oasc.RequestHandlers.initHandlersFromConfig created mltrh: org.apache.solr.handler.component.SearchHandler
   [junit4]   2> 296540 T1071 oasc.RequestHandlers.initHandlersFromConfig created tvrh: org.apache.solr.handler.component.SearchHandler
   [junit4]   2> 296540 T1071 oasc.RequestHandlers.initHandlersFromConfig created /mlt: solr.MoreLikeThisHandler
   [junit4]   2> 296541 T1071 oasc.RequestHandlers.initHandlersFromConfig created /debug/dump: solr.DumpRequestHandler
   [junit4]   2> 296542 T1071 oashl.XMLLoader.init xsltCacheLifetimeSeconds=60
   [junit4]   2> 296544 T1071 oasc.SolrCore.initDeprecatedSupport WARN solrconfig.xml uses deprecated <admin/gettableFiles>, Please update your config to use the ShowFileRequestHandler.
   [junit4]   2> 296546 T1071 oasu.CommitTracker.<init> Hard AutoCommit: disabled
   [junit4]   2> 296546 T1071 oasu.CommitTracker.<init> Soft AutoCommit: disabled
   [junit4]   2> 296547 T1071 oasu.RandomMergePolicy.<init> RandomMergePolicy wrapping class org.apache.lucene.index.LogDocMergePolicy: [LogDocMergePolicy: minMergeSize=1000, mergeFactor=13, maxMergeSize=9223372036854775807, maxMergeSizeForForcedMerge=9223372036854775807, calibrateSizeByDeletes=true, maxMergeDocs=2147483647, maxCFSSegmentSizeMB=8.796093022207999E12, noCFSRatio=0.0]
   [junit4]   2> 296547 T1071 oasc.SolrDeletionPolicy.onInit SolrDeletionPolicy.onInit: commits: num=1
   [junit4]   2> 		commit{dir=RateLimitedDirectoryWrapper(MockDirectoryWrapper(org.apache.lucene.store.RAMDirectory@6cba9349 lockFactory=org.apache.lucene.store.SingleInstanceLockFactory@af0027e0)),segFN=segments_1,generation=1}
   [junit4]   2> 296548 T1071 oasc.SolrDeletionPolicy.updateCommits newest commit generation = 1
   [junit4]   2> 296548 T1071 oass.SolrIndexSearcher.<init> Opening Searcher@43480266 main
   [junit4]   2> 296549 T1071 oashc.SpellCheckComponent.inform Initializing spell checkers
   [junit4]   2> 296552 T1071 oass.DirectSolrSpellChecker.init init: {name=direct,classname=DirectSolrSpellChecker,field=lowerfilt,minQueryLength=3}
   [junit4]   2> 296572 T1072 oasc.SolrCore.registerSearcher [collection1] Registered new searcher Searcher@43480266 main{StandardDirectoryReader(segments_1:1:nrt)}
   [junit4]   2> 296576 T1071 oasc.CoreContainer.registerCore registering core: collection1
   [junit4]   2> 296576 T1061 oass.SolrDispatchFilter.init user.dir=/mnt/ssd/jenkins/workspace/Lucene-Solr-trunk-Linux/solr/build/solr-core/test/J1
   [junit4]   2> 296577 T1061 oass.SolrDispatchFilter.init SolrDispatchFilter.init() done
   [junit4]   2> 296579 T1061 oejs.Server.doStart jetty-8.1.10.v20130312
   [junit4]   2> 296584 T1061 oejs.AbstractConnector.doStart Started SelectChannelConnector@127.0.0.1:57890
   [junit4]   2> 296585 T1061 oass.SolrDispatchFilter.init SolrDispatchFilter.init()
   [junit4]   2> 296586 T1061 oasc.SolrResourceLoader.locateSolrHome JNDI not configured for solr (NoInitialContextEx)
   [junit4]   2> 296586 T1061 oasc.SolrResourceLoader.locateSolrHome using system property solr.solr.home: /mnt/ssd/jenkins/workspace/Lucene-Solr-trunk-Linux/solr/build/solr-core/test-files/solr
   [junit4]   2> 296587 T1061 oasc.SolrResourceLoader.<init> new SolrResourceLoader for directory: '/mnt/ssd/jenkins/workspace/Lucene-Solr-trunk-Linux/solr/build/solr-core/test-files/solr/'
   [junit4]   2> 296595 T1061 oasc.ConfigSolr.fromFile Loading container configuration from /mnt/ssd/jenkins/workspace/Lucene-Solr-trunk-Linux/solr/build/solr-core/test-files/solr/solr.xml
   [junit4]   2> 296627 T1061 oasc.CoreContainer.<init> New CoreContainer -1971215791
   [junit4]   2> 296628 T1061 oasc.CoreContainer.load Loading cores into CoreContainer [instanceDir=/mnt/ssd/jenkins/workspace/Lucene-Solr-trunk-Linux/solr/build/solr-core/test-files/solr/]
   [junit4]   2> 296629 T1061 oashc.HttpShardHandlerFactory.getParameter Setting socketTimeout to: 90000
   [junit4]   2> 296630 T1061 oashc.HttpShardHandlerFactory.getParameter Setting urlScheme to: http://
   [junit4]   2> 296630 T1061 oashc.HttpShardHandlerFactory.getParameter Setting connTimeout to: 15000
   [junit4]   2> 296631 T1061 oashc.HttpShardHandlerFactory.getParameter Setting maxConnectionsPerHost to: 20
   [junit4]   2> 296632 T1061 oashc.HttpShardHandlerFactory.getParameter Setting corePoolSize to: 0
   [junit4]   2> 296632 T1061 oashc.HttpShardHandlerFactory.getParameter Setting maximumPoolSize to: 2147483647
   [junit4]   2> 296633 T1061 oashc.HttpShardHandlerFactory.getParameter Setting maxThreadIdleTime to: 5
   [junit4]   2> 296633 T1061 oashc.HttpShardHandlerFactory.getParameter Setting sizeOfQueue to: -1
   [junit4]   2> 296634 T1061 oashc.HttpShardHandlerFactory.getParameter Setting fairnessPolicy to: false
   [junit4]   2> 296638 T1061 oasl.LogWatcher.createWatcher SLF4J impl is org.slf4j.impl.Log4jLoggerFactory
   [junit4]   2> 296639 T1061 oasl.LogWatcher.newRegisteredLogWatcher Registering Log Listener [Log4j (org.slf4j.impl.Log4jLoggerFactory)]
   [junit4]   2> 296640 T1061 oasc.CoreContainer.load Host Name: 127.0.0.1
   [junit4]   2> 296643 T1083 oasc.CoreContainer.create Creating SolrCore 'collection1' using instanceDir: /mnt/ssd/jenkins/workspace/Lucene-Solr-trunk-Linux/solr/build/solr-core/test-files/solr/collection1
   [junit4]   2> 296643 T1083 oasc.SolrResourceLoader.<init> new SolrResourceLoader for directory: '/mnt/ssd/jenkins/workspace/Lucene-Solr-trunk-Linux/solr/build/solr-core/test-files/solr/collection1/'
   [junit4]   2> 296644 T1083 oasc.SolrResourceLoader.replaceClassLoader Adding 'file:/mnt/ssd/jenkins/workspace/Lucene-Solr-trunk-Linux/solr/build/solr-core/test-files/solr/collection1/lib/classes/' to classloader
   [junit4]   2> 296644 T1083 oasc.SolrResourceLoader.replaceClassLoader Adding 'file:/mnt/ssd/jenkins/workspace/Lucene-Solr-trunk-Linux/solr/build/solr-core/test-files/solr/collection1/lib/README' to classloader
   [junit4]   2> 296681 T1083 oasc.SolrConfig.<init> Using Lucene MatchVersion: LUCENE_50
   [junit4]   2> 296725 T1083 oasc.SolrConfig.<init> Loaded SolrConfig: solrconfig.xml
   [junit4]   2> 296726 T1083 oass.IndexSchema.readSchema Reading Solr Schema from schema.xml
   [junit4]   2> 296732 T1083 oass.IndexSchema.readSchema [collection1] Schema name=test
   [junit4]   2> 297049 T1083 oass.OpenExchangeRatesOrgProvider.init Initialized with rates=open-exchange-rates.json, refreshInterval=1440.
   [junit4]   2> 297054 T1083 oass.IndexSchema.readSchema default search field in schema is text
   [junit4]   2> 297056 T1083 oass.IndexSchema.readSchema unique key field: id
   [junit4]   2> 297062 T1083 oass.FileExchangeRateProvider.reload Reloading exchange rates from file currency.xml
   [junit4]   2> 297065 T1083 oass.FileExchangeRateProvider.reload Reloading exchange rates from file currency.xml
   [junit4]   2> 297069 T1083 oass.OpenExchangeRatesOrgProvider.reload Reloading exchange rates from open-exchange-rates.json
   [junit4]   2> 297069 T1083 oass.OpenExchangeRatesOrgProvider$OpenExchangeRates.<init> WARN Unknown key IMPORTANT NOTE
   [junit4]   2> 297070 T1083 oass.OpenExchangeRatesOrgProvider$OpenExchangeRates.<init> WARN Expected key, got STRING
   [junit4]   2> 297070 T1083 oass.OpenExchangeRatesOrgProvider.reload Reloading exchange rates from open-exchange-rates.json
   [junit4]   2> 297070 T1083 oass.OpenExchangeRatesOrgProvider$OpenExchangeRates.<init> WARN Unknown key IMPORTANT NOTE
   [junit4]   2> 297071 T1083 oass.OpenExchangeRatesOrgProvider$OpenExchangeRates.<init> WARN Expected key, got STRING
   [junit4]   2> 297071 T1083 oasc.SolrCore.initDirectoryFactory org.apache.solr.core.MockDirectoryFactory
   [junit4]   2> 297071 T1083 oasc.SolrCore.<init> [collection1] Opening new SolrCore at /mnt/ssd/jenkins/workspace/Lucene-Solr-trunk-Linux/solr/build/solr-core/test-files/solr/collection1/, dataDir=./org.apache.solr.handler.component.TermVectorComponentDistributedTest-1385458007969/shard0/data/
   [junit4]   2> 297072 T1083 oasc.JmxMonitoredMap.<init> JMX monitoring is enabled. Adding Solr mbeans to JMX Server: com.sun.jmx.mbeanserver.JmxMBeanServer@16a4edec
   [junit4]   2> 297073 T1083 oasc.CachingDirectoryFactory.get return new directory for ./org.apache.solr.handler.component.TermVectorComponentDistributedTest-1385458007969/shard0/data
   [junit4]   2> 297073 T1083 oasc.SolrCore.getNewIndexDir New index directory detected: old=null new=./org.apache.solr.handler.component.TermVectorComponentDistributedTest-1385458007969/shard0/data/index/
   [junit4]   2> 297073 T1083 oasc.SolrCore.initIndex WARN [collection1] Solr index directory './org.apache.solr.handler.component.TermVectorComponentDistributedTest-1385458007969/shard0/data/index' doesn't exist. Creating new index...
   [junit4]   2> 297074 T1083 oasc.CachingDirectoryFactory.get return new directory for ./org.apache.solr.handler.component.TermVectorComponentDistributedTest-1385458007969/shard0/data/index
   [junit4]   2> 297074 T1083 oasu.RandomMergePolicy.<init> RandomMergePolicy wrapping class org.apache.lucene.index.TieredMergePolicy: [TieredMergePolicy: maxMergeAtOnce=48, maxMergeAtOnceExplicit=26, maxMergedSegmentMB=9.1435546875, floorSegmentMB=1.4150390625, forceMergeDeletesPctAllowed=2.951092152536723, segmentsPerTier=41.0, maxCFSSegmentSizeMB=8.796093022207999E12, noCFSRatio=0.27170328666538757
   [junit4]   2> 297075 T1083 oasc.SolrDeletionPolicy.onCommit SolrDeletionPolicy.onCommit: commits: num=1
   [junit4]   2> 		commit{dir=RateLimitedDirectoryWrapper(MockDirectoryWrapper(org.apache.lucene.store.RAMDirectory@eb96e0c4 lockFactory=org.apache.lucene.store.SingleInstanceLockFactory@da24ba)),segFN=segments_1,generation=1}
   [junit4]   2> 297076 T1083 oasc.SolrDeletionPolicy.updateCommits newest commit generation = 1
   [junit4]   2> 297076 T1083 oasc.SolrCore.initWriters created xml: solr.XMLResponseWriter
   [junit4]   2> 297079 T1083 oasup.UpdateRequestProcessorChain.init creating updateRequestProcessorChain "dedupe"
   [junit4]   2> 297079 T1083 oasup.UpdateRequestProcessorChain.init inserting DistributedUpdateProcessorFactory into updateRequestProcessorChain "dedupe"
   [junit4]   2> 297079 T1083 oasup.UpdateRequestProcessorChain.init creating updateRequestProcessorChain "dedupe-allfields"
   [junit4]   2> 297080 T1083 oasup.UpdateRequestProcessorChain.init inserting DistributedUpdateProcessorFactory into updateRequestProcessorChain "dedupe-allfields"
   [junit4]   2> 297080 T1083 oasup.UpdateRequestProcessorChain.init creating updateRequestProcessorChain "stored_sig"
   [junit4]   2> 297080 T1083 oasup.UpdateRequestProcessorChain.init inserting DistributedUpdateProcessorFactory into updateRequestProcessorChain "stored_sig"
   [junit4]   2> 297081 T1083 oasup.UpdateRequestProcessorChain.init creating updateRequestProcessorChain "uniq-fields"
   [junit4]   2> 297081 T1083 oasup.UpdateRequestProcessorChain.init inserting DistributedUpdateProcessorFactory into updateRequestProcessorChain "uniq-fields"
   [junit4]   2> 297082 T1083 oasup.UpdateRequestProcessorChain.init creating updateRequestProcessorChain "distrib-dup-test-chain-explicit"
   [junit4]   2> 297082 T1083 oasup.UpdateRequestProcessorChain.init creating updateRequestProcessorChain "distrib-dup-test-chain-implicit"
   [junit4]   2> 297082 T1083 oasup.UpdateRequestProcessorChain.init inserting DistributedUpdateProcessorFactory into updateRequestProcessorChain "distrib-dup-test-chain-implicit"
   [junit4]   2> 297083 T1083 oasc.SolrCore.loadUpdateProcessorChains no updateRequestProcessorChain defined as default, creating implicit default
   [junit4]   2> 297083 T1083 oasc.RequestHandlers.initHandlersFromConfig adding lazy requestHandler: solr.ReplicationHandler
   [junit4]   2> 297083 T1083 oasc.RequestHandlers.initHandlersFromConfig created /replication: solr.ReplicationHandler
   [junit4]   2> 297084 T1083 oasc.RequestHandlers.initHandlersFromConfig created standard: solr.StandardRequestHandler
   [junit4]   2> 297085 T1083 oasc.RequestHandlers.initHandlersFromConfig created /get: solr.RealTimeGetHandler
   [junit4]   2> 297085 T1083 oasc.RequestHandlers.initHandlersFromConfig created dismax: solr.SearchHandler
   [junit4]   2> 297086 T1083 oasc.RequestHandlers.initHandlersFromConfig created mock: org.apache.solr.core.MockQuerySenderListenerReqHandler
   [junit4]   2> 297086 T1083 oasc.RequestHandlers.initHandlersFromConfig created /admin/: org.apache.solr.handler.admin.AdminHandlers
   [junit4]   2> 297087 T1083 oasc.RequestHandlers.initHandlersFromConfig created /admin/file: solr.admin.ShowFileRequestHandler
   [junit4]   2> 297087 T1083 oasc.RequestHandlers.initHandlersFromConfig created defaults: solr.StandardRequestHandler
   [junit4]   2> 297088 T1083 oasc.RequestHandlers.initHandlersFromConfig adding lazy requestHandler: solr.StandardRequestHandler
   [junit4]   2> 297088 T1083 oasc.RequestHandlers.initHandlersFromConfig created lazy: solr.StandardRequestHandler
   [junit4]   2> 297088 T1083 oasc.RequestHandlers.initHandlersFromConfig created /update: solr.UpdateRequestHandler
   [junit4]   2> 297089 T1083 oasc.RequestHandlers.initHandlersFromConfig created /terms: org.apache.solr.handler.component.SearchHandler
   [junit4]   2> 297090 T1083 oasc.RequestHandlers.initHandlersFromConfig created spellCheckCompRH: org.apache.solr.handler.component.SearchHandler
   [junit4]   2> 297090 T1083 oasc.RequestHandlers.initHandlersFromConfig created spellCheckCompRH_Direct: org.apache.solr.handler.component.SearchHandler
   [junit4]   2> 297091 T1083 oasc.RequestHandlers.initHandlersFromConfig created spellCheckWithWordbreak: org.apache.solr.handler.component.SearchHandler
   [junit4]   2> 297091 T1083 oasc.RequestHandlers.initHandlersFromConfig created spellCheckWithWordbreak_Direct: org.apache.solr.handler.component.SearchHandler
   [junit4]   2> 297092 T1083 oasc.RequestHandlers.initHandlersFromConfig created spellCheckCompRH1: org.apache.solr.handler.component.SearchHandler
   [junit4]   2> 297093 T1083 oasc.RequestHandlers.initHandlersFromConfig created mltrh: org.apache.solr.handler.component.SearchHandler
   [junit4]   2> 297093 T1083 oasc.RequestHandlers.initHandlersFromConfig created tvrh: org.apache.solr.handler.component.SearchHandler
   [junit4]   2> 297094 T1083 oasc.RequestHandlers.initHandlersFromConfig created /mlt: solr.MoreLikeThisHandler
   [junit4]   2> 297094 T1083 oasc.RequestHandlers.initHandlersFromConfig created /debug/dump: solr.DumpRequestHandler
   [junit4]   2> 297096 T1083 oashl.XMLLoader.init xsltCacheLifetimeSeconds=60
   [junit4]   2> 297097 T1083 oasc.SolrCore.initDeprecatedSupport WARN solrconfig.xml uses deprecated <admin/gettableFiles>, Please update your config to use the ShowFileRequestHandler.
   [junit4]   2> 297099 T1083 oasu.CommitTracker.<init> Hard AutoCommit: disabled
   [junit4]   2> 297099 T1083 oasu.CommitTracker.<init> Soft AutoCommit: disabled
   [junit4]   2> 297100 T1083 oasu.RandomMergePolicy.<init> RandomMergePolicy wrapping class org.apache.lucene.index.LogDocMergePolicy: [LogDocMergePolicy: minMergeSize=1000, mergeFactor=13, maxMergeSize=9223372036854775807, maxMergeSizeForForcedMerge=9223372036854775807, calibrateSizeByDeletes=true, maxMergeDocs=2147483647, maxCFSSegmentSizeMB=8.796093022207999E12, noCFSRatio=0.0]
   [junit4]   2> 297100 T1083 oasc.SolrDeletionPolicy.onInit SolrDeletionPolicy.onInit: commits: num=1
   [junit4]   2> 		commit{dir=RateLimitedDirectoryWrapper(MockDirectoryWrapper(org.apache.lucene.store.RAMDirectory@eb96e0c4 lockFactory=org.apache.lucene.store.SingleInstanceLockFactory@da24ba)),segFN=segments_1,generation=1}
   [junit4]   2> 297101 T1083 oasc.SolrDeletionPolicy.updateCommits newest commit generation = 1
   [junit4]   2> 297101 T1083 oass.SolrIndexSearcher.<init> Opening Searcher@3f790d0b main
   [junit4]   2> 297102 T1083 oashc.SpellCheckComponent.inform Initializing spell checkers
   [junit4]   2> 297105 T1083 oass.DirectSolrSpellChecker.init init: {name=direct,classname=DirectSolrSpellChecker,field=lowerfilt,minQueryLength=3}
   [junit4]   2> 297124 T1084 oasc.SolrCore.registerSearcher [collection1] Registered new searcher Searcher@3f790d0b main{StandardDirectoryReader(segments_1:1:nrt)}
   [junit4]   2> 297129 T1083 oasc.CoreContainer.registerCore registering core: collection1
   [junit4]   2> 297129 T1061 oass.SolrDispatchFilter.init user.dir=/mnt/ssd/jenkins/workspace/Lucene-Solr-trunk-Linux/solr/build/solr-core/test/J1
   [junit4]   2> 297130 T1061 oass.SolrDispatchFilter.init SolrDispatchFilter.init() done
   [junit4]   2> ASYNC  NEW_CORE C302 name=collection1 org.apache.solr.core.SolrCore@f0def473
   [junit4]   2> 297141 T1070 C302 oasup.LogUpdateProcessor.finish [collection1] webapp=/e/wc path=/update params={wt=javabin&version=2} {add=[0 (1452758017335361536)]} 0 3
   [junit4]   2> ASYNC  NEW_CORE C303 name=collection1 org.apache.solr.core.SolrCore@be811048
   [junit4]   2> 297150 T1082 C303 oasup.LogUpdateProcessor.finish [collection1] webapp=/e/wc path=/update params={wt=javabin&version=2} {add=[0 (1452758017345847296)]} 0 1
   [junit4]   2> 297153 T1067 C302 oasup.LogUpdateProcessor.finish [collection1] webapp=/e/wc path=/update params={version=2&wt=javabin} {add=[1 (1452758017350041600)]} 0 1
   [junit4]   2> 297157 T1079 C303 oasup.LogUpdateProcessor.finish [collection1] webapp=/e/wc path=/update params={version=2&wt=javabin} {add=[1 (1452758017354235904)]} 0 1
   [junit4]   2> 297161 T1068 C302 oasup.LogUpdateProcessor.finish [collection1] webapp=/e/wc path=/update params={version=2&wt=javabin} {add=[2 (1452758017358430208)]} 0 1
   [junit4]   2> 297164 T1080 C303 oasup.LogUpdateProcessor.finish [collection1] webapp=/e/wc path=/update params={version=2&wt=javabin} {add=[2 (1452758017362624512)]} 0 1
   [junit4]   2> 297168 T1069 C302 oasup.LogUpdateProcessor.finish [collection1] webapp=/e/wc path=/update params={version=2&wt=javabin} {add=[3 (1452758017365770240)]} 0 1
   [junit4]   2> 297171 T1081 C303 oasup.LogUpdateProcessor.finish [collection1] webapp=/e/wc path=/update params={version=2&wt=javabin} {add=[3 (1452758017369964544)]} 0 1
   [junit4]   2> 297174 T1070 C302 oasup.LogUpdateProcessor.finish [collection1] webapp=/e/wc path=/update params={version=2&wt=javabin} {add=[4 (1452758017373110272)]} 0 0
   [junit4]   2> 297178 T1082 C303 oasup.LogUpdateProcessor.finish [collection1] webapp=/e/wc path=/update params={version=2&wt=javabin} {add=[4 (1452758017376256000)]} 0 1
   [junit4]   2> 297181 T1067 C302 oasup.LogUpdateProcessor.finish [collection1] webapp=/e/wc path=/update params={wt=javabin&version=2} {add=[5 (1452758017380450304)]} 0 0
   [junit4]   2> 297184 T1079 C303 oasup.LogUpdateProcessor.finish [collection1] webapp=/e/wc path=/update params={version=2&wt=javabin} {add=[5 (1452758017383596032)]} 0 0
   [junit4]   2> 297187 T1068 C302 oasup.LogUpdateProcessor.finish [collection1] webapp=/e/wc path=/update params={version=2&wt=javabin} {add=[6 (1452758017386741760)]} 0 0
   [junit4]   2> 297190 T1080 C303 oasup.LogUpdateProcessor.finish [collection1] webapp=/e/wc path=/update params={wt=javabin&version=2} {add=[6 (1452758017389887488)]} 0 0
   [junit4]   2> 297193 T1069 C302 oasup.LogUpdateProcessor.finish [collection1] webapp=/e/wc path=/update params={wt=javabin&version=2} {add=[7 (1452758017393033216)]} 0 0
   [junit4]   2> 297196 T1081 C303 oasup.LogUpdateProcessor.finish [collection1] webapp=/e/wc path=/update params={wt=javabin&version=2} {add=[7 (1452758017396178944)]} 0 0
   [junit4]   2> 297199 T1070 C302 oasup.LogUpdateProcessor.finish [collection1] webapp=/e/wc path=/update params={wt=javabin&version=2} {add=[8 (1452758017399324672)]} 0 0
   [junit4]   2> 297203 T1082 C303 oasup.LogUpdateProcessor.finish [collection1] webapp=/e/wc path=/update params={wt=javabin&version=2} {add=[8 (1452758017402470400)]} 0 1
   [junit4]   2> 297206 T1067 C302 oasup.LogUpdateProcessor.finish [collection1] webapp=/e/wc path=/update params={wt=javabin&version=2} {add=[9 (1452758017406664704)]} 0 0
   [junit4]   2> 297209 T1079 C303 oasup.LogUpdateProcessor.finish [collection1] webapp=/e/wc path=/update params={wt=javabin&version=2} {add=[9 (1452758017409810432)]} 0 1
   [junit4]   2> 297212 T1068 C302 oasu.DirectUpdateHandler2.commit start commit{,optimize=false,openSearcher=true,waitSearcher=true,expungeDeletes=false,softCommit=false,prepareCommit=false}
   [junit4]   2> 297215 T1068 C302 oasc.SolrDeletionPolicy.onCommit SolrDeletionPolicy.onCommit: commits: num=2
   [junit4]   2> 		commit{dir=RateLimitedDirectoryWrapper(MockDirectoryWrapper(org.apache.lucene.store.RAMDirectory@6cba9349 lockFactory=org.apache.lucene.store.SingleInstanceLockFactory@af0027e0)),segFN=segments_1,generation=1}
   [junit4]   2> 		commit{dir=RateLimitedDirectoryWrapper(MockDirectoryWrapper(org.apache.lucene.store.RAMDirectory@6cba9349 lockFactory=org.apache.lucene.store.SingleInstanceLockFactory@af0027e0)),segFN=segments_2,generation=2}
   [junit4]   2> 297216 T1068 C302 oasc.SolrDeletionPolicy.updateCommits newest commit generation = 2
   [junit4]   2> 297217 T1068 C302 oass.SolrIndexSearcher.<init> Opening Searcher@6576d7b3 main
   [junit4]   2> 297218 T1068 C302 oasu.DirectUpdateHandler2.commit end_commit_flush
   [junit4]   2> 297220 T1072 oasc.SolrCore.registerSearcher [collection1] Registered new searcher Searcher@6576d7b3 main{StandardDirectoryReader(segments_2:3:nrt _0(5.0):C10)}
   [junit4]   2> 297221 T1068 C302 oasup.LogUpdateProcessor.finish [collection1] webapp=/e/wc path=/update params={wt=javabin&waitSearcher=true&commit=true&version=2&softCommit=false} {commit=} 0 9
   [junit4]   2> 297223 T1080 C303 oasu.DirectUpdateHandler2.commit start commit{,optimize=false,openSearcher=true,waitSearcher=true,expungeDeletes=false,softCommit=false,prepareCommit=false}
   [junit4]   2> 297227 T1080 C303 oasc.SolrDeletionPolicy.onCommit SolrDeletionPolicy.onCommit: commits: num=2
   [junit4]   2> 		commit{dir=RateLimitedDirectoryWrapper(MockDirectoryWrapper(org.apache.lucene.store.RAMDirectory@eb96e0c4 lockFactory=org.apache.lucene.store.SingleInstanceLockFactory@da24ba)),segFN=segments_1,generation=1}
   [junit4]   2> 		commit{dir=RateLimitedDirectoryWrapper(MockDirectoryWrapper(org.apache.lucene.store.RAMDirectory@eb96e0c4 lockFactory=org.apache.lucene.store.SingleInstanceLockFactory@da24ba)),segFN=segments_2,generation=2}
   [junit4]   2> 297227 T1080 C303 oasc.SolrDeletionPolicy.updateCommits newest commit generation = 2
   [junit4]   2> 297229 T1080 C303 oass.SolrIndexSearcher.<init> Opening Searcher@1ff5780f main
   [junit4]   2> 297229 T1080 C303 oasu.DirectUpdateHandler2.commit end_commit_flush
   [junit4]   2> 297230 T1084 oasc.SolrCore.registerSearcher [collection1] Registered new searcher Searcher@1ff5780f main{StandardDirectoryReader(segments_2:3:nrt _0(5.0):C10)}
   [junit4]   2> 297231 T1080 C303 oasup.LogUpdateProcessor.finish [collection1] webapp=/e/wc path=/update params={softCommit=false&version=2&waitSearcher=true&commit=true&wt=javabin} {commit=} 0 8
   [junit4]   2> 297239 T1070 C302 oasc.SolrCore.execute [collection1] webapp=/e/wc path=/select params={distrib=false&wt=javabin&shards.qt=tvrh&tv=true&sort=id+desc&tv.tf=true&q=id:0&version=2&qt=tvrh} hits=1 status=0 QTime=5 
   [junit4]   2> 297244 T1082 C303 oasc.SolrCore.execute [collection1] webapp=/e/wc path=/select params={tv=true&shard.url=127.0.0.1:57890/e/wc&tv.tf=true&isShard=true&fl=id&distrib=false&rows=10&shards.qt=tvrh&start=0&NOW=1385458009189&sort=id+desc&q=id:0&version=2&qt=tvrh&fsv=true&wt=javabin} hits=1 status=0 QTime=0 
   [junit4]   2> 297248 T1079 C303 oasc.SolrCore.execute [collection1] webapp=/e/wc path=/select params={isShard=true&tv.tf=true&q=id:0&version=2&qt=tvrh&NOW=1385458009189&shard.url=127.0.0.1:57890/e/wc&tv=true&shards.qt=tvrh&distrib=false&wt=javabin&ids=0} status=0 QTime=0 
   [junit4]   2> 297249 T1081 C303 oasc.SolrCore.execute [collection1] webapp=/e/wc path=/select params={sort=id+desc&tv=true&version=2&qt=tvrh&tv.tf=true&q=id:0&wt=javabin&shards=127.0.0.1:57890/e/wc&shards.qt=tvrh} hits=1 status=0 QTime=8 
   [junit4]   2> 297253 T1067 C302 oasc.SolrCore.execute [collection1] webapp=/e/wc path=/select params={version=2&qt=tvrh&tv.tf=true&fl=*,score&q=id:0&sort=id+asc&tv.fl=test_basictv,test_offtv&tv=true&shards.qt=tvrh&wt=javabin&distrib=false} hits=1 status=0 QTime=1 
   [junit4]   2> 297262 T1082 C303 oasc.SolrCore.execute [collection1] webapp=/e/wc path=/select params={NOW=1385458009203&tv.fl=test_basictv,test_offtv&sort=id+asc&q=id:0&fsv=true&version=2&qt=tvrh&wt=javabin&shard.url=[ff01::114]:33332/e/wc|[ff01::083]:33332/e/wc|127.0.0.1:57890/e/wc&tv=true&fl=id,score&tv.tf=true&isShard=true&distrib=false&shards.qt=tvrh&rows=10&start=0} hits=1 status=0 QTime=0 
   [junit4]   2> 297265 T1079 C303 oasc.SolrCore.execute [collection1] webapp=/e/wc path=/select params={q=id:0&version=2&qt=tvrh&NOW=1385458009203&tv.fl=test_basictv,test_offtv&ids=0&wt=javabin&tv.tf=true&isShard=true&fl=*,score&tv=true&shard.url=[ff01::114]:33332/e/wc|[ff01::083]:33332/e/wc|127.0.0.1:57890/e/wc&shards.qt=tvrh&distrib=false} status=0 QTime=1 
   [junit4]   2> 297265 T1080 C303 oasc.SolrCore.execute [collection1] webapp=/e/wc path=/select params={version=2&qt=tvrh&tv.tf=true&fl=*,score&q=id:0&sort=id+asc&tv.fl=test_basictv,test_offtv&tv=true&shards=[ff01::114]:33332/e/wc|[ff01::083]:33332/e/wc|127.0.0.1:57890/e/wc&shards.qt=tvrh&wt=javabin} hits=1 status=0 QTime=10 
   [junit4]   2> 297267 T1061 oas.BaseDistributedSearchTestCase.compareSolrResponses ERROR Mismatched responses:
   [junit4]   2> 	{responseHeader={status=0,QTime=10},response={numFound=1,start=0,maxScore=2.609438,docs=[SolrDocument{id=0, range_facet_si=0, range_facet_l=[0], range_facet_sl=[0], test_posofftv=[This is a title and another title], test_basictv=[This is a title and another title], test_notv=[This is a title and another title], test_postv=[This is a title and another title], test_offtv=[This is a title and another title], _version_=1452758017345847296, intDefault=42, timestamp=Tue Nov 26 11:26:49 CAT 2013, multiDefault=[muLti-Default], score=2.609438}]},termVectors={uniqueKeyFieldName=id,0={uniqueKey=0,test_basictv={anoth={tf=1},titl={tf=2}},test_offtv={anoth={tf=1},titl={tf=2}}}}}
   [junit4]   2> 	{responseHeader={status=0,QTime=1},response={numFound=1,start=0,maxScore=2.609438,docs=[SolrDocument{id=0, range_facet_si=0, range_facet_l=[0], range_facet_sl=[0], test_posofftv=[This is a title and another title], test_basictv=[This is a title and another title], test_notv=[This is a title and another title], test_postv=[This is a title and another title], test_offtv=[This is a title and another title], _version_=1452758017335361536, intDefault=42, timestamp=Tue Nov 26 11:26:49 CAT 2013, multiDefault=[muLti-Default], score=2.609438}]},termVectors={uniqueKeyFieldName=id,0={uniqueKey=0,test_offtv={anoth={tf=1},titl={tf=2}},test_basictv={anoth={tf=1},titl={tf=2}}}}}
   [junit4]   2> 297288 T1061 oasc.CoreContainer.shutdown Shutting down CoreContainer instance=403942612
   [junit4]   2> 297289 T1061 oasc.SolrCore.close [collection1]  CLOSING SolrCore org.apache.solr.core.SolrCore@f0def473
   [junit4]   2> 297296 T1061 oasu.DirectUpdateHandler2.close closing DirectUpdateHandler2{commits=1,autocommits=0,soft autocommits=0,optimizes=0,rollbacks=0,expungeDeletes=0,docsPending=0,adds=0,deletesById=0,deletesByQuery=0,errors=0,cumulative_adds=10,cumulative_deletesById=0,cumulative_deletesByQuery=0,cumulative_errors=0,transaction_logs_total_size=1285,transaction_logs_total_number=1}
   [junit4]   2> 297297 T1061 oasu.SolrCoreState.decrefSolrCoreState Closing SolrCoreState
   [junit4]   2> 297297 T1061 oasu.DefaultSolrCoreState.closeIndexWriter SolrCoreState ref count has reached 0 - closing IndexWriter
   [junit4]   2> 297298 T1061 oasu.DefaultSolrCoreState.closeIndexWriter closing IndexWriter with IndexWriterCloser
   [junit4]   2> 297299 T1061 oasc.SolrCore.closeSearcher [collection1] Closing main searcher on request.
   [junit4]   2> 297299 T1061 oasc.CachingDirectoryFactory.close Closing MockDirectoryFactory - 2 directories currently being tracked
   [junit4]   2> 297300 T1061 oasc.CachingDirectoryFactory.closeCacheValue looking to close ./org.apache.solr.handler.component.TermVectorComponentDistributedTest-1385458007969/control/data [CachedDir<<refCount=0;path=./org.apache.solr.handler.component.TermVectorComponentDistributedTest-1385458007969/control/data;done=false>>]
   [junit4]   2> 297300 T1061 oasc.CachingDirectoryFactory.close Closing directory: ./org.apache.solr.handler.component.TermVectorComponentDistributedTest-1385458007969/control/data
   [junit4]   2> 297301 T1061 oasc.CachingDirectoryFactory.closeCacheValue looking to close ./org.apache.solr.handler.component.TermVectorComponentDistributedTest-1385458007969/control/data/index [CachedDir<<refCount=0;path=./org.apache.solr.handler.component.TermVectorComponentDistributedTest-1385458007969/control/data/index;done=false>>]
   [junit4]   2> 297302 T1061 oasc.CachingDirectoryFactory.close Closing directory: ./org.apache.solr.handler.component.TermVectorComponentDistributedTest-1385458007969/control/data/index
   [junit4]   2> 297302 T1061 oejsh.ContextHandler.doStop stopped o.e.j.s.ServletContextHandler{/e/wc,null}
   [junit4]   2> 297375 T1061 oasc.CoreContainer.shutdown Shutting down CoreContainer instance=-1971215791
   [junit4]   2> 297376 T1061 oasc.SolrCore.close [collection1]  CLOSING SolrCore org.apache.solr.core.SolrCore@be811048
   [junit4]   2> 297389 T1061 oasu.DirectUpdateHandler2.close closing DirectUpdateHandler2{commits=1,autocommits=0,soft autocommits=0,optimizes=0,rollbacks=0,expungeDeletes=0,docsPending=0,adds=0,deletesById=0,deletesByQuery=0,errors=0,cumulative_adds=10,cumulative_deletesById=0,cumulative_deletesByQuery=0,cumulative_errors=0,transaction_logs_total_size=1285,transaction_logs_total_number=1}
   [junit4]   2> 297390 T1061 oasu.SolrCoreState.decrefSolrCoreState Closing SolrCoreState
   [junit4]   2> 297390 T1061 oasu.DefaultSolrCoreState.closeIndexWriter SolrCoreState ref count has reached 0 - closing IndexWriter
   [junit4]   2> 297391 T1061 oasu.DefaultSolrCoreState.closeIndexWriter closing IndexWriter with IndexWriterCloser
   [junit4]   2> 297392 T1061 oasc.SolrCore.closeSearcher [collection1] Closing main searcher on request.
   [junit4]   2> 297392 T1061 oasc.CachingDirectoryFactory.close Closing MockDirectoryFactory - 2 directories currently being tracked
   [junit4]   2> 297393 T1061 oasc.CachingDirectoryFactory.closeCacheValue looking to close ./org.apache.solr.handler.component.TermVectorComponentDistributedTest-1385458007969/shard0/data/index [CachedDir<<refCount=0;path=./org.apache.solr.handler.component.TermVectorComponentDistributedTest-1385458007969/shard0/data/index;done=false>>]
   [junit4]   2> 297394 T1061 oasc.CachingDirectoryFactory.close Closing directory: ./org.apache.solr.handler.component.TermVectorComponentDistributedTest-1385458007969/shard0/data/index
   [junit4]   2> 297394 T1061 oasc.CachingDirectoryFactory.closeCacheValue looking to close ./org.apache.solr.handler.component.TermVectorComponentDistributedTest-1385458007969/shard0/data [CachedDir<<refCount=0;path=./org.apache.solr.handler.component.TermVectorComponentDistributedTest-1385458007969/shard0/data;done=false>>]
   [junit4]   2> 297395 T1061 oasc.CachingDirectoryFactory.close Closing directory: ./org.apache.solr.handler.component.TermVectorComponentDistributedTest-1385458007969/shard0/data
   [junit4]   2> 297396 T1061 oejsh.ContextHandler.doStop stopped o.e.j.s.ServletContextHandler{/e/wc,null}
   [junit4]   2> 297454 T1061 oas.SolrTestCaseJ4.tearDown ###Ending testDistribSearch
   [junit4]   2> NOTE: reproduce with: ant test  -Dtestcase=TermVectorComponentDistributedTest -Dtests.method=testDistribSearch -Dtests.seed=9740471648477CBB -Dtests.multiplier=3 -Dtests.slow=true -Dtests.locale=ar_IQ -Dtests.timezone=Africa/Lubumbashi -Dtests.file.encoding=UTF-8
   [junit4] FAILURE 1.45s J1 | TermVectorComponentDistributedTest.testDistribSearch <<<
   [junit4]    > Throwable #1: junit.framework.AssertionFailedError: .termVectors.0.test_basictv!=test_offtv (unordered or missing)
   [junit4]    > 	at __randomizedtesting.SeedInfo.seed([9740471648477CBB:16A6C90E3F181C87]:0)
   [junit4]    > 	at junit.framework.Assert.fail(Assert.java:50)
   [junit4]    > 	at org.apache.solr.BaseDistributedSearchTestCase.compareSolrResponses(BaseDistributedSearchTestCase.java:808)
   [junit4]    > 	at org.apache.solr.BaseDistributedSearchTestCase.compareResponses(BaseDistributedSearchTestCase.java:827)
   [junit4]    > 	at org.apache.solr.BaseDistributedSearchTestCase.query(BaseDistributedSearchTestCase.java:531)
   [junit4]    > 	at org.apache.solr.BaseDistributedSearchTestCase.query(BaseDistributedSearchTestCase.java:511)
   [junit4]    > 	at org.apache.solr.handler.component.TermVectorComponentDistributedTest.doTest(TermVectorComponentDistributedTest.java:127)
   [junit4]    > 	at org.apache.solr.BaseDistributedSearchTestCase.testDistribSearch(BaseDistributedSearchTestCase.java:841)
   [junit4]    > 	at java.lang.Thread.run(Thread.java:780)
   [junit4]   2> 297463 T1061 oas.SolrTestCaseJ4.deleteCore ###deleteCore
   [junit4]   2> NOTE: test params are: codec=CheapBastard, sim=RandomSimilarityProvider(queryNorm=false,coord=crazy): {}, locale=ar_IQ, timezone=Africa/Lubumbashi
   [junit4]   2> NOTE: Linux 3.8.0-33-generic x86/IBM Corporation 1.7.0 (32-bit)/cpus=8,threads=1,free=39902360,total=167706624
   [junit4]   2> NOTE: All tests run in this JVM: [TestOmitPositions, TestImplicitCoreProperties, SpellCheckComponentTest, ModifyConfFileTest, DateFieldTest, RequestHandlersTest, SuggesterWFSTTest, QueryFacetTest, TestStressLucene, TestLazyCores, TestArbitraryIndexDir, TestCodecSupport, DirectSolrSpellCheckerTest, TestStressUserVersions, SolrTestCaseJ4Test, TestIBSimilarityFactory, TestPartialUpdateDeduplication, TestDefaultSimilarityFactory, TestHashPartitioner, BlockCacheTest, DefaultValueUpdateProcessorTest, OutputWriterTest, SolrCmdDistributorTest, NumericFieldsTest, MinimalSchemaTest, UniqFieldsUpdateProcessorFactoryTest, LeaderElectionIntegrationTest, TestUpdate, TestSolrDeletionPolicy2, PreAnalyzedUpdateProcessorTest, AssignTest, TestAnalyzedSuggestions, TestXIncludeConfig, PingRequestHandlerTest, SpellCheckCollatorTest, ChaosMonkeyNothingIsSafeTest, SolrXmlInZkTest, TestCoreDiscovery, ShardRoutingCustomTest, ZkNodePropsTest, TestNRTOpen, JSONWriterTest, TimeZoneUtilsTest, CoreContainerCoreInitFailuresTest, TestStressRecovery, HdfsRecoveryZkTest, TestSolrQueryParserResource, TestNonNRTOpen, TermVectorComponentDistributedTest]
   [junit4] Completed on J1 in 1.47s, 1 test, 1 failure <<< FAILURES!

[...truncated 4 lines...]
   [junit4] Suite: org.apache.solr.handler.component.DistributedQueryElevationComponentTest
   [junit4]   2> 306643 T924 oas.BaseDistributedSearchTestCase.initHostContext Setting hostContext system property: /
   [junit4]   2> 306646 T924 oas.SolrTestCaseJ4.setUp ###Starting testDistribSearch
   [junit4]   2> 306648 T924 oejs.Server.doStart jetty-8.1.10.v20130312
   [junit4]   2> 306653 T924 oejs.AbstractConnector.doStart Started SelectChannelConnector@127.0.0.1:52535
   [junit4]   2> 306654 T924 oass.SolrDispatchFilter.init SolrDispatchFilter.init()
   [junit4]   2> 306655 T924 oasc.SolrResourceLoader.locateSolrHome JNDI not configured for solr (NoInitialContextEx)
   [junit4]   2> 306655 T924 oasc.SolrResourceLoader.locateSolrHome using system property solr.solr.home: /mnt/ssd/jenkins/workspace/Lucene-Solr-trunk-Linux/solr/build/solr-core/test-files/solr
   [junit4]   2> 306656 T924 oasc.SolrResourceLoader.<init> new SolrResourceLoader for directory: '/mnt/ssd/jenkins/workspace/Lucene-Solr-trunk-Linux/solr/build/solr-core/test-files/solr/'
   [junit4]   2> 306664 T924 oasc.ConfigSolr.fromFile Loading container configuration from /mnt/ssd/jenkins/workspace/Lucene-Solr-trunk-Linux/solr/build/solr-core/test-files/solr/solr.xml
   [junit4]   2> 306697 T924 oasc.CoreContainer.<init> New CoreContainer -2012131906
   [junit4]   2> 306698 T924 oasc.CoreContainer.load Loading cores into CoreContainer [instanceDir=/mnt/ssd/jenkins/workspace/Lucene-Solr-trunk-Linux/solr/build/solr-core/test-files/solr/]
   [junit4]   2> 306699 T924 oashc.HttpShardHandlerFactory.getParameter Setting socketTimeout to: 90000
   [junit4]   2> 306700 T924 oashc.HttpShardHandlerFactory.getParameter Setting urlScheme to: http://
   [junit4]   2> 306700 T924 oashc.HttpShardHandlerFactory.getParameter Setting connTimeout to: 15000
   [junit4]   2> 306701 T924 oashc.HttpShardHandlerFactory.getParameter Setting maxConnectionsPerHost to: 20
   [junit4]   2> 306701 T924 oashc.HttpShardHandlerFactory.getParameter Setting corePoolSize to: 0
   [junit4]   2> 306702 T924 oashc.HttpShardHandlerFactory.getParameter Setting maximumPoolSize to: 2147483647
   [junit4]   2> 306702 T924 oashc.HttpShardHandlerFactory.getParameter Setting maxThreadIdleTime to: 5
   [junit4]   2> 306703 T924 oashc.HttpShardHandlerFactory.getParameter Setting sizeOfQueue to: -1
   [junit4]   2> 306703 T924 oashc.HttpShardHandlerFactory.getParameter Setting fairnessPolicy to: false
   [junit4]   2> 306708 T924 oasl.LogWatcher.createWatcher SLF4J impl is org.slf4j.impl.Log4jLoggerFactory
   [junit4]   2> 306708 T924 oasl.LogWatcher.newRegisteredLogWatcher Registering Log Listener [Log4j (org.slf4j.impl.Log4jLoggerFactory)]
   [junit4]   2> 306709 T924 oasc.CoreContainer.load Host Name: 127.0.0.1
   [junit4]   2> 306713 T934 oasc.CoreContainer.create Creating SolrCore 'collection1' using instanceDir: /mnt/ssd/jenkins/workspace/Lucene-Solr-trunk-Linux/solr/build/solr-core/test-files/solr/collection1
   [junit4]   2> 306713 T934 oasc.SolrResourceLoader.<init> new SolrResourceLoader for directory: '/mnt/ssd/jenkins/workspace/Lucene-Solr-trunk-Linux/solr/build/solr-core/test-files/solr/collection1/'
   [junit4]   2> 306714 T934 oasc.SolrResourceLoader.replaceClassLoader Adding 'file:/mnt/ssd/jenkins/workspace/Lucene-Solr-trunk-Linux/solr/build/solr-core/test-files/solr/collection1/lib/classes/' to classloader
   [junit4]   2> 306715 T934 oasc.SolrResourceLoader.replaceClassLoader Adding 'file:/mnt/ssd/jenkins/workspace/Lucene-Solr-trunk-Linux/solr/build/solr-core/test-files/solr/collection1/lib/README' to classloader
   [junit4]   2> 306746 T934 oasc.SolrConfig.<init> Using Lucene MatchVersion: LUCENE_50
   [junit4]   2> 306779 T934 oasc.SolrConfig.<init> Loaded SolrConfig: solrconfig-elevate.xml
   [junit4]   2> 306779 T934 oass.IndexSchema.readSchema Reading Solr Schema from schema11.xml
   [junit4]   2> 306784 T934 oass.IndexSchema.readSchema [collection1] Schema name=example
   [junit4]   2> 306922 T934 oass.IndexSchema.readSchema default search field in schema is text
   [junit4]   2> 306924 T934 oass.IndexSchema.readSchema unique key field: id
   [junit4]   2> 306929 T934 oasc.SolrCore.initDirectoryFactory org.apache.solr.core.MockDirectoryFactory
   [junit4]   2> 306929 T934 oasc.SolrCore.<init> [collection1] Opening new SolrCore at /mnt/ssd/jenkins/workspace/Lucene-Solr-trunk-Linux/solr/build/solr-core/test-files/solr/collection1/, dataDir=./org.apache.solr.handler.component.DistributedQueryElevationComponentTest-1385458018790/control/data/
   [junit4]   2> 306929 T934 oasc.JmxMonitoredMap.<init> JMX monitoring is enabled. Adding Solr mbeans to JMX Server: com.sun.jmx.mbeanserver.JmxMBeanServer@41856a59
   [junit4]   2> 306930 T934 oasc.CachingDirectoryFactory.get return new directory for ./org.apache.solr.handler.component.DistributedQueryElevationComponentTest-1385458018790/control/data
   [junit4]   2> 306931 T934 oasc.SolrCore.getNewIndexDir New index directory detected: old=null new=./org.apache.solr.handler.component.DistributedQueryElevationComponentTest-1385458018790/control/data/index/
   [junit4]   2> 306931 T934 oasc.SolrCore.initIndex WARN [collection1] Solr index directory './org.apache.solr.handler.component.DistributedQueryElevationComponentTest-1385458018790/control/data/index' doesn't exist. Creating new index...
   [junit4]   2> 306931 T934 oasc.CachingDirectoryFactory.get return new directory for ./org.apache.solr.handler.component.DistributedQueryElevationComponentTest-1385458018790/control/data/index
   [junit4]   2> 306932 T934 oasu.RandomMergePolicy.<init> RandomMergePolicy wrapping class org.apache.lucene.index.TieredMergePolicy: [TieredMergePolicy: maxMergeAtOnce=25, maxMergeAtOnceExplicit=43, maxMergedSegmentMB=58.6328125, floorSegmentMB=0.2685546875, forceMergeDeletesPctAllowed=20.69685902104468, segmentsPerTier=13.0, maxCFSSegmentSizeMB=8.796093022207999E12, noCFSRatio=0.0
   [junit4]   2> 306933 T934 oasc.SolrDeletionPolicy.onCommit SolrDeletionPolicy.onCommit: commits: num=1
   [junit4]   2> 		commit{dir=MockDirectoryWrapper(org.apache.lucene.store.RAMDirectory@f6090dab lockFactory=org.apache.lucene.store.SingleInstanceLockFactory@d935975a),segFN=segments_1,generation=1}
   [junit4]   2> 306933 T934 oasc.SolrDeletionPolicy.updateCommits newest commit generation = 1
   [junit4]   2> 306935 T934 oasc.SolrCore.loadUpdateProcessorChains no updateRequestProcessorChain defined as default, creating implicit default
   [junit4]   2> 306936 T934 oasc.RequestHandlers.initHandlersFromConfig created /update: solr.UpdateRequestHandler
   [junit4]   2> 306936 T934 oasc.RequestHandlers.initHandlersFromConfig created /elevate: org.apache.solr.handler.component.SearchHandler
   [junit4]   2> 306937 T934 oasc.RequestHandlers.initHandlersFromConfig created /dataElevate: org.apache.solr.handler.component.SearchHandler
   [junit4]   2> 306938 T934 oashl.XMLLoader.init xsltCacheLifetimeSeconds=60
   [junit4]   2> 306938 T934 oasc.RequestHandlers.initHandlersFromConfig WARN no default request handler is registered (either '/select' or 'standard')
   [junit4]   2> 306939 T934 oasc.SolrCore.initDeprecatedSupport WARN solrconfig.xml uses deprecated <admin/gettableFiles>, Please update your config to use the ShowFileRequestHandler.
   [junit4]   2> 306941 T934 oasc.SolrCore.initDeprecatedSupport WARN adding ShowFileRequestHandler with hidden files: [SOLRCONFIG-NOCACHE.XML, SOLRCONFIG_PERF.XML, SOLRCONFIG-INFOSTREAM-LOGGING.XML, SCHEMA11.XML, SCHEMA12.XML, SOLRCONFIG-ALTDIRECTORY.XML, SCHEMA-MINIMAL.XML, JASUGGEST.TXT, SCHEMA-TINY.XML, SCHEMA-DFR.XML, BAD-SCHEMA-MISPLACED-ASTERISK-COPYFIELD-SOURCE-SHOULD-FAIL-TEST.XML, SCHEMA-REPLICATION1.XML, MISSING.FUNCTIONS.UPDATEPROCESSOR.JS, STOP-1.TXT, SOLRCONFIG-SPELLCHECKCOMPONENT.XML, HYPHENATION.DTD, SOLRCONFIG-SUGGESTERCOMPONENT.XML, SOLRCONFIG-LOGMERGEPOLICY.XML, SCHEMA-ENUMS.XML, BAD-SCHEMA-SIM-GLOBAL-VS-FT-MISMATCH.XML, DA_UTF8.XML, BAD-SCHEMA-DUP-DYNAMICFIELD.XML, STOPWORDSWRONGENCODING.TX

[...truncated too long message...]

ncoding="UTF-8"?>
   [junit4]    > <response>
   [junit4]    > <lst name="responseHeader">
   [junit4]    >   <int name="status">0</int>
   [junit4]    >   <int name="QTime">48</int>
   [junit4]    > </lst>
   [junit4]    > <result name="response" numFound="100" start="0">
   [junit4]    > </result>
   [junit4]    > <lst name="stats">
   [junit4]    >   <lst name="stats_fields"/>
   [junit4]    > </lst>
   [junit4]    > <lst name="stats">
   [junit4]    >   <lst name="cnr">
   [junit4]    >     <double name="c10">10.0"
   [junit4]    > 	at __randomizedtesting.SeedInfo.seed([9740471648477CBB:B6EC670385DA24DD]:0)
   [junit4]    > 	at sun.misc.FloatingDecimal.readJavaFormatString(FloatingDecimal.java:1312)
   [junit4]    > 	at java.lang.Double.parseDouble(Double.java:551)
   [junit4]    > 	at org.apache.solr.analytics.expression.ExpressionTest.getStatResult(ExpressionTest.java:240)
   [junit4]    > 	at org.apache.solr.analytics.expression.ExpressionTest.absoluteValueTest(ExpressionTest.java:148)
   [junit4]    > 	at java.lang.Thread.run(Thread.java:780)
   [junit4]   2> 1392967 T4219 oas.SolrTestCaseJ4.setUp ###Starting constantDateTest
   [junit4]   2> 1392967 T4219 oas.SolrTestCaseJ4.tearDown ###Ending constantDateTest
   [junit4]   2> 1392973 T4219 oas.SolrTestCaseJ4.setUp ###Starting constantNumberTest
   [junit4]   2> 1392974 T4219 oas.SolrTestCaseJ4.tearDown ###Ending constantNumberTest
   [junit4]   2> 1392979 T4219 oas.SolrTestCaseJ4.setUp ###Starting dateMathTest
   [junit4]   2> 1392980 T4219 oas.SolrTestCaseJ4.tearDown ###Ending dateMathTest
   [junit4]   2> 1392983 T4219 oas.SolrTestCaseJ4.deleteCore ###deleteCore
   [junit4]   2> 1392983 T4219 oasc.CoreContainer.shutdown Shutting down CoreContainer instance=1096904518
   [junit4]   2> 1392986 T4219 oasc.SolrCore.close [collection1]  CLOSING SolrCore org.apache.solr.core.SolrCore@e1a6c0b8
   [junit4]   2> 1392986 T4219 oasu.DirectUpdateHandler2.close closing DirectUpdateHandler2{commits=1,autocommits=0,soft autocommits=0,optimizes=0,rollbacks=0,expungeDeletes=0,docsPending=0,adds=0,deletesById=0,deletesByQuery=0,errors=0,cumulative_adds=100,cumulative_deletesById=0,cumulative_deletesByQuery=1,cumulative_errors=0}
   [junit4]   2> 1392987 T4219 oasu.SolrCoreState.decrefSolrCoreState Closing SolrCoreState
   [junit4]   2> 1392988 T4219 oasu.DefaultSolrCoreState.closeIndexWriter SolrCoreState ref count has reached 0 - closing IndexWriter
   [junit4]   2> 1392988 T4219 oasu.DefaultSolrCoreState.closeIndexWriter closing IndexWriter with IndexWriterCloser
   [junit4]   2> 1392989 T4219 oasc.SolrCore.closeSearcher [collection1] Closing main searcher on request.
   [junit4]   2> 1392990 T4219 oasc.CachingDirectoryFactory.close Closing MockDirectoryFactory - 2 directories currently being tracked
   [junit4]   2> 1392990 T4219 oasc.CachingDirectoryFactory.closeCacheValue looking to close /mnt/ssd/jenkins/workspace/Lucene-Solr-trunk-Linux/solr/build/solr-core/test/J0/./solrtest-ExpressionTest-1385459103775/index [CachedDir<<refCount=0;path=/mnt/ssd/jenkins/workspace/Lucene-Solr-trunk-Linux/solr/build/solr-core/test/J0/./solrtest-ExpressionTest-1385459103775/index;done=false>>]
   [junit4]   2> 1392991 T4219 oasc.CachingDirectoryFactory.close Closing directory: /mnt/ssd/jenkins/workspace/Lucene-Solr-trunk-Linux/solr/build/solr-core/test/J0/./solrtest-ExpressionTest-1385459103775/index
   [junit4]   2> 1392992 T4219 oasc.CachingDirectoryFactory.closeCacheValue looking to close /mnt/ssd/jenkins/workspace/Lucene-Solr-trunk-Linux/solr/build/solr-core/test/J0/./solrtest-ExpressionTest-1385459103775 [CachedDir<<refCount=0;path=/mnt/ssd/jenkins/workspace/Lucene-Solr-trunk-Linux/solr/build/solr-core/test/J0/./solrtest-ExpressionTest-1385459103775;done=false>>]
   [junit4]   2> 1392992 T4219 oasc.CachingDirectoryFactory.close Closing directory: /mnt/ssd/jenkins/workspace/Lucene-Solr-trunk-Linux/solr/build/solr-core/test/J0/./solrtest-ExpressionTest-1385459103775
   [junit4]   2> NOTE: test params are: codec=Lucene46: {double_dd=PostingsFormat(name=NestedPulsing), string_sd=PostingsFormat(name=FSTPulsing41), long_ld=MockFixedIntBlock(blockSize=872), date_dtd=MockFixedIntBlock(blockSize=872), id=MockFixedIntBlock(blockSize=872), int_id=PostingsFormat(name=FSTPulsing41), float_fd=PostingsFormat(name=FSTPulsing41)}, docValues:{longdv=DocValuesFormat(name=Disk), double_dd=DocValuesFormat(name=Disk), int_id=DocValuesFormat(name=Lucene45), stringdv=DocValuesFormat(name=Memory), long_ld=DocValuesFormat(name=Memory), date_dtd=DocValuesFormat(name=Memory), intdv=DocValuesFormat(name=Lucene45), string_sd=DocValuesFormat(name=Lucene45), doubledv=DocValuesFormat(name=Memory), float_fd=DocValuesFormat(name=Lucene45), floatdv=DocValuesFormat(name=Disk), datedv=DocValuesFormat(name=SimpleText), stringdvm=DocValuesFormat(name=Disk)}, sim=RandomSimilarityProvider(queryNorm=true,coord=crazy): {}, locale=it_IT_PREEURO, timezone=Australia/Perth
   [junit4]   2> NOTE: Linux 3.8.0-33-generic x86/IBM Corporation 1.7.0 (32-bit)/cpus=8,threads=1,free=64420112,total=215154688
   [junit4]   2> NOTE: All tests run in this JVM: [TestSystemIdResolver, CopyFieldTest, TestHighFrequencyDictionaryFactory, TestFieldResource, TestManagedSchema, StatelessScriptUpdateProcessorFactoryTest, UnloadDistributedZkTest, FieldMutatingUpdateProcessorTest, BasicDistributedZkTest, ReturnFieldsTest, TestPerFieldSimilarity, SynonymTokenizerTest, ZkCLITest, TestRemoteStreaming, SolrInfoMBeanTest, TestSolrXmlPersistor, AliasIntegrationTest, DistributedQueryElevationComponentTest, CoreMergeIndexesAdminHandlerTest, SliceStateUpdateTest, PrimitiveFieldTypeTest, ChangedSchemaMergeTest, SearchHandlerTest, PolyFieldTest, TestJmxMonitoredMap, SpatialFilterTest, TestFunctionQuery, DocValuesTest, TestRandomMergePolicy, DistributedSpellCheckComponentTest, OverseerCollectionProcessorTest, ShowFileRequestHandlerTest, SimpleFacetsTest, ExternalFileFieldSortTest, TestSchemaNameResource, TestCoreContainer, HdfsLockFactoryTest, EchoParamsTest, TestDynamicFieldCollectionResource, RecoveryZkTest, WordBreakSolrSpellCheckerTest, TestReloadAndDeleteDocs, TestLuceneMatchVersion, BadComponentTest, SOLR749Test, DirectUpdateHandlerOptimizeTest, TestSolrXml, TestDynamicFieldResource, ClusterStateUpdateTest, CacheHeaderTest, AddBlockUpdateTest, TestSolrXMLSerializer, LukeRequestHandlerTest, DocumentBuilderTest, LeaderElectionTest, BinaryUpdateRequestHandlerTest, TestTrie, TestNoOpRegenerator, TestSolrXmlPersistence, UUIDFieldTest, ShardSplitTest, SoftAutoCommitTest, TestFieldTypeResource, QueryParsingTest, TestJoin, BasicFunctionalityTest, AnalysisAfterCoreReloadTest, HdfsCollectionsAPIDistributedZkTest, TriLevelCompositeIdRoutingTest, HdfsChaosMonkeySafeLeaderTest, SolrCoreTest, ResponseLogComponentTest, ResourceLoaderTest, TestWriterPerf, TestBM25SimilarityFactory, DocValuesMissingTest, UpdateParamsTest, DistributedSuggesterComponentTest, QueryEqualityTest, ZkControllerTest, TestReversedWildcardFilterFactory, FileBasedSpellCheckerTest, TermsComponentTest, TestSolrDeletionPolicy1, TestStressVersions, OverseerTest, BasicZkTest, ZkSolrClientTest, TestZkChroot, TestDistributedSearch, AutoCommitTest, TestFaceting, TestRecovery, TestRealTimeGet, DistributedTermsComponentTest, TestSolr4Spatial, TestGroupingSearch, TestFiltering, TestExtendedDismaxParser, SolrRequestParserTest, SuggesterTest, SchemaVersionSpecificBehaviorTest, TestPseudoReturnFields, DocValuesMultiTest, DistanceFunctionTest, IndexBasedSpellCheckerTest, TestQueryUtils, TestQueryTypes, TestValueSourceCache, PathHierarchyTokenizerFactoryTest, TestIndexingPerformance, RequiredFieldsTest, TestSolrQueryParser, IndexSchemaRuntimeFieldTest, RegexBoostProcessorTest, SolrPluginUtilsTest, UpdateRequestProcessorFactoryTest, MBeansHandlerTest, TestPHPSerializedResponseWriter, TestBinaryResponseWriter, TestQuerySenderListener, TestQuerySenderNoQuery, TestMergePolicyConfig, SampleTest, TestBinaryField, TestElisionMultitermQuery, TestFuzzyAnalyzedSuggestions, TestPostingsSolrHighlighter, NotRequiredUniqueKeyTest, SpellPossibilityIteratorTest, TestSweetSpotSimilarityFactory, TestDFRSimilarityFactory, TestNumberUtils, TestLMJelinekMercerSimilarityFactory, LegacyHTMLStripCharFilterTest, ScriptEngineTest, PluginInfoTest, DateMathParserTest, PrimUtilsTest, TestSuggestSpellingConverter, SpellingQueryConverterTest, DOMUtilTest, RAMDirectoryFactoryTest, TestSolrJ, TestUtils, SliceStateTest, FileUtilsTest, TestRTGBase, ExpressionTest]
   [junit4] Completed on J0 in 1.39s, 12 tests, 3 errors <<< FAILURES!

[...truncated 143 lines...]
BUILD FAILED
/mnt/ssd/jenkins/workspace/Lucene-Solr-trunk-Linux/build.xml:420: The following error occurred while executing this line:
/mnt/ssd/jenkins/workspace/Lucene-Solr-trunk-Linux/build.xml:413: The following error occurred while executing this line:
/mnt/ssd/jenkins/workspace/Lucene-Solr-trunk-Linux/build.xml:39: The following error occurred while executing this line:
/mnt/ssd/jenkins/workspace/Lucene-Solr-trunk-Linux/extra-targets.xml:37: The following error occurred while executing this line:
/mnt/ssd/jenkins/workspace/Lucene-Solr-trunk-Linux/solr/build.xml:189: The following error occurred while executing this line:
/mnt/ssd/jenkins/workspace/Lucene-Solr-trunk-Linux/solr/common-build.xml:491: The following error occurred while executing this line:
/mnt/ssd/jenkins/workspace/Lucene-Solr-trunk-Linux/lucene/common-build.xml:1275: The following error occurred while executing this line:
/mnt/ssd/jenkins/workspace/Lucene-Solr-trunk-Linux/lucene/common-build.xml:908: There were test failures: 353 suites, 1558 tests, 4 errors, 3 failures, 34 ignored (6 assumptions)

Total time: 53 minutes 7 seconds
Build step 'Invoke Ant' marked build as failure
Description set: Java: 32bit/ibm-j9-jdk7 -Xjit:exclude={org/apache/lucene/util/fst/FST.pack(IIF)Lorg/apache/lucene/util/fst/FST;}
Archiving artifacts
Recording test results
Email was triggered for: Failure
Sending email for trigger: Failure



Mime
View raw message