lucene-dev mailing list archives

Site index · List index
Message view « Date » · « Thread »
Top « Date » · « Thread »
From Policeman Jenkins Server <jenk...@thetaphi.de>
Subject [JENKINS] Lucene-Solr-4.x-Linux (32bit/ibm-j9-jdk6) - Build # 8415 - Still Failing!
Date Sat, 30 Nov 2013 01:19:49 GMT
Build: http://jenkins.thetaphi.de/job/Lucene-Solr-4.x-Linux/8415/
Java: 32bit/ibm-j9-jdk6 -Xjit:exclude={org/apache/lucene/util/fst/FST.pack(IIF)Lorg/apache/lucene/util/fst/FST;}

4 tests failed.
REGRESSION:  org.apache.solr.handler.component.DistributedQueryElevationComponentTest.testDistribSearch

Error Message:
.responseHeader.params.fl!=version (unordered or missing)

Stack Trace:
junit.framework.AssertionFailedError: .responseHeader.params.fl!=version (unordered or missing)
	at __randomizedtesting.SeedInfo.seed([ADF623EBC61C67E6:2C10ADF3B14307DA]:0)
	at junit.framework.Assert.fail(Assert.java:50)
	at org.apache.solr.BaseDistributedSearchTestCase.compareSolrResponses(BaseDistributedSearchTestCase.java:816)
	at org.apache.solr.BaseDistributedSearchTestCase.compareResponses(BaseDistributedSearchTestCase.java:835)
	at org.apache.solr.BaseDistributedSearchTestCase.query(BaseDistributedSearchTestCase.java:538)
	at org.apache.solr.BaseDistributedSearchTestCase.query(BaseDistributedSearchTestCase.java:515)
	at org.apache.solr.handler.component.DistributedQueryElevationComponentTest.doTest(DistributedQueryElevationComponentTest.java:81)
	at org.apache.solr.BaseDistributedSearchTestCase.testDistribSearch(BaseDistributedSearchTestCase.java:843)
	at sun.reflect.NativeMethodAccessorImpl.invoke0(Native Method)
	at sun.reflect.NativeMethodAccessorImpl.invoke(NativeMethodAccessorImpl.java:60)
	at sun.reflect.DelegatingMethodAccessorImpl.invoke(DelegatingMethodAccessorImpl.java:37)
	at java.lang.reflect.Method.invoke(Method.java:611)
	at com.carrotsearch.randomizedtesting.RandomizedRunner.invoke(RandomizedRunner.java:1559)
	at com.carrotsearch.randomizedtesting.RandomizedRunner.access$600(RandomizedRunner.java:79)
	at com.carrotsearch.randomizedtesting.RandomizedRunner$6.evaluate(RandomizedRunner.java:737)
	at com.carrotsearch.randomizedtesting.RandomizedRunner$7.evaluate(RandomizedRunner.java:773)
	at com.carrotsearch.randomizedtesting.RandomizedRunner$8.evaluate(RandomizedRunner.java:787)
	at com.carrotsearch.randomizedtesting.rules.SystemPropertiesRestoreRule$1.evaluate(SystemPropertiesRestoreRule.java:53)
	at org.apache.lucene.util.TestRuleSetupTeardownChained$1.evaluate(TestRuleSetupTeardownChained.java:50)
	at org.apache.lucene.util.TestRuleFieldCacheSanity$1.evaluate(TestRuleFieldCacheSanity.java:51)
	at org.apache.lucene.util.AbstractBeforeAfterRule$1.evaluate(AbstractBeforeAfterRule.java:46)
	at com.carrotsearch.randomizedtesting.rules.SystemPropertiesInvariantRule$1.evaluate(SystemPropertiesInvariantRule.java:55)
	at org.apache.lucene.util.TestRuleThreadAndTestName$1.evaluate(TestRuleThreadAndTestName.java:49)
	at org.apache.lucene.util.TestRuleIgnoreAfterMaxFailures$1.evaluate(TestRuleIgnoreAfterMaxFailures.java:70)
	at org.apache.lucene.util.TestRuleMarkFailure$1.evaluate(TestRuleMarkFailure.java:48)
	at com.carrotsearch.randomizedtesting.rules.StatementAdapter.evaluate(StatementAdapter.java:36)
	at com.carrotsearch.randomizedtesting.ThreadLeakControl$StatementRunner.run(ThreadLeakControl.java:358)
	at com.carrotsearch.randomizedtesting.ThreadLeakControl.forkTimeoutingTask(ThreadLeakControl.java:782)
	at com.carrotsearch.randomizedtesting.ThreadLeakControl$3.evaluate(ThreadLeakControl.java:442)
	at com.carrotsearch.randomizedtesting.RandomizedRunner.runSingleTest(RandomizedRunner.java:746)
	at com.carrotsearch.randomizedtesting.RandomizedRunner$3.evaluate(RandomizedRunner.java:648)
	at com.carrotsearch.randomizedtesting.RandomizedRunner$4.evaluate(RandomizedRunner.java:682)
	at com.carrotsearch.randomizedtesting.RandomizedRunner$5.evaluate(RandomizedRunner.java:693)
	at com.carrotsearch.randomizedtesting.rules.StatementAdapter.evaluate(StatementAdapter.java:36)
	at com.carrotsearch.randomizedtesting.rules.SystemPropertiesRestoreRule$1.evaluate(SystemPropertiesRestoreRule.java:53)
	at org.apache.lucene.util.AbstractBeforeAfterRule$1.evaluate(AbstractBeforeAfterRule.java:46)
	at org.apache.lucene.util.TestRuleStoreClassName$1.evaluate(TestRuleStoreClassName.java:42)
	at com.carrotsearch.randomizedtesting.rules.SystemPropertiesInvariantRule$1.evaluate(SystemPropertiesInvariantRule.java:55)
	at com.carrotsearch.randomizedtesting.rules.NoShadowingOrOverridesOnMethodsRule$1.evaluate(NoShadowingOrOverridesOnMethodsRule.java:39)
	at com.carrotsearch.randomizedtesting.rules.NoShadowingOrOverridesOnMethodsRule$1.evaluate(NoShadowingOrOverridesOnMethodsRule.java:39)
	at com.carrotsearch.randomizedtesting.rules.StatementAdapter.evaluate(StatementAdapter.java:36)
	at org.apache.lucene.util.TestRuleAssertionsRequired$1.evaluate(TestRuleAssertionsRequired.java:43)
	at org.apache.lucene.util.TestRuleMarkFailure$1.evaluate(TestRuleMarkFailure.java:48)
	at org.apache.lucene.util.TestRuleIgnoreAfterMaxFailures$1.evaluate(TestRuleIgnoreAfterMaxFailures.java:70)
	at org.apache.lucene.util.TestRuleIgnoreTestSuites$1.evaluate(TestRuleIgnoreTestSuites.java:55)
	at com.carrotsearch.randomizedtesting.rules.StatementAdapter.evaluate(StatementAdapter.java:36)
	at com.carrotsearch.randomizedtesting.ThreadLeakControl$StatementRunner.run(ThreadLeakControl.java:358)
	at java.lang.Thread.run(Thread.java:738)


REGRESSION:  org.apache.solr.handler.component.TermVectorComponentDistributedTest.testDistribSearch

Error Message:
.termVectors.0.test_basictv!=test_offtv (unordered or missing)

Stack Trace:
junit.framework.AssertionFailedError: .termVectors.0.test_basictv!=test_offtv (unordered or missing)
	at __randomizedtesting.SeedInfo.seed([ADF623EBC61C67E6:2C10ADF3B14307DA]:0)
	at junit.framework.Assert.fail(Assert.java:50)
	at org.apache.solr.BaseDistributedSearchTestCase.compareSolrResponses(BaseDistributedSearchTestCase.java:816)
	at org.apache.solr.BaseDistributedSearchTestCase.compareResponses(BaseDistributedSearchTestCase.java:835)
	at org.apache.solr.BaseDistributedSearchTestCase.query(BaseDistributedSearchTestCase.java:538)
	at org.apache.solr.BaseDistributedSearchTestCase.query(BaseDistributedSearchTestCase.java:515)
	at org.apache.solr.handler.component.TermVectorComponentDistributedTest.doTest(TermVectorComponentDistributedTest.java:127)
	at org.apache.solr.BaseDistributedSearchTestCase.testDistribSearch(BaseDistributedSearchTestCase.java:849)
	at sun.reflect.NativeMethodAccessorImpl.invoke0(Native Method)
	at sun.reflect.NativeMethodAccessorImpl.invoke(NativeMethodAccessorImpl.java:60)
	at sun.reflect.DelegatingMethodAccessorImpl.invoke(DelegatingMethodAccessorImpl.java:37)
	at java.lang.reflect.Method.invoke(Method.java:611)
	at com.carrotsearch.randomizedtesting.RandomizedRunner.invoke(RandomizedRunner.java:1559)
	at com.carrotsearch.randomizedtesting.RandomizedRunner.access$600(RandomizedRunner.java:79)
	at com.carrotsearch.randomizedtesting.RandomizedRunner$6.evaluate(RandomizedRunner.java:737)
	at com.carrotsearch.randomizedtesting.RandomizedRunner$7.evaluate(RandomizedRunner.java:773)
	at com.carrotsearch.randomizedtesting.RandomizedRunner$8.evaluate(RandomizedRunner.java:787)
	at com.carrotsearch.randomizedtesting.rules.SystemPropertiesRestoreRule$1.evaluate(SystemPropertiesRestoreRule.java:53)
	at org.apache.lucene.util.TestRuleSetupTeardownChained$1.evaluate(TestRuleSetupTeardownChained.java:50)
	at org.apache.lucene.util.TestRuleFieldCacheSanity$1.evaluate(TestRuleFieldCacheSanity.java:51)
	at org.apache.lucene.util.AbstractBeforeAfterRule$1.evaluate(AbstractBeforeAfterRule.java:46)
	at com.carrotsearch.randomizedtesting.rules.SystemPropertiesInvariantRule$1.evaluate(SystemPropertiesInvariantRule.java:55)
	at org.apache.lucene.util.TestRuleThreadAndTestName$1.evaluate(TestRuleThreadAndTestName.java:49)
	at org.apache.lucene.util.TestRuleIgnoreAfterMaxFailures$1.evaluate(TestRuleIgnoreAfterMaxFailures.java:70)
	at org.apache.lucene.util.TestRuleMarkFailure$1.evaluate(TestRuleMarkFailure.java:48)
	at com.carrotsearch.randomizedtesting.rules.StatementAdapter.evaluate(StatementAdapter.java:36)
	at com.carrotsearch.randomizedtesting.ThreadLeakControl$StatementRunner.run(ThreadLeakControl.java:358)
	at com.carrotsearch.randomizedtesting.ThreadLeakControl.forkTimeoutingTask(ThreadLeakControl.java:782)
	at com.carrotsearch.randomizedtesting.ThreadLeakControl$3.evaluate(ThreadLeakControl.java:442)
	at com.carrotsearch.randomizedtesting.RandomizedRunner.runSingleTest(RandomizedRunner.java:746)
	at com.carrotsearch.randomizedtesting.RandomizedRunner$3.evaluate(RandomizedRunner.java:648)
	at com.carrotsearch.randomizedtesting.RandomizedRunner$4.evaluate(RandomizedRunner.java:682)
	at com.carrotsearch.randomizedtesting.RandomizedRunner$5.evaluate(RandomizedRunner.java:693)
	at com.carrotsearch.randomizedtesting.rules.StatementAdapter.evaluate(StatementAdapter.java:36)
	at com.carrotsearch.randomizedtesting.rules.SystemPropertiesRestoreRule$1.evaluate(SystemPropertiesRestoreRule.java:53)
	at org.apache.lucene.util.AbstractBeforeAfterRule$1.evaluate(AbstractBeforeAfterRule.java:46)
	at org.apache.lucene.util.TestRuleStoreClassName$1.evaluate(TestRuleStoreClassName.java:42)
	at com.carrotsearch.randomizedtesting.rules.SystemPropertiesInvariantRule$1.evaluate(SystemPropertiesInvariantRule.java:55)
	at com.carrotsearch.randomizedtesting.rules.NoShadowingOrOverridesOnMethodsRule$1.evaluate(NoShadowingOrOverridesOnMethodsRule.java:39)
	at com.carrotsearch.randomizedtesting.rules.NoShadowingOrOverridesOnMethodsRule$1.evaluate(NoShadowingOrOverridesOnMethodsRule.java:39)
	at com.carrotsearch.randomizedtesting.rules.StatementAdapter.evaluate(StatementAdapter.java:36)
	at org.apache.lucene.util.TestRuleAssertionsRequired$1.evaluate(TestRuleAssertionsRequired.java:43)
	at org.apache.lucene.util.TestRuleMarkFailure$1.evaluate(TestRuleMarkFailure.java:48)
	at org.apache.lucene.util.TestRuleIgnoreAfterMaxFailures$1.evaluate(TestRuleIgnoreAfterMaxFailures.java:70)
	at org.apache.lucene.util.TestRuleIgnoreTestSuites$1.evaluate(TestRuleIgnoreTestSuites.java:55)
	at com.carrotsearch.randomizedtesting.rules.StatementAdapter.evaluate(StatementAdapter.java:36)
	at com.carrotsearch.randomizedtesting.ThreadLeakControl$StatementRunner.run(ThreadLeakControl.java:358)
	at java.lang.Thread.run(Thread.java:738)


REGRESSION:  org.apache.solr.update.processor.SignatureUpdateProcessorFactoryTest.testMultiThreaded

Error Message:
expected:<1> but was:<2>

Stack Trace:
java.lang.AssertionError: expected:<1> but was:<2>
	at __randomizedtesting.SeedInfo.seed([ADF623EBC61C67E6:CC63F90B2ECD6D10]:0)
	at org.junit.Assert.fail(Assert.java:93)
	at org.junit.Assert.failNotEquals(Assert.java:647)
	at org.junit.Assert.assertEquals(Assert.java:128)
	at org.junit.Assert.assertEquals(Assert.java:472)
	at org.junit.Assert.assertEquals(Assert.java:456)
	at org.apache.solr.update.processor.SignatureUpdateProcessorFactoryTest.checkNumDocs(SignatureUpdateProcessorFactoryTest.java:71)
	at org.apache.solr.update.processor.SignatureUpdateProcessorFactoryTest.testMultiThreaded(SignatureUpdateProcessorFactoryTest.java:222)
	at sun.reflect.NativeMethodAccessorImpl.invoke0(Native Method)
	at sun.reflect.NativeMethodAccessorImpl.invoke(NativeMethodAccessorImpl.java:60)
	at sun.reflect.DelegatingMethodAccessorImpl.invoke(DelegatingMethodAccessorImpl.java:37)
	at java.lang.reflect.Method.invoke(Method.java:611)
	at com.carrotsearch.randomizedtesting.RandomizedRunner.invoke(RandomizedRunner.java:1559)
	at com.carrotsearch.randomizedtesting.RandomizedRunner.access$600(RandomizedRunner.java:79)
	at com.carrotsearch.randomizedtesting.RandomizedRunner$6.evaluate(RandomizedRunner.java:737)
	at com.carrotsearch.randomizedtesting.RandomizedRunner$7.evaluate(RandomizedRunner.java:773)
	at com.carrotsearch.randomizedtesting.RandomizedRunner$8.evaluate(RandomizedRunner.java:787)
	at com.carrotsearch.randomizedtesting.rules.SystemPropertiesRestoreRule$1.evaluate(SystemPropertiesRestoreRule.java:53)
	at org.apache.lucene.util.TestRuleSetupTeardownChained$1.evaluate(TestRuleSetupTeardownChained.java:50)
	at org.apache.lucene.util.TestRuleFieldCacheSanity$1.evaluate(TestRuleFieldCacheSanity.java:51)
	at org.apache.lucene.util.AbstractBeforeAfterRule$1.evaluate(AbstractBeforeAfterRule.java:46)
	at com.carrotsearch.randomizedtesting.rules.SystemPropertiesInvariantRule$1.evaluate(SystemPropertiesInvariantRule.java:55)
	at org.apache.lucene.util.TestRuleThreadAndTestName$1.evaluate(TestRuleThreadAndTestName.java:49)
	at org.apache.lucene.util.TestRuleIgnoreAfterMaxFailures$1.evaluate(TestRuleIgnoreAfterMaxFailures.java:70)
	at org.apache.lucene.util.TestRuleMarkFailure$1.evaluate(TestRuleMarkFailure.java:48)
	at com.carrotsearch.randomizedtesting.rules.StatementAdapter.evaluate(StatementAdapter.java:36)
	at com.carrotsearch.randomizedtesting.ThreadLeakControl$StatementRunner.run(ThreadLeakControl.java:358)
	at com.carrotsearch.randomizedtesting.ThreadLeakControl.forkTimeoutingTask(ThreadLeakControl.java:782)
	at com.carrotsearch.randomizedtesting.ThreadLeakControl$3.evaluate(ThreadLeakControl.java:442)
	at com.carrotsearch.randomizedtesting.RandomizedRunner.runSingleTest(RandomizedRunner.java:746)
	at com.carrotsearch.randomizedtesting.RandomizedRunner$3.evaluate(RandomizedRunner.java:648)
	at com.carrotsearch.randomizedtesting.RandomizedRunner$4.evaluate(RandomizedRunner.java:682)
	at com.carrotsearch.randomizedtesting.RandomizedRunner$5.evaluate(RandomizedRunner.java:693)
	at com.carrotsearch.randomizedtesting.rules.StatementAdapter.evaluate(StatementAdapter.java:36)
	at com.carrotsearch.randomizedtesting.rules.SystemPropertiesRestoreRule$1.evaluate(SystemPropertiesRestoreRule.java:53)
	at org.apache.lucene.util.AbstractBeforeAfterRule$1.evaluate(AbstractBeforeAfterRule.java:46)
	at org.apache.lucene.util.TestRuleStoreClassName$1.evaluate(TestRuleStoreClassName.java:42)
	at com.carrotsearch.randomizedtesting.rules.SystemPropertiesInvariantRule$1.evaluate(SystemPropertiesInvariantRule.java:55)
	at com.carrotsearch.randomizedtesting.rules.NoShadowingOrOverridesOnMethodsRule$1.evaluate(NoShadowingOrOverridesOnMethodsRule.java:39)
	at com.carrotsearch.randomizedtesting.rules.NoShadowingOrOverridesOnMethodsRule$1.evaluate(NoShadowingOrOverridesOnMethodsRule.java:39)
	at com.carrotsearch.randomizedtesting.rules.StatementAdapter.evaluate(StatementAdapter.java:36)
	at org.apache.lucene.util.TestRuleAssertionsRequired$1.evaluate(TestRuleAssertionsRequired.java:43)
	at org.apache.lucene.util.TestRuleMarkFailure$1.evaluate(TestRuleMarkFailure.java:48)
	at org.apache.lucene.util.TestRuleIgnoreAfterMaxFailures$1.evaluate(TestRuleIgnoreAfterMaxFailures.java:70)
	at org.apache.lucene.util.TestRuleIgnoreTestSuites$1.evaluate(TestRuleIgnoreTestSuites.java:55)
	at com.carrotsearch.randomizedtesting.rules.StatementAdapter.evaluate(StatementAdapter.java:36)
	at com.carrotsearch.randomizedtesting.ThreadLeakControl$StatementRunner.run(ThreadLeakControl.java:358)
	at java.lang.Thread.run(Thread.java:738)


REGRESSION:  org.apache.solr.update.processor.SignatureUpdateProcessorFactoryTest.testDupeDetection

Error Message:
expected:<1> but was:<3>

Stack Trace:
java.lang.AssertionError: expected:<1> but was:<3>
	at __randomizedtesting.SeedInfo.seed([ADF623EBC61C67E6:F6C6D823C55BC49A]:0)
	at org.junit.Assert.fail(Assert.java:93)
	at org.junit.Assert.failNotEquals(Assert.java:647)
	at org.junit.Assert.assertEquals(Assert.java:128)
	at org.junit.Assert.assertEquals(Assert.java:472)
	at org.junit.Assert.assertEquals(Assert.java:456)
	at org.apache.solr.update.processor.SignatureUpdateProcessorFactoryTest.checkNumDocs(SignatureUpdateProcessorFactoryTest.java:71)
	at org.apache.solr.update.processor.SignatureUpdateProcessorFactoryTest.testDupeDetection(SignatureUpdateProcessorFactoryTest.java:119)
	at sun.reflect.NativeMethodAccessorImpl.invoke0(Native Method)
	at sun.reflect.NativeMethodAccessorImpl.invoke(NativeMethodAccessorImpl.java:60)
	at sun.reflect.DelegatingMethodAccessorImpl.invoke(DelegatingMethodAccessorImpl.java:37)
	at java.lang.reflect.Method.invoke(Method.java:611)
	at com.carrotsearch.randomizedtesting.RandomizedRunner.invoke(RandomizedRunner.java:1559)
	at com.carrotsearch.randomizedtesting.RandomizedRunner.access$600(RandomizedRunner.java:79)
	at com.carrotsearch.randomizedtesting.RandomizedRunner$6.evaluate(RandomizedRunner.java:737)
	at com.carrotsearch.randomizedtesting.RandomizedRunner$7.evaluate(RandomizedRunner.java:773)
	at com.carrotsearch.randomizedtesting.RandomizedRunner$8.evaluate(RandomizedRunner.java:787)
	at com.carrotsearch.randomizedtesting.rules.SystemPropertiesRestoreRule$1.evaluate(SystemPropertiesRestoreRule.java:53)
	at org.apache.lucene.util.TestRuleSetupTeardownChained$1.evaluate(TestRuleSetupTeardownChained.java:50)
	at org.apache.lucene.util.TestRuleFieldCacheSanity$1.evaluate(TestRuleFieldCacheSanity.java:51)
	at org.apache.lucene.util.AbstractBeforeAfterRule$1.evaluate(AbstractBeforeAfterRule.java:46)
	at com.carrotsearch.randomizedtesting.rules.SystemPropertiesInvariantRule$1.evaluate(SystemPropertiesInvariantRule.java:55)
	at org.apache.lucene.util.TestRuleThreadAndTestName$1.evaluate(TestRuleThreadAndTestName.java:49)
	at org.apache.lucene.util.TestRuleIgnoreAfterMaxFailures$1.evaluate(TestRuleIgnoreAfterMaxFailures.java:70)
	at org.apache.lucene.util.TestRuleMarkFailure$1.evaluate(TestRuleMarkFailure.java:48)
	at com.carrotsearch.randomizedtesting.rules.StatementAdapter.evaluate(StatementAdapter.java:36)
	at com.carrotsearch.randomizedtesting.ThreadLeakControl$StatementRunner.run(ThreadLeakControl.java:358)
	at com.carrotsearch.randomizedtesting.ThreadLeakControl.forkTimeoutingTask(ThreadLeakControl.java:782)
	at com.carrotsearch.randomizedtesting.ThreadLeakControl$3.evaluate(ThreadLeakControl.java:442)
	at com.carrotsearch.randomizedtesting.RandomizedRunner.runSingleTest(RandomizedRunner.java:746)
	at com.carrotsearch.randomizedtesting.RandomizedRunner$3.evaluate(RandomizedRunner.java:648)
	at com.carrotsearch.randomizedtesting.RandomizedRunner$4.evaluate(RandomizedRunner.java:682)
	at com.carrotsearch.randomizedtesting.RandomizedRunner$5.evaluate(RandomizedRunner.java:693)
	at com.carrotsearch.randomizedtesting.rules.StatementAdapter.evaluate(StatementAdapter.java:36)
	at com.carrotsearch.randomizedtesting.rules.SystemPropertiesRestoreRule$1.evaluate(SystemPropertiesRestoreRule.java:53)
	at org.apache.lucene.util.AbstractBeforeAfterRule$1.evaluate(AbstractBeforeAfterRule.java:46)
	at org.apache.lucene.util.TestRuleStoreClassName$1.evaluate(TestRuleStoreClassName.java:42)
	at com.carrotsearch.randomizedtesting.rules.SystemPropertiesInvariantRule$1.evaluate(SystemPropertiesInvariantRule.java:55)
	at com.carrotsearch.randomizedtesting.rules.NoShadowingOrOverridesOnMethodsRule$1.evaluate(NoShadowingOrOverridesOnMethodsRule.java:39)
	at com.carrotsearch.randomizedtesting.rules.NoShadowingOrOverridesOnMethodsRule$1.evaluate(NoShadowingOrOverridesOnMethodsRule.java:39)
	at com.carrotsearch.randomizedtesting.rules.StatementAdapter.evaluate(StatementAdapter.java:36)
	at org.apache.lucene.util.TestRuleAssertionsRequired$1.evaluate(TestRuleAssertionsRequired.java:43)
	at org.apache.lucene.util.TestRuleMarkFailure$1.evaluate(TestRuleMarkFailure.java:48)
	at org.apache.lucene.util.TestRuleIgnoreAfterMaxFailures$1.evaluate(TestRuleIgnoreAfterMaxFailures.java:70)
	at org.apache.lucene.util.TestRuleIgnoreTestSuites$1.evaluate(TestRuleIgnoreTestSuites.java:55)
	at com.carrotsearch.randomizedtesting.rules.StatementAdapter.evaluate(StatementAdapter.java:36)
	at com.carrotsearch.randomizedtesting.ThreadLeakControl$StatementRunner.run(ThreadLeakControl.java:358)
	at java.lang.Thread.run(Thread.java:738)




Build Log:
[...truncated 9375 lines...]
   [junit4] Suite: org.apache.solr.handler.component.DistributedQueryElevationComponentTest
   [junit4]   2> 41600 T170 oas.BaseDistributedSearchTestCase.initHostContext Setting hostContext system property: /g/l
   [junit4]   2> 41604 T170 oas.SolrTestCaseJ4.setUp ###Starting testDistribSearch
   [junit4]   2> 41606 T170 oejs.Server.doStart jetty-8.1.10.v20130312
   [junit4]   2> 41610 T170 oejs.AbstractConnector.doStart Started SelectChannelConnector@127.0.0.1:54519
   [junit4]   2> 41612 T170 oass.SolrDispatchFilter.init SolrDispatchFilter.init()
   [junit4]   2> 41613 T170 oasc.SolrResourceLoader.locateSolrHome JNDI not configured for solr (NoInitialContextEx)
   [junit4]   2> 41614 T170 oasc.SolrResourceLoader.locateSolrHome using system property solr.solr.home: /mnt/ssd/jenkins/workspace/Lucene-Solr-4.x-Linux/solr/build/solr-core/test-files/solr
   [junit4]   2> 41615 T170 oasc.SolrResourceLoader.<init> new SolrResourceLoader for directory: '/mnt/ssd/jenkins/workspace/Lucene-Solr-4.x-Linux/solr/build/solr-core/test-files/solr/'
   [junit4]   2> 41631 T170 oasc.ConfigSolr.fromFile Loading container configuration from /mnt/ssd/jenkins/workspace/Lucene-Solr-4.x-Linux/solr/build/solr-core/test-files/solr/solr.xml
   [junit4]   2> 41685 T170 oasc.CoreContainer.<init> New CoreContainer 2119532117
   [junit4]   2> 41686 T170 oasc.CoreContainer.load Loading cores into CoreContainer [instanceDir=/mnt/ssd/jenkins/workspace/Lucene-Solr-4.x-Linux/solr/build/solr-core/test-files/solr/]
   [junit4]   2> 41687 T170 oashc.HttpShardHandlerFactory.getParameter Setting socketTimeout to: 90000
   [junit4]   2> 41688 T170 oashc.HttpShardHandlerFactory.getParameter Setting urlScheme to: http://
   [junit4]   2> 41689 T170 oashc.HttpShardHandlerFactory.getParameter Setting connTimeout to: 15000
   [junit4]   2> 41690 T170 oashc.HttpShardHandlerFactory.getParameter Setting maxConnectionsPerHost to: 20
   [junit4]   2> 41690 T170 oashc.HttpShardHandlerFactory.getParameter Setting corePoolSize to: 0
   [junit4]   2> 41691 T170 oashc.HttpShardHandlerFactory.getParameter Setting maximumPoolSize to: 2147483647
   [junit4]   2> 41692 T170 oashc.HttpShardHandlerFactory.getParameter Setting maxThreadIdleTime to: 5
   [junit4]   2> 41692 T170 oashc.HttpShardHandlerFactory.getParameter Setting sizeOfQueue to: -1
   [junit4]   2> 41693 T170 oashc.HttpShardHandlerFactory.getParameter Setting fairnessPolicy to: false
   [junit4]   2> 41700 T170 oasl.LogWatcher.createWatcher SLF4J impl is org.slf4j.impl.Log4jLoggerFactory
   [junit4]   2> 41701 T170 oasl.LogWatcher.newRegisteredLogWatcher Registering Log Listener [Log4j (org.slf4j.impl.Log4jLoggerFactory)]
   [junit4]   2> 41701 T170 oasc.CoreContainer.load Host Name: 127.0.0.1
   [junit4]   2> 41707 T180 oasc.CoreContainer.create Creating SolrCore 'collection1' using instanceDir: /mnt/ssd/jenkins/workspace/Lucene-Solr-4.x-Linux/solr/build/solr-core/test-files/solr/collection1
   [junit4]   2> 41707 T180 oasc.SolrResourceLoader.<init> new SolrResourceLoader for directory: '/mnt/ssd/jenkins/workspace/Lucene-Solr-4.x-Linux/solr/build/solr-core/test-files/solr/collection1/'
   [junit4]   2> 41709 T180 oasc.SolrResourceLoader.replaceClassLoader Adding 'file:/mnt/ssd/jenkins/workspace/Lucene-Solr-4.x-Linux/solr/build/solr-core/test-files/solr/collection1/lib/classes/' to classloader
   [junit4]   2> 41709 T180 oasc.SolrResourceLoader.replaceClassLoader Adding 'file:/mnt/ssd/jenkins/workspace/Lucene-Solr-4.x-Linux/solr/build/solr-core/test-files/solr/collection1/lib/README' to classloader
   [junit4]   2> 41759 T180 oasc.SolrConfig.<init> Using Lucene MatchVersion: LUCENE_47
   [junit4]   2> 41798 T180 oasc.SolrConfig.<init> Loaded SolrConfig: solrconfig-elevate.xml
   [junit4]   2> 41799 T180 oass.IndexSchema.readSchema Reading Solr Schema from schema11.xml
   [junit4]   2> 41805 T180 oass.IndexSchema.readSchema [collection1] Schema name=example
   [junit4]   2> 41973 T180 oass.IndexSchema.readSchema default search field in schema is text
   [junit4]   2> 41975 T180 oass.IndexSchema.readSchema unique key field: id
   [junit4]   2> 41984 T180 oasc.SolrCore.initDirectoryFactory org.apache.solr.core.MockDirectoryFactory
   [junit4]   2> 41984 T180 oasc.SolrCore.<init> [collection1] Opening new SolrCore at /mnt/ssd/jenkins/workspace/Lucene-Solr-4.x-Linux/solr/build/solr-core/test-files/solr/collection1/, dataDir=./org.apache.solr.handler.component.DistributedQueryElevationComponentTest-1385771797574/control/data/
   [junit4]   2> 41985 T180 oasc.JmxMonitoredMap.<init> No JMX servers found, not exposing Solr information with JMX.
   [junit4]   2> 41986 T180 oasc.CachingDirectoryFactory.get return new directory for ./org.apache.solr.handler.component.DistributedQueryElevationComponentTest-1385771797574/control/data
   [junit4]   2> 41987 T180 oasc.SolrCore.getNewIndexDir New index directory detected: old=null new=./org.apache.solr.handler.component.DistributedQueryElevationComponentTest-1385771797574/control/data/index/
   [junit4]   2> 41987 T180 oasc.SolrCore.initIndex WARN [collection1] Solr index directory './org.apache.solr.handler.component.DistributedQueryElevationComponentTest-1385771797574/control/data/index' doesn't exist. Creating new index...
   [junit4]   2> 41988 T180 oasc.CachingDirectoryFactory.get return new directory for ./org.apache.solr.handler.component.DistributedQueryElevationComponentTest-1385771797574/control/data/index
   [junit4]   2> 41988 T180 oasu.RandomMergePolicy.<init> RandomMergePolicy wrapping class org.apache.lucene.index.LogByteSizeMergePolicy: [LogByteSizeMergePolicy: minMergeSize=1677721, mergeFactor=23, maxMergeSize=2147483648, maxMergeSizeForForcedMerge=9223372036854775807, calibrateSizeByDeletes=true, maxMergeDocs=2147483647, maxCFSSegmentSizeMB=8.796093022207999E12, noCFSRatio=0.0]
   [junit4]   2> 41990 T180 oasc.SolrDeletionPolicy.onCommit SolrDeletionPolicy.onCommit: commits: num=1
   [junit4]   2> 		commit{dir=MockDirectoryWrapper(org.apache.lucene.store.RAMDirectory@4d0a4d0a lockFactory=org.apache.lucene.store.SingleInstanceLockFactory@6d5f6d5f),segFN=segments_1,generation=1}
   [junit4]   2> 41990 T180 oasc.SolrDeletionPolicy.updateCommits newest commit generation = 1
   [junit4]   2> 41994 T180 oasc.SolrCore.loadUpdateProcessorChains no updateRequestProcessorChain defined as default, creating implicit default
   [junit4]   2> 41994 T180 oasc.RequestHandlers.initHandlersFromConfig created /update: solr.UpdateRequestHandler
   [junit4]   2> 41995 T180 oasc.RequestHandlers.initHandlersFromConfig created /elevate: org.apache.solr.handler.component.SearchHandler
   [junit4]   2> 41995 T180 oasc.RequestHandlers.initHandlersFromConfig created /dataElevate: org.apache.solr.handler.component.SearchHandler
   [junit4]   2> 41997 T180 oashl.XMLLoader.init xsltCacheLifetimeSeconds=60
   [junit4]   2> 41997 T180 oasc.RequestHandlers.initHandlersFromConfig WARN no default request handler is registered (either '/select' or 'standard')
   [junit4]   2> 41999 T180 oasc.SolrCore.initDeprecatedSupport WARN solrconfig.xml uses deprecated <admin/gettableFiles>, Please update your config to use the ShowFileRequestHandler.
   [junit4]   2> 42001 T180 oasc.SolrCore.initDeprecatedSupport WARN adding ShowFileRequestHandler with hidden files: [SCHEMA-REST-LUCENE-MATCH-VERSION.XML, BAD-SOLRCONFIG-UNEXPECTED-SCHEMA-ATTRIBUTE.XML, KEEP-1.TXT, SCHEMA-XINCLUDE.XML, SCHEMA-SPATIAL.XML, ENUMSCONFIG.XML, SCHEMA-SNIPPET-TYPES.INCL, BAD-SCHEMA-CURRENCY-DYNAMIC-MULTIVALUED.XML, BAD-SCHEMA-NONTEXT-ANALYZER.XML, SOLRCONFIG-SNIPPET-PROCESSOR.XML, BAD-SCHEMA-ANALYZER-CLASS-AND-NESTED.XML, BAD-SOLRCONFIG-WARMER-NO-REOPEN.XML, SCHEMA-EFF.XML, SCHEMA-IB.XML, BAD-SOLRCONFIG-MULTIPLE-CFS.XML, FUZZYSUGGEST.TXT, SCHEMA11.XML, SCHEMA-REPLICATION1.XML, SCHEMA-COLLATE.XML, CONDITIONAL.UPDATEPROCESSOR.JS, SCHEMA-TINY.XML, SOLRCONFIG-RESPONSE-LOG-COMPONENT.XML, BAD-SCHEMA-MULTIPLE-ASTERISK-COPYFIELD-SOURCE-SHOULD-FAIL-TEST.XML, SCHEMA-COPYFIELD-TEST.XML, BAD-SCHEMA-CURRENCY-MULTIVALUED.XML, SOLRCONFIG-DELPOLICY1.XML, DA_COMPOUNDDICTIONARY.TXT, BAD-SCHEMA-CODEC-GLOBAL-VS-FT-MISMATCH.XML, HYPHENATION.DTD, SOLRCONFIG-CACHING.XML, SOLRCONFIG-EXTERNALVERSIONCONSTRAINT.XML, STOPWITHBOM.TXT, BAD-SCHEMA-NOT-INDEXED-BUT-POS.XML, HUNSPELL-TEST.AFF, SCHEMA-NUMERIC.XML, ANALYZINGINFIXSUGGEST.TXT, TRIVIAL.UPDATEPROCESSOR1.JS, SOLRCONFIG-SLAVE.XML, OPEN-EXCHANGE-RATES.JSON, BAD-SCHEMA-BOGUS-FIELD-PARAMETERS.XML, SCHEMA-BM25.XML, SOLRCONFIG-TIEREDMERGEPOLICY.XML, SCHEMASURROUND.XML, SCHEMA-SYNONYM-TOKENIZER.XML, SOLRCONFIG-DELPOLICY2.XML, SCHEMA-CHARFILTERS.XML, BAD-SCHEMA-SWEETSPOT-PARTIAL-HYPERBOLIC.XML, BAD-SCHEMA-DUP-DYNAMICFIELD.XML, SOLRCONFIG-SPELLCHECKER.XML, SCHEMA-LUCENEMATCHVERSION.XML, BAD-SOLRCONFIG-BOGUS-SCRIPTENGINE-NAME.XML, SCHEMA-REVERSED.XML, WDFTYPES.TXT, SCHEMA-DOCVALUESFACETING.XML, SOLRCONFIG-TLOG.XML, SOLRCONFIG-WARMER.XML, SOLRCONFIG-SPELLCHECKCOMPONENT.XML, SCHEMA-FOLDING.XML, JASUGGEST.TXT, SOLRCONFIG-PHRASESUGGEST.XML, BAD-SOLRCONFIG-INVALID-SCRIPTFILE.XML, SOLRCONFIG-SCRIPT-UPDATEPROCESSOR.XML, SOLRCONFIG-MASTER1.XML, SOLRCONFIG-FUNCTIONQUERY.XML, SOLRCONFIG-REQHANDLER.INCL, BAD_SOLRCONFIG.XML, SCHEMA-COLLATEFILTER.XML, SOLRCONFIG-MINIMAL.XML, SCHEMA-ONE-FIELD-NO-DYNAMIC-FIELD.XML, SOLRCONFIG-LOGMERGEPOLICY.XML, BAD-SOLRCONFIG-MULTIPLE-DIRFACTORY.XML, SOLRCONFIG_CODEC.XML, SCHEMA-MINIMAL.XML, BAD-SOLRCONFIG-MISSING-SCRIPTFILE.XML, SOLRCONFIG.SNIPPET.RANDOMINDEXCONFIG.XML, BAD-SCHEMA-NOT-INDEXED-BUT-NORMS.XML, BAD-SOLRCONFIG-MULTIPLE-INDEXCONFIGS.XML, BAD-SCHEMA-UNIQUEKEY-USES-DEFAULT.XML, MISSLEADING.EXTENSION.UPDATEPROCESSOR.JS.TXT, SOLRCONFIG-NOOPREGEN.XML, REGEX-BOOST-PROCESSOR-TEST.TXT, STOP-SNOWBALL.TXT, SOLRCONFIG-MASTER1-KEEPONEBACKUP.XML, BAD-SCHEMA-CURRENCY-FT-BOGUS-DEFAULT-CODE.XML, STOP-2.TXT, SOLRCONFIG-POSTINGSHIGHLIGHT.XML, BAD-SCHEMA-MISPLACED-ASTERISK-COPYFIELD-SOURCE-SHOULD-FAIL-TEST.XML, BAD-SCHEMA-DYNAMICFIELD-DEFAULT-VAL.XML, SCHEMA-DOCVALUESMISSING.XML, SCHEMA-SNIPPET-FIELD.XML, SOLRCONFIG-QUERYSENDER.XML, SOLRCONFIG-INDEXCONFIG.XML, SCHEMA-REQUIRED-FIELDS.XML, BAD-SCHEMA-DUP-FIELD.XML, SOLRCONFIG-HIGHLIGHT.XML, BAD-SCHEMA-NOT-INDEXED-BUT-TF.XML, MAPPING-ISOLATIN1ACCENT.TXT, PHRASESUGGEST.TXT, SOLRCONFIG-ALTDIRECTORY.XML, SCHEMA15.XML, BAD-SCHEMA-DUP-FIELDTYPE.XML, SOLRCONFIG-BASIC.XML, BAD-SCHEMA-UNIQUEKEY-MULTIVALUED.XML, SCHEMA_CODEC.XML, SCHEMA-POSTINGSHIGHLIGHT.XML, BAD-SCHEMA-NON-GLOB-COPYFIELD-SOURCE-MATCHING-NOTHING-SHOULD-FAIL-TEST.XML, SCHEMA-STOP-KEEP.XML, SCHEMA-TFIDF.XML, SOLRCONFIG-PARSING-UPDATE-PROCESSOR-CHAINS.XML, SOLRCONFIG-MASTER3.XML, BAD-SCHEMA-DYNAMICFIELD-REQUIRED.XML, SCHEMA-BEHAVIOR.XML, SOLRCONFIG-MASTER.XML, SOLRCONFIG-TRANSFORMERS.XML, BAD-SCHEMA-SWEETSPOT-BOTH-TF.XML, SOLRCONFIG-ELEVATE.XML, MISSING.FUNCTIONS.UPDATEPROCESSOR.JS, KEEP-2.TXT, SCHEMA-DFR.XML, XSLT, SCHEMA-LMDIRICHLET.XML, ELEVATE.XML, SOLRCONFIG-BASIC-LUCENEVERSION31.XML, SCHEMA-LMJELINEKMERCER.XML, SOLRCONFIG-NOCACHE.XML, SOLRCONFIG-DEFAULTS.XML, SCHEMA-TRIE.XML, SCHEMA-CLASS-NAME-SHORTENING-ON-SERIALIZATION.XML, SOLRCONFIG-MANAGED-SCHEMA.XML, BAD-SCHEMA-SWEETSPOT-PARTIAL-NORMS.XML, SCHEMA-ONE-FIELD-NO-DYNAMIC-FIELD-UNIQUE-KEY.XML, PROTWORDS.TXT, SOLRCONFIG-LAZYWRITER.XML, SOLRCONFIG-MASTER2.XML, BAD-SCHEMA-CURRENCY-FT-MULTIVALUED.XML, SOLRCONFIG-ADD-SCHEMA-FIELDS-UPDATE-PROCESSOR-CHAINS.XML, SOLRCONFIG-XINCLUDE.XML, BAD-SCHEMA-UNSUPPORTED-DOCVALUES.XML, SOLRCONFIG-INFOSTREAM-LOGGING.XML, STOPWORDSWRONGENCODING.TXT, BAD-MP-SOLRCONFIG.XML, SCHEMA-NOT-REQUIRED-UNIQUE-KEY.XML, STOP-1.TXT, SCHEMA-SIM.XML, SCHEMA-ADD-SCHEMA-FIELDS-UPDATE-PROCESSOR.XML, SOLRCONFIG-MERGEPOLICY-DEFAULTS.XML, SOLRCONFIG-MERGEPOLICY-LEGACY.XML, SCHEMA-PHRASESUGGEST.XML, SOLRCONFIG-COMPONENTS-NAME.XML, SOLRCONFIG-SOLCOREPROPERTIES.XML, SOLRCONFIG_PERF.XML, FRENCHARTICLES.TXT, SCHEMA-COLLATE-DV.XML, SCHEMA-BINARYFIELD.XML, BAD-SCHEMA-EXTERNAL-FILEFIELD.XML, ADDFIELDS.UPDATEPROCESSOR.JS, BAD-SOLRCONFIG-MANAGED-SCHEMA-NAMED-SCHEMA.XML.XML, BAD-SCHEMA-SWEETSPOT-PARTIAL-BASELINE.XML, SCHEMA-CUSTOM-FIELD.XML, SCHEMA-ENUMS.XML, SCHEMA-SPELLCHECKER.XML, BAD-SCHEMA-SIM-GLOBAL-VS-FT-MISMATCH.XML, HUNSPELL-TEST.DIC, BAD-SOLRCONFIG-SCHEMA-MUTABLE-BUT-NOT-MANAGED.XML, SCHEMA-DOCVALUES.XML, SCHEMA-SNIPPET-TYPE.XML, SOLRCONFIG-TERMINDEX.XML, SOLRCONFIG-IMPLICITPROPERTIES.XML, CURRENCY.XML, SOLRCONFIG-REPEATER.XML, BAD-SCHEMA-CURRENCY-FT-OER-NORATES.XML, SOLRCONFIG-SOLR-749.XML, SOLRCONFIG-SUGGESTERCOMPONENT.XML, SCHEMA-REPLICATION2.XML, BAD-CURRENCY.XML, SOLRCONFIG-QUERYSENDER-NOQUERY.XML, OLD_SYNONYMS.TXT, STEMDICT.TXT, STOPTYPES-1.TXT, SCHEMA-REST.XML, SCHEMA-DOCVALUESMULTI.XML, BAD-SCHEMA-BOGUS-ANALYSIS-PARAMETERS.XML, BAD-SCHEMA-UNIQUEKEY-IS-COPYFIELD-DEST.XML, SCHEMA12.XML, SCHEMA-DISTRIBUTED-MISSING-SORT.XML, SCHEMA-SWEETSPOT.XML, SYNONYMS.TXT, TRIVIAL.UPDATEPROCESSOR0.JS, BAD-SCHEMA-CURRENCY-FT-BOGUS-CODE-IN-XML.XML, DA_UTF8.XML, BAD-SCHEMA-MISPLACED-ASTERISK-COPYFIELD-DEST-SHOULD-FAIL-TEST.XML, SOLRCONFIG-UPDATE-PROCESSOR-CHAINS.XML, THROW.ERROR.ON.ADD.UPDATEPROCESSOR.JS, BAD-SCHEMA-MULTIPLE-ASTERISK-COPYFIELD-DEST-SHOULD-FAIL-TEST.XML, COMPOUNDDICTIONARY.TXT, BAD-SCHEMA-OMIT-TF-BUT-NOT-POS.XML, STOPTYPES-2.TXT, SCHEMA-SIMPLEQPPLUGIN.XML, SOLRCONFIG-COLLAPSEQPARSER.XML, SCHEMA-ID-AND-VERSION-FIELDS-ONLY.XML, SOLRCONFIG-SLAVE1.XML, STOPWORDS.TXT, SOLRCONFIG-TEST-MISC.XML]
   [junit4]   2> 42003 T180 oasu.CommitTracker.<init> Hard AutoCommit: disabled
   [junit4]   2> 42003 T180 oasu.CommitTracker.<init> Soft AutoCommit: disabled
   [junit4]   2> 42004 T180 oasu.RandomMergePolicy.<init> RandomMergePolicy wrapping class org.apache.lucene.index.LogByteSizeMergePolicy: [LogByteSizeMergePolicy: minMergeSize=1677721, mergeFactor=14, maxMergeSize=2147483648, maxMergeSizeForForcedMerge=9223372036854775807, calibrateSizeByDeletes=false, maxMergeDocs=2147483647, maxCFSSegmentSizeMB=8.796093022207999E12, noCFSRatio=0.7680765748513475]
   [junit4]   2> 42005 T180 oasc.SolrDeletionPolicy.onInit SolrDeletionPolicy.onInit: commits: num=1
   [junit4]   2> 		commit{dir=MockDirectoryWrapper(org.apache.lucene.store.RAMDirectory@4d0a4d0a lockFactory=org.apache.lucene.store.SingleInstanceLockFactory@6d5f6d5f),segFN=segments_1,generation=1}
   [junit4]   2> 42005 T180 oasc.SolrDeletionPolicy.updateCommits newest commit generation = 1
   [junit4]   2> 42006 T180 oass.SolrIndexSearcher.<init> Opening Searcher@6be96be9 main
   [junit4]   2> 42013 T180 oashc.QueryElevationComponent.inform Loading QueryElevation from: /mnt/ssd/jenkins/workspace/Lucene-Solr-4.x-Linux/solr/build/solr-core/test-files/solr/collection1/conf/elevate.xml
   [junit4]   2> 42025 T180 oashc.QueryElevationComponent.inform Loading QueryElevation from: /mnt/ssd/jenkins/workspace/Lucene-Solr-4.x-Linux/solr/build/solr-core/test-files/solr/collection1/conf/elevate.xml
   [junit4]   2> 42035 T181 oasc.SolrCore.registerSearcher [collection1] Registered new searcher Searcher@6be96be9 main{StandardDirectoryReader(segments_1:1:nrt)}
   [junit4]   2> 42035 T180 oasc.CoreContainer.registerCore registering core: collection1
   [junit4]   2> 42037 T170 oass.SolrDispatchFilter.init user.dir=/mnt/ssd/jenkins/workspace/Lucene-Solr-4.x-Linux/solr/build/solr-core/test/J0
   [junit4]   2> 42038 T170 oass.SolrDispatchFilter.init SolrDispatchFilter.init() done
   [junit4]   2> 42041 T170 oejs.Server.doStart jetty-8.1.10.v20130312
   [junit4]   2> 42044 T170 oejs.AbstractConnector.doStart Started SelectChannelConnector@127.0.0.1:47878
   [junit4]   2> 42045 T170 oass.SolrDispatchFilter.init SolrDispatchFilter.init()
   [junit4]   2> 42046 T170 oasc.SolrResourceLoader.locateSolrHome JNDI not configured for solr (NoInitialContextEx)
   [junit4]   2> 42046 T170 oasc.SolrResourceLoader.locateSolrHome using system property solr.solr.home: /mnt/ssd/jenkins/workspace/Lucene-Solr-4.x-Linux/solr/build/solr-core/test-files/solr
   [junit4]   2> 42047 T170 oasc.SolrResourceLoader.<init> new SolrResourceLoader for directory: '/mnt/ssd/jenkins/workspace/Lucene-Solr-4.x-Linux/solr/build/solr-core/test-files/solr/'
   [junit4]   2> 42059 T170 oasc.ConfigSolr.fromFile Loading container configuration from /mnt/ssd/jenkins/workspace/Lucene-Solr-4.x-Linux/solr/build/solr-core/test-files/solr/solr.xml
   [junit4]   2> 42104 T170 oasc.CoreContainer.<init> New CoreContainer 834089399
   [junit4]   2> 42105 T170 oasc.CoreContainer.load Loading cores into CoreContainer [instanceDir=/mnt/ssd/jenkins/workspace/Lucene-Solr-4.x-Linux/solr/build/solr-core/test-files/solr/]
   [junit4]   2> 42106 T170 oashc.HttpShardHandlerFactory.getParameter Setting socketTimeout to: 90000
   [junit4]   2> 42107 T170 oashc.HttpShardHandlerFactory.getParameter Setting urlScheme to: http://
   [junit4]   2> 42107 T170 oashc.HttpShardHandlerFactory.getParameter Setting connTimeout to: 15000
   [junit4]   2> 42108 T170 oashc.HttpShardHandlerFactory.getParameter Setting maxConnectionsPerHost to: 20
   [junit4]   2> 42109 T170 oashc.HttpShardHandlerFactory.getParameter Setting corePoolSize to: 0
   [junit4]   2> 42109 T170 oashc.HttpShardHandlerFactory.getParameter Setting maximumPoolSize to: 2147483647
   [junit4]   2> 42110 T170 oashc.HttpShardHandlerFactory.getParameter Setting maxThreadIdleTime to: 5
   [junit4]   2> 42111 T170 oashc.HttpShardHandlerFactory.getParameter Setting sizeOfQueue to: -1
   [junit4]   2> 42112 T170 oashc.HttpShardHandlerFactory.getParameter Setting fairnessPolicy to: false
   [junit4]   2> 42118 T170 oasl.LogWatcher.createWatcher SLF4J impl is org.slf4j.impl.Log4jLoggerFactory
   [junit4]   2> 42119 T170 oasl.LogWatcher.newRegisteredLogWatcher Registering Log Listener [Log4j (org.slf4j.impl.Log4jLoggerFactory)]
   [junit4]   2> 42120 T170 oasc.CoreContainer.load Host Name: 127.0.0.1
   [junit4]   2> 42125 T192 oasc.CoreContainer.create Creating SolrCore 'collection1' using instanceDir: /mnt/ssd/jenkins/workspace/Lucene-Solr-4.x-Linux/solr/build/solr-core/test-files/solr/collection1
   [junit4]   2> 42125 T192 oasc.SolrResourceLoader.<init> new SolrResourceLoader for directory: '/mnt/ssd/jenkins/workspace/Lucene-Solr-4.x-Linux/solr/build/solr-core/test-files/solr/collection1/'
   [junit4]   2> 42127 T192 oasc.SolrResourceLoader.replaceClassLoader Adding 'file:/mnt/ssd/jenkins/workspace/Lucene-Solr-4.x-Linux/solr/build/solr-core/test-files/solr/collection1/lib/classes/' to classloader
   [junit4]   2> 42127 T192 oasc.SolrResourceLoader.replaceClassLoader Adding 'file:/mnt/ssd/jenkins/workspace/Lucene-Solr-4.x-Linux/solr/build/solr-core/test-files/solr/collection1/lib/README' to classloader
   [junit4]   2> 42177 T192 oasc.SolrConfig.<init> Using Lucene MatchVersion: LUCENE_47
   [junit4]   2> 42220 T192 oasc.SolrConfig.<init> Loaded SolrConfig: solrconfig-elevate.xml
   [junit4]   2> 42221 T192 oass.IndexSchema.readSchema Reading Solr Schema from schema11.xml
   [junit4]   2> 42227 T192 oass.IndexSchema.readSchema [collection1] Schema name=example
   [junit4]   2> 42393 T192 oass.IndexSchema.readSchema default search field in schema is text
   [junit4]   2> 42402 T192 oass.IndexSchema.readSchema unique key field: id
   [junit4]   2> 42412 T192 oasc.SolrCore.initDirectoryFactory org.apache.solr.core.MockDirectoryFactory
   [junit4]   2> 42412 T192 oasc.SolrCore.<init> [collection1] Opening new SolrCore at /mnt/ssd/jenkins/workspace/Lucene-Solr-4.x-Linux/solr/build/solr-core/test-files/solr/collection1/, dataDir=./org.apache.solr.handler.component.DistributedQueryElevationComponentTest-1385771797574/shard0/data/
   [junit4]   2> 42413 T192 oasc.JmxMonitoredMap.<init> No JMX servers found, not exposing Solr information with JMX.
   [junit4]   2> 42414 T192 oasc.CachingDirectoryFactory.get return new directory for ./org.apache.solr.handler.component.DistributedQueryElevationComponentTest-1385771797574/shard0/data
   [junit4]   2> 42414 T192 oasc.SolrCore.getNewIndexDir New index directory detected: old=null new=./org.apache.solr.handler.component.DistributedQueryElevationComponentTest-1385771797574/shard0/data/index/
   [junit4]   2> 42415 T192 oasc.SolrCore.initIndex WARN [collection1] Solr index directory './org.apache.solr.handler.component.DistributedQueryElevationComponentTest-1385771797574/shard0/data/index' doesn't exist. Creating new index...
   [junit4]   2> 42416 T192 oasc.CachingDirectoryFactory.get return new directory for ./org.apache.solr.handler.component.DistributedQueryElevationComponentTest-1385771797574/shard0/data/index
   [junit4]   2> 42416 T192 oasu.RandomMergePolicy.<init> RandomMergePolicy wrapping class org.apache.lucene.index.LogByteSizeMergePolicy: [LogByteSizeMergePolicy: minMergeSize=1677721, mergeFactor=23, maxMergeSize=2147483648, maxMergeSizeForForcedMerge=9223372036854775807, calibrateSizeByDeletes=true, maxMergeDocs=2147483647, maxCFSSegmentSizeMB=8.796093022207999E12, noCFSRatio=0.0]
   [junit4]   2> 42418 T192 oasc.SolrDeletionPolicy.onCommit SolrDeletionPolicy.onCommit: commits: num=1
   [junit4]   2> 		commit{dir=MockDirectoryWrapper(org.apache.lucene.store.RAMDirectory@71ec71ec lockFactory=org.apache.lucene.store.SingleInstanceLockFactory@b200b2),segFN=segments_1,generation=1}
   [junit4]   2> 42418 T192 oasc.SolrDeletionPolicy.updateCommits newest commit generation = 1
   [junit4]   2> 42419 T192 oasc.SolrCore.loadUpdateProcessorChains no updateRequestProcessorChain defined as default, creating implicit default
   [junit4]   2> 42420 T192 oasc.RequestHandlers.initHandlersFromConfig created /update: solr.UpdateRequestHandler
   [junit4]   2> 42420 T192 oasc.RequestHandlers.initHandlersFromConfig created /elevate: org.apache.solr.handler.component.SearchHandler
   [junit4]   2> 42421 T192 oasc.RequestHandlers.initHandlersFromConfig created /dataElevate: org.apache.solr.handler.component.SearchHandler
   [junit4]   2> 42423 T192 oashl.XMLLoader.init xsltCacheLifetimeSeconds=60
   [junit4]   2> 42423 T192 oasc.RequestHandlers.initHandlersFromConfig WARN no default request handler is registered (either '/select' or 'standard')
   [junit4]   2> 42425 T192 oasc.SolrCore.initDeprecatedSupport WARN solrconfig.xml uses deprecated <admin/gettableFiles>, Please update your config to use the ShowFileRequestHandler.
   [junit4]   2> 42427 T192 oasc.SolrCore.initDeprecatedSupport WARN adding ShowFileRequestHandler with hidden files: [BAD-SCHEMA-UNIQUEKEY-IS-COPYFIELD-DEST.XML, SCHEMA12.XML, SCHEMA-DISTRIBUTED-MISSING-SORT.XML, SCHEMA-SWEETSPOT.XML, SYNONYMS.TXT, TRIVIAL.UPDATEPROCESSOR0.JS, BAD-CURRENCY.XML, SOLRCONFIG-QUERYSENDER-NOQUERY.XML, OLD_SYNONYMS.TXT, STEMDICT.TXT, STOPTYPES-1.TXT, SCHEMA-REST.XML, SCHEMA-DOCVALUESMULTI.XML, BAD-SCHEMA-BOGUS-ANALYSIS-PARAMETERS.XML, SCHEMA-SIMPLEQPPLUGIN.XML, SOLRCONFIG-COLLAPSEQPARSER.XML, SCHEMA-ID-AND-VERSION-FIELDS-ONLY.XML, SOLRCONFIG-SLAVE1.XML, STOPWORDS.TXT, SOLRCONFIG-TEST-MISC.XML, BAD-SCHEMA-CURRENCY-FT-BOGUS-CODE-IN-XML.XML, DA_UTF8.XML, BAD-SCHEMA-MISPLACED-ASTERISK-COPYFIELD-DEST-SHOULD-FAIL-TEST.XML, SOLRCONFIG-UPDATE-PROCESSOR-CHAINS.XML, THROW.ERROR.ON.ADD.UPDATEPROCESSOR.JS, BAD-SCHEMA-MULTIPLE-ASTERISK-COPYFIELD-DEST-SHOULD-FAIL-TEST.XML, COMPOUNDDICTIONARY.TXT, BAD-SCHEMA-OMIT-TF-BUT-NOT-POS.XML, STOPTYPES-2.TXT, FRENCHARTICLES.TXT, SCHEMA-COLLATE-DV.XML, SCHEMA-BINARYFIELD.XML, BAD-SCHEMA-EXTERNAL-FILEFIELD.XML, ADDFIELDS.UPDATEPROCESSOR.JS, BAD-SOLRCONFIG-MANAGED-SCHEMA-NAMED-SCHEMA.XML.XML, SCHEMA-ADD-SCHEMA-FIELDS-UPDATE-PROCESSOR.XML, SOLRCONFIG-MERGEPOLICY-DEFAULTS.XML, SOLRCONFIG-MERGEPOLICY-LEGACY.XML, SCHEMA-PHRASESUGGEST.XML, SOLRCONFIG-COMPONENTS-NAME.XML, SOLRCONFIG-SOLCOREPROPERTIES.XML, SOLRCONFIG_PERF.XML, SCHEMA-SNIPPET-TYPE.XML, SOLRCONFIG-TERMINDEX.XML, SOLRCONFIG-IMPLICITPROPERTIES.XML, CURRENCY.XML, SOLRCONFIG-REPEATER.XML, BAD-SCHEMA-CURRENCY-FT-OER-NORATES.XML, SOLRCONFIG-SOLR-749.XML, SOLRCONFIG-SUGGESTERCOMPONENT.XML, SCHEMA-REPLICATION2.XML, BAD-SCHEMA-SWEETSPOT-PARTIAL-BASELINE.XML, SCHEMA-CUSTOM-FIELD.XML, SCHEMA-ENUMS.XML, SCHEMA-SPELLCHECKER.XML, BAD-SCHEMA-SIM-GLOBAL-VS-FT-MISMATCH.XML, HUNSPELL-TEST.DIC, BAD-SOLRCONFIG-SCHEMA-MUTABLE-BUT-NOT-MANAGED.XML, SCHEMA-DOCVALUES.XML, ELEVATE.XML, SOLRCONFIG-BASIC-LUCENEVERSION31.XML, SCHEMA-LMJELINEKMERCER.XML, SOLRCONFIG-PARSING-UPDATE-PROCESSOR-CHAINS.XML, SOLRCONFIG-MASTER3.XML, BAD-SCHEMA-DYNAMICFIELD-REQUIRED.XML, SCHEMA-BEHAVIOR.XML, SOLRCONFIG-MASTER.XML, SOLRCONFIG-TRANSFORMERS.XML, BAD-SCHEMA-SWEETSPOT-BOTH-TF.XML, SOLRCONFIG-ELEVATE.XML, MISSING.FUNCTIONS.UPDATEPROCESSOR.JS, KEEP-2.TXT, SCHEMA-DFR.XML, XSLT, SCHEMA-LMDIRICHLET.XML, BAD-SCHEMA-CURRENCY-FT-MULTIVALUED.XML, SOLRCONFIG-ADD-SCHEMA-FIELDS-UPDATE-PROCESSOR-CHAINS.XML, SOLRCONFIG-XINCLUDE.XML, BAD-SCHEMA-UNSUPPORTED-DOCVALUES.XML, SOLRCONFIG-INFOSTREAM-LOGGING.XML, STOPWORDSWRONGENCODING.TXT, BAD-MP-SOLRCONFIG.XML, SCHEMA-NOT-REQUIRED-UNIQUE-KEY.XML, STOP-1.TXT, SCHEMA-SIM.XML, SOLRCONFIG-NOCACHE.XML, SOLRCONFIG-DEFAULTS.XML, SCHEMA-TRIE.XML, SCHEMA-CLASS-NAME-SHORTENING-ON-SERIALIZATION.XML, SOLRCONFIG-MANAGED-SCHEMA.XML, BAD-SCHEMA-SWEETSPOT-PARTIAL-NORMS.XML, SCHEMA-ONE-FIELD-NO-DYNAMIC-FIELD-UNIQUE-KEY.XML, PROTWORDS.TXT, SOLRCONFIG-LAZYWRITER.XML, SOLRCONFIG-MASTER2.XML, MAPPING-ISOLATIN1ACCENT.TXT, PHRASESUGGEST.TXT, SOLRCONFIG-ALTDIRECTORY.XML, SCHEMA15.XML, SCHEMA-SNIPPET-FIELD.XML, SOLRCONFIG-QUERYSENDER.XML, SOLRCONFIG-INDEXCONFIG.XML, SCHEMA-REQUIRED-FIELDS.XML, BAD-SCHEMA-DUP-FIELD.XML, SOLRCONFIG-HIGHLIGHT.XML, BAD-SCHEMA-NOT-INDEXED-BUT-TF.XML, SCHEMA-POSTINGSHIGHLIGHT.XML, BAD-SCHEMA-NON-GLOB-COPYFIELD-SOURCE-MATCHING-NOTHING-SHOULD-FAIL-TEST.XML, SCHEMA-STOP-KEEP.XML, SCHEMA-TFIDF.XML, BAD-SCHEMA-DUP-FIELDTYPE.XML, SOLRCONFIG-BASIC.XML, BAD-SCHEMA-UNIQUEKEY-MULTIVALUED.XML, SCHEMA_CODEC.XML, SCHEMA-MINIMAL.XML, BAD-SOLRCONFIG-MISSING-SCRIPTFILE.XML, SCHEMA-ONE-FIELD-NO-DYNAMIC-FIELD.XML, SOLRCONFIG-LOGMERGEPOLICY.XML, BAD-SOLRCONFIG-MULTIPLE-DIRFACTORY.XML, SOLRCONFIG_CODEC.XML, MISSLEADING.EXTENSION.UPDATEPROCESSOR.JS.TXT, SOLRCONFIG-NOOPREGEN.XML, REGEX-BOOST-PROCESSOR-TEST.TXT, STOP-SNOWBALL.TXT, SOLRCONFIG-MASTER1-KEEPONEBACKUP.XML, BAD-SCHEMA-CURRENCY-FT-BOGUS-DEFAULT-CODE.XML, STOP-2.TXT, SOLRCONFIG-POSTINGSHIGHLIGHT.XML, BAD-SCHEMA-MISPLACED-ASTERISK-COPYFIELD-SOURCE-SHOULD-FAIL-TEST.XML, BAD-SCHEMA-DYNAMICFIELD-DEFAULT-VAL.XML, SCHEMA-DOCVALUESMISSING.XML, SOLRCONFIG.SNIPPET.RANDOMINDEXCONFIG.XML, BAD-SCHEMA-NOT-INDEXED-BUT-NORMS.XML, BAD-SOLRCONFIG-MULTIPLE-INDEXCONFIGS.XML, BAD-SCHEMA-UNIQUEKEY-USES-DEFAULT.XML, SOLRCONFIG-WARMER.XML, SOLRCONFIG-SPELLCHECKCOMPONENT.XML, SCHEMA-FOLDING.XML, SCHEMA-REVERSED.XML, WDFTYPES.TXT, SCHEMA-DOCVALUESFACETING.XML, SOLRCONFIG-TLOG.XML, BAD_SOLRCONFIG.XML, SCHEMA-COLLATEFILTER.XML, SOLRCONFIG-MINIMAL.XML, JASUGGEST.TXT, SOLRCONFIG-PHRASESUGGEST.XML, BAD-SOLRCONFIG-INVALID-SCRIPTFILE.XML, SOLRCONFIG-SCRIPT-UPDATEPROCESSOR.XML, SOLRCONFIG-MASTER1.XML, SOLRCONFIG-FUNCTIONQUERY.XML, SOLRCONFIG-REQHANDLER.INCL, STOPWITHBOM.TXT, BAD-SCHEMA-NOT-INDEXED-BUT-POS.XML, HUNSPELL-TEST.AFF, SCHEMA-NUMERIC.XML, ANALYZINGINFIXSUGGEST.TXT, TRIVIAL.UPDATEPROCESSOR1.JS, SOLRCONFIG-RESPONSE-LOG-COMPONENT.XML, BAD-SCHEMA-MULTIPLE-ASTERISK-COPYFIELD-SOURCE-SHOULD-FAIL-TEST.XML, SCHEMA-COPYFIELD-TEST.XML, BAD-SCHEMA-CURRENCY-MULTIVALUED.XML, SOLRCONFIG-DELPOLICY1.XML, DA_COMPOUNDDICTIONARY.TXT, BAD-SCHEMA-CODEC-GLOBAL-VS-FT-MISMATCH.XML, HYPHENATION.DTD, SOLRCONFIG-CACHING.XML, SOLRCONFIG-EXTERNALVERSIONCONSTRAINT.XML, SCHEMA-SYNONYM-TOKENIZER.XML, SOLRCONFIG-DELPOLICY2.XML, SCHEMA-CHARFILTERS.XML, BAD-SCHEMA-SWEETSPOT-PARTIAL-HYPERBOLIC.XML, BAD-SCHEMA-DUP-DYNAMICFIELD.XML, SOLRCONFIG-SPELLCHECKER.XML, SCHEMA-LUCENEMATCHVERSION.XML, BAD-SOLRCONFIG-BOGUS-SCRIPTENGINE-NAME.XML, SOLRCONFIG-SLAVE.XML, OPEN-EXCHANGE-RATES.JSON, BAD-SCHEMA-BOGUS-FIELD-PARAMETERS.XML, SCHEMA-BM25.XML, SOLRCONFIG-TIEREDMERGEPOLICY.XML, SCHEMASURROUND.XML, BAD-SCHEMA-CURRENCY-DYNAMIC-MULTIVALUED.XML, BAD-SCHEMA-NONTEXT-ANALYZER.XML, SOLRCONFIG-SNIPPET-PROCESSOR.XML, BAD-SCHEMA-ANALYZER-CLASS-AND-NESTED.XML, SCHEMA-REST-LUCENE-MATCH-VERSION.XML, BAD-SOLRCONFIG-UNEXPECTED-SCHEMA-ATTRIBUTE.XML, KEEP-1.TXT, SCHEMA-XINCLUDE.XML, SCHEMA-SPATIAL.XML, ENUMSCONFIG.XML, SCHEMA-SNIPPET-TYPES.INCL, FUZZYSUGGEST.TXT, SCHEMA11.XML, SCHEMA-REPLICATION1.XML, SCHEMA-COLLATE.XML, CONDITIONAL.UPDATEPROCESSOR.JS, SCHEMA-TINY.XML, BAD-SOLRCONFIG-WARMER-NO-REOPEN.XML, SCHEMA-EFF.XML, SCHEMA-IB.XML, BAD-SOLRCONFIG-MULTIPLE-CFS.XML]
   [junit4]   2> 42429 T192 oasu.CommitTracker.<init> Hard AutoCommit: disabled
   [junit4]   2> 42429 T192 oasu.CommitTracker.<init> Soft AutoCommit: disabled
   [junit4]   2> 42430 T192 oasu.RandomMergePolicy.<init> RandomMergePolicy wrapping class org.apache.lucene.index.LogByteSizeMergePolicy: [LogByteSizeMergePolicy: minMergeSize=1677721, mergeFactor=14, maxMergeSize=2147483648, maxMergeSizeForForcedMerge=9223372036854775807, calibrateSizeByDeletes=false, maxMergeDocs=2147483647, maxCFSSegmentSizeMB=8.796093022207999E12, noCFSRatio=0.7680765748513475]
   [junit4]   2> 42431 T192 oasc.SolrDeletionPolicy.onInit SolrDeletionPolicy.onInit: commits: num=1
   [junit4]   2> 		commit{dir=MockDirectoryWrapper(org.apache.lucene.store.RAMDirectory@71ec71ec lockFactory=org.apache.lucene.store.SingleInstanceLockFactory@b200b2),segFN=segments_1,generation=1}
   [junit4]   2> 42432 T192 oasc.SolrDeletionPolicy.updateCommits newest commit generation = 1
   [junit4]   2> 42432 T192 oass.SolrIndexSearcher.<init> Opening Searcher@59f659f6 main
   [junit4]   2> 42433 T192 oashc.QueryElevationComponent.inform Loading QueryElevation from: /mnt/ssd/jenkins/workspace/Lucene-Solr-4.x-Linux/solr/build/solr-core/test-files/solr/collection1/conf/elevate.xml
   [junit4]   2> 42445 T192 oashc.QueryElevationComponent.inform Loading QueryElevation from: /mnt/ssd/jenkins/workspace/Lucene-Solr-4.x-Linux/solr/build/solr-core/test-files/solr/collection1/conf/elevate.xml
   [junit4]   2> 42456 T192 oasc.CoreContainer.registerCore registering core: collection1
   [junit4]   2> 42456 T193 oasc.SolrCore.registerSearcher [collection1] Registered new searcher Searcher@59f659f6 main{StandardDirectoryReader(segments_1:1:nrt)}
   [junit4]   2> 42457 T170 oass.SolrDispatchFilter.init user.dir=/mnt/ssd/jenkins/workspace/Lucene-Solr-4.x-Linux/solr/build/solr-core/test/J0
   [junit4]   2> 42458 T170 oass.SolrDispatchFilter.init SolrDispatchFilter.init() done
   [junit4]   2> 42461 T170 oejs.Server.doStart jetty-8.1.10.v20130312
   [junit4]   2> 42463 T170 oejs.AbstractConnector.doStart Started SelectChannelConnector@127.0.0.1:41701
   [junit4]   2> 42465 T170 oass.SolrDispatchFilter.init SolrDispatchFilter.init()
   [junit4]   2> 42475 T170 oasc.SolrResourceLoader.locateSolrHome JNDI not configured for solr (NoInitialContextEx)
   [junit4]   2> 42476 T170 oasc.SolrResourceLoader.locateSolrHome using system property solr.solr.home: /mnt/ssd/jenkins/workspace/Lucene-Solr-4.x-Linux/solr/build/solr-core/test-files/solr
   [junit4]   2> 42476 T170 oasc.SolrResourceLoader.<init> new SolrResourceLoader for directory: '/mnt/ssd/jenkins/workspace/Lucene-Solr-4.x-Linux/solr/build/solr-core/test-files/solr/'
   [junit4]   2> 42488 T170 oasc.ConfigSolr.fromFile Loading container configuration from /mnt/ssd/jenkins/workspace/Lucene-Solr-4.x-Linux/solr/build/solr-core/test-files/solr/solr.xml
   [junit4]   2> 42532 T170 oasc.CoreContainer.<init> New CoreContainer 1854566026
   [junit4]   2> 42533 T170 oasc.CoreContainer.load Loading cores into CoreContainer [instanceDir=/mnt/ssd/jenkins/workspace/Lucene-Solr-4.x-Linux/solr/build/solr-core/test-files/solr/]
   [junit4]   2> 42534 T170 oashc.HttpShardHandlerFactory.getParameter Setting socketTimeout to: 90000
   [junit4]   2> 42535 T170 oashc.HttpShardHandlerFactory.getParameter Setting urlScheme to: http://
   [junit4]   2> 42536 T170 oashc.HttpShardHandlerFactory.getParameter Setting connTimeout to: 15000
   [junit4]   2> 42537 T170 oashc.HttpShardHandlerFactory.getParameter Setting maxConnectionsPerHost to: 20
   [junit4]   2> 42537 T170 oashc.HttpShardHandlerFactory.getParameter Setting corePoolSize to: 0
   [junit4]   2> 42538 T170 oashc.HttpShardHandlerFactory.getParameter Setting maximumPoolSize to: 2147483647
   [junit4]   2> 42539 T170 oashc.HttpShardHandlerFactory.getParameter Setting maxThreadIdleTime to: 5
   [junit4]   2> 42540 T170 oashc.HttpShardHandlerFactory.getParameter Setting sizeOfQueue to: -1
   [junit4]   2> 42540 T170 oashc.HttpShardHandlerFactory.getParameter Setting fairnessPolicy to: false
   [junit4]   2> 42547 T170 oasl.LogWatcher.createWatcher SLF4J impl is org.slf4j.impl.Log4jLoggerFactory
   [junit4]   2> 42548 T170 oasl.LogWatcher.newRegisteredLogWatcher Registering Log Listener [Log4j (org.slf4j.impl.Log4jLoggerFactory)]
   [junit4]   2> 42548 T170 oasc.CoreContainer.load Host Name: 127.0.0.1
   [junit4]   2> 42554 T204 oasc.CoreContainer.create Creating SolrCore 'collection1' using instanceDir: /mnt/ssd/jenkins/workspace/Lucene-Solr-4.x-Linux/solr/build/solr-core/test-files/solr/collection1
   [junit4]   2> 42555 T204 oasc.SolrResourceLoader.<init> new SolrResourceLoader for directory: '/mnt/ssd/jenkins/workspace/Lucene-Solr-4.x-Linux/solr/build/solr-core/test-files/solr/collection1/'
   [junit4]   2> 42556 T204 oasc.SolrResourceLoader.replaceClassLoader Adding 'file:/mnt/ssd/jenkins/workspace/Lucene-Solr-4.x-Linux/solr/build/solr-core/test-files/solr/collection1/lib/classes/' to classloader
   [junit4]   2> 42557 T204 oasc.SolrResourceLoader.replaceClassLoader Adding 'file:/mnt/ssd/jenkins/workspace/Lucene-Solr-4.x-Linux/solr/build/solr-core/test-files/solr/collection1/lib/README' to classloader
   [junit4]   2> 42606 T204 oasc.SolrConfig.<init> Using Lucene MatchVersion: LUCENE_47
   [junit4]   2> 42645 T204 oasc.SolrConfig.<init> Loaded SolrConfig: solrconfig-elevate.xml
   [junit4]   2> 42653 T204 oass.IndexSchema.readSchema Reading Solr Schema from schema11.xml
   [junit4]   2> 42659 T204 oass.IndexSchema.readSchema [collection1] Schema name=example
   [junit4]   2> 42829 T204 oass.IndexSchema.readSchema default search field in schema is text
   [junit4]   2> 42831 T204 oass.IndexSchema.readSchema unique key field: id
   [junit4]   2> 42840 T204 oasc.SolrCore.initDirectoryFactory org.apache.solr.core.MockDirectoryFactory
   [junit4]   2> 42841 T204 oasc.SolrCore.<init> [collection1] Opening new SolrCore at /mnt/ssd/jenkins/workspace/Lucene-Solr-4.x-Linux/solr/build/solr-core/test-files/solr/collection1/, dataDir=./org.apache.solr.handler.component.DistributedQueryElevationComponentTest-1385771797574/shard1/data/
   [junit4]   2> 42842 T204 oasc.JmxMonitoredMap.<init> No JMX servers found, not exposing Solr information with JMX.
   [junit4]   2> 42843 T204 oasc.CachingDirectoryFactory.get return new directory for ./org.apache.solr.handler.component.DistributedQueryElevationComponentTest-1385771797574/shard1/data
   [junit4]   2> 42843 T204 oasc.SolrCore.getNewIndexDir New index directory detected: old=null new=./org.apache.solr.handler.component.DistributedQueryElevationComponentTest-1385771797574/shard1/data/index/
   [junit4]   2> 42844 T204 oasc.SolrCore.initIndex WARN [collection1] Solr index directory './org.apache.solr.handler.component.DistributedQueryElevationComponentTest-1385771797574/shard1/data/index' doesn't exist. Creating new index...
   [junit4]   2> 42844 T204 oasc.CachingDirectoryFactory.get return new directory for ./org.apache.solr.handler.component.DistributedQueryElevationComponentTest-1385771797574/shard1/data/index
   [junit4]   2> 42845 T204 oasu.RandomMergePolicy.<init> RandomMergePolicy wrapping class org.apache.lucene.index.LogByteSizeMergePolicy: [LogByteSizeMergePolicy: minMergeSize=1677721, mergeFactor=23, maxMergeSize=2147483648, maxMergeSizeForForcedMerge=9223372036854775807, calibrateSizeByDeletes=true, maxMergeDocs=2147483647, maxCFSSegmentSizeMB=8.796093022207999E12, noCFSRatio=0.0]
   [junit4]   2> 42846 T204 oasc.SolrDeletionPolicy.onCommit SolrDeletionPolicy.onCommit: commits: num=1
   [junit4]   2> 		commit{dir=MockDirectoryWrapper(org.apache.lucene.store.RAMDirectory@4a4a4a4a lockFactory=org.apache.lucene.store.SingleInstanceLockFactory@6bff6bff),segFN=segments_1,generation=1}
   [junit4]   2> 42847 T204 oasc.SolrDeletionPolicy.updateCommits newest commit generation = 1
   [junit4]   2> 42848 T204 oasc.SolrCore.loadUpdateProcessorChains no updateRequestProcessorChain defined as default, creating implicit default
   [junit4]   2> 42849 T204 oasc.RequestHandlers.initHandlersFromConfig created /update: solr.UpdateRequestHandler
   [junit4]   2> 42850 T204 oasc.RequestHandlers.initHandlersFromConfig created /elevate: org.apache.solr.handler.component.SearchHandler
   [junit4]   2> 42850 T204 oasc.RequestHandlers.initHandlersFromConfig created /dataElevate: org.apache.solr.handler.component.SearchHandler
   [junit4]   2> 42852 T204 oashl.XMLLoader.init xsltCacheLifetimeSeconds=60
   [junit4]   2> 42853 T204 oasc.RequestHandlers.initHandlersFromConfig WARN no default request handler is registered (either '/select' or 'standard')
   [junit4]   2> 42854 T204 oasc.SolrCore.initDeprecatedSupport WARN solrconfig.xml uses deprecated <admin/gettableFiles>, Please update your config to use the ShowFileRequestHandler.
   [junit4]   2> 42856 T204 oasc.SolrCore.initDeprecatedSupport WARN adding ShowFileRequestHandler with hidden files: [BAD-SCHEMA-CURRENCY-FT-MULTIVALUED.XML, SOLRCONFIG-ADD-SCHEMA-FIELDS-UPDATE-PROCESSOR-CHAINS.XML, SOLRCONFIG-XINCLUDE.XML, BAD-SCHEMA-UNSUPPORTED-DOCVALUES.XML, STOPWORDSWRONGENCODING.TXT, SOLRCONFIG-INFOSTREAM-LOGGING.XML, BAD-MP-SOLRCONFIG.XML, SCHEMA-NOT-REQUIRED-UNIQUE-KEY.XML, SCHEMA-SIM.XML, STOP-1.TXT, SOLRCONFIG-NOCACHE.XML, SCHEMA-TRIE.XML, SCHEMA-CLASS-NAME-SHORTENING-ON-SERIALIZATION.XML, SOLRCONFIG-DEFAULTS.XML, SOLRCONFIG-MANAGED-SCHEMA.XML, BAD-SCHEMA-SWEETSPOT-PARTIAL-NORMS.XML, SCHEMA-ONE-FIELD-NO-DYNAMIC-FIELD-UNIQUE-KEY.XML, SOLRCONFIG-LAZYWRITER.XML, PROTWORDS.TXT, SOLRCONFIG-MASTER2.XML, ELEVATE.XML, SOLRCONFIG-BASIC-LUCENEVERSION31.XML, SCHEMA-LMJELINEKMERCER.XML, BAD-SCHEMA-DYNAMICFIELD-REQUIRED.XML, SOLRCONFIG-PARSING-UPDATE-PROCESSOR-CHAINS.XML, SOLRCONFIG-MASTER3.XML, SCHEMA-BEHAVIOR.XML, SOLRCONFIG-MASTER.XML, SOLRCONFIG-TRANSFORMERS.XML, BAD-SCHEMA-SWEETSPOT-BOTH-TF.XML, SOLRCONFIG-ELEVATE.XML, MISSING.FUNCTIONS.UPDATEPROCESSOR.JS, KEEP-2.TXT, SCHEMA-DFR.XML, SCHEMA-LMDIRICHLET.XML, XSLT, BAD-SCHEMA-NON-GLOB-COPYFIELD-SOURCE-MATCHING-NOTHING-SHOULD-FAIL-TEST.XML, SCHEMA-STOP-KEEP.XML, SCHEMA-POSTINGSHIGHLIGHT.XML, SCHEMA-TFIDF.XML, BAD-SCHEMA-DUP-FIELDTYPE.XML, SOLRCONFIG-BASIC.XML, BAD-SCHEMA-UNIQUEKEY-MULTIVALUED.XML, SCHEMA_CODEC.XML, MAPPING-ISOLATIN1ACCENT.TXT, PHRASESUGGEST.TXT, SOLRCONFIG-ALTDIRECTORY.XML, SCHEMA15.XML, SOLRCONFIG-QUERYSENDER.XML, SCHEMA-SNIPPET-FIELD.XML, SOLRCONFIG-INDEXCONFIG.XML, SCHEMA-REQUIRED-FIELDS.XML, BAD-SCHEMA-DUP-FIELD.XML, SOLRCONFIG-HIGHLIGHT.XML, BAD-SCHEMA-NOT-INDEXED-BUT-TF.XML, SOLRCONFIG-COLLAPSEQPARSER.XML, SCHEMA-SIMPLEQPPLUGIN.XML, SCHEMA-ID-AND-VERSION-FIELDS-ONLY.XML, STOPWORDS.TXT, SOLRCONFIG-SLAVE1.XML, SOLRCONFIG-TEST-MISC.XML, DA_UTF8.XML, BAD-SCHEMA-CURRENCY-FT-BOGUS-CODE-IN-XML.XML, BAD-SCHEMA-MISPLACED-ASTERISK-COPYFIELD-DEST-SHOULD-FAIL-TEST.XML, THROW.ERROR.ON.ADD.UPDATEPROCESSOR.JS, BAD-SCHEMA-MULTIPLE-ASTERISK-COPYFIELD-DEST-SHOULD-FAIL-TEST.XML, SOLRCONFIG-UPDATE-PROCESSOR-CHAINS.XML, COMPOUNDDICTIONARY.TXT, BAD-SCHEMA-OMIT-TF-BUT-NOT-POS.XML, STOPTYPES-2.TXT, BAD-SCHEMA-UNIQUEKEY-IS-COPYFIELD-DEST.XML, SCHEMA12.XML, SCHEMA-SWEETSPOT.XML, SCHEMA-DISTRIBUTED-MISSING-SORT.XML, SYNONYMS.TXT, TRIVIAL.UPDATEPROCESSOR0.JS, BAD-CURRENCY.XML, SOLRCONFIG-QUERYSENDER-NOQUERY.XML, OLD_SYNONYMS.TXT, STEMDICT.TXT, STOPTYPES-1.TXT, SCHEMA-REST.XML, BAD-SCHEMA-BOGUS-ANALYSIS-PARAMETERS.XML, SCHEMA-DOCVALUESMULTI.XML, SCHEMA-SNIPPET-TYPE.XML, SOLRCONFIG-TERMINDEX.XML, SOLRCONFIG-IMPLICITPROPERTIES.XML, CURRENCY.XML, SOLRCONFIG-REPEATER.XML, BAD-SCHEMA-CURRENCY-FT-OER-NORATES.XML, SOLRCONFIG-SUGGESTERCOMPONENT.XML, SCHEMA-REPLICATION2.XML, SOLRCONFIG-SOLR-749.XML, BAD-SCHEMA-SWEETSPOT-PARTIAL-BASELINE.XML, SCHEMA-CUSTOM-FIELD.XML, SCHEMA-ENUMS.XML, BAD-SCHEMA-SIM-GLOBAL-VS-FT-MISMATCH.XML, HUNSPELL-TEST.DIC, SCHEMA-SPELLCHECKER.XML, BAD-SOLRCONFIG-SCHEMA-MUTABLE-BUT-NOT-MANAGED.XML, SCHEMA-DOCVALUES.XML, FRENCHARTICLES.TXT, SCHEMA-COLLATE-DV.XML, SCHEMA-BINARYFIELD.XML, BAD-SCHEMA-EXTERNAL-FILEFIELD.XML, ADDFIELDS.UPDATEPROCESSOR.JS, BAD-SOLRCONFIG-MANAGED-SCHEMA-NAMED-SCHEMA.XML.XML, SOLRCONFIG-MERGEPOLICY-DEFAULTS.XML, SOLRCONFIG-MERGEPOLICY-LEGACY.XML, SCHEMA-ADD-SCHEMA-FIELDS-UPDATE-PROCESSOR.XML, SCHEMA-PHRASESUGGEST.XML, SOLRCONFIG-COMPONENTS-NAME.XML, SOLRCONFIG-SOLCOREPROPERTIES.XML, SOLRCONFIG_PERF.XML, BAD-SCHEMA-SWEETSPOT-PARTIAL-HYPERBOLIC.XML, SCHEMA-SYNONYM-TOKENIZER.XML, SOLRCONFIG-DELPOLICY2.XML, SCHEMA-CHARFILTERS.XML, BAD-SCHEMA-DUP-DYNAMICFIELD.XML, SOLRCONFIG-SPELLCHECKER.XML, SCHEMA-LUCENEMATCHVERSION.XML, BAD-SOLRCONFIG-BOGUS-SCRIPTENGINE-NAME.XML, SOLRCONFIG-SLAVE.XML, OPEN-EXCHANGE-RATES.JSON, BAD-SCHEMA-BOGUS-FIELD-PARAMETERS.XML, SCHEMA-BM25.XML, SOLRCONFIG-TIEREDMERGEPOLICY.XML, SCHEMASURROUND.XML, STOPWITHBOM.TXT, BAD-SCHEMA-NOT-INDEXED-BUT-POS.XML, HUNSPELL-TEST.AFF, SCHEMA-NUMERIC.XML, ANALYZINGINFIXSUGGEST.TXT, TRIVIAL.UPDATEPROCESSOR1.JS, SOLRCONFIG-RESPONSE-LOG-COMPONENT.XML, SCHEMA-COPYFIELD-TEST.XML, BAD-SCHEMA-MULTIPLE-ASTERISK-COPYFIELD-SOURCE-SHOULD-FAIL-TEST.XML, SOLRCONFIG-DELPOLICY1.XML, BAD-SCHEMA-CURRENCY-MULTIVALUED.XML, HYPHENATION.DTD, DA_COMPOUNDDICTIONARY.TXT, BAD-SCHEMA-CODEC-GLOBAL-VS-FT-MISMATCH.XML, SOLRCONFIG-EXTERNALVERSIONCONSTRAINT.XML, SOLRCONFIG-CACHING.XML, FUZZYSUGGEST.TXT, SCHEMA11.XML, SCHEMA-REPLICATION1.XML, SCHEMA-COLLATE.XML, CONDITIONAL.UPDATEPROCESSOR.JS, SCHEMA-TINY.XML, BAD-SOLRCONFIG-WARMER-NO-REOPEN.XML, SCHEMA-EFF.XML, SCHEMA-IB.XML, BAD-SOLRCONFIG-MULTIPLE-CFS.XML, BAD-SCHEMA-NONTEXT-ANALYZER.XML, BAD-SCHEMA-CURRENCY-DYNAMIC-MULTIVALUED.XML, SOLRCONFIG-SNIPPET-PROCESSOR.XML, BAD-SCHEMA-ANALYZER-CLASS-AND-NESTED.XML, SCHEMA-REST-LUCENE-MATCH-VERSION.XML, BAD-SOLRCONFIG-UNEXPECTED-SCHEMA-ATTRIBUTE.XML, KEEP-1.TXT, SCHEMA-SPATIAL.XML, SCHEMA-XINCLUDE.XML, ENUMSCONFIG.XML, SCHEMA-SNIPPET-TYPES.INCL, MISSLEADING.EXTENSION.UPDATEPROCESSOR.JS.TXT, SOLRCONFIG-NOOPREGEN.XML, STOP-SNOWBALL.TXT, REGEX-BOOST-PROCESSOR-TEST.TXT, SOLRCONFIG-MASTER1-KEEPONEBACKUP.XML, STOP-2.TXT, SOLRCONFIG-POSTINGSHIGHLIGHT.XML, BAD-SCHEMA-CURRENCY-FT-BOGUS-DEFAULT-CODE.XML, BAD-SCHEMA-MISPLACED-ASTERISK-COPYFIELD-SOURCE-SHOULD-FAIL-TEST.XML, BAD-SCHEMA-DYNAMICFIELD-DEFAULT-VAL.XML, SCHEMA-DOCVALUESMISSING.XML, SOLRCONFIG.SNIPPET.RANDOMINDEXCONFIG.XML, BAD-SCHEMA-NOT-INDEXED-BUT-NORMS.XML, BAD-SOLRCONFIG-MULTIPLE-INDEXCONFIGS.XML, BAD-SCHEMA-UNIQUEKEY-USES-DEFAULT.XML, SCHEMA-MINIMAL.XML, BAD-SOLRCONFIG-MISSING-SCRIPTFILE.XML, SCHEMA-ONE-FIELD-NO-DYNAMIC-FIELD.XML, SOLRCONFIG-LOGMERGEPOLICY.XML, BAD-SOLRCONFIG-MULTIPLE-DIRFACTORY.XML, SOLRCONFIG_CODEC.XML, BAD_SOLRCONFIG.XML, SCHEMA-COLLATEFILTER.XML, SOLRCONFIG-MINIMAL.XML, SOLRCONFIG-PHRASESUGGEST.XML, JASUGGEST.TXT, BAD-SOLRCONFIG-INVALID-SCRIPTFILE.XML, SOLRCONFIG-SCRIPT-UPDATEPROCESSOR.XML, SOLRCONFIG-MASTER1.XML, SOLRCONFIG-FUNCTIONQUERY.XML, SOLRCONFIG-REQHANDLER.INCL, SCHEMA-FOLDING.XML, SOLRCONFIG-WARMER.XML, SOLRCONFIG-SPELLCHECKCOMPONENT.XML, SCHEMA-REVERSED.XML, SOLRCONFIG-TLOG.XML, WDFTYPES.TXT, SCHEMA-DOCVALUESFACETING.XML]
   [junit4]   2> 42859 T204 oasu.CommitTracker.<init> Hard AutoCommit: disabled
   [junit4]   2> 42860 T204 oasu.CommitTracker.<init> Soft AutoCommit: disabled
   [junit4]   2> 42860 T204 oasu.RandomMergePolicy.<init> RandomMergePolicy wrapping class org.apache.lucene.index.LogByteSizeMergePolicy: [LogByteSizeMergePolicy: minMergeSize=1677721, mergeFactor=14, maxMergeSize=2147483648, maxMergeSizeForForcedMerge=9223372036854775807, calibrateSizeByDeletes=false, maxMergeDocs=2147483647, maxCFSSegmentSizeMB=8.796093022207999E12, noCFSRatio=0.7680765748513475]
   [junit4]   2> 42861 T204 oasc.SolrDeletionPolicy.onInit SolrDeletionPolicy.onInit: commits: num=1
   [junit4]   2> 		commit{dir=MockDirectoryWrapper(org.apache.lucene.store.RAMDirectory@4a4a4a4a lockFactory=org.apache.lucene.store.SingleInstanceLockFactory@6bff6bff),segFN=segments_1,generation=1}
   [junit4]   2> 42862 T204 oasc.SolrDeletionPolicy.updateCommits newest commit generation = 1
   [junit4]   2> 42863 T204 oass.SolrIndexSearcher.<init> Opening Searcher@63036303 main
   [junit4]   2> 42864 T204 oashc.QueryElevationComponent.inform Loading QueryElevation from: /mnt/ssd/jenkins/workspace/Lucene-Solr-4.x-Linux/solr/build/solr-core/test-files/solr/collection1/conf/elevate.xml
   [junit4]   2> 42874 T204 oashc.QueryElevationComponent.inform Loading QueryElevation from: /mnt/ssd/jenkins/workspace/Lucene-Solr-4.x-Linux/solr/build/solr-core/test-files/solr/collection1/conf/elevate.xml
   [junit4]   2> 42889 T204 oasc.CoreContainer.registerCore registering core: collection1
   [junit4]   2> 42889 T205 oasc.SolrCore.registerSearcher [collection1] Registered new searcher Searcher@63036303 main{StandardDirectoryReader(segments_1:1:nrt)}
   [junit4]   2> 42891 T170 oass.SolrDispatchFilter.init user.dir=/mnt/ssd/jenkins/workspace/Lucene-Solr-4.x-Linux/solr/build/solr-core/test/J0
   [junit4]   2> 42892 T170 oass.SolrDispatchFilter.init SolrDispatchFilter.init() done
   [junit4]   2> 42897 T170 oejs.Server.doStart jetty-8.1.10.v20130312
   [junit4]   2> 42901 T170 oejs.AbstractConnector.doStart Started SelectChannelConnector@127.0.0.1:34924
   [junit4]   2> 42903 T170 oass.SolrDispatchFilter.init SolrDispatchFilter.init()
   [junit4]   2> 42903 T170 oasc.SolrResourceLoader.locateSolrHome JNDI not configured for solr (NoInitialContextEx)
   [junit4]   2> 42904 T170 oasc.SolrResourceLoader.locateSolrHome using system property solr.solr.home: /mnt/ssd/jenkins/workspace/Lucene-Solr-4.x-Linux/solr/build/solr-core/test-files/solr
   [junit4]   2> 42911 T170 oasc.SolrResourceLoader.<init> new SolrResourceLoader for directory: '/mnt/ssd/jenkins/workspace/Lucene-Solr-4.x-Linux/solr/build/solr-core/test-files/solr/'
   [junit4]   2> 42924 T170 oasc.ConfigSolr.fromFile Loading container configuration from /mnt/ssd/jenkins/workspace/Lucene-Solr-4.x-Linux/solr/build/solr-core/test-files/solr/solr.xml
   [junit4]   2> 42964 T170 oasc.CoreContainer.<init> New CoreContainer 1216497794
   [junit4]   2> 42965 T170 oasc.CoreContainer.load Loading cores into CoreContainer [instanceDir=/mnt/ssd/jenkins/workspace/Lucene-Solr-4.x-Linux/solr/build/solr-core/test-files/solr/]
   [junit4]   2> 42966 T170 oashc.HttpShardHandlerFactory.getParameter Setting socketTimeout to: 90000
   [junit4]   2> 42967 T170 oashc.HttpShardHandlerFactory.getParameter Setting urlScheme to: http://
   [junit4]   2> 42968 T170 oashc.HttpShardHandlerFactory.getParameter Setting connTimeout to: 15000
   [junit4]   2> 42968 T170 oashc.HttpShardHandlerFactory.getParameter Setting maxConnectionsPerHost to: 20
   [junit4]   2> 42969 T170 oashc.HttpShardHandlerFactory.getParameter Setting corePoolSize to: 0
   [junit4]   2> 42970 T170 oashc.HttpShardHandlerFactory.getParameter Setting maximumPoolSize to: 2147483647
   [junit4]   2> 42970 T170 oashc.HttpShardHandlerFactory.getParameter Setting maxThreadIdleTime to: 5
   [junit4]   2> 42971 T170 oashc.HttpShardHandlerFactory.getParameter Setting sizeOfQueue to: -1
   [junit4]   2> 42972 T170 oashc.HttpShardHandlerFactory.getParameter Setting fairnessPolicy to: false
   [junit4]   2> 42978 T170 oasl.LogWatcher.createWatcher SLF4J impl is org.slf4j.impl.Log4jLoggerFactory
   [junit4]   2> 42979 T170 oasl.LogWatcher.newRegisteredLogWatcher Registering Log Listener [Log4j (org.slf4j.impl.Log4jLoggerFactory)]
   [junit4]   2> 42980 T170 oasc.CoreContainer.load Host Name: 127.0.0.1
   [junit4]   2> 42992 T216 oasc.CoreContainer.create Creating SolrCore 'collection1' using instanceDir: /mnt/ssd/jenkins/workspace/Lucene-Solr-4.x-Linux/solr/build/solr-core/test-files/solr/collection1
   [junit4]   2> 42992 T216 oasc.SolrResourceLoader.<init> new SolrResourceLoader for directory: '/mnt/ssd/jenkins/workspace/Lucene-Solr-4.x-Linux/solr/build/solr-core/test-files/solr/collection1/'
   [junit4]   2> 42994 T216 oasc.SolrResourceLoader.replaceClassLoader Adding 'file:/mnt/ssd/jenkins/workspace/Lucene-Solr-4.x-Linux/solr/build/solr-core/test-files/solr/collection1/lib/classes/' to classloader
   [junit4]   2> 42994 T216 oasc.SolrResourceLoader.replaceClassLoader Adding 'file:/mnt/ssd/jenkins/workspace/Lucene-Solr-4.x-Linux/solr/build/solr-core/test-files/solr/collection1/lib/README' to classloader
   [junit4]   2> 43036 T216 oasc.SolrConfig.<init> Using Lucene MatchVersion: LUCENE_47
   [junit4]   2> 43081 T216 oasc.SolrConfig.<init> Loaded SolrConfig: solrconfig-elevate.xml
   [junit4]   2> 43082 T216 oass.IndexSchema.readSchema Reading Solr Schema from schema11.xml
   [junit4]   2> 43087 T216 oass.IndexSchema.readSchema [collection1] Schema name=example
   [junit4]   2> 43247 T216 oass.IndexSchema.readSchema default search field in schema is text
   [junit4]   2> 43249 T216 oass.IndexSchema.readSchema unique key field: id
   [junit4]   2> 43258 T216 oasc.SolrCore.initDirectoryFactory org.apache.solr.core.MockDirectoryFactory
   [junit4]   2> 43259 T216 oasc.SolrCore.<init> [collection1] Opening new SolrCore at /mnt/ssd/jenkins/workspace/Lucene-Solr-4.x-Linux/solr/build/solr-core/test-files/solr/collection1/, dataDir=./org.apache.solr.handler.component.DistributedQueryElevationComponentTest-1385771797574/shard2/data/
   [junit4]   2> 43259 T216 oasc.JmxMonitoredMap.<init> No JMX servers found, not exposing Solr information with JMX.
   [junit4]   2> 43260 T216 oasc.CachingDirectoryFactory.get return new directory for ./org.apache.solr.handler.component.DistributedQueryElevationComponentTest-1385771797574/shard2/data
   [junit4]   2> 43261 T216 oasc.SolrCore.getNewIndexDir New index directory detected: old=null new=./org.apache.solr.handler.component.DistributedQueryElevationComponentTest-1385771797574/shard2/data/index/
   [junit4]   2> 43261 T216 oasc.SolrCore.initIndex WARN [collection1] Solr index directory './org.apache.solr.handler.component.DistributedQueryElevationComponentTest-1385771797574/shard2/data/index' doesn't exist. Creating new index...
   [junit4]   2> 43262 T216 oasc.CachingDirectoryFactory.get return new directory for ./org.apache.solr.handler.component.DistributedQueryElevationComponentTest-1385771797574/shard2/data/index
   [junit4]   2> 43262 T216 oasu.RandomMergePolicy.<init> RandomMergePolicy wrapping class org.apache.lucene.index.LogByteSizeMergePolicy: [LogByteSizeMergePolicy: minMergeSize=1677721, mergeFactor=23, maxMergeSize=2147483648, maxMergeSizeForForcedMerge=9223372036854775807, calibrateSizeByDeletes=true, maxMergeDocs=2147483647, maxCFSSegmentSizeMB=8.796093022207999E12, noCFSRatio=0.0]
   [junit4]   2> 43264 T216 oasc.SolrDeletionPolicy.onCommit SolrDeletionPolicy.onCommit: commits: num=1
   [junit4]   2> 		commit{dir=MockDirectoryWrapper(org.apache.lucene.store.RAMDirectory@38ac38ac lockFactory=org.apache.lucene.store.SingleInstanceLockFactory@23302330),segFN=segments_1,generation=1}
   [junit4]   2> 43264 T216 oasc.SolrDeletionPolicy.updateCommits newest commit generation = 1
   [junit4]   2> 43265 T216 oasc.SolrCore.loadUpdateProcessorChains no updateRequestProcessorChain defined as default, creating implicit default
   [junit4]   2> 43266 T216 oasc.RequestHandlers.initHandlersFromConfig created /update: solr.UpdateRequestHandler
   [junit4]   2> 43267 T216 oasc.RequestHandlers.initHandlersFromConfig created /elevate: org.apache.solr.handler.component.SearchHandler
   [junit4]   2> 43267 T216 oasc.RequestHandlers.initHandlersFromConfig created /dataElevate: org.apache.solr.handler.component.SearchHandler
   [junit4]   2> 43269 T216 oashl.XMLLoader.init xsltCacheLifetimeSeconds=60
   [junit4]   2> 43269 T216 oasc.RequestHandlers.initHandlersFromConfig WARN no default request handler is registered (either '/select' or 'standard')
   [junit4]   2> 43277 T216 oasc.SolrCore.initDeprecatedSupport WARN solrconfig.xml uses deprecated <admin/gettableFiles>, Please update your config to use the ShowFileRequestHandler.
   [junit4]   2> 43279 T216 oasc.SolrCore.initDeprecatedSupport WARN adding ShowFileRequestHandler with hidden files: [FUZZYSUGGEST.TXT, SCHEMA11.XML, SCHEMA-REPLICATION1.XML, SCHEMA-COLLATE.XML, CONDITIONAL.UPDATEPROCESSOR.JS, SCHEMA-TINY.XML, BAD-SOLRCONFIG-WARMER-NO-REOPEN.XML, SCHEMA-EFF.XML, SCHEMA-IB.XML, BAD-SOLRCONFIG-MULTIPLE-CFS.XML, BAD-SCHEMA-NONTEXT-ANALYZER.XML, BAD-SCHEMA-CURRENCY-DYNAMIC-MULTIVALUED.XML, SOLRCONFIG-SNIPPET-PROCESSOR.XML, BAD-SCHEMA-ANALYZER-CLASS-AND-NESTED.XML, SCHEMA-REST-LUCENE-MATCH-VERSION.XML, BAD-SOLRCONFIG-UNEXPECTED-SCHEMA-ATTRIBUTE.XML, KEEP-1.TXT, SCHEMA-SPATIAL.XML, SCHEMA-XINCLUDE.XML, ENUMSCONFIG.XML, SCHEMA-SNIPPET-TYPES.INCL, BAD-SCHEMA-SWEETSPOT-PARTIAL-HYPERBOLIC.XML, SCHEMA-SYNONYM-TOKENIZER.XML, SOLRCONFIG-DELPOLICY2.XML, SCHEMA-CHARFILTERS.XML, BAD-SCHEMA-DUP-DYNAMICFIELD.XML, SOLRCONFIG-SPELLCHECKER.XML, SCHEMA-LUCENEMATCHVERSION.XML, BAD-SOLRCONFIG-BOGUS-SCRIPTENGINE-NAME.XML, SOLRCONFIG-SLAVE.XML, OPEN-EXCHANGE-RATES.JSON, BAD-SCHEMA-BOGUS-FIELD-PARAMETERS.XML, SCHEMA-BM25.XML, SOLRCONFIG-TIEREDMERGEPOLICY.XML, SCHEMASURROUND.XML, STOPWITHBOM.TXT, BAD-SCHEMA-NOT-INDEXED-BUT-POS.XML, HUNSPELL-TEST.AFF, SCHEMA-NUMERIC.XML, ANALYZINGINFIXSUGGEST.TXT, TRIVIAL.UPDATEPROCESSOR1.JS, SOLRCONFIG-RESPONSE-LOG-COMPONENT.XML, SCHEMA-COPYFIELD-TEST.XML, BAD-SCHEMA-MULTIPLE-ASTERISK-COPYFIELD-SOURCE-SHOULD-FAIL-TEST.XML, SOLRCONFIG-DELPOLICY1.XML, BAD-SCHEMA-CURRENCY-MULTIVALUED.XML, HYPHENATION.DTD, DA_COMPOUNDDICTIONARY.TXT, BAD-SCHEMA-CODEC-GLOBAL-VS-FT-MISMATCH.XML, SOLRCONFIG-EXTERNALVERSIONCONSTRAINT.XML, SOLRCONFIG-CACHING.XML, BAD_SOLRCONFIG.XML, SCHEMA-COLLATEFILTER.XML, SOLRCONFIG-MINIMAL.XML, SOLRCONFIG-PHRASESUGGEST.XML, JASUGGEST.TXT, BAD-SOLRCONFIG-INVALID-SCRIPTFILE.XML, SOLRCONFIG-SCRIPT-UPDATEPROCESSOR.XML, SOLRCONFIG-MASTER1.XML, SOLRCONFIG-FUNCTIONQUERY.XML, SOLRCONFIG-REQHANDLER.INCL, SCHEMA-FOLDING.XML, SOLRCONFIG-WARMER.XML, SOLRCONFIG-SPELLCHECKCOMPONENT.XML, SCHEMA-REVERSED.XML, SOLRCONFIG-TLOG.XML, WDFTYPES.TXT, SCHEMA-DOCVALUESFACETING.XML, MISSLEADING.EXTENSION.UPDATEPROCESSOR.JS.TXT, SOLRCONFIG-NOOPREGEN.XML, STOP-SNOWBALL.TXT, REGEX-BOOST-PROCESSOR-TEST.TXT, SOLRCONFIG-MASTER1-KEEPONEBACKUP.XML, STOP-2.TXT, SOLRCONFIG-POSTINGSHIGHLIGHT.XML, BAD-SCHEMA-CURRENCY-FT-BOGUS-DEFAULT-CODE.XML, BAD-SCHEMA-MISPLACED-ASTERISK-COPYFIELD-SOURCE-SHOULD-FAIL-TEST.XML, BAD-SCHEMA-DYNAMICFIELD-DEFAULT-VAL.XML, SCHEMA-DOCVALUESMISSING.XML, SOLRCONFIG.SNIPPET.RANDOMINDEXCONFIG.XML, BAD-SCHEMA-NOT-INDEXED-BUT-NORMS.XML, BAD-SOLRCONFIG-MULTIPLE-INDEXCONFIGS.XML, BAD-SCHEMA-UNIQUEKEY-USES-DEFAULT.XML, SCHEMA-MINIMAL.XML, BAD-SOLRCONFIG-MISSING-SCRIPTFILE.XML, SCHEMA-ONE-FIELD-NO-DYNAMIC-FIELD.XML, SOLRCONFIG-LOGMERGEPOLICY.XML, BAD-SOLRCONFIG-MULTIPLE-DIRFACTORY.XML, SOLRCONFIG_CODEC.XML, BAD-SCHEMA-NON-GLOB-COPYFIELD-SOURCE-MATCHING-NOTHING-SHOULD-FAIL-TEST.XML, SCHEMA-STOP-KEEP.XML, SCHEMA-POSTINGSHIGHLIGHT.XML, SCHEMA-TFIDF.XML, BAD-SCHEMA-DUP-FIELDTYPE.XML, SOLRCONFIG-BASIC.XML, BAD-SCHEMA-UNIQUEKEY-MULTIVALUED.XML, SCHEMA_CODEC.XML, MAPPING-ISOLATIN1ACCENT.TXT, PHRASESUGGEST.TXT, SOLRCONFIG-ALTDIRECTORY.XML, SCHEMA15.XML, SOLRCONFIG-QUERYSENDER.XML, SCHEMA-SNIPPET-FIELD.XML, SOLRCONFIG-INDEXCONFIG.XML, SCHEMA-REQUIRED-FIELDS.XML, BAD-SCHEMA-DUP-FIELD.XML, SOLRCONFIG-HIGHLIGHT.XML, BAD-SCHEMA-NOT-INDEXED-BUT-TF.XML, BAD-SCHEMA-CURRENCY-FT-MULTIVALUED.XML, SOLRCONFIG-ADD-SCHEMA-FIELDS-UPDATE-PROCESSOR-CHAINS.XML, SOLRCONFIG-XINCLUDE.XML, BAD-SCHEMA-UNSUPPORTED-DOCVALUES.XML, STOPWORDSWRONGENCODING.TXT, SOLRCONFIG-INFOSTREAM-LOGGING.XML, BAD-MP-SOLRCONFIG.XML, SCHEMA-NOT-REQUIRED-UNIQUE-KEY.XML, SCHEMA-SIM.XML, STOP-1.TXT, SOLRCONFIG-NOCACHE.XML, SCHEMA-TRIE.XML, SCHEMA-CLASS-NAME-SHORTENING-ON-SERIALIZATION.XML, SOLRCONFIG-DEFAULTS.XML, SOLRCONFIG-MANAGED-SCHEMA.XML, BAD-SCHEMA-SWEETSPOT-PARTIAL-NORMS.XML, SCHEMA-ONE-FIELD-NO-DYNAMIC-FIELD-UNIQUE-KEY.XML, SOLRCONFIG-LAZYWRITER.XML, PROTWORDS.TXT, SOLRCONFIG-MASTER2.XML, ELEVATE.XML, SOLRCONFIG-BASIC-LUCENEVERSION31.XML, SCHEMA-LMJELINEKMERCER.XML, BAD-SCHEMA-DYNAMICFIELD-REQUIRED.XML, SOLRCONFIG-PARSING-UPDATE-PROCESSOR-CHAINS.XML, SOLRCONFIG-MASTER3.XML, SCHEMA-BEHAVIOR.XML, SOLRCONFIG-MASTER.XML, SOLRCONFIG-TRANSFORMERS.XML, BAD-SCHEMA-SWEETSPOT-BOTH-TF.XML, SOLRCONFIG-ELEVATE.XML, MISSING.FUNCTIONS.UPDATEPROCESSOR.JS, KEEP-2.TXT, SCHEMA-DFR.XML, SCHEMA-LMDIRICHLET.XML, XSLT, SCHEMA-SNIPPET-TYPE.XML, SOLRCONFIG-TERMINDEX.XML, SOLRCONFIG-IMPLICITPROPERTIES.XML, CURRENCY.XML, SOLRCONFIG-REPEATER.XML, BAD-SCHEMA-CURRENCY-FT-OER-NORATES.XML, SOLRCONFIG-SUGGESTERCOMPONENT.XML, SCHEMA-REPLICATION2.XML, SOLRCONFIG-SOLR-749.XML, BAD-SCHEMA-SWEETSPOT-PARTIAL-BASELINE.XML, SCHEMA-CUSTOM-FIELD.XML, SCHEMA-ENUMS.XML, BAD-SCHEMA-SIM-GLOBAL-VS-FT-MISMATCH.XML, HUNSPELL-TEST.DIC, SCHEMA-SPELLCHECKER.XML, BAD-SOLRCONFIG-SCHEMA-MUTABLE-BUT-NOT-MANAGED.XML, SCHEMA-DOCVALUES.XML, FRENCHARTICLES.TXT, SCHEMA-COLLATE-DV.XML, SCHEMA-BINARYFIELD.XML, BAD-SCHEMA-EXTERNAL-FILEFIELD.XML, ADDFIELDS.UPDATEPROCESSOR.JS, BAD-SOLRCONFIG-MANAGED-SCHEMA-NAMED-SCHEMA.XML.XML, SOLRCONFIG-MERGEPOLICY-DEFAULTS.XML, SOLRCONFIG-MERGEPOLICY-LEGACY.XML, SCHEMA-ADD-SCHEMA-FIELDS-UPDATE-PROCESSOR.XML, SCHEMA-PHRASESUGGEST.XML, SOLRCONFIG-COMPONENTS-NAME.XML, SOLRCONFIG-SOLCOREPROPERTIES.XML, SOLRCONFIG_PERF.XML, SOLRCONFIG-COLLAPSEQPARSER.XML, SCHEMA-SIMPLEQPPLUGIN.XML, SCHEMA-ID-AND-VERSION-FIELDS-ONLY.XML, STOPWORDS.TXT, SOLRCONFIG-SLAVE1.XML, SOLRCONFIG-TEST-MISC.XML, DA_UTF8.XML, BAD-SCHEMA-CURRENCY-FT-BOGUS-CODE-IN-XML.XML, BAD-SCHEMA-MISPLACED-ASTERISK-COPYFIELD-DEST-SHOULD-FAIL-TEST.XML, THROW.ERROR.ON.ADD.UPDATEPROCESSOR.JS, BAD-SCHEMA-MULTIPLE-ASTERISK-COPYFIELD-DEST-SHOULD-FAIL-TEST.XML, SOLRCONFIG-UPDATE-PROCESSOR-CHAINS.XML, COMPOUNDDICTIONARY.TXT, BAD-SCHEMA-OMIT-TF-BUT-NOT-POS.XML, STOPTYPES-2.TXT, BAD-SCHEMA-UNIQUEKEY-IS-COPYFIELD-DEST.XML, SCHEMA12.XML, SCHEMA-SWEETSPOT.XML, SCHEMA-DISTRIBUTED-MISSING-SORT.XML, SYNONYMS.TXT, TRIVIAL.UPDATEPROCESSOR0.JS, BAD-CURRENCY.XML, SOLRCONFIG-QUERYSENDER-NOQUERY.XML, OLD_SYNONYMS.TXT, STEMDICT.TXT, STOPTYPES-1.TXT, SCHEMA-REST.XML, BAD-SCHEMA-BOGUS-ANALYSIS-PARAMETERS.XML, SCHEMA-DOCVALUESMULTI.XML]
   [junit4]   2> 43281 T216 oasu.CommitTracker.<init> Hard AutoCommit: disabled
   [junit4]   2> 43282 T216 oasu.CommitTracker.<init> Soft AutoCommit: disabled
   [junit4]   2> 43283 T216 oasu.RandomMergePolicy.<init> RandomMergePolicy wrapping class org.apache.lucene.index.LogByteSizeMergePolicy: [LogByteSizeMergePolicy: minMergeSize=1677721, mergeFactor=14, maxMergeSize=2147483648, maxMergeSizeForForcedMerge=9223372036854775807, calibrateSizeByDeletes=false, maxMergeDocs=2147483647, maxCFSSegmentSizeMB=8.796093022207999E12, noCFSRatio=0.7680765748513475]
   [junit4]   2> 43284 T216 oasc.SolrDeletionPolicy.onInit SolrDeletionPolicy.onInit: commits: num=1
   [junit4]   2> 		commit{dir=MockDirectoryWrapper(org.apache.lucene.store.RAMDirectory@38ac38ac lockFactory=org.apache.lucene.store.SingleInstanceLockFactory@23302330),segFN=segments_1,generation=1}
   [junit4]   2> 43284 T216 oasc.SolrDeletionPolicy.updateCommits newest commit generation = 1
   [junit4]   2> 43285 T216 oass.SolrIndexSearcher.<init> Opening Searcher@338f338f main
   [junit4]   2> 43286 T216 oashc.QueryElevationComponent.inform Loading QueryElevation from: /mnt/ssd/jenkins/workspace/Lucene-Solr-4.x-Linux/solr/build/solr-core/test-files/solr/collection1/conf/elevate.xml
   [junit4]   2> 43297 T216 oashc.QueryElevationComponent.inform Loading QueryElevation from: /mnt/ssd/jenkins/workspace/Lucene-Solr-4.x-Linux/solr/build/solr-core/test-files/solr/collection1/conf/elevate.xml
   [junit4]   2> 43307 T216 oasc.CoreContainer.registerCore registering core: collection1
   [junit4]   2> 43307 T217 oasc.SolrCore.registerSearcher [collection1] Registered new searcher Searcher@338f338f main{StandardDirectoryReader(segments_1:1:nrt)}
   [junit4]   2> 43308 T170 oass.SolrDispatchFilter.init user.dir=/mnt/ssd/jenkins/workspace/Lucene-Solr-4.x-Linux/solr/build/solr-core/test/J0
   [junit4]   2> 43309 T170 oass.SolrDispatchFilter.init SolrDispatchFilter.init() done
   [junit4]   2> ASYNC  NEW_CORE C25 name=collection1 org.apache.solr.core.SolrCore@796c796c
   [junit4]   2> 43324 T179 C25 oasu.DirectUpdateHandler2.deleteAll [collection1] REMOVING ALL DOCUMENTS FROM INDEX
   [junit4]   2> 43325 T179 C25 oasup.LogUpdateProcessor.finish [collection1] webapp=/g/l path=/update params={version=2&wt=javabin} {deleteByQuery=*:*} 0 4
   [junit4]   2> ASYNC  NEW_CORE C26 name=collection1 org.apache.solr.core.SolrCore@4ca04ca
   [junit4]   2> 43336 T188 C26 oasu.DirectUpdateHandler2.deleteAll [collection1] REMOVING ALL DOCUMENTS FROM INDEX
   [junit4]   2> 43337 T188 C26 oasup.LogUpdateProcessor.finish [collection1] webapp=/g/l path=/update params={wt=javabin&version=2} {deleteByQuery=*:*} 0 1
   [junit4]   2> ASYNC  NEW_CORE C27 name=collection1 org.apache.solr.core.SolrCore@55be55be
   [junit4]   2> 43348 T203 C27 oasu.DirectUpdateHandler2.deleteAll [collection1] REMOVING ALL DOCUMENTS FROM INDEX
   [junit4]   2> 43349 T203 C27 oasup.LogUpdateProcessor.finish [collection1] webapp=/g/l path=/update params={wt=javabin&version=2} {deleteByQuery=*:*} 0 2
   [junit4]   2> ASYNC  NEW_CORE C28 name=collection1 org.apache.solr.core.SolrCore@44154415
   [junit4]   2> 43361 T215 C28 oasu.DirectUpdateHandler2.deleteAll [collection1] REMOVING ALL DOCUMENTS FROM INDEX
   [junit4]   2> 43363 T215 C28 oasup.LogUpdateProcessor.finish [collection1] webapp=/g/l path=/update params={version=2&wt=javabin} {deleteByQuery=*:*} 0 2
   [junit4]   2> 43376 T176 C25 oasup.LogUpdateProcessor.finish [collection1] webapp=/g/l path=/update params={version=2&wt=javabin} {add=[1]} 0 8
   [junit4]   2> 43384 T191 C26 oasup.LogUpdateProcessor.finish [collection1] webapp=/g/l path=/update params={version=2&wt=javabin} {add=[1]} 0 3
   [junit4]   2> 43391 T177 C25 oasup.LogUpdateProcessor.finish [collection1] webapp=/g/l path=/update params={version=2&wt=javabin} {add=[2]} 0 3
   [junit4]   2> ASYNC  NEW_CORE C29 name=collection1 org.apache.solr.core.SolrCore@55be55be
   [junit4]   2> 43407 T201 C29 oasup.LogUpdateProcessor.finish [collection1] webapp=/g/l path=/update params={wt=javabin&version=2} {add=[2]} 0 3
   [junit4]   2> ASYNC  NEW_CORE C30 name=collection1 org.apache.solr.core.SolrCore@796c796c
   [junit4]   2> 43413 T178 C30 oasup.LogUpdateProcessor.finish [collection1] webapp=/g/l path=/update params={version=2&wt=javabin} {add=[3]} 0 2
   [junit4]   2> ASYNC  NEW_CORE C31 name=collection1 org.apache.solr.core.SolrCore@44154415
   [junit4]   2> 43419 T212 C31 oasup.LogUpdateProcessor.finish [collection1] webapp=/g/l path=/update params={version=2&wt=javabin} {add=[3]} 0 2
   [junit4]   2> 43424 T179 C30 oasup.LogUpdateProcessor.finish [collection1] webapp=/g/l path=/update params={version=2&wt=javabin} {add=[4]} 0 1
   [junit4]   2> ASYNC  NEW_CORE C32 name=collection1 org.apache.solr.core.SolrCore@4ca04ca
   [junit4]   2> 43429 T190 C32 oasup.LogUpdateProcessor.finish [collection1] webapp=/g/l path=/update params={wt=javabin&version=2} {add=[4]} 0 1
   [junit4]   2> 43435 T176 C30 oasup.LogUpdateProcessor.finish [collection1] webapp=/g/l path=/update params={version=2&wt=javabin} {add=[5]} 0 1
   [junit4]   2> 43441 T200 C29 oasup.LogUpdateProcessor.finish [collection1] webapp=/g/l path=/update params={version=2&wt=javabin} {add=[5]} 0 2
   [junit4]   2> 43446 T177 C30 oasup.LogUpdateProcessor.finish [collection1] webapp=/g/l path=/update params={wt=javabin&version=2} {add=[6]} 0 1
   [junit4]   2> 43451 T213 C31 oasup.LogUpdateProcessor.finish [collection1] webapp=/g/l path=/update params={wt=javabin&version=2} {add=[6]} 0 1
   [junit4]   2> 43461 T178 C30 oasup.LogUpdateProcessor.finish [collection1] webapp=/g/l path=/update params={version=2&wt=javabin} {add=[7]} 0 1
   [junit4]   2> 43467 T214 C31 oasup.LogUpdateProcessor.finish [collection1] webapp=/g/l path=/update params={version=2&wt=javabin} {add=[7]} 0 2
   [junit4]   2> 43473 T179 C30 oasu.DirectUpdateHandler2.commit start commit{,optimize=false,openSearcher=true,waitSearcher=true,expungeDeletes=false,softCommit=false,prepareCommit=false}
   [junit4]   2> 43478 T179 C30 oasc.SolrDeletionPolicy.onCommit SolrDeletionPolicy.onCommit: commits: num=2
   [junit4]   2> 		commit{dir=MockDirectoryWrapper(org.apache.lucene.store.RAMDirectory@4d0a4d0a lockFactory=org.apache.lucene.store.SingleInstanceLockFactory@6d5f6d5f),segFN=segments_1,generation=1}
   [junit4]   2> 		commit{dir=MockDirectoryWrapper(org.apache.lucene.store.RAMDirectory@4d0a4d0a lockFactory=org.apache.lucene.store.SingleInstanceLockFactory@6d5f6d5f),segFN=segments_2,generation=2}
   [junit4]   2> 43479 T179 C30 oasc.SolrDeletionPolicy.updateCommits newest commit generation = 2
   [junit4]   2> 43481 T179 C30 oass.SolrIndexSearcher.<init> Opening Searcher@2ac62ac6 main
   [junit4]   2> 43482 T179 C30 oasu.DirectUpdateHandler2.commit end_commit_flush
   [junit4]   2> 43482 T181 oasc.SolrCore.registerSearcher [collection1] Registered new searcher Searcher@2ac62ac6 main{StandardDirectoryReader(segments_2:4:nrt _0(4.7):C7)}
   [junit4]   2> 43483 T179 C30 oasup.LogUpdateProcessor.finish [collection1] webapp=/g/l path=/update params={version=2&waitSearcher=true&softCommit=false&commit=true&wt=javabin} {commit=} 0 11
   [junit4]   2> 43488 T189 C32 oasu.DirectUpdateHandler2.commit start commit{,optimize=false,openSearcher=true,waitSearcher=true,expungeDeletes=false,softCommit=false,prepareCommit=false}
   [junit4]   2> 43492 T189 C32 oasc.SolrDeletionPolicy.onCommit SolrDeletionPolicy.onCommit: commits: num=2
   [junit4]   2> 		commit{dir=MockDirectoryWrapper(org.apache.lucene.store.RAMDirectory@71ec71ec lockFactory=org.apache.lucene.store.SingleInstanceLockFactory@b200b2),segFN=segments_1,generation=1}
   [junit4]   2> 		commit{dir=MockDirectoryWrapper(org.apache.lucene.store.RAMDirectory@71ec71ec lockFactory=org.apache.lucene.store.SingleInstanceLockFactory@b200b2),segFN=segments_2,generation=2}
   [junit4]   2> 43493 T189 C32 oasc.SolrDeletionPolicy.updateCommits newest commit generation = 2
   [junit4]   2> 43495 T189 C32 oass.SolrIndexSearcher.<init> Opening Searcher@69df69df main
   [junit4]   2> 43496 T189 C32 oasu.DirectUpdateHandler2.commit end_commit_flush
   [junit4]   2> 43496 T193 oasc.SolrCore.registerSearcher [collection1] Registered new searcher Searcher@69df69df main{StandardDirectoryReader(segments_2:4:nrt _0(4.7):C2)}
   [junit4]   2> 43497 T189 C32 oasup.LogUpdateProcessor.finish [collection1] webapp=/g/l path=/update params={version=2&waitSearcher=true&softCommit=false&commit=true&wt=javabin} {commit=} 0 9
   [junit4]   2> 43502 T202 C29 oasu.DirectUpdateHandler2.commit start commit{,optimize=false,openSearcher=true,waitSearcher=true,expungeDeletes=false,softCommit=false,prepareCommit=false}
   [junit4]   2> 43508 T202 C29 oasc.SolrDeletionPolicy.onCommit SolrDeletionPolicy.onCommit: commits: num=2
   [junit4]   2> 		commit{dir=MockDirectoryWrapper(org.apache.lucene.store.RAMDirectory@4a4a4a4a lockFactory=org.apache.lucene.store.SingleInstanceLockFactory@6bff6bff),segFN=segments_1,generation=1}
   [junit4]   2> 		commit{dir=MockDirectoryWrapper(org.apache.lucene.store.RAMDirectory@4a4a4a4a lockFactory=org.apache.lucene.store.SingleInstanceLockFactory@6bff6bff),segFN=segments_2,generation=2}
   [junit4]   2> 43509 T202 C29 oasc.SolrDeletionPolicy.updateCommits newest commit generation = 2
   [junit4]   2> 43512 T202 C29 oass.SolrIndexSearcher.<init> Opening Searcher@c500c50 main
   [junit4]   2> 43513 T202 C29 oasu.DirectUpdateHandler2.commit end_commit_flush
   [junit4]   2> 43513 T205 oasc.SolrCore.registerSearcher [collection1] Registered new searcher Searcher@c500c50 main{StandardDirectoryReader(segments_2:4:nrt _0(4.7):C2)}
   [junit4]   2> 43515 T202 C29 oasup.LogUpdateProcessor.finish [collection1] webapp=/g/l path=/update params={version=2&waitSearcher=true&commit=true&softCommit=false&wt=javabin} {commit=} 0 13
   [junit4]   2> 43520 T215 C31 oasu.DirectUpdateHandler2.commit start commit{,optimize=false,openSearcher=true,waitSearcher=true,expungeDeletes=false,softCommit=false,prepareCommit=false}
   [junit4]   2> 43524 T215 C31 oasc.SolrDeletionPolicy.onCommit SolrDeletionPolicy.onCommit: commits: num=2
   [junit4]   2> 		commit{dir=MockDirectoryWrapper(org.apache.lucene.store.RAMDirectory@38ac38ac lockFactory=org.apache.lucene.store.SingleInstanceLockFactory@23302330),segFN=segments_1,generation=1}
   [junit4]   2> 		commit{dir=MockDirectoryWrapper(org.apache.lucene.store.RAMDirectory@38ac38ac lockFactory=org.apache.lucene.store.SingleInstanceLockFactory@23302330),segFN=segments_2,generation=2}
   [junit4]   2> 43524 T215 C31 oasc.SolrDeletionPolicy.updateCommits newest commit generation = 2
   [junit4]   2> 43526 T215 C31 oass.SolrIndexSearcher.<init> Opening Searcher@6c356c35 main
   [junit4]   2> 43527 T215 C31 oasu.DirectUpdateHandler2.commit end_commit_flush
   [junit4]   2> 43527 T217 oasc.SolrCore.registerSearcher [collection1] Registered new searcher Searcher@6c356c35 main{StandardDirectoryReader(segments_2:4:nrt _0(4.7):C3)}
   [junit4]   2> 43528 T215 C31 oasup.LogUpdateProcessor.finish [collection1] webapp=/g/l path=/update params={version=2&waitSearcher=true&wt=javabin&commit=true&softCommit=false} {commit=} 0 8
   [junit4]   2> 43557 T176 C30 oasc.SolrCore.execute [collection1] webapp=/g/l path=/elevate params={qt=/elevate&version=2&q=*:*&distrib=false&fl=id,+score,+[elevated]&rows=500&shards.qt=/elevate&wt=javabin&sort=id+desc} hits=7 status=0 QTime=23 
   [junit4]   2> 43578 T213 C31 oasc.SolrCore.execute [collection1] webapp=/g/l path=/elevate params={fl=id,score&fsv=true&distrib=false&version=2&NOW=1385771799534&qt=/elevate&rows=500&q=*:*&start=0&shard.url=127.0.0.1:34924/g/l&sort=id+desc&isShard=true&wt=javabin&shards.qt=/elevate} hits=3 status=0 QTime=1 
   [junit4]   2> 43578 T191 C32 oasc.SolrCore.execute [collection1] webapp=/g/l path=/elevate params={sort=id+desc&isShard=true&wt=javabin&shards.qt=/elevate&rows=500&q=*:*&start=0&shard.url=[ff01::083]:33332/g/l|127.0.0.1:47878/g/l&fl=id,score&fsv=true&distrib=false&version=2&NOW=1385771799534&qt=/elevate} hits=2 status=0 QTime=2 
   [junit4]   2> 43583 T200 C2

[...truncated too long message...]

webapp=null path=null params={} {commit=} 0 8
   [junit4]   2> 2297655 T2549 oasu.DirectUpdateHandler2.commit start commit{,optimize=false,openSearcher=true,waitSearcher=true,expungeDeletes=false,softCommit=false,prepareCommit=false}
   [junit4]   2> 2297664 T2549 oasc.SolrDeletionPolicy.onCommit SolrDeletionPolicy.onCommit: commits: num=2
   [junit4]   2> 		commit{dir=RateLimitedDirectoryWrapper(MockDirectoryWrapper(org.apache.lucene.store.RAMDirectory@7eb87eb8 lockFactory=org.apache.lucene.store.SingleInstanceLockFactory@6520652)),segFN=segments_13,generation=39}
   [junit4]   2> 		commit{dir=RateLimitedDirectoryWrapper(MockDirectoryWrapper(org.apache.lucene.store.RAMDirectory@7eb87eb8 lockFactory=org.apache.lucene.store.SingleInstanceLockFactory@6520652)),segFN=segments_14,generation=40}
   [junit4]   2> 2297665 T2549 oasc.SolrDeletionPolicy.updateCommits newest commit generation = 40
   [junit4]   2> 2297666 T2549 oass.SolrIndexSearcher.<init> Opening Searcher@57e357e3 main
   [junit4]   2> 2297668 T2549 oasu.DirectUpdateHandler2.commit end_commit_flush
   [junit4]   2> 2297671 T2551 oasc.SolrCore.registerSearcher [collection1] Registered new searcher Searcher@57e357e3 main{StandardDirectoryReader(segments_14:160:nrt _1c(4.7):c2)}
   [junit4]   2> 2297676 T2549 oasu.DirectUpdateHandler2.commit start commit{,optimize=false,openSearcher=true,waitSearcher=true,expungeDeletes=false,softCommit=false,prepareCommit=false}
   [junit4]   2> 2297679 T2549 oasc.SolrDeletionPolicy.onCommit SolrDeletionPolicy.onCommit: commits: num=2
   [junit4]   2> 		commit{dir=RateLimitedDirectoryWrapper(MockDirectoryWrapper(org.apache.lucene.store.RAMDirectory@7eb87eb8 lockFactory=org.apache.lucene.store.SingleInstanceLockFactory@6520652)),segFN=segments_14,generation=40}
   [junit4]   2> 		commit{dir=RateLimitedDirectoryWrapper(MockDirectoryWrapper(org.apache.lucene.store.RAMDirectory@7eb87eb8 lockFactory=org.apache.lucene.store.SingleInstanceLockFactory@6520652)),segFN=segments_15,generation=41}
   [junit4]   2> 2297680 T2549 oasc.SolrDeletionPolicy.updateCommits newest commit generation = 41
   [junit4]   2> 2297681 T2549 oass.SolrIndexSearcher.<init> Opening Searcher@38983898 main
   [junit4]   2> 2297682 T2549 oasu.DirectUpdateHandler2.commit end_commit_flush
   [junit4]   2> 2297686 T2551 oasc.SolrCore.registerSearcher [collection1] Registered new searcher Searcher@38983898 main{StandardDirectoryReader(segments_15:162:nrt _1c(4.7):c2 _1d(4.7):c1)}
   [junit4]   2> 2297687 T2549 oas.SolrTestCaseJ4.tearDown ###Ending testDupeDetection
   [junit4]   2> NOTE: reproduce with: ant test  -Dtestcase=SignatureUpdateProcessorFactoryTest -Dtests.method=testDupeDetection -Dtests.seed=ADF623EBC61C67E6 -Dtests.multiplier=3 -Dtests.slow=true -Dtests.locale=sl_SI -Dtests.timezone=Asia/Irkutsk -Dtests.file.encoding=ISO-8859-1
   [junit4] FAILURE 0.08s J1 | SignatureUpdateProcessorFactoryTest.testDupeDetection <<<
   [junit4]    > Throwable #1: java.lang.AssertionError: expected:<1> but was:<3>
   [junit4]    > 	at __randomizedtesting.SeedInfo.seed([ADF623EBC61C67E6:F6C6D823C55BC49A]:0)
   [junit4]    > 	at org.apache.solr.update.processor.SignatureUpdateProcessorFactoryTest.checkNumDocs(SignatureUpdateProcessorFactoryTest.java:71)
   [junit4]    > 	at org.apache.solr.update.processor.SignatureUpdateProcessorFactoryTest.testDupeDetection(SignatureUpdateProcessorFactoryTest.java:119)
   [junit4]    > 	at java.lang.Thread.run(Thread.java:738)
   [junit4]   2> 2297699 T2549 oas.SolrTestCaseJ4.deleteCore ###deleteCore
   [junit4]   2> 2297700 T2549 oasc.CoreContainer.shutdown Shutting down CoreContainer instance=100074999
   [junit4]   2> 2297701 T2549 oasc.SolrCore.close [collection1]  CLOSING SolrCore org.apache.solr.core.SolrCore@14331433
   [junit4]   2> 2297725 T2549 oasu.DirectUpdateHandler2.close closing DirectUpdateHandler2{commits=42,autocommits=0,soft autocommits=0,optimizes=0,rollbacks=0,expungeDeletes=0,docsPending=0,adds=0,deletesById=0,deletesByQuery=0,errors=0,cumulative_adds=253,cumulative_deletesById=0,cumulative_deletesByQuery=6,cumulative_errors=0}
   [junit4]   2> 2297726 T2549 oasu.SolrCoreState.decrefSolrCoreState Closing SolrCoreState
   [junit4]   2> 2297727 T2549 oasu.DefaultSolrCoreState.closeIndexWriter SolrCoreState ref count has reached 0 - closing IndexWriter
   [junit4]   2> 2297728 T2549 oasu.DefaultSolrCoreState.closeIndexWriter closing IndexWriter with IndexWriterCloser
   [junit4]   2> 2297729 T2549 oasc.SolrCore.closeSearcher [collection1] Closing main searcher on request.
   [junit4]   2> 2297730 T2549 oasc.CachingDirectoryFactory.close Closing MockDirectoryFactory - 2 directories currently being tracked
   [junit4]   2> 2297731 T2549 oasc.CachingDirectoryFactory.closeCacheValue looking to close /mnt/ssd/jenkins/workspace/Lucene-Solr-4.x-Linux/solr/build/solr-core/test/J1/./solrtest-SignatureUpdateProcessorFactoryTest-1385774052081/index [CachedDir<<refCount=0;path=/mnt/ssd/jenkins/workspace/Lucene-Solr-4.x-Linux/solr/build/solr-core/test/J1/./solrtest-SignatureUpdateProcessorFactoryTest-1385774052081/index;done=false>>]
   [junit4]   2> 2297732 T2549 oasc.CachingDirectoryFactory.close Closing directory: /mnt/ssd/jenkins/workspace/Lucene-Solr-4.x-Linux/solr/build/solr-core/test/J1/./solrtest-SignatureUpdateProcessorFactoryTest-1385774052081/index
   [junit4]   2> 2297732 T2549 oasc.CachingDirectoryFactory.closeCacheValue looking to close /mnt/ssd/jenkins/workspace/Lucene-Solr-4.x-Linux/solr/build/solr-core/test/J1/./solrtest-SignatureUpdateProcessorFactoryTest-1385774052081 [CachedDir<<refCount=0;path=/mnt/ssd/jenkins/workspace/Lucene-Solr-4.x-Linux/solr/build/solr-core/test/J1/./solrtest-SignatureUpdateProcessorFactoryTest-1385774052081;done=false>>]
   [junit4]   2> 2297733 T2549 oasc.CachingDirectoryFactory.close Closing directory: /mnt/ssd/jenkins/workspace/Lucene-Solr-4.x-Linux/solr/build/solr-core/test/J1/./solrtest-SignatureUpdateProcessorFactoryTest-1385774052081
   [junit4]   2> NOTE: test params are: codec=Lucene40, sim=RandomSimilarityProvider(queryNorm=true,coord=no): {}, locale=sl_SI, timezone=Asia/Irkutsk
   [junit4]   2> NOTE: Linux 3.8.0-33-generic x86/IBM Corporation 1.6.0 (32-bit)/cpus=8,threads=1,free=14120576,total=93481472
   [junit4]   2> NOTE: All tests run in this JVM: [TestFastOutputStream, TestAddFieldRealTimeGet, TestDistributedMissingSort, TestShardHandlerFactory, TestFastLRUCache, TestQuerySenderNoQuery, DocValuesMultiTest, MultiTermTest, CurrencyFieldXmlFileTest, HdfsLockFactoryTest, TestFiltering, TestFieldTypeCollectionResource, OpenCloseCoreStressTest, PluginInfoTest, DistributedDebugComponentTest, TestStressReorder, SuggesterTSTTest, HighlighterConfigTest, TestDefaultSearchFieldResource, NotRequiredUniqueKeyTest, TestCollationFieldDocValues, TestNoOpRegenerator, TestIndexingPerformance, AlternateDirectoryTest, HdfsChaosMonkeySafeLeaderTest, ZkNodePropsTest, TestDistributedSearch, AddBlockUpdateTest, RAMDirectoryFactoryTest, RequiredFieldsTest, TestSchemaNameResource, TestStressRecovery, HdfsDirectoryTest, TestNumberUtils, TestXIncludeConfig, DirectSolrSpellCheckerTest, UniqFieldsUpdateProcessorFactoryTest, SpellCheckComponentTest, TestWordDelimiterFilterFactory, SpellingQueryConverterTest, DistributedQueryComponentCustomSortTest, DisMaxRequestHandlerTest, ChaosMonkeySafeLeaderTest, StandardRequestHandlerTest, NumericFieldsTest, TestSolrQueryParserResource, TestBinaryResponseWriter, TestCoreDiscovery, PrimUtilsTest, TestCollationKeyRangeQueries, TestSweetSpotSimilarityFactory, CachingDirectoryFactoryTest, TestDFRSimilarityFactory, DistanceFunctionTest, TestAnalyzedSuggestions, XsltUpdateRequestHandlerTest, ChangedSchemaMergeTest, OutputWriterTest, TestFieldResource, TestCollationField, TestFuzzyAnalyzedSuggestions, TestRTGBase, CustomCollectionTest, DirectUpdateHandlerTest, TestRandomFaceting, EnumFieldTest, TestSolrXml, DefaultValueUpdateProcessorTest, TestIBSimilarityFactory, TestJmxIntegration, TestMultiCoreConfBootstrap, CoreMergeIndexesAdminHandlerTest, SolrCmdDistributorTest, HardAutoCommitTest, TestUpdate, DirectSolrConnectionTest, TimeZoneUtilsTest, TestRecovery, MinimalSchemaTest, SolrIndexConfigTest, PingRequestHandlerTest, ChaosMonkeyNothingIsSafeTest, TestCodecSupport, DeleteInactiveReplicaTest, TestReload, TestRangeQuery, TestCoreContainer, TestSolr4Spatial, ConvertedLegacyTest, BasicFunctionalityTest, OverseerCollectionProcessorTest, TestIndexSearcher, SoftAutoCommitTest, SignatureUpdateProcessorFactoryTest]
   [junit4] Completed on J1 in 2.25s, 6 tests, 2 failures <<< FAILURES!

[...truncated 425 lines...]
BUILD FAILED
/mnt/ssd/jenkins/workspace/Lucene-Solr-4.x-Linux/build.xml:426: The following error occurred while executing this line:
/mnt/ssd/jenkins/workspace/Lucene-Solr-4.x-Linux/build.xml:419: The following error occurred while executing this line:
/mnt/ssd/jenkins/workspace/Lucene-Solr-4.x-Linux/build.xml:39: The following error occurred while executing this line:
/mnt/ssd/jenkins/workspace/Lucene-Solr-4.x-Linux/extra-targets.xml:37: The following error occurred while executing this line:
/mnt/ssd/jenkins/workspace/Lucene-Solr-4.x-Linux/solr/build.xml:189: The following error occurred while executing this line:
/mnt/ssd/jenkins/workspace/Lucene-Solr-4.x-Linux/solr/common-build.xml:491: The following error occurred while executing this line:
/mnt/ssd/jenkins/workspace/Lucene-Solr-4.x-Linux/lucene/common-build.xml:1279: The following error occurred while executing this line:
/mnt/ssd/jenkins/workspace/Lucene-Solr-4.x-Linux/lucene/common-build.xml:912: There were test failures: 349 suites, 1516 tests, 4 failures, 34 ignored (6 assumptions)

Total time: 72 minutes 39 seconds
Build step 'Invoke Ant' marked build as failure
Description set: Java: 32bit/ibm-j9-jdk6 -Xjit:exclude={org/apache/lucene/util/fst/FST.pack(IIF)Lorg/apache/lucene/util/fst/FST;}
Archiving artifacts
Recording test results
Email was triggered for: Failure
Sending email for trigger: Failure



Mime
View raw message