lucene-dev mailing list archives

Site index · List index
Message view « Date » · « Thread »
Top « Date » · « Thread »
From Policeman Jenkins Server <jenk...@thetaphi.de>
Subject [JENKINS] Lucene-Solr-4.x-Windows (64bit/jdk1.7.0_45) - Build # 3430 - Failure!
Date Tue, 26 Nov 2013 07:22:44 GMT
Build: http://jenkins.thetaphi.de/job/Lucene-Solr-4.x-Windows/3430/
Java: 64bit/jdk1.7.0_45 -XX:-UseCompressedOops -XX:+UseG1GC

1 tests failed.
REGRESSION:  org.apache.solr.update.SolrCmdDistributorTest.testDistribSearch

Error Message:
expected:<191> but was:<192>

Stack Trace:
java.lang.AssertionError: expected:<191> but was:<192>
	at __randomizedtesting.SeedInfo.seed([5EEBFF84DCFFFAD9:DF0D719CABA09AE5]:0)
	at org.junit.Assert.fail(Assert.java:93)
	at org.junit.Assert.failNotEquals(Assert.java:647)
	at org.junit.Assert.assertEquals(Assert.java:128)
	at org.junit.Assert.assertEquals(Assert.java:472)
	at org.junit.Assert.assertEquals(Assert.java:456)
	at org.apache.solr.update.SolrCmdDistributorTest.testRetryNode(SolrCmdDistributorTest.java:443)
	at org.apache.solr.update.SolrCmdDistributorTest.doTest(SolrCmdDistributorTest.java:321)
	at org.apache.solr.BaseDistributedSearchTestCase.testDistribSearch(BaseDistributedSearchTestCase.java:835)
	at sun.reflect.NativeMethodAccessorImpl.invoke0(Native Method)
	at sun.reflect.NativeMethodAccessorImpl.invoke(NativeMethodAccessorImpl.java:57)
	at sun.reflect.DelegatingMethodAccessorImpl.invoke(DelegatingMethodAccessorImpl.java:43)
	at java.lang.reflect.Method.invoke(Method.java:606)
	at com.carrotsearch.randomizedtesting.RandomizedRunner.invoke(RandomizedRunner.java:1559)
	at com.carrotsearch.randomizedtesting.RandomizedRunner.access$600(RandomizedRunner.java:79)
	at com.carrotsearch.randomizedtesting.RandomizedRunner$6.evaluate(RandomizedRunner.java:737)
	at com.carrotsearch.randomizedtesting.RandomizedRunner$7.evaluate(RandomizedRunner.java:773)
	at com.carrotsearch.randomizedtesting.RandomizedRunner$8.evaluate(RandomizedRunner.java:787)
	at com.carrotsearch.randomizedtesting.rules.SystemPropertiesRestoreRule$1.evaluate(SystemPropertiesRestoreRule.java:53)
	at org.apache.lucene.util.TestRuleSetupTeardownChained$1.evaluate(TestRuleSetupTeardownChained.java:50)
	at org.apache.lucene.util.TestRuleFieldCacheSanity$1.evaluate(TestRuleFieldCacheSanity.java:51)
	at org.apache.lucene.util.AbstractBeforeAfterRule$1.evaluate(AbstractBeforeAfterRule.java:46)
	at com.carrotsearch.randomizedtesting.rules.SystemPropertiesInvariantRule$1.evaluate(SystemPropertiesInvariantRule.java:55)
	at org.apache.lucene.util.TestRuleThreadAndTestName$1.evaluate(TestRuleThreadAndTestName.java:49)
	at org.apache.lucene.util.TestRuleIgnoreAfterMaxFailures$1.evaluate(TestRuleIgnoreAfterMaxFailures.java:70)
	at org.apache.lucene.util.TestRuleMarkFailure$1.evaluate(TestRuleMarkFailure.java:48)
	at com.carrotsearch.randomizedtesting.rules.StatementAdapter.evaluate(StatementAdapter.java:36)
	at com.carrotsearch.randomizedtesting.ThreadLeakControl$StatementRunner.run(ThreadLeakControl.java:358)
	at com.carrotsearch.randomizedtesting.ThreadLeakControl.forkTimeoutingTask(ThreadLeakControl.java:782)
	at com.carrotsearch.randomizedtesting.ThreadLeakControl$3.evaluate(ThreadLeakControl.java:442)
	at com.carrotsearch.randomizedtesting.RandomizedRunner.runSingleTest(RandomizedRunner.java:746)
	at com.carrotsearch.randomizedtesting.RandomizedRunner$3.evaluate(RandomizedRunner.java:648)
	at com.carrotsearch.randomizedtesting.RandomizedRunner$4.evaluate(RandomizedRunner.java:682)
	at com.carrotsearch.randomizedtesting.RandomizedRunner$5.evaluate(RandomizedRunner.java:693)
	at com.carrotsearch.randomizedtesting.rules.StatementAdapter.evaluate(StatementAdapter.java:36)
	at com.carrotsearch.randomizedtesting.rules.SystemPropertiesRestoreRule$1.evaluate(SystemPropertiesRestoreRule.java:53)
	at org.apache.lucene.util.AbstractBeforeAfterRule$1.evaluate(AbstractBeforeAfterRule.java:46)
	at org.apache.lucene.util.TestRuleStoreClassName$1.evaluate(TestRuleStoreClassName.java:42)
	at com.carrotsearch.randomizedtesting.rules.SystemPropertiesInvariantRule$1.evaluate(SystemPropertiesInvariantRule.java:55)
	at com.carrotsearch.randomizedtesting.rules.NoShadowingOrOverridesOnMethodsRule$1.evaluate(NoShadowingOrOverridesOnMethodsRule.java:39)
	at com.carrotsearch.randomizedtesting.rules.NoShadowingOrOverridesOnMethodsRule$1.evaluate(NoShadowingOrOverridesOnMethodsRule.java:39)
	at com.carrotsearch.randomizedtesting.rules.StatementAdapter.evaluate(StatementAdapter.java:36)
	at org.apache.lucene.util.TestRuleAssertionsRequired$1.evaluate(TestRuleAssertionsRequired.java:43)
	at org.apache.lucene.util.TestRuleMarkFailure$1.evaluate(TestRuleMarkFailure.java:48)
	at org.apache.lucene.util.TestRuleIgnoreAfterMaxFailures$1.evaluate(TestRuleIgnoreAfterMaxFailures.java:70)
	at org.apache.lucene.util.TestRuleIgnoreTestSuites$1.evaluate(TestRuleIgnoreTestSuites.java:55)
	at com.carrotsearch.randomizedtesting.rules.StatementAdapter.evaluate(StatementAdapter.java:36)
	at com.carrotsearch.randomizedtesting.ThreadLeakControl$StatementRunner.run(ThreadLeakControl.java:358)
	at java.lang.Thread.run(Thread.java:744)




Build Log:
[...truncated 10649 lines...]
   [junit4] Suite: org.apache.solr.update.SolrCmdDistributorTest
   [junit4]   2> 2778023 T7785 oas.BaseDistributedSearchTestCase.initHostContext Setting hostContext system property: /
   [junit4]   2> 2778034 T7785 oas.SolrTestCaseJ4.setUp ###Starting testDistribSearch
   [junit4]   2> 2778037 T7785 oejs.Server.doStart jetty-8.1.10.v20130312
   [junit4]   2> 2778044 T7785 oejs.AbstractConnector.doStart Started SelectChannelConnector@127.0.0.1:62671
   [junit4]   2> 2778045 T7785 oass.SolrDispatchFilter.init SolrDispatchFilter.init()
   [junit4]   2> 2778045 T7785 oasc.SolrResourceLoader.locateSolrHome JNDI not configured for solr (NoInitialContextEx)
   [junit4]   2> 2778046 T7785 oasc.SolrResourceLoader.locateSolrHome using system property solr.solr.home: C:\Users\JenkinsSlave\workspace\Lucene-Solr-4.x-Windows\solr\build\solr-core\test-files\solr
   [junit4]   2> 2778046 T7785 oasc.SolrResourceLoader.<init> new SolrResourceLoader for directory: 'C:\Users\JenkinsSlave\workspace\Lucene-Solr-4.x-Windows\solr\build\solr-core\test-files\solr\'
   [junit4]   2> 2778075 T7785 oasc.ConfigSolr.fromFile Loading container configuration from C:\Users\JenkinsSlave\workspace\Lucene-Solr-4.x-Windows\solr\build\solr-core\test-files\solr\solr.xml
   [junit4]   2> 2778153 T7785 oasc.CoreContainer.<init> New CoreContainer 548063288
   [junit4]   2> 2778154 T7785 oasc.CoreContainer.load Loading cores into CoreContainer [instanceDir=C:\Users\JenkinsSlave\workspace\Lucene-Solr-4.x-Windows\solr\build\solr-core\test-files\solr\]
   [junit4]   2> 2778155 T7785 oashc.HttpShardHandlerFactory.getParameter Setting socketTimeout to: 90000
   [junit4]   2> 2778155 T7785 oashc.HttpShardHandlerFactory.getParameter Setting urlScheme to: http://
   [junit4]   2> 2778156 T7785 oashc.HttpShardHandlerFactory.getParameter Setting connTimeout to: 15000
   [junit4]   2> 2778156 T7785 oashc.HttpShardHandlerFactory.getParameter Setting maxConnectionsPerHost to: 20
   [junit4]   2> 2778156 T7785 oashc.HttpShardHandlerFactory.getParameter Setting corePoolSize to: 0
   [junit4]   2> 2778157 T7785 oashc.HttpShardHandlerFactory.getParameter Setting maximumPoolSize to: 2147483647
   [junit4]   2> 2778157 T7785 oashc.HttpShardHandlerFactory.getParameter Setting maxThreadIdleTime to: 5
   [junit4]   2> 2778157 T7785 oashc.HttpShardHandlerFactory.getParameter Setting sizeOfQueue to: -1
   [junit4]   2> 2778157 T7785 oashc.HttpShardHandlerFactory.getParameter Setting fairnessPolicy to: false
   [junit4]   2> 2778162 T7785 oasl.LogWatcher.createWatcher SLF4J impl is org.slf4j.impl.Log4jLoggerFactory
   [junit4]   2> 2778162 T7785 oasl.LogWatcher.newRegisteredLogWatcher Registering Log Listener [Log4j (org.slf4j.impl.Log4jLoggerFactory)]
   [junit4]   2> 2778162 T7785 oasc.CoreContainer.load Host Name: 127.0.0.1
   [junit4]   2> 2778172 T7795 oasc.CoreContainer.create Creating SolrCore 'collection1' using instanceDir: C:\Users\JenkinsSlave\workspace\Lucene-Solr-4.x-Windows\solr\build\solr-core\test-files\solr\collection1
   [junit4]   2> 2778173 T7795 oasc.SolrResourceLoader.<init> new SolrResourceLoader for directory: 'C:\Users\JenkinsSlave\workspace\Lucene-Solr-4.x-Windows\solr\build\solr-core\test-files\solr\collection1\'
   [junit4]   2> 2778176 T7795 oasc.SolrResourceLoader.replaceClassLoader Adding 'file:/C:/Users/JenkinsSlave/workspace/Lucene-Solr-4.x-Windows/solr/build/solr-core/test-files/solr/collection1/lib/classes/' to classloader
   [junit4]   2> 2778176 T7795 oasc.SolrResourceLoader.replaceClassLoader Adding 'file:/C:/Users/JenkinsSlave/workspace/Lucene-Solr-4.x-Windows/solr/build/solr-core/test-files/solr/collection1/lib/README' to classloader
   [junit4]   2> 2778246 T7795 oasc.SolrConfig.<init> Using Lucene MatchVersion: LUCENE_47
   [junit4]   2> 2778312 T7795 oasc.SolrConfig.<init> Loaded SolrConfig: solrconfig-tlog.xml
   [junit4]   2> 2778313 T7795 oass.IndexSchema.readSchema Reading Solr Schema from schema.xml
   [junit4]   2> 2778322 T7795 oass.IndexSchema.readSchema [collection1] Schema name=test
   [junit4]   2> 2778964 T7795 oass.ByteField.init WARN ByteField is deprecated and will be removed in 5.0. You should use TrieIntField instead.
   [junit4]   2> 2778966 T7795 oass.ShortField.init WARN ShortField is deprecated and will be removed in 5.0. You should use TrieIntField instead.
   [junit4]   2> 2778966 T7795 oass.OpenExchangeRatesOrgProvider.init Initialized with rates=open-exchange-rates.json, refreshInterval=1440.
   [junit4]   2> 2778975 T7795 oass.IndexSchema.readSchema default search field in schema is text
   [junit4]   2> 2778979 T7795 oass.IndexSchema.readSchema unique key field: id
   [junit4]   2> 2778987 T7795 oass.FileExchangeRateProvider.reload Reloading exchange rates from file currency.xml
   [junit4]   2> 2778992 T7795 oass.FileExchangeRateProvider.reload Reloading exchange rates from file currency.xml
   [junit4]   2> 2778996 T7795 oass.OpenExchangeRatesOrgProvider.reload Reloading exchange rates from open-exchange-rates.json
   [junit4]   2> 2778996 T7795 oass.OpenExchangeRatesOrgProvider$OpenExchangeRates.<init> WARN Unknown key IMPORTANT NOTE
   [junit4]   2> 2778996 T7795 oass.OpenExchangeRatesOrgProvider$OpenExchangeRates.<init> WARN Expected key, got STRING
   [junit4]   2> 2778996 T7795 oass.OpenExchangeRatesOrgProvider.reload Reloading exchange rates from open-exchange-rates.json
   [junit4]   2> 2778996 T7795 oass.OpenExchangeRatesOrgProvider$OpenExchangeRates.<init> WARN Unknown key IMPORTANT NOTE
   [junit4]   2> 2778996 T7795 oass.OpenExchangeRatesOrgProvider$OpenExchangeRates.<init> WARN Expected key, got STRING
   [junit4]   2> 2778996 T7795 oasc.SolrCore.initDirectoryFactory org.apache.solr.core.MockDirectoryFactory
   [junit4]   2> 2778998 T7795 oasc.SolrCore.<init> [collection1] Opening new SolrCore at C:\Users\JenkinsSlave\workspace\Lucene-Solr-4.x-Windows\solr\build\solr-core\test-files\solr\collection1\, dataDir=.\org.apache.solr.update.SolrCmdDistributorTest-1385449764971/control/data\
   [junit4]   2> 2778998 T7795 oasc.JmxMonitoredMap.<init> JMX monitoring is enabled. Adding Solr mbeans to JMX Server: com.sun.jmx.mbeanserver.JmxMBeanServer@79891e97
   [junit4]   2> 2778999 T7795 oasc.CachingDirectoryFactory.get return new directory for .\org.apache.solr.update.SolrCmdDistributorTest-1385449764971/control/data\
   [junit4]   2> 2778999 T7795 oasc.SolrCore.getNewIndexDir New index directory detected: old=null new=.\org.apache.solr.update.SolrCmdDistributorTest-1385449764971/control/data\index/
   [junit4]   2> 2778999 T7795 oasc.SolrCore.initIndex WARN [collection1] Solr index directory '.\org.apache.solr.update.SolrCmdDistributorTest-1385449764971\control\data\index' doesn't exist. Creating new index...
   [junit4]   2> 2779000 T7795 oasc.CachingDirectoryFactory.get return new directory for .\org.apache.solr.update.SolrCmdDistributorTest-1385449764971/control/data\index
   [junit4]   2> 2779000 T7795 oasc.SolrDeletionPolicy.onCommit SolrDeletionPolicy.onCommit: commits: num=1
   [junit4]   2> 		commit{dir=MockDirectoryWrapper(org.apache.lucene.store.RAMDirectory@2da0594b lockFactory=org.apache.lucene.store.SingleInstanceLockFactory@d068),segFN=segments_1,generation=1}
   [junit4]   2> 2779000 T7795 oasc.SolrDeletionPolicy.updateCommits newest commit generation = 1
   [junit4]   2> 2779004 T7795 oasup.UpdateRequestProcessorChain.init creating updateRequestProcessorChain "nodistrib"
   [junit4]   2> 2779004 T7795 oasup.UpdateRequestProcessorChain.init creating updateRequestProcessorChain "dedupe"
   [junit4]   2> 2779004 T7795 oasup.UpdateRequestProcessorChain.init inserting DistributedUpdateProcessorFactory into updateRequestProcessorChain "dedupe"
   [junit4]   2> 2779004 T7795 oasup.UpdateRequestProcessorChain.init creating updateRequestProcessorChain "stored_sig"
   [junit4]   2> 2779005 T7795 oasup.UpdateRequestProcessorChain.init inserting DistributedUpdateProcessorFactory into updateRequestProcessorChain "stored_sig"
   [junit4]   2> 2779005 T7795 oasup.UpdateRequestProcessorChain.init creating updateRequestProcessorChain "distrib-dup-test-chain-explicit"
   [junit4]   2> 2779005 T7795 oasup.UpdateRequestProcessorChain.init creating updateRequestProcessorChain "distrib-dup-test-chain-implicit"
   [junit4]   2> 2779005 T7795 oasup.UpdateRequestProcessorChain.init inserting DistributedUpdateProcessorFactory into updateRequestProcessorChain "distrib-dup-test-chain-implicit"
   [junit4]   2> 2779005 T7795 oasc.SolrCore.loadUpdateProcessorChains no updateRequestProcessorChain defined as default, creating implicit default
   [junit4]   2> 2779007 T7795 oasc.RequestHandlers.initHandlersFromConfig created standard: solr.StandardRequestHandler
   [junit4]   2> 2779007 T7795 oasc.RequestHandlers.initHandlersFromConfig created /get: solr.RealTimeGetHandler
   [junit4]   2> 2779007 T7795 oasc.RequestHandlers.initHandlersFromConfig adding lazy requestHandler: solr.ReplicationHandler
   [junit4]   2> 2779007 T7795 oasc.RequestHandlers.initHandlersFromConfig created /replication: solr.ReplicationHandler
   [junit4]   2> 2779008 T7795 oasc.RequestHandlers.initHandlersFromConfig created /update: solr.UpdateRequestHandler
   [junit4]   2> 2779008 T7795 oasc.RequestHandlers.initHandlersFromConfig created /admin/: org.apache.solr.handler.admin.AdminHandlers
   [junit4]   2> 2779008 T7795 oasc.RequestHandlers.initHandlersFromConfig created /admin/file: solr.admin.ShowFileRequestHandler
   [junit4]   2> 2779015 T7795 oashl.XMLLoader.init xsltCacheLifetimeSeconds=60
   [junit4]   2> 2779023 T7795 oasu.CommitTracker.<init> Hard AutoCommit: disabled
   [junit4]   2> 2779023 T7795 oasu.CommitTracker.<init> Soft AutoCommit: disabled
   [junit4]   2> 2779025 T7795 oasc.SolrDeletionPolicy.onInit SolrDeletionPolicy.onInit: commits: num=1
   [junit4]   2> 		commit{dir=MockDirectoryWrapper(org.apache.lucene.store.RAMDirectory@2da0594b lockFactory=org.apache.lucene.store.SingleInstanceLockFactory@d068),segFN=segments_1,generation=1}
   [junit4]   2> 2779026 T7795 oasc.SolrDeletionPolicy.updateCommits newest commit generation = 1
   [junit4]   2> 2779026 T7795 oass.SolrIndexSearcher.<init> Opening Searcher@5b194a19 main
   [junit4]   2> 2779031 T7796 oasc.SolrCore.registerSearcher [collection1] Registered new searcher Searcher@5b194a19 main{StandardDirectoryReader(segments_1:1:nrt)}
   [junit4]   2> 2779031 T7795 oasc.CoreContainer.registerCore registering core: collection1
   [junit4]   2> 2779032 T7785 oass.SolrDispatchFilter.init user.dir=C:\Users\JenkinsSlave\workspace\Lucene-Solr-4.x-Windows\solr\build\solr-core\test\J0
   [junit4]   2> 2779032 T7785 oass.SolrDispatchFilter.init SolrDispatchFilter.init() done
   [junit4]   2> 2779034 T7785 oejs.Server.doStart jetty-8.1.10.v20130312
   [junit4]   2> 2779041 T7785 oejs.AbstractConnector.doStart Started SelectChannelConnector@127.0.0.1:62674
   [junit4]   2> 2779041 T7785 oass.SolrDispatchFilter.init SolrDispatchFilter.init()
   [junit4]   2> 2779042 T7785 oasc.SolrResourceLoader.locateSolrHome JNDI not configured for solr (NoInitialContextEx)
   [junit4]   2> 2779042 T7785 oasc.SolrResourceLoader.locateSolrHome using system property solr.solr.home: C:\Users\JenkinsSlave\workspace\Lucene-Solr-4.x-Windows\solr\build\solr-core\test-files\solr
   [junit4]   2> 2779042 T7785 oasc.SolrResourceLoader.<init> new SolrResourceLoader for directory: 'C:\Users\JenkinsSlave\workspace\Lucene-Solr-4.x-Windows\solr\build\solr-core\test-files\solr\'
   [junit4]   2> 2779059 T7785 oasc.ConfigSolr.fromFile Loading container configuration from C:\Users\JenkinsSlave\workspace\Lucene-Solr-4.x-Windows\solr\build\solr-core\test-files\solr\solr.xml
   [junit4]   2> 2779121 T7785 oasc.CoreContainer.<init> New CoreContainer 1678060136
   [junit4]   2> 2779121 T7785 oasc.CoreContainer.load Loading cores into CoreContainer [instanceDir=C:\Users\JenkinsSlave\workspace\Lucene-Solr-4.x-Windows\solr\build\solr-core\test-files\solr\]
   [junit4]   2> 2779124 T7785 oashc.HttpShardHandlerFactory.getParameter Setting socketTimeout to: 90000
   [junit4]   2> 2779124 T7785 oashc.HttpShardHandlerFactory.getParameter Setting urlScheme to: http://
   [junit4]   2> 2779124 T7785 oashc.HttpShardHandlerFactory.getParameter Setting connTimeout to: 15000
   [junit4]   2> 2779124 T7785 oashc.HttpShardHandlerFactory.getParameter Setting maxConnectionsPerHost to: 20
   [junit4]   2> 2779124 T7785 oashc.HttpShardHandlerFactory.getParameter Setting corePoolSize to: 0
   [junit4]   2> 2779124 T7785 oashc.HttpShardHandlerFactory.getParameter Setting maximumPoolSize to: 2147483647
   [junit4]   2> 2779125 T7785 oashc.HttpShardHandlerFactory.getParameter Setting maxThreadIdleTime to: 5
   [junit4]   2> 2779126 T7785 oashc.HttpShardHandlerFactory.getParameter Setting sizeOfQueue to: -1
   [junit4]   2> 2779126 T7785 oashc.HttpShardHandlerFactory.getParameter Setting fairnessPolicy to: false
   [junit4]   2> 2779130 T7785 oasl.LogWatcher.createWatcher SLF4J impl is org.slf4j.impl.Log4jLoggerFactory
   [junit4]   2> 2779130 T7785 oasl.LogWatcher.newRegisteredLogWatcher Registering Log Listener [Log4j (org.slf4j.impl.Log4jLoggerFactory)]
   [junit4]   2> 2779130 T7785 oasc.CoreContainer.load Host Name: 127.0.0.1
   [junit4]   2> 2779137 T7807 oasc.CoreContainer.create Creating SolrCore 'collection1' using instanceDir: C:\Users\JenkinsSlave\workspace\Lucene-Solr-4.x-Windows\solr\build\solr-core\test-files\solr\collection1
   [junit4]   2> 2779138 T7807 oasc.SolrResourceLoader.<init> new SolrResourceLoader for directory: 'C:\Users\JenkinsSlave\workspace\Lucene-Solr-4.x-Windows\solr\build\solr-core\test-files\solr\collection1\'
   [junit4]   2> 2779138 T7807 oasc.SolrResourceLoader.replaceClassLoader Adding 'file:/C:/Users/JenkinsSlave/workspace/Lucene-Solr-4.x-Windows/solr/build/solr-core/test-files/solr/collection1/lib/classes/' to classloader
   [junit4]   2> 2779138 T7807 oasc.SolrResourceLoader.replaceClassLoader Adding 'file:/C:/Users/JenkinsSlave/workspace/Lucene-Solr-4.x-Windows/solr/build/solr-core/test-files/solr/collection1/lib/README' to classloader
   [junit4]   2> 2779193 T7807 oasc.SolrConfig.<init> Using Lucene MatchVersion: LUCENE_47
   [junit4]   2> 2779280 T7807 oasc.SolrConfig.<init> Loaded SolrConfig: solrconfig-tlog.xml
   [junit4]   2> 2779281 T7807 oass.IndexSchema.readSchema Reading Solr Schema from schema.xml
   [junit4]   2> 2779291 T7807 oass.IndexSchema.readSchema [collection1] Schema name=test
   [junit4]   2> 2779967 T7807 oass.ByteField.init WARN ByteField is deprecated and will be removed in 5.0. You should use TrieIntField instead.
   [junit4]   2> 2779968 T7807 oass.ShortField.init WARN ShortField is deprecated and will be removed in 5.0. You should use TrieIntField instead.
   [junit4]   2> 2779968 T7807 oass.OpenExchangeRatesOrgProvider.init Initialized with rates=open-exchange-rates.json, refreshInterval=1440.
   [junit4]   2> 2779974 T7807 oass.IndexSchema.readSchema default search field in schema is text
   [junit4]   2> 2779978 T7807 oass.IndexSchema.readSchema unique key field: id
   [junit4]   2> 2779986 T7807 oass.FileExchangeRateProvider.reload Reloading exchange rates from file currency.xml
   [junit4]   2> 2779990 T7807 oass.FileExchangeRateProvider.reload Reloading exchange rates from file currency.xml
   [junit4]   2> 2779994 T7807 oass.OpenExchangeRatesOrgProvider.reload Reloading exchange rates from open-exchange-rates.json
   [junit4]   2> 2779994 T7807 oass.OpenExchangeRatesOrgProvider$OpenExchangeRates.<init> WARN Unknown key IMPORTANT NOTE
   [junit4]   2> 2779994 T7807 oass.OpenExchangeRatesOrgProvider$OpenExchangeRates.<init> WARN Expected key, got STRING
   [junit4]   2> 2779994 T7807 oass.OpenExchangeRatesOrgProvider.reload Reloading exchange rates from open-exchange-rates.json
   [junit4]   2> 2779994 T7807 oass.OpenExchangeRatesOrgProvider$OpenExchangeRates.<init> WARN Unknown key IMPORTANT NOTE
   [junit4]   2> 2779994 T7807 oass.OpenExchangeRatesOrgProvider$OpenExchangeRates.<init> WARN Expected key, got STRING
   [junit4]   2> 2779994 T7807 oasc.SolrCore.initDirectoryFactory org.apache.solr.core.MockDirectoryFactory
   [junit4]   2> 2779996 T7807 oasc.SolrCore.<init> [collection1] Opening new SolrCore at C:\Users\JenkinsSlave\workspace\Lucene-Solr-4.x-Windows\solr\build\solr-core\test-files\solr\collection1\, dataDir=.\org.apache.solr.update.SolrCmdDistributorTest-1385449764971/shard0/data\
   [junit4]   2> 2779996 T7807 oasc.JmxMonitoredMap.<init> JMX monitoring is enabled. Adding Solr mbeans to JMX Server: com.sun.jmx.mbeanserver.JmxMBeanServer@79891e97
   [junit4]   2> 2779997 T7807 oasc.CachingDirectoryFactory.get return new directory for .\org.apache.solr.update.SolrCmdDistributorTest-1385449764971/shard0/data\
   [junit4]   2> 2779997 T7807 oasc.SolrCore.getNewIndexDir New index directory detected: old=null new=.\org.apache.solr.update.SolrCmdDistributorTest-1385449764971/shard0/data\index/
   [junit4]   2> 2779997 T7807 oasc.SolrCore.initIndex WARN [collection1] Solr index directory '.\org.apache.solr.update.SolrCmdDistributorTest-1385449764971\shard0\data\index' doesn't exist. Creating new index...
   [junit4]   2> 2779997 T7807 oasc.CachingDirectoryFactory.get return new directory for .\org.apache.solr.update.SolrCmdDistributorTest-1385449764971/shard0/data\index
   [junit4]   2> 2779998 T7807 oasc.SolrDeletionPolicy.onCommit SolrDeletionPolicy.onCommit: commits: num=1
   [junit4]   2> 		commit{dir=MockDirectoryWrapper(org.apache.lucene.store.RAMDirectory@342145c2 lockFactory=org.apache.lucene.store.SingleInstanceLockFactory@50243bba),segFN=segments_1,generation=1}
   [junit4]   2> 2779998 T7807 oasc.SolrDeletionPolicy.updateCommits newest commit generation = 1
   [junit4]   2> 2780002 T7807 oasup.UpdateRequestProcessorChain.init creating updateRequestProcessorChain "nodistrib"
   [junit4]   2> 2780002 T7807 oasup.UpdateRequestProcessorChain.init creating updateRequestProcessorChain "dedupe"
   [junit4]   2> 2780003 T7807 oasup.UpdateRequestProcessorChain.init inserting DistributedUpdateProcessorFactory into updateRequestProcessorChain "dedupe"
   [junit4]   2> 2780003 T7807 oasup.UpdateRequestProcessorChain.init creating updateRequestProcessorChain "stored_sig"
   [junit4]   2> 2780003 T7807 oasup.UpdateRequestProcessorChain.init inserting DistributedUpdateProcessorFactory into updateRequestProcessorChain "stored_sig"
   [junit4]   2> 2780003 T7807 oasup.UpdateRequestProcessorChain.init creating updateRequestProcessorChain "distrib-dup-test-chain-explicit"
   [junit4]   2> 2780004 T7807 oasup.UpdateRequestProcessorChain.init creating updateRequestProcessorChain "distrib-dup-test-chain-implicit"
   [junit4]   2> 2780004 T7807 oasup.UpdateRequestProcessorChain.init inserting DistributedUpdateProcessorFactory into updateRequestProcessorChain "distrib-dup-test-chain-implicit"
   [junit4]   2> 2780004 T7807 oasc.SolrCore.loadUpdateProcessorChains no updateRequestProcessorChain defined as default, creating implicit default
   [junit4]   2> 2780005 T7807 oasc.RequestHandlers.initHandlersFromConfig created standard: solr.StandardRequestHandler
   [junit4]   2> 2780005 T7807 oasc.RequestHandlers.initHandlersFromConfig created /get: solr.RealTimeGetHandler
   [junit4]   2> 2780005 T7807 oasc.RequestHandlers.initHandlersFromConfig adding lazy requestHandler: solr.ReplicationHandler
   [junit4]   2> 2780005 T7807 oasc.RequestHandlers.initHandlersFromConfig created /replication: solr.ReplicationHandler
   [junit4]   2> 2780006 T7807 oasc.RequestHandlers.initHandlersFromConfig created /update: solr.UpdateRequestHandler
   [junit4]   2> 2780006 T7807 oasc.RequestHandlers.initHandlersFromConfig created /admin/: org.apache.solr.handler.admin.AdminHandlers
   [junit4]   2> 2780007 T7807 oasc.RequestHandlers.initHandlersFromConfig created /admin/file: solr.admin.ShowFileRequestHandler
   [junit4]   2> 2780007 T7807 oashl.XMLLoader.init xsltCacheLifetimeSeconds=60
   [junit4]   2> 2780015 T7807 oasu.CommitTracker.<init> Hard AutoCommit: disabled
   [junit4]   2> 2780015 T7807 oasu.CommitTracker.<init> Soft AutoCommit: disabled
   [junit4]   2> 2780017 T7807 oasc.SolrDeletionPolicy.onInit SolrDeletionPolicy.onInit: commits: num=1
   [junit4]   2> 		commit{dir=MockDirectoryWrapper(org.apache.lucene.store.RAMDirectory@342145c2 lockFactory=org.apache.lucene.store.SingleInstanceLockFactory@50243bba),segFN=segments_1,generation=1}
   [junit4]   2> 2780017 T7807 oasc.SolrDeletionPolicy.updateCommits newest commit generation = 1
   [junit4]   2> 2780017 T7807 oass.SolrIndexSearcher.<init> Opening Searcher@568a6324 main
   [junit4]   2> 2780023 T7808 oasc.SolrCore.registerSearcher [collection1] Registered new searcher Searcher@568a6324 main{StandardDirectoryReader(segments_1:1:nrt)}
   [junit4]   2> 2780028 T7807 oasc.CoreContainer.registerCore registering core: collection1
   [junit4]   2> 2780029 T7785 oass.SolrDispatchFilter.init user.dir=C:\Users\JenkinsSlave\workspace\Lucene-Solr-4.x-Windows\solr\build\solr-core\test\J0
   [junit4]   2> 2780029 T7785 oass.SolrDispatchFilter.init SolrDispatchFilter.init() done
   [junit4]   2> 2780032 T7785 oejs.Server.doStart jetty-8.1.10.v20130312
   [junit4]   2> 2780035 T7785 oejs.AbstractConnector.doStart Started SelectChannelConnector@127.0.0.1:62677
   [junit4]   2> 2780037 T7785 oass.SolrDispatchFilter.init SolrDispatchFilter.init()
   [junit4]   2> 2780037 T7785 oasc.SolrResourceLoader.locateSolrHome JNDI not configured for solr (NoInitialContextEx)
   [junit4]   2> 2780037 T7785 oasc.SolrResourceLoader.locateSolrHome using system property solr.solr.home: C:\Users\JenkinsSlave\workspace\Lucene-Solr-4.x-Windows\solr\build\solr-core\test-files\solr
   [junit4]   2> 2780037 T7785 oasc.SolrResourceLoader.<init> new SolrResourceLoader for directory: 'C:\Users\JenkinsSlave\workspace\Lucene-Solr-4.x-Windows\solr\build\solr-core\test-files\solr\'
   [junit4]   2> 2780057 T7785 oasc.ConfigSolr.fromFile Loading container configuration from C:\Users\JenkinsSlave\workspace\Lucene-Solr-4.x-Windows\solr\build\solr-core\test-files\solr\solr.xml
   [junit4]   2> 2780120 T7785 oasc.CoreContainer.<init> New CoreContainer 1691915342
   [junit4]   2> 2780120 T7785 oasc.CoreContainer.load Loading cores into CoreContainer [instanceDir=C:\Users\JenkinsSlave\workspace\Lucene-Solr-4.x-Windows\solr\build\solr-core\test-files\solr\]
   [junit4]   2> 2780122 T7785 oashc.HttpShardHandlerFactory.getParameter Setting socketTimeout to: 90000
   [junit4]   2> 2780122 T7785 oashc.HttpShardHandlerFactory.getParameter Setting urlScheme to: http://
   [junit4]   2> 2780122 T7785 oashc.HttpShardHandlerFactory.getParameter Setting connTimeout to: 15000
   [junit4]   2> 2780122 T7785 oashc.HttpShardHandlerFactory.getParameter Setting maxConnectionsPerHost to: 20
   [junit4]   2> 2780122 T7785 oashc.HttpShardHandlerFactory.getParameter Setting corePoolSize to: 0
   [junit4]   2> 2780122 T7785 oashc.HttpShardHandlerFactory.getParameter Setting maximumPoolSize to: 2147483647
   [junit4]   2> 2780122 T7785 oashc.HttpShardHandlerFactory.getParameter Setting maxThreadIdleTime to: 5
   [junit4]   2> 2780122 T7785 oashc.HttpShardHandlerFactory.getParameter Setting sizeOfQueue to: -1
   [junit4]   2> 2780123 T7785 oashc.HttpShardHandlerFactory.getParameter Setting fairnessPolicy to: false
   [junit4]   2> 2780127 T7785 oasl.LogWatcher.createWatcher SLF4J impl is org.slf4j.impl.Log4jLoggerFactory
   [junit4]   2> 2780127 T7785 oasl.LogWatcher.newRegisteredLogWatcher Registering Log Listener [Log4j (org.slf4j.impl.Log4jLoggerFactory)]
   [junit4]   2> 2780127 T7785 oasc.CoreContainer.load Host Name: 127.0.0.1
   [junit4]   2> 2780134 T7819 oasc.CoreContainer.create Creating SolrCore 'collection1' using instanceDir: C:\Users\JenkinsSlave\workspace\Lucene-Solr-4.x-Windows\solr\build\solr-core\test-files\solr\collection1
   [junit4]   2> 2780135 T7819 oasc.SolrResourceLoader.<init> new SolrResourceLoader for directory: 'C:\Users\JenkinsSlave\workspace\Lucene-Solr-4.x-Windows\solr\build\solr-core\test-files\solr\collection1\'
   [junit4]   2> 2780135 T7819 oasc.SolrResourceLoader.replaceClassLoader Adding 'file:/C:/Users/JenkinsSlave/workspace/Lucene-Solr-4.x-Windows/solr/build/solr-core/test-files/solr/collection1/lib/classes/' to classloader
   [junit4]   2> 2780135 T7819 oasc.SolrResourceLoader.replaceClassLoader Adding 'file:/C:/Users/JenkinsSlave/workspace/Lucene-Solr-4.x-Windows/solr/build/solr-core/test-files/solr/collection1/lib/README' to classloader
   [junit4]   2> 2780191 T7819 oasc.SolrConfig.<init> Using Lucene MatchVersion: LUCENE_47
   [junit4]   2> 2780253 T7819 oasc.SolrConfig.<init> Loaded SolrConfig: solrconfig-tlog.xml
   [junit4]   2> 2780253 T7819 oass.IndexSchema.readSchema Reading Solr Schema from schema.xml
   [junit4]   2> 2780262 T7819 oass.IndexSchema.readSchema [collection1] Schema name=test
   [junit4]   2> 2780903 T7819 oass.ByteField.init WARN ByteField is deprecated and will be removed in 5.0. You should use TrieIntField instead.
   [junit4]   2> 2780905 T7819 oass.ShortField.init WARN ShortField is deprecated and will be removed in 5.0. You should use TrieIntField instead.
   [junit4]   2> 2780905 T7819 oass.OpenExchangeRatesOrgProvider.init Initialized with rates=open-exchange-rates.json, refreshInterval=1440.
   [junit4]   2> 2780912 T7819 oass.IndexSchema.readSchema default search field in schema is text
   [junit4]   2> 2780916 T7819 oass.IndexSchema.readSchema unique key field: id
   [junit4]   2> 2780924 T7819 oass.FileExchangeRateProvider.reload Reloading exchange rates from file currency.xml
   [junit4]   2> 2780928 T7819 oass.FileExchangeRateProvider.reload Reloading exchange rates from file currency.xml
   [junit4]   2> 2780932 T7819 oass.OpenExchangeRatesOrgProvider.reload Reloading exchange rates from open-exchange-rates.json
   [junit4]   2> 2780932 T7819 oass.OpenExchangeRatesOrgProvider$OpenExchangeRates.<init> WARN Unknown key IMPORTANT NOTE
   [junit4]   2> 2780933 T7819 oass.OpenExchangeRatesOrgProvider$OpenExchangeRates.<init> WARN Expected key, got STRING
   [junit4]   2> 2780933 T7819 oass.OpenExchangeRatesOrgProvider.reload Reloading exchange rates from open-exchange-rates.json
   [junit4]   2> 2780933 T7819 oass.OpenExchangeRatesOrgProvider$OpenExchangeRates.<init> WARN Unknown key IMPORTANT NOTE
   [junit4]   2> 2780934 T7819 oass.OpenExchangeRatesOrgProvider$OpenExchangeRates.<init> WARN Expected key, got STRING
   [junit4]   2> 2780934 T7819 oasc.SolrCore.initDirectoryFactory org.apache.solr.core.MockDirectoryFactory
   [junit4]   2> 2780934 T7819 oasc.SolrCore.<init> [collection1] Opening new SolrCore at C:\Users\JenkinsSlave\workspace\Lucene-Solr-4.x-Windows\solr\build\solr-core\test-files\solr\collection1\, dataDir=.\org.apache.solr.update.SolrCmdDistributorTest-1385449764971/shard1/data\
   [junit4]   2> 2780934 T7819 oasc.JmxMonitoredMap.<init> JMX monitoring is enabled. Adding Solr mbeans to JMX Server: com.sun.jmx.mbeanserver.JmxMBeanServer@79891e97
   [junit4]   2> 2780935 T7819 oasc.CachingDirectoryFactory.get return new directory for .\org.apache.solr.update.SolrCmdDistributorTest-1385449764971/shard1/data\
   [junit4]   2> 2780935 T7819 oasc.SolrCore.getNewIndexDir New index directory detected: old=null new=.\org.apache.solr.update.SolrCmdDistributorTest-1385449764971/shard1/data\index/
   [junit4]   2> 2780935 T7819 oasc.SolrCore.initIndex WARN [collection1] Solr index directory '.\org.apache.solr.update.SolrCmdDistributorTest-1385449764971\shard1\data\index' doesn't exist. Creating new index...
   [junit4]   2> 2780936 T7819 oasc.CachingDirectoryFactory.get return new directory for .\org.apache.solr.update.SolrCmdDistributorTest-1385449764971/shard1/data\index
   [junit4]   2> 2780936 T7819 oasc.SolrDeletionPolicy.onCommit SolrDeletionPolicy.onCommit: commits: num=1
   [junit4]   2> 		commit{dir=MockDirectoryWrapper(org.apache.lucene.store.RAMDirectory@4f184be2 lockFactory=org.apache.lucene.store.SingleInstanceLockFactory@18e5e307),segFN=segments_1,generation=1}
   [junit4]   2> 2780937 T7819 oasc.SolrDeletionPolicy.updateCommits newest commit generation = 1
   [junit4]   2> 2780940 T7819 oasup.UpdateRequestProcessorChain.init creating updateRequestProcessorChain "nodistrib"
   [junit4]   2> 2780941 T7819 oasup.UpdateRequestProcessorChain.init creating updateRequestProcessorChain "dedupe"
   [junit4]   2> 2780941 T7819 oasup.UpdateRequestProcessorChain.init inserting DistributedUpdateProcessorFactory into updateRequestProcessorChain "dedupe"
   [junit4]   2> 2780941 T7819 oasup.UpdateRequestProcessorChain.init creating updateRequestProcessorChain "stored_sig"
   [junit4]   2> 2780941 T7819 oasup.UpdateRequestProcessorChain.init inserting DistributedUpdateProcessorFactory into updateRequestProcessorChain "stored_sig"
   [junit4]   2> 2780942 T7819 oasup.UpdateRequestProcessorChain.init creating updateRequestProcessorChain "distrib-dup-test-chain-explicit"
   [junit4]   2> 2780942 T7819 oasup.UpdateRequestProcessorChain.init creating updateRequestProcessorChain "distrib-dup-test-chain-implicit"
   [junit4]   2> 2780942 T7819 oasup.UpdateRequestProcessorChain.init inserting DistributedUpdateProcessorFactory into updateRequestProcessorChain "distrib-dup-test-chain-implicit"
   [junit4]   2> 2780943 T7819 oasc.SolrCore.loadUpdateProcessorChains no updateRequestProcessorChain defined as default, creating implicit default
   [junit4]   2> 2780943 T7819 oasc.RequestHandlers.initHandlersFromConfig created standard: solr.StandardRequestHandler
   [junit4]   2> 2780944 T7819 oasc.RequestHandlers.initHandlersFromConfig created /get: solr.RealTimeGetHandler
   [junit4]   2> 2780944 T7819 oasc.RequestHandlers.initHandlersFromConfig adding lazy requestHandler: solr.ReplicationHandler
   [junit4]   2> 2780944 T7819 oasc.RequestHandlers.initHandlersFromConfig created /replication: solr.ReplicationHandler
   [junit4]   2> 2780945 T7819 oasc.RequestHandlers.initHandlersFromConfig created /update: solr.UpdateRequestHandler
   [junit4]   2> 2780945 T7819 oasc.RequestHandlers.initHandlersFromConfig created /admin/: org.apache.solr.handler.admin.AdminHandlers
   [junit4]   2> 2780946 T7819 oasc.RequestHandlers.initHandlersFromConfig created /admin/file: solr.admin.ShowFileRequestHandler
   [junit4]   2> 2780948 T7819 oashl.XMLLoader.init xsltCacheLifetimeSeconds=60
   [junit4]   2> 2780953 T7819 oasu.CommitTracker.<init> Hard AutoCommit: disabled
   [junit4]   2> 2780953 T7819 oasu.CommitTracker.<init> Soft AutoCommit: disabled
   [junit4]   2> 2780954 T7819 oasc.SolrDeletionPolicy.onInit SolrDeletionPolicy.onInit: commits: num=1
   [junit4]   2> 		commit{dir=MockDirectoryWrapper(org.apache.lucene.store.RAMDirectory@4f184be2 lockFactory=org.apache.lucene.store.SingleInstanceLockFactory@18e5e307),segFN=segments_1,generation=1}
   [junit4]   2> 2780954 T7819 oasc.SolrDeletionPolicy.updateCommits newest commit generation = 1
   [junit4]   2> 2780955 T7819 oass.SolrIndexSearcher.<init> Opening Searcher@1e7dfa3c main
   [junit4]   2> 2780958 T7820 oasc.SolrCore.registerSearcher [collection1] Registered new searcher Searcher@1e7dfa3c main{StandardDirectoryReader(segments_1:1:nrt)}
   [junit4]   2> 2780962 T7819 oasc.CoreContainer.registerCore registering core: collection1
   [junit4]   2> 2780963 T7785 oass.SolrDispatchFilter.init user.dir=C:\Users\JenkinsSlave\workspace\Lucene-Solr-4.x-Windows\solr\build\solr-core\test\J0
   [junit4]   2> 2780963 T7785 oass.SolrDispatchFilter.init SolrDispatchFilter.init() done
   [junit4]   2> 2780965 T7785 oejs.Server.doStart jetty-8.1.10.v20130312
   [junit4]   2> 2780972 T7785 oejs.AbstractConnector.doStart Started SelectChannelConnector@127.0.0.1:62680
   [junit4]   2> 2780972 T7785 oass.SolrDispatchFilter.init SolrDispatchFilter.init()
   [junit4]   2> 2780972 T7785 oasc.SolrResourceLoader.locateSolrHome JNDI not configured for solr (NoInitialContextEx)
   [junit4]   2> 2780972 T7785 oasc.SolrResourceLoader.locateSolrHome using system property solr.solr.home: C:\Users\JenkinsSlave\workspace\Lucene-Solr-4.x-Windows\solr\build\solr-core\test-files\solr
   [junit4]   2> 2780972 T7785 oasc.SolrResourceLoader.<init> new SolrResourceLoader for directory: 'C:\Users\JenkinsSlave\workspace\Lucene-Solr-4.x-Windows\solr\build\solr-core\test-files\solr\'
   [junit4]   2> 2780988 T7785 oasc.ConfigSolr.fromFile Loading container configuration from C:\Users\JenkinsSlave\workspace\Lucene-Solr-4.x-Windows\solr\build\solr-core\test-files\solr\solr.xml
   [junit4]   2> 2781049 T7785 oasc.CoreContainer.<init> New CoreContainer 1636785953
   [junit4]   2> 2781049 T7785 oasc.CoreContainer.load Loading cores into CoreContainer [instanceDir=C:\Users\JenkinsSlave\workspace\Lucene-Solr-4.x-Windows\solr\build\solr-core\test-files\solr\]
   [junit4]   2> 2781051 T7785 oashc.HttpShardHandlerFactory.getParameter Setting socketTimeout to: 90000
   [junit4]   2> 2781051 T7785 oashc.HttpShardHandlerFactory.getParameter Setting urlScheme to: http://
   [junit4]   2> 2781051 T7785 oashc.HttpShardHandlerFactory.getParameter Setting connTimeout to: 15000
   [junit4]   2> 2781051 T7785 oashc.HttpShardHandlerFactory.getParameter Setting maxConnectionsPerHost to: 20
   [junit4]   2> 2781051 T7785 oashc.HttpShardHandlerFactory.getParameter Setting corePoolSize to: 0
   [junit4]   2> 2781051 T7785 oashc.HttpShardHandlerFactory.getParameter Setting maximumPoolSize to: 2147483647
   [junit4]   2> 2781051 T7785 oashc.HttpShardHandlerFactory.getParameter Setting maxThreadIdleTime to: 5
   [junit4]   2> 2781051 T7785 oashc.HttpShardHandlerFactory.getParameter Setting sizeOfQueue to: -1
   [junit4]   2> 2781051 T7785 oashc.HttpShardHandlerFactory.getParameter Setting fairnessPolicy to: false
   [junit4]   2> 2781056 T7785 oasl.LogWatcher.createWatcher SLF4J impl is org.slf4j.impl.Log4jLoggerFactory
   [junit4]   2> 2781056 T7785 oasl.LogWatcher.newRegisteredLogWatcher Registering Log Listener [Log4j (org.slf4j.impl.Log4jLoggerFactory)]
   [junit4]   2> 2781056 T7785 oasc.CoreContainer.load Host Name: 127.0.0.1
   [junit4]   2> 2781062 T7831 oasc.CoreContainer.create Creating SolrCore 'collection1' using instanceDir: C:\Users\JenkinsSlave\workspace\Lucene-Solr-4.x-Windows\solr\build\solr-core\test-files\solr\collection1
   [junit4]   2> 2781063 T7831 oasc.SolrResourceLoader.<init> new SolrResourceLoader for directory: 'C:\Users\JenkinsSlave\workspace\Lucene-Solr-4.x-Windows\solr\build\solr-core\test-files\solr\collection1\'
   [junit4]   2> 2781063 T7831 oasc.SolrResourceLoader.replaceClassLoader Adding 'file:/C:/Users/JenkinsSlave/workspace/Lucene-Solr-4.x-Windows/solr/build/solr-core/test-files/solr/collection1/lib/classes/' to classloader
   [junit4]   2> 2781063 T7831 oasc.SolrResourceLoader.replaceClassLoader Adding 'file:/C:/Users/JenkinsSlave/workspace/Lucene-Solr-4.x-Windows/solr/build/solr-core/test-files/solr/collection1/lib/README' to classloader
   [junit4]   2> 2781118 T7831 oasc.SolrConfig.<init> Using Lucene MatchVersion: LUCENE_47
   [junit4]   2> 2781181 T7831 oasc.SolrConfig.<init> Loaded SolrConfig: solrconfig-tlog.xml
   [junit4]   2> 2781181 T7831 oass.IndexSchema.readSchema Reading Solr Schema from schema.xml
   [junit4]   2> 2781191 T7831 oass.IndexSchema.readSchema [collection1] Schema name=test
   [junit4]   2> 2781819 T7831 oass.ByteField.init WARN ByteField is deprecated and will be removed in 5.0. You should use TrieIntField instead.
   [junit4]   2> 2781821 T7831 oass.ShortField.init WARN ShortField is deprecated and will be removed in 5.0. You should use TrieIntField instead.
   [junit4]   2> 2781821 T7831 oass.OpenExchangeRatesOrgProvider.init Initialized with rates=open-exchange-rates.json, refreshInterval=1440.
   [junit4]   2> 2781829 T7831 oass.IndexSchema.readSchema default search field in schema is text
   [junit4]   2> 2781832 T7831 oass.IndexSchema.readSchema unique key field: id
   [junit4]   2> 2781841 T7831 oass.FileExchangeRateProvider.reload Reloading exchange rates from file currency.xml
   [junit4]   2> 2781844 T7831 oass.FileExchangeRateProvider.reload Reloading exchange rates from file currency.xml
   [junit4]   2> 2781848 T7831 oass.OpenExchangeRatesOrgProvider.reload Reloading exchange rates from open-exchange-rates.json
   [junit4]   2> 2781849 T7831 oass.OpenExchangeRatesOrgProvider$OpenExchangeRates.<init> WARN Unknown key IMPORTANT NOTE
   [junit4]   2> 2781849 T7831 oass.OpenExchangeRatesOrgProvider$OpenExchangeRates.<init> WARN Expected key, got STRING
   [junit4]   2> 2781849 T7831 oass.OpenExchangeRatesOrgProvider.reload Reloading exchange rates from open-exchange-rates.json
   [junit4]   2> 2781850 T7831 oass.OpenExchangeRatesOrgProvider$OpenExchangeRates.<init> WARN Unknown key IMPORTANT NOTE
   [junit4]   2> 2781850 T7831 oass.OpenExchangeRatesOrgProvider$OpenExchangeRates.<init> WARN Expected key, got STRING
   [junit4]   2> 2781850 T7831 oasc.SolrCore.initDirectoryFactory org.apache.solr.core.MockDirectoryFactory
   [junit4]   2> 2781851 T7831 oasc.SolrCore.<init> [collection1] Opening new SolrCore at C:\Users\JenkinsSlave\workspace\Lucene-Solr-4.x-Windows\solr\build\solr-core\test-files\solr\collection1\, dataDir=.\org.apache.solr.update.SolrCmdDistributorTest-1385449764971/shard2/data\
   [junit4]   2> 2781851 T7831 oasc.JmxMonitoredMap.<init> JMX monitoring is enabled. Adding Solr mbeans to JMX Server: com.sun.jmx.mbeanserver.JmxMBeanServer@79891e97
   [junit4]   2> 2781851 T7831 oasc.CachingDirectoryFactory.get return new directory for .\org.apache.solr.update.SolrCmdDistributorTest-1385449764971/shard2/data\
   [junit4]   2> 2781852 T7831 oasc.SolrCore.getNewIndexDir New index directory detected: old=null new=.\org.apache.solr.update.SolrCmdDistributorTest-1385449764971/shard2/data\index/
   [junit4]   2> 2781852 T7831 oasc.SolrCore.initIndex WARN [collection1] Solr index directory '.\org.apache.solr.update.SolrCmdDistributorTest-1385449764971\shard2\data\index' doesn't exist. Creating new index...
   [junit4]   2> 2781852 T7831 oasc.CachingDirectoryFactory.get return new directory for .\org.apache.solr.update.SolrCmdDistributorTest-1385449764971/shard2/data\index
   [junit4]   2> 2781853 T7831 oasc.SolrDeletionPolicy.onCommit SolrDeletionPolicy.onCommit: commits: num=1
   [junit4]   2> 		commit{dir=MockDirectoryWrapper(org.apache.lucene.store.RAMDirectory@65d42890 lockFactory=org.apache.lucene.store.SingleInstanceLockFactory@27f85f50),segFN=segments_1,generation=1}
   [junit4]   2> 2781853 T7831 oasc.SolrDeletionPolicy.updateCommits newest commit generation = 1
   [junit4]   2> 2781856 T7831 oasup.UpdateRequestProcessorChain.init creating updateRequestProcessorChain "nodistrib"
   [junit4]   2> 2781857 T7831 oasup.UpdateRequestProcessorChain.init creating updateRequestProcessorChain "dedupe"
   [junit4]   2> 2781857 T7831 oasup.UpdateRequestProcessorChain.init inserting DistributedUpdateProcessorFactory into updateRequestProcessorChain "dedupe"
   [junit4]   2> 2781857 T7831 oasup.UpdateRequestProcessorChain.init creating updateRequestProcessorChain "stored_sig"
   [junit4]   2> 2781858 T7831 oasup.UpdateRequestProcessorChain.init inserting DistributedUpdateProcessorFactory into updateRequestProcessorChain "stored_sig"
   [junit4]   2> 2781858 T7831 oasup.UpdateRequestProcessorChain.init creating updateRequestProcessorChain "distrib-dup-test-chain-explicit"
   [junit4]   2> 2781858 T7831 oasup.UpdateRequestProcessorChain.init creating updateRequestProcessorChain "distrib-dup-test-chain-implicit"
   [junit4]   2> 2781859 T7831 oasup.UpdateRequestProcessorChain.init inserting DistributedUpdateProcessorFactory into updateRequestProcessorChain "distrib-dup-test-chain-implicit"
   [junit4]   2> 2781859 T7831 oasc.SolrCore.loadUpdateProcessorChains no updateRequestProcessorChain defined as default, creating implicit default
   [junit4]   2> 2781859 T7831 oasc.RequestHandlers.initHandlersFromConfig created standard: solr.StandardRequestHandler
   [junit4]   2> 2781860 T7831 oasc.RequestHandlers.initHandlersFromConfig created /get: solr.RealTimeGetHandler
   [junit4]   2> 2781860 T7831 oasc.RequestHandlers.initHandlersFromConfig adding lazy requestHandler: solr.ReplicationHandler
   [junit4]   2> 2781860 T7831 oasc.RequestHandlers.initHandlersFromConfig created /replication: solr.ReplicationHandler
   [junit4]   2> 2781861 T7831 oasc.RequestHandlers.initHandlersFromConfig created /update: solr.UpdateRequestHandler
   [junit4]   2> 2781861 T7831 oasc.RequestHandlers.initHandlersFromConfig created /admin/: org.apache.solr.handler.admin.AdminHandlers
   [junit4]   2> 2781863 T7831 oasc.RequestHandlers.initHandlersFromConfig created /admin/file: solr.admin.ShowFileRequestHandler
   [junit4]   2> 2781864 T7831 oashl.XMLLoader.init xsltCacheLifetimeSeconds=60
   [junit4]   2> 2781869 T7831 oasu.CommitTracker.<init> Hard AutoCommit: disabled
   [junit4]   2> 2781870 T7831 oasu.CommitTracker.<init> Soft AutoCommit: disabled
   [junit4]   2> 2781871 T7831 oasc.SolrDeletionPolicy.onInit SolrDeletionPolicy.onInit: commits: num=1
   [junit4]   2> 		commit{dir=MockDirectoryWrapper(org.apache.lucene.store.RAMDirectory@65d42890 lockFactory=org.apache.lucene.store.SingleInstanceLockFactory@27f85f50),segFN=segments_1,generation=1}
   [junit4]   2> 2781871 T7831 oasc.SolrDeletionPolicy.updateCommits newest commit generation = 1
   [junit4]   2> 2781871 T7831 oass.SolrIndexSearcher.<init> Opening Searcher@5e55c7ee main
   [junit4]   2> 2781879 T7832 oasc.SolrCore.registerSearcher [collection1] Registered new searcher Searcher@5e55c7ee main{StandardDirectoryReader(segments_1:1:nrt)}
   [junit4]   2> 2781881 T7831 oasc.CoreContainer.registerCore registering core: collection1
   [junit4]   2> 2781882 T7785 oass.SolrDispatchFilter.init user.dir=C:\Users\JenkinsSlave\workspace\Lucene-Solr-4.x-Windows\solr\build\solr-core\test\J0
   [junit4]   2> 2781883 T7785 oass.SolrDispatchFilter.init SolrDispatchFilter.init() done
   [junit4]   2> 2781886 T7785 oejs.Server.doStart jetty-8.1.10.v20130312
   [junit4]   2> 2781893 T7785 oejs.AbstractConnector.doStart Started SelectChannelConnector@127.0.0.1:62683
   [junit4]   2> 2781894 T7785 oass.SolrDispatchFilter.init SolrDispatchFilter.init()
   [junit4]   2> 2781895 T7785 oasc.SolrResourceLoader.locateSolrHome JNDI not configured for solr (NoInitialContextEx)
   [junit4]   2> 2781895 T7785 oasc.SolrResourceLoader.locateSolrHome using system property solr.solr.home: C:\Users\JenkinsSlave\workspace\Lucene-Solr-4.x-Windows\solr\build\solr-core\test-files\solr
   [junit4]   2> 2781895 T7785 oasc.SolrResourceLoader.<init> new SolrResourceLoader for directory: 'C:\Users\JenkinsSlave\workspace\Lucene-Solr-4.x-Windows\solr\build\solr-core\test-files\solr\'
   [junit4]   2> 2781913 T7785 oasc.ConfigSolr.fromFile Loading container configuration from C:\Users\JenkinsSlave\workspace\Lucene-Solr-4.x-Windows\solr\build\solr-core\test-files\solr\solr.xml
   [junit4]   2> 2782005 T7785 oasc.CoreContainer.<init> New CoreContainer 1225767341
   [junit4]   2> 2782005 T7785 oasc.CoreContainer.load Loading cores into CoreContainer [instanceDir=C:\Users\JenkinsSlave\workspace\Lucene-Solr-4.x-Windows\solr\build\solr-core\test-files\solr\]
   [junit4]   2> 2782007 T7785 oashc.HttpShardHandlerFactory.getParameter Setting socketTimeout to: 90000
   [junit4]   2> 2782007 T7785 oashc.HttpShardHandlerFactory.getParameter Setting urlScheme to: http://
   [junit4]   2> 2782007 T7785 oashc.HttpShardHandlerFactory.getParameter Setting connTimeout to: 15000
   [junit4]   2> 2782008 T7785 oashc.HttpShardHandlerFactory.getParameter Setting maxConnectionsPerHost to: 20
   [junit4]   2> 2782008 T7785 oashc.HttpShardHandlerFactory.getParameter Setting corePoolSize to: 0
   [junit4]   2> 2782008 T7785 oashc.HttpShardHandlerFactory.getParameter Setting maximumPoolSize to: 2147483647
   [junit4]   2> 2782008 T7785 oashc.HttpShardHandlerFactory.getParameter Setting maxThreadIdleTime to: 5
   [junit4]   2> 2782009 T7785 oashc.HttpShardHandlerFactory.getParameter Setting sizeOfQueue to: -1
   [junit4]   2> 2782009 T7785 oashc.HttpShardHandlerFactory.getParameter Setting fairnessPolicy to: false
   [junit4]   2> 2782014 T7785 oasl.LogWatcher.createWatcher SLF4J impl is org.slf4j.impl.Log4jLoggerFactory
   [junit4]   2> 2782014 T7785 oasl.LogWatcher.newRegisteredLogWatcher Registering Log Listener [Log4j (org.slf4j.impl.Log4jLoggerFactory)]
   [junit4]   2> 2782015 T7785 oasc.CoreContainer.load Host Name: 127.0.0.1
   [junit4]   2> 2782020 T7843 oasc.CoreContainer.create Creating SolrCore 'collection1' using instanceDir: C:\Users\JenkinsSlave\workspace\Lucene-Solr-4.x-Windows\solr\build\solr-core\test-files\solr\collection1
   [junit4]   2> 2782021 T7843 oasc.SolrResourceLoader.<init> new SolrResourceLoader for directory: 'C:\Users\JenkinsSlave\workspace\Lucene-Solr-4.x-Windows\solr\build\solr-core\test-files\solr\collection1\'
   [junit4]   2> 2782021 T7843 oasc.SolrResourceLoader.replaceClassLoader Adding 'file:/C:/Users/JenkinsSlave/workspace/Lucene-Solr-4.x-Windows/solr/build/solr-core/test-files/solr/collection1/lib/classes/' to classloader
   [junit4]   2> 2782021 T7843 oasc.SolrResourceLoader.replaceClassLoader Adding 'file:/C:/Users/JenkinsSlave/workspace/Lucene-Solr-4.x-Windows/solr/build/solr-core/test-files/solr/collection1/lib/README' to classloader
   [junit4]   2> 2782084 T7843 oasc.SolrConfig.<init> Using Lucene MatchVersion: LUCENE_47
   [junit4]   2> 2782148 T7843 oasc.SolrConfig.<init> Loaded SolrConfig: solrconfig-tlog.xml
   [junit4]   2> 2782148 T7843 oass.IndexSchema.readSchema Reading Solr Schema from schema.xml
   [junit4]   2> 2782157 T7843 oass.IndexSchema.readSchema [collection1] Schema name=test
   [junit4]   2> 2782786 T7843 oass.ByteField.init WARN ByteField is deprecated and will be removed in 5.0. You should use TrieIntField instead.
   [junit4]   2> 2782787 T7843 oass.ShortField.init WARN ShortField is deprecated and will be removed in 5.0. You should use TrieIntField instead.
   [junit4]   2> 2782788 T7843 oass.OpenExchangeRatesOrgProvider.init Initialized with rates=open-exchange-rates.json, refreshInterval=1440.
   [junit4]   2> 2782795 T7843 oass.IndexSchema.readSchema default search field in schema is text
   [junit4]   2> 2782798 T7843 oass.IndexSchema.readSchema unique key field: id
   [junit4]   2> 2782805 T7843 oass.FileExchangeRateProvider.reload Reloading exchange rates from file currency.xml
   [junit4]   2> 2782810 T7843 oass.FileExchangeRateProvider.reload Reloading exchange rates from file currency.xml
   [junit4]   2> 2782814 T7843 oass.OpenExchangeRatesOrgProvider.reload Reloading exchange rates from open-exchange-rates.json
   [junit4]   2> 2782814 T7843 oass.OpenExchangeRatesOrgProvider$OpenExchangeRates.<init> WARN Unknown key IMPORTANT NOTE
   [junit4]   2> 2782814 T7843 oass.OpenExchangeRatesOrgProvider$OpenExchangeRates.<init> WARN Expected key, got STRING
   [junit4]   2> 2782814 T7843 oass.OpenExchangeRatesOrgProvider.reload Reloading exchange rates from open-exchange-rates.json
   [junit4]   2> 2782814 T7843 oass.OpenExchangeRatesOrgProvider$OpenExchangeRates.<init> WARN Unknown key IMPORTANT NOTE
   [junit4]   2> 2782814 T7843 oass.OpenExchangeRatesOrgProvider$OpenExchangeRates.<init> WARN Expected key, got STRING
   [junit4]   2> 2782814 T7843 oasc.SolrCore.initDirectoryFactory org.apache.solr.core.MockDirectoryFactory
   [junit4]   2> 2782816 T7843 oasc.SolrCore.<init> [collection1] Opening new SolrCore at C:\Users\JenkinsSlave\workspace\Lucene-Solr-4.x-Windows\solr\build\solr-core\test-files\solr\collection1\, dataDir=.\org.apache.solr.update.SolrCmdDistributorTest-1385449764971/shard3/data\
   [junit4]   2> 2782816 T7843 oasc.JmxMonitoredMap.<init> JMX monitoring is enabled. Adding Solr mbeans to JMX Server: com.sun.jmx.mbeanserver.JmxMBeanServer@79891e97
   [junit4]   2> 2782817 T7843 oasc.CachingDirectoryFactory.get return new directory for .\org.apache.solr.update.SolrCmdDistributorTest-1385449764971/shard3/data\
   [junit4]   2> 2782817 T7843 oasc.SolrCore.getNewIndexDir New index directory detected: old=null new=.\org.apache.solr.update.SolrCmdDistributorTest-1385449764971/shard3/data\index/
   [junit4]   2> 2782817 T7843 oasc.SolrCore.initIndex WARN [collection1] Solr index directory '.\org.apache.solr.update.SolrCmdDistributorTest-1385449764971\shard3\data\index' doesn't exist. Creating new index...
   [junit4]   2> 2782818 T7843 oasc.CachingDirectoryFactory.get return new directory for .\org.apache.solr.update.SolrCmdDistributorTest-1385449764971/shard3/data\index
   [junit4]   2> 2782818 T7843 oasc.SolrDeletionPolicy.onCommit SolrDeletionPolicy.onCommit: commits: num=1
   [junit4]   2> 		commit{dir=MockDirectoryWrapper(org.apache.lucene.store.RAMDirectory@5da0fb33 lockFactory=org.apache.lucene.store.SingleInstanceLockFactory@7e6f4937),segFN=segments_1,generation=1}
   [junit4]   2> 2782818 T7843 oasc.SolrDeletionPolicy.updateCommits newest commit generation = 1
   [junit4]   2> 2782822 T7843 oasup.UpdateRequestProcessorChain.init creating updateRequestProcessorChain "nodistrib"
   [junit4]   2> 2782822 T7843 oasup.UpdateRequestProcessorChain.init creating updateRequestProcessorChain "dedupe"
   [junit4]   2> 2782822 T7843 oasup.UpdateRequestProcessorChain.init inserting DistributedUpdateProcessorFactory into updateRequestProcessorChain "dedupe"
   [junit4]   2> 2782822 T7843 oasup.UpdateRequestProcessorChain.init creating updateRequestProcessorChain "stored_sig"
   [junit4]   2> 2782823 T7843 oasup.UpdateRequestProcessorChain.init inserting DistributedUpdateProcessorFactory into updateRequestProcessorChain "stored_sig"
   [junit4]   2> 2782823 T7843 oasup.UpdateRequestProcessorChain.init creating updateRequestProcessorChain "distrib-dup-test-chain-explicit"
   [junit4]   2> 2782823 T7843 oasup.UpdateRequestProcessorChain.init creating updateRequestProcessorChain "distrib-dup-test-chain-implicit"
   [junit4]   2> 2782823 T7843 oasup.UpdateRequestProcessorChain.init inserting DistributedUpdateProcessorFactory into updateRequestProcessorChain "distrib-dup-test-chain-implicit"
   [junit4]   2> 2782823 T7843 oasc.SolrCore.loadUpdateProcessorChains no updateRequestProcessorChain defined as default, creating implicit default
   [junit4]   2> 2782823 T7843 oasc.RequestHandlers.initHandlersFromConfig created standard: solr.StandardRequestHandler
   [junit4]   2> 2782824 T7843 oasc.RequestHandlers.initHandlersFromConfig created /get: solr.RealTimeGetHandler
   [junit4]   2> 2782824 T7843 oasc.RequestHandlers.initHandlersFromConfig adding lazy requestHandler: solr.ReplicationHandler
   [junit4]   2> 2782824 T7843 oasc.RequestHandlers.initHandlersFromConfig created /replication: solr.ReplicationHandler
   [junit4]   2> 2782825 T7843 oasc.RequestHandlers.initHandlersFromConfig created /update: solr.UpdateRequestHandler
   [junit4]   2> 2782825 T7843 oasc.RequestHandlers.initHandlersFromConfig created /admin/: org.apache.solr.handler.admin.AdminHandlers
   [junit4]   2> 2782826 T7843 oasc.RequestHandlers.initHandlersFromConfig created /admin/file: solr.admin.ShowFileRequestHandler
   [junit4]   2> 2782826 T7843 oashl.XMLLoader.init xsltCacheLifetimeSeconds=60
   [junit4]   2> 2782836 T7843 oasu.CommitTracker.<init> Hard AutoCommit: disabled
   [junit4]   2> 2782837 T7843 oasu.CommitTracker.<init> Soft AutoCommit: disabled
   [junit4]   2> 2782838 T7843 oasc.SolrDeletionPolicy.onInit SolrDeletionPolicy.onInit: commits: num=1
   [junit4]   2> 		commit{dir=MockDirectoryWrapper(org.apache.lucene.store.RAMDirectory@5da0fb33 lockFactory=org.apache.lucene.store.SingleInstanceLockFactory@7e6f4937),segFN=segments_1,generation=1}
   [junit4]   2> 2782839 T7843 oasc.SolrDeletionPolicy.updateCommits newest commit generation = 1
   [junit4]   2> 2782839 T7843 oass.SolrIndexSearcher.<init> Opening Searcher@7d677d67 main
   [junit4]   2> 2782845 T7844 oasc.SolrCore.registerSearcher [collection1] Registered new searcher Searcher@7d677d67 main{StandardDirectoryReader(segments_1:1:nrt)}
   [junit4]   2> 2782847 T7843 oasc.CoreContainer.registerCore registering core: collection1
   [junit4]   2> 2782848 T7785 oass.SolrDispatchFilter.init user.dir=C:\Users\JenkinsSlave\workspace\Lucene-Solr-4.x-Windows\solr\build\solr-core\test\J0
   [junit4]   2> 2782848 T7785 oass.SolrDispatchFilter.init SolrDispatchFilter.init() done
   [junit4]   2> ASYNC  NEW_CORE C2178 name=collection1 org.apache.solr.core.SolrCore@50e74b7d
   [junit4]   2> 2782862 T7789 C2178 oasup.LogUpdateProcessor.finish [collection1] webapp= path=/update params={version=2&wt=javabin} {deleteByQuery=*:* (-1452749377814659072)} 0 2
   [junit4]   2> ASYNC  NEW_CORE C2179 name=collection1 org.apache.solr.core.SolrCore@2254f171
   [junit4]   2> 2782873 T7806 C2179 oasup.LogUpdateProcessor.finish [collection1] webapp= path=/update params={version=2&wt=javabin} {deleteByQuery=*:* (-1452749377826193408)} 0 2
   [junit4]   2> ASYNC  NEW_CORE C2180 name=collection1 org.apache.solr.core.SolrCore@3fc667a5
   [junit4]   2> 2782887 T7817 C2180 oasup.LogUpdateProcessor.finish [collection1] webapp= path=/update params={version=2&wt=javabin} {deleteByQuery=*:* (-1452749377840873472)} 0 2
   [junit4]   2> ASYNC  NEW_CORE C2181 name=collection1 org.apache.solr.core.SolrCore@793a03ca
   [junit4]   2> 2782901 T7827 C2181 oasup.LogUpdateProcessor.finish [collection1] webapp= path=/update params={version=2&wt=javabin} {deleteByQuery=*:* (-1452749377854504960)} 0 3
   [junit4]   2> ASYNC  NEW_CORE C2182 name=collection1 org.apache.solr.core.SolrCore@4b585cd7
   [junit4]   2> 2782914 T7837 C2182 oasup.LogUpdateProcessor.finish [collection1] webapp= path=/update params={version=2&wt=javabin} {deleteByQuery=*:* (-1452749377869185024)} 0 2
   [junit4]   2> 2782920 T7790 C2178 oasup.LogUpdateProcessor.finish [collection1] webapp= path=/update params={version=2&wt=javabin} {add=[1 (1452749377876525056)]} 0 1
   [junit4]   2> 2782923 T7791 C2178 oasu.DirectUpdateHandler2.commit start commit{,optimize=false,openSearcher=true,waitSearcher=true,expungeDeletes=false,softCommit=false,prepareCommit=false}
   [junit4]   2> 2782924 T7791 C2178 oasc.SolrDeletionPolicy.onCommit SolrDeletionPolicy.onCommit: commits: num=2
   [junit4]   2> 		commit{dir=MockDirectoryWrapper(org.apache.lucene.store.RAMDirectory@2da0594b lockFactory=org.apache.lucene.store.SingleInstanceLockFactory@d068),segFN=segments_1,generation=1}
   [junit4]   2> 		commit{dir=MockDirectoryWrapper(org.apache.lucene.store.RAMDirectory@2da0594b lockFactory=org.apache.lucene.store.SingleInstanceLockFactory@d068),segFN=segments_2,generation=2}
   [junit4]   2> 2782925 T7791 C2178 oasc.SolrDeletionPolicy.updateCommits newest commit generation = 2
   [junit4]   2> 2782926 T7791 C2178 oass.SolrIndexSearcher.<init> Opening Searcher@623a9fbc main
   [junit4]   2> 2782926 T7791 C2178 oasu.DirectUpdateHandler2.commit end_commit_flush
   [junit4]   2> 2782926 T7796 oasc.SolrCore.registerSearcher [collection1] Registered new searcher Searcher@623a9fbc main{StandardDirectoryReader(segments_2:3:nrt _0(4.7):c1)}
   [junit4]   2> 2782927 T7791 C2178 oasup.LogUpdateProcessor.finish [collection1] webapp= path=/update params={commit_end_point=true&version=2&wt=javabin&expungeDeletes=false&waitSearcher=true&commit=true&softCommit=false} {commit=} 0 4
   [junit4]   2> 2782931 T7792 C2178 oasc.SolrCore.execute [collection1] webapp= path=/select params={version=2&wt=javabin&q=*:*} hits=1 status=0 QTime=2 
   [junit4]   2> 2782936 T7801 C2179 oasup.LogUpdateProcessor.finish [collection1] webapp= path=/update params={commit_end_point=true&version=2&wt=javabin} {add=[2 (1452749377892253696), 3 (1452749377893302272), 4 (1452749377893302273)]} 0 2
   [junit4]   2> 2782937 T7793 C2178 oasup.LogUpdateProcessor.finish [collection1] webapp= path=/update params={commit_end_point=true&version=2&wt=javabin} {add=[2 (1452749377892253696), 3 (1452749377895399424)]} 0 3
   [junit4]   2> 2782940 T7794 C2178 oasu.DirectUpdateHandler2.commit start commit{,optimize=false,openSearcher=true,waitSearcher=true,expungeDeletes=false,softCommit=false,prepareCommit=false}
   [junit4]   2> 2782943 T7794 C2178 oasc.SolrDeletionPolicy.onCommit SolrDeletionPolicy.onCommit: commits: num=2
   [junit4]   2> 		commit{dir=MockDirectoryWrapper(org.apache.lucene.store.RAMDirectory@2da0594b lockFactory=org.apache.lucene.store.SingleInstanceLockFactory@d068),segFN=segments_2,generation=2}
   [junit4]   2> 		commit{dir=MockDirectoryWrapper(org.apache.lucene.store.RAMDirectory@2da0594b lockFactory=org.apache.lucene.store.SingleInstanceLockFactory@d068),segFN=segments_3,generation=3}
   [junit4]   2> 2782943 T7794 C2178 oasc.SolrDeletionPolicy.updateCommits newest commit generation = 3
   [junit4]   2> 2782944 T7794 C2178 oass.SolrIndexSearcher.<init> Opening Searcher@4befaec2 main
   [junit4]   2> 2782945 T7794 C2178 oasu.DirectUpdateHandler2.commit end_commit_flush
   [junit4]   2> 2782946 T7796 oasc.SolrCore.registerSearcher [collection1] Registered new searcher Searcher@4befaec2 main{StandardDirectoryReader(segments_3:5:nrt _0(4.7):c1 _1(4.7):c2)}
   [junit4]   2> 2782948 T7794 C2178 oasup.LogUpdateProcessor.finish [collection1] webapp= path=/update params={commit_end_point=true&version=2&wt=javabin&expungeDeletes=false&waitSearcher=true&commit=true&softCommit=false} {commit=} 0 8
   [junit4]   2> 2782951 T7802 C2179 oasu.DirectUpdateHandler2.commit start commit{,optimize=false,openSearcher=true,waitSearcher=true,expungeDeletes=false,softCommit=false,prepareCommit=false}
   [junit4]   2> 2782952 T7802 C2179 oasc.SolrDeletionPolicy.onCommit SolrDeletionPolicy.onCommit: commits: num=2
   [junit4]   2> 		commit{dir=MockDirectoryWrapper(org.apache.lucene.store.RAMDirectory@342145c2 lockFactory=org.apache.lucene.store.SingleInstanceLockFactory@50243bba),segFN=segments_1,generation=1}
   [junit4]   2> 		commit{dir=MockDirectoryWrapper(org.apache.lucene.store.RAMDirectory@342145c2 lockFactory=org.apache.lucene.store.SingleInstanceLockFactory@50243bba),segFN=segments_2,generation=2}
   [junit4]   2> 2782953 T7802 C2179 oasc.SolrDeletionPolicy.updateCommits newest commit generation = 2
   [junit4]   2> 2782953 T7802 C2179 oass.SolrIndexSearcher.<init> Opening Searcher@60d6f84d main
   [junit4]   2> 2782956 T7802 C2179 oasu.DirectUpdateHandler2.commit end_commit_flush
   [junit4]   2> 2782956 T7808 oasc.SolrCore.registerSearcher [collection1] Registered new searcher Searcher@60d6f84d main{StandardDirectoryReader(segments_2:3:nrt _0(4.7):c3)}
   [junit4]   2> 2782957 T7802 C2179 oasup.LogUpdateProcessor.finish [collection1] webapp= path=/update params={commit_end_point=true&version=2&wt=javabin&expungeDeletes=false&waitSearcher=true&commit=true&softCommit=false} {commit=} 0 6
   [junit4]   2> 2782960 T7789 C2178 oasc.SolrCore.execute [collection1] webapp= path=/select params={version=2&wt=javabin&q=*:*} hits=3 status=0 QTime=1 
   [junit4]   2> 2782963 T7803 C2179 oasc.SolrCore.execute [collection1] webapp= path=/select params={version=2&wt=javabin&q=*:*} hits=3 status=0 QTime=1 
   [junit4]   2> 2782969 T7790 C2178 oasup.LogUpdateProcessor.finish [collection1] webapp= path=/update params={commit_end_point=true&version=2&wt=javabin} {delete=[3 (-1452749377925808128)]} 0 3
   [junit4]   2> 2782971 T7804 C2179 oasup.LogUpdateProcessor.finish [collection1] webapp= path=/update params={commit_end_point=true&version=2&wt=javabin} {delete=[3 (-1452749377925808128)]} 0 5
   [junit4]   2> 2782975 T7791 C2178 oasu.DirectUpdateHandler2.commit start commit{,optimize=false,openSearcher=true,waitSearcher=true,expungeDeletes=false,softCommit=false,prepareCommit=false}
   [junit4]   2> 2782976 T7791 C2178 oasc.SolrDeletionPolicy.onCommit SolrDeletionPolicy.onCommit: commits: num=2
   [junit4]   2> 		commit{dir=MockDirectoryWrapper(org.apache.lucene.store.RAMDirectory@2da0594b lockFactory=org.apache.lucene.store.SingleInstanceLockFactory@d068),segFN=segments_3,generation=3}
   [junit4]   2> 		commit{dir=MockDirectoryWrapper(org.apache.lucene.store.RAMDirectory@2da0594b lockFactory=org.apache.lucene.store.SingleInstanceLockFactory@d068),segFN=segments_4,generation=4}
   [junit4]   2> 2782977 T7791 C2178 oasc.SolrDeletionPolicy.updateCommits newest commit generation = 4
   [junit4]   2> 2782978 T7791 C2178 oass.SolrIndexSearcher.<init> Opening Searcher@3361d4b0 main
   [junit4]   2> 2782979 T7791 C2178 oasu.DirectUpdateHandler2.commit end_commit_flush
   [junit4]   2> 2782979 T7796 oasc.SolrCore.registerSearcher [collection1] Registered new searcher Searcher@3361d4b0 main{StandardDirectoryReader(segments_4:6:nrt _0(4.7):c1 _1(4.7):c2/1:delGen=1)}
   [junit4]   2> 2782979 T7791 C2178 oasup.LogUpdateProcessor.finish [collection1] webapp= path=/update params={commit_end_point=true&version=2&wt=javabin&expungeDeletes=false&waitSearcher=true&commit=true&softCommit=false} {commit=} 0 5
   [junit4]   2> 2782984 T7805 C2179 oasu.DirectUpdateHandler2.commit start commit{,optimize=false,openSearcher=true,waitSearcher=true,expungeDeletes=false,softCommit=false,prepareCommit=false}
   [junit4]   2> 2782986 T7805 C2179 oasc.SolrDeletionPolicy.onCommit SolrDeletionPolicy.onCommit: commits: num=2
   [junit4]   2> 		commit{dir=MockDirectoryWrapper(org.apache.lucene.store.RAMDirectory@342145c2 lockFactory=org.apache.lucene.store.SingleInstanceLockFactory@50243bba),segFN=segments_2,generation=2}
   [junit4]   2> 		commit{dir=MockDirectoryWrapper(org.apache.lucene.store.RAMDirectory@342145c2 lockFactory=org.apache.lucene.store.SingleInstanceLockFactory@50243bba),segFN=segments_3,generation=3}
   [junit4]   2> 2782987 T7805 C2179 oasc.SolrDeletionPolicy.updateCommits newest commit generation = 3
   [junit4]   2> 2782990 T7805 C2179 oass.SolrIndexSearcher.<init> Opening Searcher@e9e53a9 main
   [junit4]   2> 2782991 T7805 C2179 oasu.DirectUpdateHandler2.commit end_commit_flush
   [junit4]   2> 2782991 T7808 oasc.SolrCore.registerSearcher [collection1] Registered new searcher Searcher@e9e53a9 main{StandardDirectoryReader(segments_3:4:nrt _0(4.7):c3/1:delGen=1)}
   [junit4]   2> 2782994 T7805 C2179 oasup.LogUpdateProcessor.finish [collection1] webapp= path=/update params={commit_end_point=true&version=2&wt=javabin&expungeDeletes=false&waitSearcher=true&commit=true&softCommit=false} {commit=} 0 10
   [junit4]   2> 2782998 T7792 C2178 oasc.SolrCore.execute [collection1] webapp= path=/select params={version=2&wt=javabin&q=*:*} hits=2 status=0 QTime=0 
   [junit4]   2> 2783002 T7806 C2179 oasc.SolrCore.execute [collection1] webapp= path=/select params={version=2&wt=javabin&q=*:*} hits=2 status=0 QTime=0 
   [junit4]   2> 2783006 T7801 C2179 oasu.DirectUpdateHandler2.commit start commit{,optimize=true,openSearcher=true,waitSearcher=true,expungeDeletes=false,softCommit=false,prepareCommit=false}
   [junit4]   2> 2783016 T7801 C2179 oasc.SolrDeletionPolicy.onCommit SolrDeletionPolicy.onCommit: commits: num=2
   [junit4]   2> 		commit{dir=MockDirectoryWrapper(org.apache.lucene.store.RAMDirectory@342145c2 lockFactory=org.apache.lucene.store.SingleInstanceLockFactory@50243bba),segFN=segments_3,generation=3}
   [junit4]   2> 		commit{dir=MockDirectoryWrapper(org.apache.lucene.store.RAMDirectory@342145c2 lockFactory=org.apache.lucene.store.SingleInstanceLockFactory@50243bba),segFN=segments_4,generation=4}
   [junit4]   2> 2783016 T7801 C2179 oasc.SolrDeletionPolicy.updateCommits newest commit generation = 4
   [junit4]   2> 2783018 T7801 C2179 oass.SolrIndexSearcher.<init> Opening Searcher@3f5707a6 main
   [junit4]   2> 2783018 T7801 C2179 oasu.DirectUpdateHandler2.commit end_commit_flush
   [junit4]   2> 2783021 T7808 oasc.SolrCore.registerSearcher [collection1] Registered new searcher Searcher@3f5707a6 main{StandardDirectoryReader(segments_4:6:nrt _1(4.7):c2)}
   [junit4]   2> 2783023 T7801 C2179 oasup.LogUpdateProcessor.finish [collection1] webapp= path=/update params={version=2&maxSegments=1&wt=javabin&waitSearcher=true&optimize=true} {optimize=} 0 17
   [junit4]   2> 2783026 T7818 C2180 oasu.DirectUpdateHandler2.commit start commit{,optimize=true,openSearcher=true,waitSearcher=true,expungeDeletes=false,softCommit=false,prepareCommit=false}
   [junit4]   2> 2783027 T7818 C2180 oasu.DirectUpdateHandler2.commit No uncommitted changes. Skipping IW.commit.
   [junit4]   2> 2783027 T7818 C2180 oass.SolrIndexSearcher.<init> Opening Searcher@25c2b2e6 main
   [junit4]   2> 2783028 T7818 C2180 oasu.DirectUpdateHandler2.commit end_commit_flush
   [junit4]   2> 2783029 T7820 oasc.SolrCore.registerSearcher [collection1] Registered new searcher Searcher@25c2b2e6 main{StandardDirectoryReader(segments_1:1:nrt)}
   [junit4]   2> 2783031 T7818 C2180 oasup.LogUpdateProcessor.finish [collection1] webapp= path=/update params={version=2&maxSegments=1&wt=javabin&waitSearcher=true&optimize=true} {optimize=} 0 5
   [junit4]   2> 2783035 T7828 C2181 oasu.DirectUpdateHandler2.commit start commit{,optimize=true,openSearcher=true,waitSearcher=true,expungeDeletes=false,softCommit=false,prepareCommit=false}
   [junit4]   2> 2783035 T7828 C2181 oasu.DirectUpdateHandler2.commit No uncommitted changes. Skipping IW.commit.
   [junit4]   2> 2783036 T7828 C2181 oass.SolrIndexSearcher.<init> Opening Searcher@1a0e0fc9 main
   [junit4]   2> 2783038 T7828 C2181 oasu.DirectUpdateHandler2.commit end_commit_flush
   [junit4]   2> 2783038 T7832 oasc.SolrCore.registerSearcher [collection1] Registered new searcher Searcher@1a0e0fc9 main{StandardDirectoryReader(segments_1:1:nrt)}
   [junit4]   2> 2783039 T7828 C2181 oasup.LogUpdateProcessor.finish [collection1] webapp= path=/update params={version=2&maxSegments=1&wt=javabin&waitSearcher=true&optimize=true} {optimize=} 0 4
   [junit4]   2> 2783043 T7839 C2182 oasu.DirectUpdateHandler2.commit start commit{,optimize=true,openSearcher=true,waitSearcher=true,expungeDeletes=false,softCommit=false,prepareCommit=false}
   [junit4]   2> 2783043 T7839 C2182 oasu.DirectUpdateHandler2.commit No uncommitted changes. Skipping IW.commit.
   [junit4]   2> 2783044 T7839 C2182 oass.SolrIndexSearcher.<init> Opening Searcher@7c43c3b3 main
   [junit4]   2> 2783045 T7839 C2182 oasu.DirectUpdateHandler2.commit end_commit_flush
   [junit4]   2> 2783046 T7844 oasc.SolrCore.registerSearcher [collection1] Registered new searcher Searcher@7c43c3b3 main{StandardDirectoryReader(segments_1:1:nrt)}
   [junit4]   2> 2783047 T7839 C2182 oasup.LogUpdateProcessor.finish [collection1] webapp= path=/update params={version=2&maxSegments=1&wt=javabin&waitSearcher=true&optimize=true} {optimize=} 0 4
   [junit4]   2> 2783105 T7813 C2180 oasup.LogUpdateProcessor.finish [collection1] webapp= path=/update params={version=2&wt=javabin} {add=[5 (1452749378033811456), 6 (1452749378048491520), 12 (1452749378048491521), 19 (1452749378050588672), 20 (1452749378051637248), 21 (1452749378051637249), 23 (1452749378051637250), 26 (1452749378051637251), 28 (1452749378051637252), 31 (1452749378052685824), ... (91 adds)]} 0 36
   [junit4]   2> 2783136 T7814 C2180 oasup.LogUpdateProcessor.finish [collection1] webapp= path=/update params={version=2&wt=javabin} {add=[188 (1452749378079948800), 190 (1452749378079948801), 195 (1452749378079948802), 196 (1452749378079948803), 197 (1452749378079948804), 199 (1452749378079948805), 201 (1452749378079948806), 203 (1452749378080997376), 205 (1452749378082045952), 206 (1452749378082045953), ... (104 adds)]} 0 23
   [junit4]   2> 2783143 T7802 C2179 oasup.LogUpdateProcessor.finish [collection1] webapp= path=/update params={version=2&wt=javabin} {add=[5 (1452749378023325696), 8 (1452749378049540096), 9 (1452749378050588672), 10 (1452749378051637248), 11 (1452749378056880128), 12 (1452749378056880129), 14 (1452749378056880130), 17 (1452749378056880131), 18 (1452749378056880132), 19 (1452749378058977280), ... (88 adds)]} 0 84
   [junit4]   2> 2783164 T7840 C2182 oasup.LogUpdateProcessor.finish [collection1] webapp= path=/update params={version=2&wt=javabin} {add=[5 (1452749378048491520), 9 (1452749378051637248), 10 (1452749378051637249), 12 (1452749378052685824), 14 (1452749378052685825), 15 (1452749378052685826), 16 (1452749378056880128), 18 (1452749378056880129), 19 (1452749378056880130), 20 (1452749378057928704), ... (188 adds)]} 0 81
   [junit4]   2> 2783168 T7842 C2182 oasup.LogUpdateProcessor.finish [collection1] webapp= path=/update params={version=2&wt=javabin} {add=[394 (1452749378137620480), 395 (1452749378137620481)]} 0 0
   [junit4]   2> 2783175 T7830 C2181 oasup.LogUpdateProcessor.finish [collection1] webapp= path=/update params={version=2&wt=javabin} {add=[5 (1452749378050588672), 6 (1452749378053734400), 8 (1452749378053734401), 10 (1452749378053734402), 11 (1452749378053734403), 12 (1452749378055831552), 13 (1452749378056880128), 14 (1452749378056880129), 15 (1452749378056880130), 16 (1452749378058977280), ... (195 adds)]} 0 90
   [junit4]   2> 2783178 T7803 C2179 oasup.LogUpdateProcessor.finish [collection1] webapp= path=/update params={version=2&wt=javabin} {add=[188 (1452749378118746112), 191 (1452749378118746113), 192 (1452749378119794688), 193 (1452749378119794689), 194 (1452749378120843264), 195 (1452749378120843265), 197 (1452749378120843266), 198 (1452749378122940416), 201 (1452749378123988992), 204 (1452749378123988993), ... (100 adds)]} 0 28
   [junit4]   2> 2783181 T7825 C2181 oasup.LogUpdateProcessor.finish [collection1] webapp= path=/update params={version=2&wt=javabin} {add=[389 (1452749378151251968), 392 (1452749378151251969), 393 (1452749378151251970), 394 (1452749378151251971), 395 (1452749378151251972)]} 0 0
   [junit4]   2> 2783184 T7804 C2179 oasu.DirectUpdateHandler2.commit start commit{,optimize=false,openSearcher=true,waitSearcher=true,expungeDeletes=false,softCommit=false,prepareCommit=false}
   [junit4]   2> 2783191 T7804 C2179 oasc.SolrDeletionPolicy.onCommit SolrDeletionPolicy.onCommit: commits: num=2
   [junit4]   2> 		commit{dir=MockDirectoryWrapper(org.apache.lucene.store.RAMDirectory@342145c2 lockFactory=org.apache.lucene.store.SingleInstanceLockFactory@50243bba),segFN=segments_4,generation=4}
   [junit4]   2> 		commit{dir=MockDirectoryWrapper(org.apache.lucene.store.RAMDirectory@342145c2 lockFactory=org.apache.lucene.store.SingleInstanceLockFactory@50243bba),segFN=segments_5,generation=5}
   [junit4]   2> 2783191 T7804 C2179 oasc.SolrDeletionPolicy.updateCommits newest commit generation = 5
   [junit4]   2> 2783192 T7804 C2179 oass.SolrIndexSearcher.<init> Opening Searcher@4a7334ee main
   [junit4]   2> 2783193 T7808 oasc.SolrCore.registerSearcher [collection1] Registered new searcher Searcher@4a7334ee main{StandardDirectoryReader(segments_5:8:nrt _1(4.7):c2 _2(4.7):c188)}
   [junit4]   2> 2783194 T7804 C2179 oasu.DirectUpdateHandler2.commit end_commit_flush
   [junit4]   2> 2783195 T7804 C2179 oasup.LogUpdateProcessor.finish [collection1] webapp= path=/update params={commit_end_point=true&version=2&wt=javabin&expungeDeletes=false&waitSearcher=true&commit=true&softCommit=false} {commit=} 0 11
   [junit4]   2> 2783198 T7815 C2180 oasu.DirectUpdateHandler2.commit start commit{,optimize=false,openSearcher=true,waitSearcher=true,expungeDeletes=false,softCommit=false,prepareCommit=false}
   [junit4]   2> 2783205 T7815 C2180 oasc.SolrDeletionPolicy.onCommit SolrDeletionPolicy.onCommit: commits: num=2
   [junit4]   2> 		commit{dir=MockDirectoryWrapper(org.apache.lucene.store.RAMDirectory@4f184be2 lockFactory=org.apache.lucene.store.SingleInstanceLockFactory@18e5e307),segFN=segments_1,generation=1}
   [junit4]   2> 		commit{dir=MockDirectoryWrapper(org.apache.lucene.store.RAMDirectory@4f184be2 lockFactory=org.apache.lucene.store.SingleInstanceLockFactory@18e5e307),segFN=segments_2,generation=2}
   [junit4]   2> 2783206 T7815 C2180 oasc.SolrDeletionPolicy.updateCommits newest commit generation = 2
   [junit4]   2> 2783208 T7815 C2180 oass.SolrIndexSearcher.<init> Opening Searcher@7d75f59a main
   [junit4]   2> 2783208 T7820 oasc.SolrCore.registerSearcher [collection1] Registered new searcher Searcher@7d75f59a main{StandardDirectoryReader(segments_2:3:nrt _0(4.7):c195)}
   [junit4]   2> 2783210 T7815 C2180 oasu.DirectUpdateHandler2.commit end_commit_flush
   [junit4]   2> 2783210 T7815 C2180 oasup.LogUpdateProcessor.finish [collection1] webapp= path=/update params={commit_end_point=true&version=2&wt=javabin&expungeDeletes=false&waitSearcher=true&commit=true&softCommit=false} {commit=} 0 13
   [junit4]   2> 2783213 T7826 C2181 oasu.DirectUpdateHandler2.commit start commit{,optimize=false,openSearcher=true,waitSearcher=true,expungeDeletes=false,softCommit=false,prepareCommit=false}
   [junit4]   2> 2783223 T7826 C2181 oasc.SolrDeletionPolicy.onCommit SolrDeletionPolicy.onCommit: commits: num=2
   [junit4]   2> 		commit{dir=MockDirectoryWrapper(org.apache.lucene.store.RAMDirectory@65d42890 lockFactory=org.apache.lucene.store.SingleInstanceLockFactory@27f85f50),segFN=segments_1,generation=1}
   [junit4]   2> 		commit{dir=MockDirectoryWrapper(org.apache.lucene.store.RAMDirectory@65d42890 lockFactory=org.apache.lucene.store.SingleInstanceLockFactory@27f85f50),segFN=segments_2,generation=2}
   [junit4]   2> 2783224 T7826 C2181 oasc.SolrDeletionPolicy.updateCommits newest commit generation = 2
   [junit4]   2> 2783225 T7826 C2181 oass.SolrIndexSearcher.<init> Opening Searcher@715acd44 main
   [junit4]   2> 2783226 T7832 oasc.SolrCore.registerSearcher [collection1] Registered new searcher Searcher@715acd44 main{StandardDirectoryReader(segments_2:3:nrt _0(4.7):c200)}
   [junit4]   2> 2783227 T7826 C2181 oasu.DirectUpdateHandler2.commit end_commit_flush
   [junit4]   2> 2783227 T7826 C2181 oasup.LogUpdateProcessor.finish [collection1] webapp= path=/update params={commit_end_point=true&version=2&wt=javabin&expungeDeletes=false&waitSearcher=true&commit=true&softCommit=false} {commit=} 0 14
   [junit4]   2> 2783230 T7838 C2182 oasu.DirectUpdateHandler2.commit start commit{,optimize=false,openSearcher=true,waitSearcher=true,expungeDeletes=false,softCommit=false,prepareCommit=false}
   [junit4]   2> 2783241 T7838 C2182 oasc.SolrDeletionPolicy.onCommit SolrDeletionPolicy.onCommit: commits: num=2
   [junit4]   2> 		commit{dir=MockDirectoryWrapper(org.apache.lucene.store.RAMDirectory@5da0fb33 lockFactory=org.apache.lucene.store.SingleInstanceLockFactory@7e6f4937),segFN=segments_1,generation=1}
   [junit4]   2> 		commit{dir=MockDirectoryWrapper(org.apache.lucene.store.RAMDirectory@5da0fb33 lockFactory=org.apache.lucene.store.SingleInstanceLockFactory@7e6f4937),segFN=segments_2,generation=2}
   [junit4]   2> 2783241 T7838 C2182 oasc.SolrDeletionPolicy.updateCommits newest commit generation = 2
   [junit4]   2> 2783242 T7838 C2182 oass.SolrIndexSearcher.<init> Opening Searcher@13ce07f9 main
   [junit4]   2> 2783244 T7844 oasc.SolrCore.registerSearcher [collection1] Registered new searcher Searcher@13ce07f9 main{StandardDirectoryReader(segments_2:3:nrt _0(4.7):c190)}
   [junit4]   2> 2783245 T7838 C2182 oasu.DirectUpdateHandler2.commit end_commit_flush
   [junit4]   2> 2783246 T7838 C2182 oasup.LogUpdateProcessor.finish [collection1] webapp= path=/update params={commit_end_point=true&version=2&wt=javabin&expungeDeletes=false&waitSearcher=true&commit=true&softCommit=false} {commit=} 0 16
   [junit4]   2> 2784184 T7805 C2179 oasc.SolrCore.execute [collection1] webapp= path=/admin/luke params={version=2&wt=javabin} status=0 QTime=928 
   [junit4]   2> 2784204 T7817 C2180 oasc.SolrCore.execute [collection1] webapp= path=/admin/luke params={version=2&wt=javabin} status=0 QTime=15 
   [junit4]   2> 2784219 T7829 C2181 oasc.SolrCore.execute [collection1] webapp= path=/admin/luke params={version=2&wt=javabin} status=0 QTime=12 
   [junit4]   2> 2784232 T7839 C2182 oasc.SolrCore.execute [collection1] webapp= path=/admin/luke params={version=2&wt=javabin} status=0 QTime=11 
   [junit4]   2> 2784243 T7785 oasc.SolrException.log ERROR java.net.ConnectException
   [junit4]   2> 		at org.apache.solr.update.MockStreamingSolrServers.exception(MockStreamingSolrServers.java:55)
   [junit4]   2> 		at org.apache.solr.update.MockStreamingSolrServers.access$100(MockStreamingSolrServers.java:30)
   [junit4]   2> 		at org.apache.solr.update.MockStreamingSolrServers$MockSolrServer.request(MockStreamingSolrServers.java:75)
   [junit4]   2> 		at org.apache.solr.update.SolrCmdDistributor.submit(SolrCmdDistributor.java:234)
   [junit4]   2> 		at org.apache.solr.update.SolrCmdDistributor.distribAdd(SolrCmdDistributor.java:183)
   [junit4]   2> 		at org.apache.solr.update.SolrCmdDistributor.distribAdd(SolrCmdDistributor.java:174)
   [junit4]   2> 		at org.apache.solr.update.SolrCmdDistributorTest.testMaxRetries(SolrCmdDistributorTest.java:347)
   [junit4]   2> 		at org.apache.solr.update.SolrCmdDistributorTest.doTest(SolrCmdDistributorTest.java:319)
   [junit4]   2> 		at org.apache.solr.BaseDistributedSearchTestCase.testDistribSearch(BaseDistributedSearchTestCase.java:835)
   [junit4]   2> 		at sun.reflect.NativeMethodAccessorImpl.invoke0(Native Method)
   [junit4]   2> 		at sun.reflect.NativeMethodAccessorImpl.invoke(NativeMethodAccessorImpl.java:57)
   [junit4]   2> 		at sun.reflect.DelegatingMethodAccessorImpl.invoke(DelegatingMethodAccessorImpl.java:43)
   [junit4]   2> 		at java.lang.reflect.Method.invoke(Method.java:606)
   [junit4]   2> 		at com.carrotsearch.randomizedtesting.RandomizedRunner.invoke(RandomizedRunner.java:1559)
   [junit4]   2> 		at com.carrotsearch.randomizedtesting.RandomizedRunner.access$600(RandomizedRunner.java:79)
   [junit4]   2> 		at com.carrotsearch.randomizedtesting.RandomizedRunner$6.evaluate(RandomizedRunner.java:737)
   [junit4]   2> 		at com.carrotsearch.randomizedtesting.RandomizedRunner$7.evaluate(RandomizedRunner.java:773)
   [junit4]   2> 		at com.carrotsearch.randomizedtesting.RandomizedRunner$8.evaluate(RandomizedRunner.java:787)
   [junit4]   2> 		at com.carrotsearch.randomizedtesting.rules.SystemPropertiesRestoreRule$1.evaluate(SystemPropertiesRestoreRule.java:53)
   [junit4]   2> 		at org.apache.lucene.util.TestRuleSetupTeardownChained$1.evaluate(TestRuleSetupTeardownChained.java:50)
   [junit4]   2> 		at org.apache.lucene.util.TestRuleFieldCacheSanity$1.evaluate(TestRuleFieldCacheSanity.java:51)
   [junit4]   2> 		at org.apache.lucene.util.AbstractBeforeAfterRule$1.evaluate(AbstractBeforeAfterRule.java:46)
   [junit4]   2> 		at com.carrotsearch.randomizedtesting.rules.SystemPropertiesInvariantRule$1.evaluate(SystemPropertiesInvariantRule.java:55)
   [junit4]   2> 		at org.apache.lucene.util.TestRuleThreadAndTestName$1.evaluate(TestRuleThreadAndTestName.java:49)
   [junit4]   2> 		at org.apache.lucene.util.TestRuleIgnoreAfterMaxFailures$1.evaluate(TestRuleIgnoreAfterMaxFailures.java:70)
   [junit4]   2> 		at org.apache.lucene.util.TestRuleMarkFailure$1.evaluate(TestRuleMarkFailure.java:48)
   [junit4]   2> 		at com.carrotsearch.randomizedtesting.rules.StatementAdapter.evaluate(StatementAdapter.java:36)
   [junit4]   2> 		at com.carrotsearch.randomizedtesting.ThreadLeakControl$StatementRunner.run(ThreadLeakControl.java:358)
   [junit4]   2> 		at com.carrotsearch.randomizedtesting.ThreadLeakControl.forkTimeoutingTask(ThreadLeakControl.java:782)
   [junit4]   2> 		at com.carrotsearch.randomizedtesting.ThreadLeakControl$3.evaluate(ThreadLeakControl.java:442)
   [junit4]   2> 		at com.carrotsearch.randomizedtesting.RandomizedRunner.runSingleTest(RandomizedRunner.java:746)
   [junit4]   2> 		at com.carrotsearch.randomizedtesting.RandomizedRunner$3.evaluate(RandomizedRunner.java:648)
   [junit4]   2> 		at com.carrotsearch.randomizedtesting.RandomizedRunner$4.evaluate(RandomizedRunner.java:682)
   [junit4]   2> 		at com.carrotsearch.randomizedtesting.RandomizedRunner$5.evaluate(RandomizedRunner.java:693)
   [junit4]   2> 		at com.carrotsearch.randomizedtesting.rules.StatementAdapter.evaluate(StatementAdapter.java:36)
   [junit4]   2> 		at com.carrotsearch.randomizedtesting.rules.SystemPropertiesRestoreRule$1.evaluate(SystemPropertiesRestoreRule.java:53)
   [junit4]   2> 		at org.apache.lucene.util.AbstractBeforeAfterRule$1.evaluate(AbstractBeforeAfterRule.java:46)
   [junit4]   2> 		at org.apache.lucene.util.TestRuleStoreClassName$1.evaluate(TestRuleStoreClassName.java:42)
   [junit4]   2> 		at com.carrotsearch.randomizedtesting.rules.SystemPropertiesInvariantRule$1.evaluate(SystemPropertiesInvariantRule.java:55)
   [junit4]   2> 		at com.carrotsearch.randomizedtesting.rules.NoShadowingOrOverridesOnMethodsRule$1.evaluate(NoShadowingOrOverridesOnMethodsRule.java:39)
   [junit4]   2> 		at com.carrotsearch.randomizedtesting.rules.NoShadowingOrOverridesOnMethodsRule$1.evaluate(NoShadowingOrOverridesOnMethodsRule.java:39)
   [junit4]   2> 		at com.carrotsearch.randomizedtesting.rules.StatementAdapter.evaluate(StatementAdapter.java:36)
   [junit4]   2> 		at org.apache.lucene.util.TestRuleAssertionsRequired$1.evaluate(TestRuleAssertionsRequired.java:43)
   [junit4]   2> 		at org.apache.lucene.util.TestRuleMarkFailure$1.evaluate(TestRuleMarkFailure.java:48)
   [junit4]   2> 		at org.apache.lucene.util.TestRuleIgnoreAfterMaxFailures$1.evaluate(TestRuleIgnoreAfterMaxFailures.java:70)
   [junit4]   2> 		at org.apache.lucene.util.TestRuleIgnoreTestSuites$1.evaluate(TestRuleIgnoreTestSuites.java:55)
   [junit4]   2> 		at com.carrotsearch.randomizedtesting.rules.StatementAdapter.evaluate(StatementAdapter.java:36)
   [junit4]   2> 		at com.carrotsearch.randomizedtesting.ThreadLeakControl$StatementRunner.run(ThreadLeakControl.java:358)
   [junit4]   2> 		at java.lang.Thread.run(Thread.java:744)
   [junit4]   2> 	
   [junit4]   2> 2784244 T7785 oasc.SolrException.log ERROR forwarding update to http://127.0.0.1:62674/ failed - retrying ... retries: 1
   [junit4]   2> 2784245 T7785 oasc.SolrException.log ERROR java.net.ConnectException
   [junit4]   2> 		at org.apache.solr.update.MockStreamingSolrServers.exception(MockStreamingSolrServers.java:55)
   [junit4]   2> 		at org.apache.solr.update.MockStreamingSolrServers.access$100(MockStreamingSolrServers.java:30)
   [junit4]   2> 		at org.apache.solr.update.MockStreamingSolrServers$MockSolrServer.request(MockStreamingSolrServers.java:75)
   [junit4]   2> 		at org.apache.solr.update.SolrCmdDistributor.submit(SolrCmdDistributor.java:234)
   [junit4]   2> 		at org.apache.solr.update.SolrCmdDistributor.doRetriesIfNeeded(SolrCmdDistributor.java:145)
   [junit4]   2> 		at org.apache.solr.update.SolrCmdDistributor.finish(SolrCmdDistributor.java:71)
   [junit4]   2> 		at org.apache.solr.update.SolrCmdDistributorTest.testMaxRetries(SolrCmdDistributorTest.java:348)
   [junit4]   2> 		at org.apache.solr.update.SolrCmdDistributorTest.doTest(SolrCmdDistributorTest.java:319)
   [junit4]   2> 		at org.apache.solr.BaseDistributedSearchTestCase.testDistribSearch(BaseDistributedSearchTestCase.java:835)
   [junit4]   2> 		at sun.reflect.NativeMethodAccessorImpl.invoke0(Native Method)
   [junit4]   2> 		at sun.reflect.NativeMethodAccessorImpl.invoke(NativeMethodAccessorImpl.java:57)
   [junit4]   2> 		at sun.reflect.DelegatingMethodAccessorImpl.invoke(DelegatingMethodAccessorImpl.java:43)
   [junit4]   2> 		at java.lang.reflect.Method.invoke(Method.java:606)
   [junit4]   2> 		at com.carrotsearch.randomizedtesting.RandomizedRunner.invoke(RandomizedRunner.java:1559)
   [junit4]   2> 		at com.carrotsearch.randomizedtesting.RandomizedRunner.access$600(RandomizedRunner.java:79)
   [junit4]   2> 		at com.carrotsearch.randomizedtesting.RandomizedRunner$6.evaluate(RandomizedRunner.java:737)
   [junit4]   2> 		at com.carrotsearch.randomizedtesting.RandomizedRunner$7.evaluate(RandomizedRunner.java:773)
   [junit4]   2> 		at com.carrotsearch.randomizedtesting.RandomizedRunner$8.evaluate(RandomizedRunner.java:787)
   [junit4]   2> 		at com.carrotsearch.randomizedtesting.rules.SystemPropertiesRestoreRule$1.evaluate(SystemPropertiesRestoreRule.java:53)
   [junit4]   2> 		at org.apache.lucene.util.TestRuleSetupTeardownChained$1.evaluate(TestRuleSetupTeardownChained.java:50)
   [junit4]   2> 		at org.apache.lucene.util.TestRuleFieldCacheSanity$1.evaluate(TestRuleFieldCacheSanity.java:51)
   [junit4]   2> 		at org.apache.lucene.util.AbstractBeforeAfterRule$1.evaluate(AbstractBeforeAfterRule.java:46)
   [junit4]   2> 		at com.carrotsearch.randomizedtesting.rules.SystemPropertiesInvariantRule$1.evaluate(SystemPropertiesInvariantRule.java:

[...truncated too long message...]

DirectoryFactory.closeCacheValue looking to close .\org.apache.solr.update.SolrCmdDistributorTest-1385449764971/shard2/data\ [CachedDir<<refCount=0;path=.\org.apache.solr.update.SolrCmdDistributorTest-1385449764971/shard2/data\;done=false>>]
   [junit4]   2> 2785158 T7785 oasc.CachingDirectoryFactory.close Closing directory: .\org.apache.solr.update.SolrCmdDistributorTest-1385449764971/shard2/data\
   [junit4]   2> 2785162 T7785 oejsh.ContextHandler.doStop stopped o.e.j.s.ServletContextHandler{/,null}
   [junit4]   2> 2785228 T7785 oasc.CoreContainer.shutdown Shutting down CoreContainer instance=1225767341
   [junit4]   2> 2785230 T7785 oasc.SolrCore.close [collection1]  CLOSING SolrCore org.apache.solr.core.SolrCore@4b585cd7
   [junit4]   2> 2785245 T7785 oasu.DirectUpdateHandler2.close closing DirectUpdateHandler2{commits=1,autocommits=0,soft autocommits=0,optimizes=1,rollbacks=0,expungeDeletes=0,docsPending=0,adds=0,deletesById=0,deletesByQuery=0,errors=0,cumulative_adds=190,cumulative_deletesById=0,cumulative_deletesByQuery=1,cumulative_errors=0,transaction_logs_total_size=6706,transaction_logs_total_number=1}
   [junit4]   2> 2785245 T7785 oasu.SolrCoreState.decrefSolrCoreState Closing SolrCoreState
   [junit4]   2> 2785245 T7785 oasu.DefaultSolrCoreState.closeIndexWriter SolrCoreState ref count has reached 0 - closing IndexWriter
   [junit4]   2> 2785245 T7785 oasu.DefaultSolrCoreState.closeIndexWriter closing IndexWriter with IndexWriterCloser
   [junit4]   2> 2785249 T7785 oasc.SolrCore.closeSearcher [collection1] Closing main searcher on request.
   [junit4]   2> 2785250 T7785 oasc.CachingDirectoryFactory.close Closing MockDirectoryFactory - 2 directories currently being tracked
   [junit4]   2> 2785250 T7785 oasc.CachingDirectoryFactory.closeCacheValue looking to close .\org.apache.solr.update.SolrCmdDistributorTest-1385449764971/shard3/data\ [CachedDir<<refCount=0;path=.\org.apache.solr.update.SolrCmdDistributorTest-1385449764971/shard3/data\;done=false>>]
   [junit4]   2> 2785250 T7785 oasc.CachingDirectoryFactory.close Closing directory: .\org.apache.solr.update.SolrCmdDistributorTest-1385449764971/shard3/data\
   [junit4]   2> 2785250 T7785 oasc.CachingDirectoryFactory.closeCacheValue looking to close .\org.apache.solr.update.SolrCmdDistributorTest-1385449764971/shard3/data\index [CachedDir<<refCount=0;path=.\org.apache.solr.update.SolrCmdDistributorTest-1385449764971/shard3/data\index;done=false>>]
   [junit4]   2> 2785250 T7785 oasc.CachingDirectoryFactory.close Closing directory: .\org.apache.solr.update.SolrCmdDistributorTest-1385449764971/shard3/data\index
   [junit4]   2> 2785250 T7785 oejsh.ContextHandler.doStop stopped o.e.j.s.ServletContextHandler{/,null}
   [junit4]   2> 2785375 T7785 oas.SolrTestCaseJ4.tearDown ###Ending testDistribSearch
   [junit4]   2> NOTE: reproduce with: ant test  -Dtestcase=SolrCmdDistributorTest -Dtests.method=testDistribSearch -Dtests.seed=5EEBFF84DCFFFAD9 -Dtests.slow=true -Dtests.locale=sq -Dtests.timezone=Australia/Lord_Howe -Dtests.file.encoding=UTF-8
   [junit4] FAILURE 7.37s | SolrCmdDistributorTest.testDistribSearch <<<
   [junit4]    > Throwable #1: java.lang.AssertionError: expected:<191> but was:<192>
   [junit4]    > 	at __randomizedtesting.SeedInfo.seed([5EEBFF84DCFFFAD9:DF0D719CABA09AE5]:0)
   [junit4]    > 	at org.apache.solr.update.SolrCmdDistributorTest.testRetryNode(SolrCmdDistributorTest.java:443)
   [junit4]    > 	at org.apache.solr.update.SolrCmdDistributorTest.doTest(SolrCmdDistributorTest.java:321)
   [junit4]    > 	at org.apache.solr.BaseDistributedSearchTestCase.testDistribSearch(BaseDistributedSearchTestCase.java:835)
   [junit4]    > 	at java.lang.Thread.run(Thread.java:744)
   [junit4]   2> 2785397 T7785 oas.SolrTestCaseJ4.deleteCore ###deleteCore
   [junit4]   2> NOTE: test params are: codec=Lucene3x, sim=RandomSimilarityProvider(queryNorm=false,coord=crazy): {}, locale=sq, timezone=Australia/Lord_Howe
   [junit4]   2> NOTE: Windows 7 6.1 amd64/Oracle Corporation 1.7.0_45 (64-bit)/cpus=2,threads=1,free=209869136,total=536870912
   [junit4]   2> NOTE: All tests run in this JVM: [DocumentBuilderTest, BinaryUpdateRequestHandlerTest, OpenCloseCoreStressTest, SuggesterTest, TestSerializedLuceneMatchVersion, ZkSolrClientTest, TestCollationField, TestValueSourceCache, SolrXmlInZkTest, CollectionsAPIDistributedZkTest, RegexBoostProcessorTest, TestClassNameShortening, TestExtendedDismaxParser, TestModifyConfFiles, ClusterStateTest, TestFastOutputStream, LoggingHandlerTest, TestRandomMergePolicy, HighlighterConfigTest, DocValuesMultiTest, TestMaxScoreQueryParser, PreAnalyzedUpdateProcessorTest, TestNonNRTOpen, TestFiltering, TestStressRecovery, AddBlockUpdateTest, SpatialFilterTest, QueryResultKeyTest, TestFastWriter, TestGroupingSearch, TermVectorComponentTest, QueryEqualityTest, UnloadDistributedZkTest, TestWriterPerf, TestCloudManagedSchema, TestLMJelinekMercerSimilarityFactory, TestSolrIndexConfig, IndexSchemaRuntimeFieldTest, RequiredFieldsTest, TestArbitraryIndexDir, SolrIndexConfigTest, PeerSyncTest, TestReload, ZkControllerTest, DeleteReplicaTest, TestInfoStreamLogging, TestImplicitCoreProperties, TestSweetSpotSimilarityFactory, OverseerTest, CoreAdminHandlerTest, ScriptEngineTest, DocumentAnalysisRequestHandlerTest, XsltUpdateRequestHandlerTest, TestWordDelimiterFilterFactory, SignatureUpdateProcessorFactoryTest, AddSchemaFieldsUpdateProcessorFactoryTest, BlockDirectoryTest, SampleTest, TestTrie, FileUtilsTest, DirectSolrConnectionTest, ConvertedLegacyTest, SuggestComponentTest, TestIndexSearcher, AliasIntegrationTest, SynonymTokenizerTest, ZkNodePropsTest, ShowFileRequestHandlerTest, TriLevelCompositeIdRoutingTest, FullSolrCloudDistribCmdsTest, OpenExchangeRatesOrgProviderTest, TestSort, TestCloudManagedSchemaAddField, CachingDirectoryFactoryTest, TestLRUCache, BasicZkTest, TestLFUCache, HdfsBasicDistributedZk2Test, SolrPluginUtilsTest, TestStressReorder, TestDFRSimilarityFactory, TestRecovery, SortByFunctionTest, TestCopyFieldCollectionResource, DistributedTermsComponentTest, TestCSVLoader, TestSolrDeletionPolicy2, TestSolr4Spatial, TestAnalyzedSuggestions, TestQuerySenderNoQuery, TestComponentsName, CoreMergeIndexesAdminHandlerTest, HdfsChaosMonkeySafeLeaderTest, SearchHandlerTest, PrimitiveFieldTypeTest, ChaosMonkeyNothingIsSafeTest, TestPostingsSolrHighlighter, UpdateParamsTest, PrimUtilsTest, BasicDistributedZkTest, TestQueryTypes, EnumFieldTest, ResourceLoaderTest, TestSolrCoreProperties, BasicDistributedZk2Test, RecoveryZkTest, SliceStateTest, TestRemoteStreaming, BadCopyFieldTest, PathHierarchyTokenizerFactoryTest, ChaosMonkeySafeLeaderTest, LegacyHTMLStripCharFilterTest, SolrRequestParserTest, LeaderElectionIntegrationTest, TestDynamicFieldCollectionResource, TestXIncludeConfig, TestFoldingMultitermQuery, TestSolrXmlPersistence, OverseerCollectionProcessorTest, SuggesterTSTTest, TestUtils, DirectUpdateHandlerTest, SchemaVersionSpecificBehaviorTest, TestStressLucene, HardAutoCommitTest, HdfsUnloadDistributedZkTest, CopyFieldTest, DateMathParserTest, DOMUtilTest, ClusterStateUpdateTest, TestHashPartitioner, FieldMutatingUpdateProcessorTest, TermsComponentTest, TestJoin, TestJmxIntegration, TestRandomDVFaceting, CircularListTest, TimeZoneUtilsTest, MultiTermTest, TestSurroundQueryParser, TestFileDictionaryLookup, TestReversedWildcardFilterFactory, TestSchemaNameResource, IndexBasedSpellCheckerTest, TestSolrJ, HdfsDirectoryTest, HdfsSyncSliceTest, TestSolrQueryParserResource, BadComponentTest, TestOmitPositions, DefaultValueUpdateProcessorTest, FieldAnalysisRequestHandlerTest, BlockCacheTest, TestAtomicUpdateErrorCases, TestNumberUtils, TestHighFrequencyDictionaryFactory, NoCacheHeaderTest, TestShardHandlerFactory, UniqFieldsUpdateProcessorFactoryTest, TestBinaryResponseWriter, QueryElevationComponentTest, TestRandomFaceting, TestNRTOpen, PreAnalyzedFieldTest, DistributedSpellCheckComponentTest, HdfsBasicDistributedZkTest, TestQuerySenderListener, CoreContainerCoreInitFailuresTest, SyncSliceTest, ShardRoutingTest, TestReplicationHandler, LeaderElectionTest, TestZkChroot, ZkCLITest, ShardRoutingCustomTest, SliceStateUpdateTest, TestDistributedSearch, AutoCommitTest, TestDistributedGrouping, TestFaceting, TermVectorComponentDistributedTest, TestRealTimeGet, TestMultiCoreConfBootstrap, TestStressVersions, TestRangeQuery, TestCoreContainer, SimpleFacetsTest, SolrCoreTest, StatsComponentTest, SpellCheckComponentTest, SolrCmdDistributorTest]
   [junit4] Completed in 7.40s, 1 test, 1 failure <<< FAILURES!

[...truncated 467 lines...]
BUILD FAILED
C:\Users\JenkinsSlave\workspace\Lucene-Solr-4.x-Windows\build.xml:426: The following error occurred while executing this line:
C:\Users\JenkinsSlave\workspace\Lucene-Solr-4.x-Windows\build.xml:406: The following error occurred while executing this line:
C:\Users\JenkinsSlave\workspace\Lucene-Solr-4.x-Windows\build.xml:39: The following error occurred while executing this line:
C:\Users\JenkinsSlave\workspace\Lucene-Solr-4.x-Windows\extra-targets.xml:37: The following error occurred while executing this line:
C:\Users\JenkinsSlave\workspace\Lucene-Solr-4.x-Windows\solr\build.xml:189: The following error occurred while executing this line:
C:\Users\JenkinsSlave\workspace\Lucene-Solr-4.x-Windows\solr\common-build.xml:491: The following error occurred while executing this line:
C:\Users\JenkinsSlave\workspace\Lucene-Solr-4.x-Windows\lucene\common-build.xml:1279: The following error occurred while executing this line:
C:\Users\JenkinsSlave\workspace\Lucene-Solr-4.x-Windows\lucene\common-build.xml:912: There were test failures: 345 suites, 1505 tests, 1 failure, 39 ignored (11 assumptions)

Total time: 83 minutes 42 seconds
Build step 'Invoke Ant' marked build as failure
Description set: Java: 64bit/jdk1.7.0_45 -XX:-UseCompressedOops -XX:+UseG1GC
Archiving artifacts
Recording test results
Email was triggered for: Failure
Sending email for trigger: Failure



Mime
View raw message