lucene-dev mailing list archives

Site index · List index
Message view « Date » · « Thread »
Top « Date » · « Thread »
From Apache Jenkins Server <jenk...@builds.apache.org>
Subject [JENKINS] Lucene-Solr-Tests-trunk-Java7 - Build # 4561 - Failure
Date Thu, 02 Jan 2014 06:38:48 GMT
Build: https://builds.apache.org/job/Lucene-Solr-Tests-trunk-Java7/4561/

1 tests failed.
FAILED:  org.apache.solr.cloud.CollectionsAPIDistributedZkTest.testDistribSearch

Error Message:


Stack Trace:
java.lang.AssertionError
	at __randomizedtesting.SeedInfo.seed([15C116A8DC1832B3:942798B0AB47528F]:0)
	at org.junit.Assert.fail(Assert.java:92)
	at org.junit.Assert.assertTrue(Assert.java:43)
	at org.junit.Assert.assertFalse(Assert.java:68)
	at org.junit.Assert.assertFalse(Assert.java:79)
	at org.apache.solr.cloud.CollectionsAPIDistributedZkTest.deleteCollectionWithDownNodes(CollectionsAPIDistributedZkTest.java:390)
	at org.apache.solr.cloud.CollectionsAPIDistributedZkTest.doTest(CollectionsAPIDistributedZkTest.java:203)
	at org.apache.solr.BaseDistributedSearchTestCase.testDistribSearch(BaseDistributedSearchTestCase.java:849)
	at sun.reflect.NativeMethodAccessorImpl.invoke0(Native Method)
	at sun.reflect.NativeMethodAccessorImpl.invoke(NativeMethodAccessorImpl.java:57)
	at sun.reflect.DelegatingMethodAccessorImpl.invoke(DelegatingMethodAccessorImpl.java:43)
	at java.lang.reflect.Method.invoke(Method.java:606)
	at com.carrotsearch.randomizedtesting.RandomizedRunner.invoke(RandomizedRunner.java:1559)
	at com.carrotsearch.randomizedtesting.RandomizedRunner.access$600(RandomizedRunner.java:79)
	at com.carrotsearch.randomizedtesting.RandomizedRunner$6.evaluate(RandomizedRunner.java:737)
	at com.carrotsearch.randomizedtesting.RandomizedRunner$7.evaluate(RandomizedRunner.java:773)
	at com.carrotsearch.randomizedtesting.RandomizedRunner$8.evaluate(RandomizedRunner.java:787)
	at com.carrotsearch.randomizedtesting.rules.SystemPropertiesRestoreRule$1.evaluate(SystemPropertiesRestoreRule.java:53)
	at org.apache.lucene.util.TestRuleSetupTeardownChained$1.evaluate(TestRuleSetupTeardownChained.java:50)
	at org.apache.lucene.util.TestRuleFieldCacheSanity$1.evaluate(TestRuleFieldCacheSanity.java:51)
	at org.apache.lucene.util.AbstractBeforeAfterRule$1.evaluate(AbstractBeforeAfterRule.java:46)
	at com.carrotsearch.randomizedtesting.rules.SystemPropertiesInvariantRule$1.evaluate(SystemPropertiesInvariantRule.java:55)
	at org.apache.lucene.util.TestRuleThreadAndTestName$1.evaluate(TestRuleThreadAndTestName.java:49)
	at org.apache.lucene.util.TestRuleIgnoreAfterMaxFailures$1.evaluate(TestRuleIgnoreAfterMaxFailures.java:70)
	at org.apache.lucene.util.TestRuleMarkFailure$1.evaluate(TestRuleMarkFailure.java:48)
	at com.carrotsearch.randomizedtesting.rules.StatementAdapter.evaluate(StatementAdapter.java:36)
	at com.carrotsearch.randomizedtesting.ThreadLeakControl$StatementRunner.run(ThreadLeakControl.java:358)
	at com.carrotsearch.randomizedtesting.ThreadLeakControl.forkTimeoutingTask(ThreadLeakControl.java:782)
	at com.carrotsearch.randomizedtesting.ThreadLeakControl$3.evaluate(ThreadLeakControl.java:442)
	at com.carrotsearch.randomizedtesting.RandomizedRunner.runSingleTest(RandomizedRunner.java:746)
	at com.carrotsearch.randomizedtesting.RandomizedRunner$3.evaluate(RandomizedRunner.java:648)
	at com.carrotsearch.randomizedtesting.RandomizedRunner$4.evaluate(RandomizedRunner.java:682)
	at com.carrotsearch.randomizedtesting.RandomizedRunner$5.evaluate(RandomizedRunner.java:693)
	at com.carrotsearch.randomizedtesting.rules.StatementAdapter.evaluate(StatementAdapter.java:36)
	at com.carrotsearch.randomizedtesting.rules.SystemPropertiesRestoreRule$1.evaluate(SystemPropertiesRestoreRule.java:53)
	at org.apache.lucene.util.AbstractBeforeAfterRule$1.evaluate(AbstractBeforeAfterRule.java:46)
	at org.apache.lucene.util.TestRuleStoreClassName$1.evaluate(TestRuleStoreClassName.java:42)
	at com.carrotsearch.randomizedtesting.rules.SystemPropertiesInvariantRule$1.evaluate(SystemPropertiesInvariantRule.java:55)
	at com.carrotsearch.randomizedtesting.rules.NoShadowingOrOverridesOnMethodsRule$1.evaluate(NoShadowingOrOverridesOnMethodsRule.java:39)
	at com.carrotsearch.randomizedtesting.rules.NoShadowingOrOverridesOnMethodsRule$1.evaluate(NoShadowingOrOverridesOnMethodsRule.java:39)
	at com.carrotsearch.randomizedtesting.rules.StatementAdapter.evaluate(StatementAdapter.java:36)
	at org.apache.lucene.util.TestRuleAssertionsRequired$1.evaluate(TestRuleAssertionsRequired.java:43)
	at org.apache.lucene.util.TestRuleMarkFailure$1.evaluate(TestRuleMarkFailure.java:48)
	at org.apache.lucene.util.TestRuleIgnoreAfterMaxFailures$1.evaluate(TestRuleIgnoreAfterMaxFailures.java:70)
	at org.apache.lucene.util.TestRuleIgnoreTestSuites$1.evaluate(TestRuleIgnoreTestSuites.java:55)
	at com.carrotsearch.randomizedtesting.rules.StatementAdapter.evaluate(StatementAdapter.java:36)
	at com.carrotsearch.randomizedtesting.ThreadLeakControl$StatementRunner.run(ThreadLeakControl.java:358)
	at java.lang.Thread.run(Thread.java:724)




Build Log:
[...truncated 10401 lines...]
   [junit4] Suite: org.apache.solr.cloud.CollectionsAPIDistributedZkTest
   [junit4]   2> 893504 T2526 oas.BaseDistributedSearchTestCase.initHostContext Setting hostContext system property: /hg_i/k
   [junit4]   2> 893508 T2526 oas.SolrTestCaseJ4.setUp ###Starting testDistribSearch
   [junit4]   2> Creating dataDir: /usr/home/hudson/hudson-slave/workspace/Lucene-Solr-Tests-trunk-Java7/solr/build/solr-core/test/J1/./solrtest-CollectionsAPIDistributedZkTest-1388642930658
   [junit4]   2> 893510 T2526 oasc.ZkTestServer.run STARTING ZK TEST SERVER
   [junit4]   2> 893510 T2527 oasc.ZkTestServer$ZKServerMain.runFromConfig Starting server
   [junit4]   2> 893611 T2526 oasc.ZkTestServer.run start zk server on port:19429
   [junit4]   2> 893612 T2526 oascc.ConnectionManager.waitForConnected Waiting for client to connect to ZooKeeper
   [junit4]   2> 893616 T2534 oascc.ConnectionManager.process Watcher org.apache.solr.common.cloud.ConnectionManager@3587fbc2 name:ZooKeeperConnection Watcher:127.0.0.1:19429 got event WatchedEvent state:SyncConnected type:None path:null path:null type:None
   [junit4]   2> 893616 T2526 oascc.ConnectionManager.waitForConnected Client is connected to ZooKeeper
   [junit4]   2> 893616 T2526 oascc.SolrZkClient.makePath makePath: /solr
   [junit4]   2> 893627 T2526 oascc.ConnectionManager.waitForConnected Waiting for client to connect to ZooKeeper
   [junit4]   2> 893628 T2537 oascc.ConnectionManager.process Watcher org.apache.solr.common.cloud.ConnectionManager@95c53d0 name:ZooKeeperConnection Watcher:127.0.0.1:19429/solr got event WatchedEvent state:SyncConnected type:None path:null path:null type:None
   [junit4]   2> 893629 T2526 oascc.ConnectionManager.waitForConnected Client is connected to ZooKeeper
   [junit4]   2> 893629 T2526 oascc.SolrZkClient.makePath makePath: /collections/collection1
   [junit4]   2> 893638 T2526 oascc.SolrZkClient.makePath makePath: /collections/collection1/shards
   [junit4]   2> 893641 T2526 oascc.SolrZkClient.makePath makePath: /collections/control_collection
   [junit4]   2> 893642 T2526 oascc.SolrZkClient.makePath makePath: /collections/control_collection/shards
   [junit4]   2> 893651 T2526 oasc.AbstractZkTestCase.putConfig put /usr/home/hudson/hudson-slave/workspace/Lucene-Solr-Tests-trunk-Java7/solr/build/solr-core/test-files/solr/collection1/conf/solrconfig-tlog.xml to /configs/conf1/solrconfig.xml
   [junit4]   2> 893651 T2526 oascc.SolrZkClient.makePath makePath: /configs/conf1/solrconfig.xml
   [junit4]   2> 893660 T2526 oasc.AbstractZkTestCase.putConfig put /usr/home/hudson/hudson-slave/workspace/Lucene-Solr-Tests-trunk-Java7/solr/build/solr-core/test-files/solr/collection1/conf/schema.xml to /configs/conf1/schema.xml
   [junit4]   2> 893660 T2526 oascc.SolrZkClient.makePath makePath: /configs/conf1/schema.xml
   [junit4]   2> 893764 T2526 oasc.AbstractZkTestCase.putConfig put /usr/home/hudson/hudson-slave/workspace/Lucene-Solr-Tests-trunk-Java7/solr/build/solr-core/test-files/solr/collection1/conf/solrconfig.snippet.randomindexconfig.xml to /configs/conf1/solrconfig.snippet.randomindexconfig.xml
   [junit4]   2> 893764 T2526 oascc.SolrZkClient.makePath makePath: /configs/conf1/solrconfig.snippet.randomindexconfig.xml
   [junit4]   2> 893767 T2526 oasc.AbstractZkTestCase.putConfig put /usr/home/hudson/hudson-slave/workspace/Lucene-Solr-Tests-trunk-Java7/solr/build/solr-core/test-files/solr/collection1/conf/stopwords.txt to /configs/conf1/stopwords.txt
   [junit4]   2> 893767 T2526 oascc.SolrZkClient.makePath makePath: /configs/conf1/stopwords.txt
   [junit4]   2> 893776 T2526 oasc.AbstractZkTestCase.putConfig put /usr/home/hudson/hudson-slave/workspace/Lucene-Solr-Tests-trunk-Java7/solr/build/solr-core/test-files/solr/collection1/conf/protwords.txt to /configs/conf1/protwords.txt
   [junit4]   2> 893777 T2526 oascc.SolrZkClient.makePath makePath: /configs/conf1/protwords.txt
   [junit4]   2> 893779 T2526 oasc.AbstractZkTestCase.putConfig put /usr/home/hudson/hudson-slave/workspace/Lucene-Solr-Tests-trunk-Java7/solr/build/solr-core/test-files/solr/collection1/conf/currency.xml to /configs/conf1/currency.xml
   [junit4]   2> 893780 T2526 oascc.SolrZkClient.makePath makePath: /configs/conf1/currency.xml
   [junit4]   2> 893782 T2526 oasc.AbstractZkTestCase.putConfig put /usr/home/hudson/hudson-slave/workspace/Lucene-Solr-Tests-trunk-Java7/solr/build/solr-core/test-files/solr/collection1/conf/enumsConfig.xml to /configs/conf1/enumsConfig.xml
   [junit4]   2> 893783 T2526 oascc.SolrZkClient.makePath makePath: /configs/conf1/enumsConfig.xml
   [junit4]   2> 893785 T2526 oasc.AbstractZkTestCase.putConfig put /usr/home/hudson/hudson-slave/workspace/Lucene-Solr-Tests-trunk-Java7/solr/build/solr-core/test-files/solr/collection1/conf/open-exchange-rates.json to /configs/conf1/open-exchange-rates.json
   [junit4]   2> 893786 T2526 oascc.SolrZkClient.makePath makePath: /configs/conf1/open-exchange-rates.json
   [junit4]   2> 893793 T2526 oasc.AbstractZkTestCase.putConfig put /usr/home/hudson/hudson-slave/workspace/Lucene-Solr-Tests-trunk-Java7/solr/build/solr-core/test-files/solr/collection1/conf/mapping-ISOLatin1Accent.txt to /configs/conf1/mapping-ISOLatin1Accent.txt
   [junit4]   2> 893794 T2526 oascc.SolrZkClient.makePath makePath: /configs/conf1/mapping-ISOLatin1Accent.txt
   [junit4]   2> 893796 T2526 oasc.AbstractZkTestCase.putConfig put /usr/home/hudson/hudson-slave/workspace/Lucene-Solr-Tests-trunk-Java7/solr/build/solr-core/test-files/solr/collection1/conf/old_synonyms.txt to /configs/conf1/old_synonyms.txt
   [junit4]   2> 893796 T2526 oascc.SolrZkClient.makePath makePath: /configs/conf1/old_synonyms.txt
   [junit4]   2> 893799 T2526 oasc.AbstractZkTestCase.putConfig put /usr/home/hudson/hudson-slave/workspace/Lucene-Solr-Tests-trunk-Java7/solr/build/solr-core/test-files/solr/collection1/conf/synonyms.txt to /configs/conf1/synonyms.txt
   [junit4]   2> 893799 T2526 oascc.SolrZkClient.makePath makePath: /configs/conf1/synonyms.txt
   [junit4]   2> Using old style solr.xml
   [junit4]   2> 894019 T2526 oejs.Server.doStart jetty-8.1.10.v20130312
   [junit4]   2> 894024 T2526 oejs.AbstractConnector.doStart Started SocketConnector@127.0.0.1:19435
   [junit4]   2> 894024 T2526 oass.SolrDispatchFilter.init SolrDispatchFilter.init()
   [junit4]   2> 894025 T2526 oasc.SolrResourceLoader.locateSolrHome JNDI not configured for solr (NoInitialContextEx)
   [junit4]   2> 894025 T2526 oasc.SolrResourceLoader.locateSolrHome using system property solr.solr.home: ../../../../../../../../../../../usr/home/hudson/hudson-slave/workspace/Lucene-Solr-Tests-trunk-Java7/solr/build/solr-core/test/J1/./org.apache.solr.cloud.CollectionsAPIDistributedZkTest-controljetty-1388642930959
   [junit4]   2> 894026 T2526 oasc.SolrResourceLoader.<init> new SolrResourceLoader for directory: '../../../../../../../../../../../usr/home/hudson/hudson-slave/workspace/Lucene-Solr-Tests-trunk-Java7/solr/build/solr-core/test/J1/./org.apache.solr.cloud.CollectionsAPIDistributedZkTest-controljetty-1388642930959/'
   [junit4]   2> 894067 T2526 oasc.ConfigSolr.fromFile Loading container configuration from /usr/home/hudson/hudson-slave/workspace/Lucene-Solr-Tests-trunk-Java7/solr/build/solr-core/test/J1/../../../../../../../../../../../usr/home/hudson/hudson-slave/workspace/Lucene-Solr-Tests-trunk-Java7/solr/build/solr-core/test/J1/./org.apache.solr.cloud.CollectionsAPIDistributedZkTest-controljetty-1388642930959/solr.xml
   [junit4]   2> 894165 T2526 oasc.CoreContainer.<init> New CoreContainer 1542613871
   [junit4]   2> 894166 T2526 oasc.CoreContainer.load Loading cores into CoreContainer [instanceDir=../../../../../../../../../../../usr/home/hudson/hudson-slave/workspace/Lucene-Solr-Tests-trunk-Java7/solr/build/solr-core/test/J1/./org.apache.solr.cloud.CollectionsAPIDistributedZkTest-controljetty-1388642930959/]
   [junit4]   2> 894168 T2526 oashc.HttpShardHandlerFactory.getParameter Setting socketTimeout to: 120000
   [junit4]   2> 894169 T2526 oashc.HttpShardHandlerFactory.getParameter Setting urlScheme to: http://
   [junit4]   2> 894169 T2526 oashc.HttpShardHandlerFactory.getParameter Setting connTimeout to: 15000
   [junit4]   2> 894169 T2526 oashc.HttpShardHandlerFactory.getParameter Setting maxConnectionsPerHost to: 20
   [junit4]   2> 894170 T2526 oashc.HttpShardHandlerFactory.getParameter Setting corePoolSize to: 0
   [junit4]   2> 894170 T2526 oashc.HttpShardHandlerFactory.getParameter Setting maximumPoolSize to: 2147483647
   [junit4]   2> 894171 T2526 oashc.HttpShardHandlerFactory.getParameter Setting maxThreadIdleTime to: 5
   [junit4]   2> 894171 T2526 oashc.HttpShardHandlerFactory.getParameter Setting sizeOfQueue to: -1
   [junit4]   2> 894172 T2526 oashc.HttpShardHandlerFactory.getParameter Setting fairnessPolicy to: false
   [junit4]   2> 894191 T2526 oasl.LogWatcher.createWatcher SLF4J impl is org.slf4j.impl.Log4jLoggerFactory
   [junit4]   2> 894191 T2526 oasl.LogWatcher.newRegisteredLogWatcher Registering Log Listener [Log4j (org.slf4j.impl.Log4jLoggerFactory)]
   [junit4]   2> 894192 T2526 oasc.CoreContainer.load Host Name: 127.0.0.1
   [junit4]   2> 894192 T2526 oasc.ZkContainer.initZooKeeper Zookeeper client=127.0.0.1:19429/solr
   [junit4]   2> 894193 T2526 oasc.ZkController.checkChrootPath zkHost includes chroot
   [junit4]   2> 894194 T2526 oascc.ConnectionManager.waitForConnected Waiting for client to connect to ZooKeeper
   [junit4]   2> 894197 T2549 oascc.ConnectionManager.process Watcher org.apache.solr.common.cloud.ConnectionManager@19c68be name:ZooKeeperConnection Watcher:127.0.0.1:19429 got event WatchedEvent state:SyncConnected type:None path:null path:null type:None
   [junit4]   2> 894197 T2526 oascc.ConnectionManager.waitForConnected Client is connected to ZooKeeper
   [junit4]   2> 894209 T2526 oascc.ConnectionManager.waitForConnected Waiting for client to connect to ZooKeeper
   [junit4]   2> 894212 T2552 oascc.ConnectionManager.process Watcher org.apache.solr.common.cloud.ConnectionManager@12c2a128 name:ZooKeeperConnection Watcher:127.0.0.1:19429/solr got event WatchedEvent state:SyncConnected type:None path:null path:null type:None
   [junit4]   2> 894212 T2526 oascc.ConnectionManager.waitForConnected Client is connected to ZooKeeper
   [junit4]   2> 894214 T2526 oascc.SolrZkClient.makePath makePath: /overseer/queue
   [junit4]   2> 894224 T2526 oascc.SolrZkClient.makePath makePath: /overseer/collection-queue-work
   [junit4]   2> 894228 T2526 oascc.SolrZkClient.makePath makePath: /live_nodes
   [junit4]   2> 894230 T2526 oasc.ZkController.createEphemeralLiveNode Register node as live in ZooKeeper:/live_nodes/127.0.0.1:19435_hg_i%2Fk
   [junit4]   2> 894238 T2526 oascc.SolrZkClient.makePath makePath: /live_nodes/127.0.0.1:19435_hg_i%2Fk
   [junit4]   2> 894242 T2526 oascc.SolrZkClient.makePath makePath: /overseer_elect
   [junit4]   2> 894245 T2526 oascc.SolrZkClient.makePath makePath: /overseer_elect/election
   [junit4]   2> 894256 T2526 oascc.SolrZkClient.makePath makePath: /overseer_elect/leader
   [junit4]   2> 894259 T2526 oasc.Overseer.start Overseer (id=91006103103995907-127.0.0.1:19435_hg_i%2Fk-n_0000000000) starting
   [junit4]   2> 894269 T2526 oascc.SolrZkClient.makePath makePath: /overseer/queue-work
   [junit4]   2> 894279 T2554 oasc.OverseerCollectionProcessor.run Process current queue of collection creations
   [junit4]   2> 894280 T2526 oascc.SolrZkClient.makePath makePath: /clusterstate.json
   [junit4]   2> 894283 T2526 oascc.SolrZkClient.makePath makePath: /aliases.json
   [junit4]   2> 894290 T2526 oascc.ZkStateReader.createClusterStateWatchersAndUpdate Updating cluster state from ZooKeeper... 
   [junit4]   2> 894293 T2553 oasc.Overseer$ClusterStateUpdater.run Starting to work on the main queue
   [junit4]   2> 894297 T2526 oass.SolrDispatchFilter.init user.dir=/usr/home/hudson/hudson-slave/workspace/Lucene-Solr-Tests-trunk-Java7/solr/build/solr-core/test/J1
   [junit4]   2> 894297 T2526 oass.SolrDispatchFilter.init SolrDispatchFilter.init() done
   [junit4]   2> 894300 T2526 oascc.ConnectionManager.waitForConnected Waiting for client to connect to ZooKeeper
   [junit4]   2> 894302 T2558 oascc.ConnectionManager.process Watcher org.apache.solr.common.cloud.ConnectionManager@462cd011 name:ZooKeeperConnection Watcher:127.0.0.1:19429/solr got event WatchedEvent state:SyncConnected type:None path:null path:null type:None
   [junit4]   2> 894303 T2526 oascc.ConnectionManager.waitForConnected Client is connected to ZooKeeper
   [junit4]   2> 894304 T2526 oascc.ZkStateReader.createClusterStateWatchersAndUpdate Updating cluster state from ZooKeeper... 
   [junit4]   2> 894306 T2526 oasc.ChaosMonkey.monkeyLog monkey: init - expire sessions:false cause connection loss:false
   [junit4]   2> 894587 T2526 oejs.Server.doStart jetty-8.1.10.v20130312
   [junit4]   2> 894591 T2526 oejs.AbstractConnector.doStart Started SocketConnector@127.0.0.1:19439
   [junit4]   2> 894592 T2526 oass.SolrDispatchFilter.init SolrDispatchFilter.init()
   [junit4]   2> 894593 T2526 oasc.SolrResourceLoader.locateSolrHome JNDI not configured for solr (NoInitialContextEx)
   [junit4]   2> 894593 T2526 oasc.SolrResourceLoader.locateSolrHome using system property solr.solr.home: ./org.apache.solr.cloud.CollectionsAPIDistributedZkTest-jetty1-1388642931456
   [junit4]   2> 894593 T2526 oasc.SolrResourceLoader.<init> new SolrResourceLoader for directory: './org.apache.solr.cloud.CollectionsAPIDistributedZkTest-jetty1-1388642931456/'
   [junit4]   2> 894636 T2526 oasc.ConfigSolr.fromFile Loading container configuration from /usr/home/hudson/hudson-slave/workspace/Lucene-Solr-Tests-trunk-Java7/solr/build/solr-core/test/J1/./org.apache.solr.cloud.CollectionsAPIDistributedZkTest-jetty1-1388642931456/solr.xml
   [junit4]   2> 894746 T2526 oasc.CoreContainer.<init> New CoreContainer 1499257818
   [junit4]   2> 894747 T2526 oasc.CoreContainer.load Loading cores into CoreContainer [instanceDir=./org.apache.solr.cloud.CollectionsAPIDistributedZkTest-jetty1-1388642931456/]
   [junit4]   2> 894749 T2526 oashc.HttpShardHandlerFactory.getParameter Setting socketTimeout to: 120000
   [junit4]   2> 894749 T2526 oashc.HttpShardHandlerFactory.getParameter Setting urlScheme to: http://
   [junit4]   2> 894750 T2526 oashc.HttpShardHandlerFactory.getParameter Setting connTimeout to: 15000
   [junit4]   2> 894750 T2526 oashc.HttpShardHandlerFactory.getParameter Setting maxConnectionsPerHost to: 20
   [junit4]   2> 894751 T2526 oashc.HttpShardHandlerFactory.getParameter Setting corePoolSize to: 0
   [junit4]   2> 894751 T2526 oashc.HttpShardHandlerFactory.getParameter Setting maximumPoolSize to: 2147483647
   [junit4]   2> 894752 T2526 oashc.HttpShardHandlerFactory.getParameter Setting maxThreadIdleTime to: 5
   [junit4]   2> 894752 T2526 oashc.HttpShardHandlerFactory.getParameter Setting sizeOfQueue to: -1
   [junit4]   2> 894753 T2526 oashc.HttpShardHandlerFactory.getParameter Setting fairnessPolicy to: false
   [junit4]   2> 894771 T2526 oasl.LogWatcher.createWatcher SLF4J impl is org.slf4j.impl.Log4jLoggerFactory
   [junit4]   2> 894771 T2526 oasl.LogWatcher.newRegisteredLogWatcher Registering Log Listener [Log4j (org.slf4j.impl.Log4jLoggerFactory)]
   [junit4]   2> 894772 T2526 oasc.CoreContainer.load Host Name: 127.0.0.1
   [junit4]   2> 894772 T2526 oasc.ZkContainer.initZooKeeper Zookeeper client=127.0.0.1:19429/solr
   [junit4]   2> 894773 T2526 oasc.ZkController.checkChrootPath zkHost includes chroot
   [junit4]   2> 894774 T2526 oascc.ConnectionManager.waitForConnected Waiting for client to connect to ZooKeeper
   [junit4]   2> 894777 T2570 oascc.ConnectionManager.process Watcher org.apache.solr.common.cloud.ConnectionManager@76707f7f name:ZooKeeperConnection Watcher:127.0.0.1:19429 got event WatchedEvent state:SyncConnected type:None path:null path:null type:None
   [junit4]   2> 894777 T2526 oascc.ConnectionManager.waitForConnected Client is connected to ZooKeeper
   [junit4]   2> 894780 T2526 oascc.ConnectionManager.waitForConnected Waiting for client to connect to ZooKeeper
   [junit4]   2> 894782 T2573 oascc.ConnectionManager.process Watcher org.apache.solr.common.cloud.ConnectionManager@780aefef name:ZooKeeperConnection Watcher:127.0.0.1:19429/solr got event WatchedEvent state:SyncConnected type:None path:null path:null type:None
   [junit4]   2> 894783 T2526 oascc.ConnectionManager.waitForConnected Client is connected to ZooKeeper
   [junit4]   2> 894794 T2526 oascc.ZkStateReader.createClusterStateWatchersAndUpdate Updating cluster state from ZooKeeper... 
   [junit4]   2> 895797 T2526 oasc.ZkController.createEphemeralLiveNode Register node as live in ZooKeeper:/live_nodes/127.0.0.1:19439_hg_i%2Fk
   [junit4]   2> 895799 T2526 oascc.SolrZkClient.makePath makePath: /live_nodes/127.0.0.1:19439_hg_i%2Fk
   [junit4]   2> 895803 T2552 oascc.ZkStateReader$3.process Updating live nodes... (2)
   [junit4]   2> 895803 T2573 oascc.ZkStateReader$3.process Updating live nodes... (2)
   [junit4]   2> 895803 T2558 oascc.ZkStateReader$3.process Updating live nodes... (2)
   [junit4]   2> 895816 T2526 oass.SolrDispatchFilter.init user.dir=/usr/home/hudson/hudson-slave/workspace/Lucene-Solr-Tests-trunk-Java7/solr/build/solr-core/test/J1
   [junit4]   2> 895816 T2526 oass.SolrDispatchFilter.init SolrDispatchFilter.init() done
   [junit4]   2> 896167 T2526 oejs.Server.doStart jetty-8.1.10.v20130312
   [junit4]   2> 896170 T2526 oejs.AbstractConnector.doStart Started SocketConnector@127.0.0.1:19445
   [junit4]   2> 896171 T2526 oass.SolrDispatchFilter.init SolrDispatchFilter.init()
   [junit4]   2> 896171 T2526 oasc.SolrResourceLoader.locateSolrHome JNDI not configured for solr (NoInitialContextEx)
   [junit4]   2> 896172 T2526 oasc.SolrResourceLoader.locateSolrHome using system property solr.solr.home: ../../../../../../../../../../../usr/home/hudson/hudson-slave/workspace/Lucene-Solr-Tests-trunk-Java7/solr/build/solr-core/test/J1/./org.apache.solr.cloud.CollectionsAPIDistributedZkTest-jetty2-1388642932967
   [junit4]   2> 896172 T2526 oasc.SolrResourceLoader.<init> new SolrResourceLoader for directory: '../../../../../../../../../../../usr/home/hudson/hudson-slave/workspace/Lucene-Solr-Tests-trunk-Java7/solr/build/solr-core/test/J1/./org.apache.solr.cloud.CollectionsAPIDistributedZkTest-jetty2-1388642932967/'
   [junit4]   2> 896213 T2526 oasc.ConfigSolr.fromFile Loading container configuration from /usr/home/hudson/hudson-slave/workspace/Lucene-Solr-Tests-trunk-Java7/solr/build/solr-core/test/J1/../../../../../../../../../../../usr/home/hudson/hudson-slave/workspace/Lucene-Solr-Tests-trunk-Java7/solr/build/solr-core/test/J1/./org.apache.solr.cloud.CollectionsAPIDistributedZkTest-jetty2-1388642932967/solr.xml
   [junit4]   2> 896311 T2526 oasc.CoreContainer.<init> New CoreContainer 204993854
   [junit4]   2> 896312 T2526 oasc.CoreContainer.load Loading cores into CoreContainer [instanceDir=../../../../../../../../../../../usr/home/hudson/hudson-slave/workspace/Lucene-Solr-Tests-trunk-Java7/solr/build/solr-core/test/J1/./org.apache.solr.cloud.CollectionsAPIDistributedZkTest-jetty2-1388642932967/]
   [junit4]   2> 896314 T2526 oashc.HttpShardHandlerFactory.getParameter Setting socketTimeout to: 120000
   [junit4]   2> 896315 T2526 oashc.HttpShardHandlerFactory.getParameter Setting urlScheme to: http://
   [junit4]   2> 896315 T2526 oashc.HttpShardHandlerFactory.getParameter Setting connTimeout to: 15000
   [junit4]   2> 896316 T2526 oashc.HttpShardHandlerFactory.getParameter Setting maxConnectionsPerHost to: 20
   [junit4]   2> 896316 T2526 oashc.HttpShardHandlerFactory.getParameter Setting corePoolSize to: 0
   [junit4]   2> 896316 T2526 oashc.HttpShardHandlerFactory.getParameter Setting maximumPoolSize to: 2147483647
   [junit4]   2> 896317 T2526 oashc.HttpShardHandlerFactory.getParameter Setting maxThreadIdleTime to: 5
   [junit4]   2> 896317 T2526 oashc.HttpShardHandlerFactory.getParameter Setting sizeOfQueue to: -1
   [junit4]   2> 896318 T2526 oashc.HttpShardHandlerFactory.getParameter Setting fairnessPolicy to: false
   [junit4]   2> 896336 T2526 oasl.LogWatcher.createWatcher SLF4J impl is org.slf4j.impl.Log4jLoggerFactory
   [junit4]   2> 896337 T2526 oasl.LogWatcher.newRegisteredLogWatcher Registering Log Listener [Log4j (org.slf4j.impl.Log4jLoggerFactory)]
   [junit4]   2> 896337 T2526 oasc.CoreContainer.load Host Name: 127.0.0.1
   [junit4]   2> 896338 T2526 oasc.ZkContainer.initZooKeeper Zookeeper client=127.0.0.1:19429/solr
   [junit4]   2> 896338 T2526 oasc.ZkController.checkChrootPath zkHost includes chroot
   [junit4]   2> 896340 T2526 oascc.ConnectionManager.waitForConnected Waiting for client to connect to ZooKeeper
   [junit4]   2> 896342 T2586 oascc.ConnectionManager.process Watcher org.apache.solr.common.cloud.ConnectionManager@3caf4997 name:ZooKeeperConnection Watcher:127.0.0.1:19429 got event WatchedEvent state:SyncConnected type:None path:null path:null type:None
   [junit4]   2> 896344 T2526 oascc.ConnectionManager.waitForConnected Client is connected to ZooKeeper
   [junit4]   2> 896395 T2526 oascc.ConnectionManager.waitForConnected Waiting for client to connect to ZooKeeper
   [junit4]   2> 896397 T2589 oascc.ConnectionManager.process Watcher org.apache.solr.common.cloud.ConnectionManager@775125ab name:ZooKeeperConnection Watcher:127.0.0.1:19429/solr got event WatchedEvent state:SyncConnected type:None path:null path:null type:None
   [junit4]   2> 896398 T2526 oascc.ConnectionManager.waitForConnected Client is connected to ZooKeeper
   [junit4]   2> 896408 T2526 oascc.ZkStateReader.createClusterStateWatchersAndUpdate Updating cluster state from ZooKeeper... 
   [junit4]   2> 897411 T2526 oasc.ZkController.createEphemeralLiveNode Register node as live in ZooKeeper:/live_nodes/127.0.0.1:19445_hg_i%2Fk
   [junit4]   2> 897414 T2526 oascc.SolrZkClient.makePath makePath: /live_nodes/127.0.0.1:19445_hg_i%2Fk
   [junit4]   2> 897417 T2558 oascc.ZkStateReader$3.process Updating live nodes... (3)
   [junit4]   2> 897418 T2589 oascc.ZkStateReader$3.process Updating live nodes... (3)
   [junit4]   2> 897418 T2573 oascc.ZkStateReader$3.process Updating live nodes... (3)
   [junit4]   2> 897417 T2552 oascc.ZkStateReader$3.process Updating live nodes... (3)
   [junit4]   2> 897435 T2526 oass.SolrDispatchFilter.init user.dir=/usr/home/hudson/hudson-slave/workspace/Lucene-Solr-Tests-trunk-Java7/solr/build/solr-core/test/J1
   [junit4]   2> 897436 T2526 oass.SolrDispatchFilter.init SolrDispatchFilter.init() done
   [junit4]   2> 897724 T2526 oejs.Server.doStart jetty-8.1.10.v20130312
   [junit4]   2> 897727 T2526 oejs.AbstractConnector.doStart Started SocketConnector@127.0.0.1:19448
   [junit4]   2> 897727 T2526 oass.SolrDispatchFilter.init SolrDispatchFilter.init()
   [junit4]   2> 897728 T2526 oasc.SolrResourceLoader.locateSolrHome JNDI not configured for solr (NoInitialContextEx)
   [junit4]   2> 897728 T2526 oasc.SolrResourceLoader.locateSolrHome using system property solr.solr.home: ../../../../../../../../../../../usr/home/hudson/hudson-slave/workspace/Lucene-Solr-Tests-trunk-Java7/solr/build/solr-core/test/J1/./org.apache.solr.cloud.CollectionsAPIDistributedZkTest-jetty3-1388642934586
   [junit4]   2> 897729 T2526 oasc.SolrResourceLoader.<init> new SolrResourceLoader for directory: '../../../../../../../../../../../usr/home/hudson/hudson-slave/workspace/Lucene-Solr-Tests-trunk-Java7/solr/build/solr-core/test/J1/./org.apache.solr.cloud.CollectionsAPIDistributedZkTest-jetty3-1388642934586/'
   [junit4]   2> 897770 T2526 oasc.ConfigSolr.fromFile Loading container configuration from /usr/home/hudson/hudson-slave/workspace/Lucene-Solr-Tests-trunk-Java7/solr/build/solr-core/test/J1/../../../../../../../../../../../usr/home/hudson/hudson-slave/workspace/Lucene-Solr-Tests-trunk-Java7/solr/build/solr-core/test/J1/./org.apache.solr.cloud.CollectionsAPIDistributedZkTest-jetty3-1388642934586/solr.xml
   [junit4]   2> 897869 T2526 oasc.CoreContainer.<init> New CoreContainer 1033609229
   [junit4]   2> 897870 T2526 oasc.CoreContainer.load Loading cores into CoreContainer [instanceDir=../../../../../../../../../../../usr/home/hudson/hudson-slave/workspace/Lucene-Solr-Tests-trunk-Java7/solr/build/solr-core/test/J1/./org.apache.solr.cloud.CollectionsAPIDistributedZkTest-jetty3-1388642934586/]
   [junit4]   2> 897872 T2526 oashc.HttpShardHandlerFactory.getParameter Setting socketTimeout to: 120000
   [junit4]   2> 897873 T2526 oashc.HttpShardHandlerFactory.getParameter Setting urlScheme to: http://
   [junit4]   2> 897873 T2526 oashc.HttpShardHandlerFactory.getParameter Setting connTimeout to: 15000
   [junit4]   2> 897874 T2526 oashc.HttpShardHandlerFactory.getParameter Setting maxConnectionsPerHost to: 20
   [junit4]   2> 897874 T2526 oashc.HttpShardHandlerFactory.getParameter Setting corePoolSize to: 0
   [junit4]   2> 897875 T2526 oashc.HttpShardHandlerFactory.getParameter Setting maximumPoolSize to: 2147483647
   [junit4]   2> 897875 T2526 oashc.HttpShardHandlerFactory.getParameter Setting maxThreadIdleTime to: 5
   [junit4]   2> 897875 T2526 oashc.HttpShardHandlerFactory.getParameter Setting sizeOfQueue to: -1
   [junit4]   2> 897876 T2526 oashc.HttpShardHandlerFactory.getParameter Setting fairnessPolicy to: false
   [junit4]   2> 897895 T2526 oasl.LogWatcher.createWatcher SLF4J impl is org.slf4j.impl.Log4jLoggerFactory
   [junit4]   2> 897896 T2526 oasl.LogWatcher.newRegisteredLogWatcher Registering Log Listener [Log4j (org.slf4j.impl.Log4jLoggerFactory)]
   [junit4]   2> 897896 T2526 oasc.CoreContainer.load Host Name: 127.0.0.1
   [junit4]   2> 897897 T2526 oasc.ZkContainer.initZooKeeper Zookeeper client=127.0.0.1:19429/solr
   [junit4]   2> 897897 T2526 oasc.ZkController.checkChrootPath zkHost includes chroot
   [junit4]   2> 897898 T2526 oascc.ConnectionManager.waitForConnected Waiting for client to connect to ZooKeeper
   [junit4]   2> 897902 T2602 oascc.ConnectionManager.process Watcher org.apache.solr.common.cloud.ConnectionManager@61ab73c3 name:ZooKeeperConnection Watcher:127.0.0.1:19429 got event WatchedEvent state:SyncConnected type:None path:null path:null type:None
   [junit4]   2> 897902 T2526 oascc.ConnectionManager.waitForConnected Client is connected to ZooKeeper
   [junit4]   2> 897916 T2526 oascc.ConnectionManager.waitForConnected Waiting for client to connect to ZooKeeper
   [junit4]   2> 897918 T2605 oascc.ConnectionManager.process Watcher org.apache.solr.common.cloud.ConnectionManager@283e5791 name:ZooKeeperConnection Watcher:127.0.0.1:19429/solr got event WatchedEvent state:SyncConnected type:None path:null path:null type:None
   [junit4]   2> 897919 T2526 oascc.ConnectionManager.waitForConnected Client is connected to ZooKeeper
   [junit4]   2> 897928 T2526 oascc.ZkStateReader.createClusterStateWatchersAndUpdate Updating cluster state from ZooKeeper... 
   [junit4]   2> 898932 T2526 oasc.ZkController.createEphemeralLiveNode Register node as live in ZooKeeper:/live_nodes/127.0.0.1:19448_hg_i%2Fk
   [junit4]   2> 898935 T2526 oascc.SolrZkClient.makePath makePath: /live_nodes/127.0.0.1:19448_hg_i%2Fk
   [junit4]   2> 898938 T2558 oascc.ZkStateReader$3.process Updating live nodes... (4)
   [junit4]   2> 898939 T2589 oascc.ZkStateReader$3.process Updating live nodes... (4)
   [junit4]   2> 898939 T2605 oascc.ZkStateReader$3.process Updating live nodes... (4)
   [junit4]   2> 898939 T2552 oascc.ZkStateReader$3.process Updating live nodes... (4)
   [junit4]   2> 898939 T2573 oascc.ZkStateReader$3.process Updating live nodes... (4)
   [junit4]   2> 898952 T2526 oass.SolrDispatchFilter.init user.dir=/usr/home/hudson/hudson-slave/workspace/Lucene-Solr-Tests-trunk-Java7/solr/build/solr-core/test/J1
   [junit4]   2> 898952 T2526 oass.SolrDispatchFilter.init SolrDispatchFilter.init() done
   [junit4]   2> 899148 T2526 oejs.Server.doStart jetty-8.1.10.v20130312
   [junit4]   2> 899151 T2526 oejs.AbstractConnector.doStart Started SocketConnector@127.0.0.1:19453
   [junit4]   2> 899151 T2526 oass.SolrDispatchFilter.init SolrDispatchFilter.init()
   [junit4]   2> 899152 T2526 oasc.SolrResourceLoader.locateSolrHome JNDI not configured for solr (NoInitialContextEx)
   [junit4]   2> 899152 T2526 oasc.SolrResourceLoader.locateSolrHome using system property solr.solr.home: ../../../../../../../../../../../usr/home/hudson/hudson-slave/workspace/Lucene-Solr-Tests-trunk-Java7/solr/build/solr-core/test/J1/./org.apache.solr.cloud.CollectionsAPIDistributedZkTest-jetty4-1388642936103
   [junit4]   2> 899152 T2526 oasc.SolrResourceLoader.<init> new SolrResourceLoader for directory: '../../../../../../../../../../../usr/home/hudson/hudson-slave/workspace/Lucene-Solr-Tests-trunk-Java7/solr/build/solr-core/test/J1/./org.apache.solr.cloud.CollectionsAPIDistributedZkTest-jetty4-1388642936103/'
   [junit4]   2> 899179 T2526 oasc.ConfigSolr.fromFile Loading container configuration from /usr/home/hudson/hudson-slave/workspace/Lucene-Solr-Tests-trunk-Java7/solr/build/solr-core/test/J1/../../../../../../../../../../../usr/home/hudson/hudson-slave/workspace/Lucene-Solr-Tests-trunk-Java7/solr/build/solr-core/test/J1/./org.apache.solr.cloud.CollectionsAPIDistributedZkTest-jetty4-1388642936103/solr.xml
   [junit4]   2> 899245 T2526 oasc.CoreContainer.<init> New CoreContainer 1404247750
   [junit4]   2> 899245 T2526 oasc.CoreContainer.load Loading cores into CoreContainer [instanceDir=../../../../../../../../../../../usr/home/hudson/hudson-slave/workspace/Lucene-Solr-Tests-trunk-Java7/solr/build/solr-core/test/J1/./org.apache.solr.cloud.CollectionsAPIDistributedZkTest-jetty4-1388642936103/]
   [junit4]   2> 899247 T2526 oashc.HttpShardHandlerFactory.getParameter Setting socketTimeout to: 120000
   [junit4]   2> 899247 T2526 oashc.HttpShardHandlerFactory.getParameter Setting urlScheme to: http://
   [junit4]   2> 899247 T2526 oashc.HttpShardHandlerFactory.getParameter Setting connTimeout to: 15000
   [junit4]   2> 899248 T2526 oashc.HttpShardHandlerFactory.getParameter Setting maxConnectionsPerHost to: 20
   [junit4]   2> 899248 T2526 oashc.HttpShardHandlerFactory.getParameter Setting corePoolSize to: 0
   [junit4]   2> 899248 T2526 oashc.HttpShardHandlerFactory.getParameter Setting maximumPoolSize to: 2147483647
   [junit4]   2> 899249 T2526 oashc.HttpShardHandlerFactory.getParameter Setting maxThreadIdleTime to: 5
   [junit4]   2> 899249 T2526 oashc.HttpShardHandlerFactory.getParameter Setting sizeOfQueue to: -1
   [junit4]   2> 899249 T2526 oashc.HttpShardHandlerFactory.getParameter Setting fairnessPolicy to: false
   [junit4]   2> 899261 T2526 oasl.LogWatcher.createWatcher SLF4J impl is org.slf4j.impl.Log4jLoggerFactory
   [junit4]   2> 899262 T2526 oasl.LogWatcher.newRegisteredLogWatcher Registering Log Listener [Log4j (org.slf4j.impl.Log4jLoggerFactory)]
   [junit4]   2> 899262 T2526 oasc.CoreContainer.load Host Name: 127.0.0.1
   [junit4]   2> 899262 T2526 oasc.ZkContainer.initZooKeeper Zookeeper client=127.0.0.1:19429/solr
   [junit4]   2> 899263 T2526 oasc.ZkController.checkChrootPath zkHost includes chroot
   [junit4]   2> 899264 T2526 oascc.ConnectionManager.waitForConnected Waiting for client to connect to ZooKeeper
   [junit4]   2> 899266 T2618 oascc.ConnectionManager.process Watcher org.apache.solr.common.cloud.ConnectionManager@5f1c50e0 name:ZooKeeperConnection Watcher:127.0.0.1:19429 got event WatchedEvent state:SyncConnected type:None path:null path:null type:None
   [junit4]   2> 899267 T2526 oascc.ConnectionManager.waitForConnected Client is connected to ZooKeeper
   [junit4]   2> 899270 T2526 oascc.ConnectionManager.waitForConnected Waiting for client to connect to ZooKeeper
   [junit4]   2> 899278 T2621 oascc.ConnectionManager.process Watcher org.apache.solr.common.cloud.ConnectionManager@719495d4 name:ZooKeeperConnection Watcher:127.0.0.1:19429/solr got event WatchedEvent state:SyncConnected type:None path:null path:null type:None
   [junit4]   2> 899278 T2526 oascc.ConnectionManager.waitForConnected Client is connected to ZooKeeper
   [junit4]   2> 899283 T2526 oascc.ZkStateReader.createClusterStateWatchersAndUpdate Updating cluster state from ZooKeeper... 
   [junit4]   2> 900286 T2526 oasc.ZkController.createEphemeralLiveNode Register node as live in ZooKeeper:/live_nodes/127.0.0.1:19453_hg_i%2Fk
   [junit4]   2> 900298 T2526 oascc.SolrZkClient.makePath makePath: /live_nodes/127.0.0.1:19453_hg_i%2Fk
   [junit4]   2> 900301 T2621 oascc.ZkStateReader$3.process Updating live nodes... (5)
   [junit4]   2> 900302 T2552 oascc.ZkStateReader$3.process Updating live nodes... (5)
   [junit4]   2> 900302 T2558 oascc.ZkStateReader$3.process Updating live nodes... (5)
   [junit4]   2> 900302 T2589 oascc.ZkStateReader$3.process Updating live nodes... (5)
   [junit4]   2> 900302 T2573 oascc.ZkStateReader$3.process Updating live nodes... (5)
   [junit4]   2> 900302 T2605 oascc.ZkStateReader$3.process Updating live nodes... (5)
   [junit4]   2> 900320 T2526 oass.SolrDispatchFilter.init user.dir=/usr/home/hudson/hudson-slave/workspace/Lucene-Solr-Tests-trunk-Java7/solr/build/solr-core/test/J1
   [junit4]   2> 900321 T2526 oass.SolrDispatchFilter.init SolrDispatchFilter.init() done
   [junit4]   2> 900378 T2561 oasha.CollectionsHandler.handleCreateAction Creating Collection : numShards=2&wt=javabin&replicationFactor=2&router.field=myOwnField&collection.configName=conf1&name=solrj_collection&version=2&router.name=compositeId&action=CREATE
   [junit4]   2> 900380 T2552 oasc.DistributedQueue$LatchChildWatcher.process LatchChildWatcher fired on path: /overseer/collection-queue-work state: SyncConnected type NodeChildrenChanged
   [junit4]   2> 900381 T2554 oasc.OverseerCollectionProcessor.run Overseer Collection Processor: Get the message id:/overseer/collection-queue-work/qn-0000000000 message:{
   [junit4]   2> 	  "operation":"createcollection",
   [junit4]   2> 	  "fromApi":"true",
   [junit4]   2> 	  "name":"solrj_collection",
   [junit4]   2> 	  "replicationFactor":"2",
   [junit4]   2> 	  "collection.configName":"conf1",
   [junit4]   2> 	  "numShards":"2",
   [junit4]   2> 	  "router.field":"myOwnField",
   [junit4]   2> 	  "router.name":"compositeId"}
   [junit4]   2> 900382 T2554 oasc.OverseerCollectionProcessor.processMessage WARN OverseerCollectionProcessor.processMessage : createcollection , {
   [junit4]   2> 	  "operation":"createcollection",
   [junit4]   2> 	  "fromApi":"true",
   [junit4]   2> 	  "name":"solrj_collection",
   [junit4]   2> 	  "replicationFactor":"2",
   [junit4]   2> 	  "collection.configName":"conf1",
   [junit4]   2> 	  "numShards":"2",
   [junit4]   2> 	  "router.field":"myOwnField",
   [junit4]   2> 	  "router.name":"compositeId"}
   [junit4]   2> 900382 T2554 oasc.OverseerCollectionProcessor.createConfNode creating collections conf node /collections/solrj_collection 
   [junit4]   2> 900382 T2554 oascc.SolrZkClient.makePath makePath: /collections/solrj_collection
   [junit4]   2> 900399 T2552 oasc.DistributedQueue$LatchChildWatcher.process LatchChildWatcher fired on path: /overseer/queue state: SyncConnected type NodeChildrenChanged
   [junit4]   2> 900400 T2553 oascc.ZkStateReader.updateClusterState Updating cloud state from ZooKeeper... 
   [junit4]   2> 900401 T2553 oasc.Overseer$ClusterStateUpdater.buildCollection building a new collection: solrj_collection
   [junit4]   2> 900401 T2553 oasc.Overseer$ClusterStateUpdater.createCollection Create collection solrj_collection with shards [shard1, shard2]
   [junit4]   2> 900404 T2552 oasc.DistributedQueue$LatchChildWatcher.process LatchChildWatcher fired on path: /overseer/queue state: SyncConnected type NodeChildrenChanged
   [junit4]   2> 900412 T2552 oascc.ZkStateReader$2.process A cluster state change: WatchedEvent state:SyncConnected type:NodeDataChanged path:/clusterstate.json, has occurred - updating... (live nodes size: 5)
   [junit4]   2> 900412 T2573 oascc.ZkStateReader$2.process A cluster state change: WatchedEvent state:SyncConnected type:NodeDataChanged path:/clusterstate.json, has occurred - updating... (live nodes size: 5)
   [junit4]   2> 900412 T2621 oascc.ZkStateReader$2.process A cluster state change: WatchedEvent state:SyncConnected type:NodeDataChanged path:/clusterstate.json, has occurred - updating... (live nodes size: 5)
   [junit4]   2> 900412 T2589 oascc.ZkStateReader$2.process A cluster state change: WatchedEvent state:SyncConnected type:NodeDataChanged path:/clusterstate.json, has occurred - updating... (live nodes size: 5)
   [junit4]   2> 900412 T2605 oascc.ZkStateReader$2.process A cluster state change: WatchedEvent state:SyncConnected type:NodeDataChanged path:/clusterstate.json, has occurred - updating... (live nodes size: 5)
   [junit4]   2> 900412 T2558 oascc.ZkStateReader$2.process A cluster state change: WatchedEvent state:SyncConnected type:NodeDataChanged path:/clusterstate.json, has occurred - updating... (live nodes size: 5)
   [junit4]   2> 900500 T2554 oasc.OverseerCollectionProcessor.createCollection going to create cores replicas shardNames [shard1, shard2] , repFactor : 2
   [junit4]   2> 900500 T2554 oasc.OverseerCollectionProcessor.createCollection Creating shard solrj_collection_shard1_replica1 as part of slice shard1 of collection solrj_collection on 127.0.0.1:19453_hg_i%2Fk
   [junit4]   2> 900500 T2554 oasc.OverseerCollectionProcessor.createCollection Creating shard solrj_collection_shard1_replica2 as part of slice shard1 of collection solrj_collection on 127.0.0.1:19445_hg_i%2Fk
   [junit4]   2> 900501 T2554 oasc.OverseerCollectionProcessor.createCollection Creating shard solrj_collection_shard2_replica1 as part of slice shard2 of collection solrj_collection on 127.0.0.1:19448_hg_i%2Fk
   [junit4]   2> 900501 T2554 oasc.OverseerCollectionProcessor.createCollection Creating shard solrj_collection_shard2_replica2 as part of slice shard2 of collection solrj_collection on 127.0.0.1:19435_hg_i%2Fk
   [junit4]   2> 900506 T2593 oasc.ZkController.publish publishing core=solrj_collection_shard2_replica1 state=down
   [junit4]   2> 900507 T2540 oasc.ZkController.publish publishing core=solrj_collection_shard2_replica2 state=down
   [junit4]   2> 900507 T2609 oasc.ZkController.publish publishing core=solrj_collection_shard1_replica1 state=down
   [junit4]   2> 900506 T2577 oasc.ZkController.publish publishing core=solrj_collection_shard1_replica2 state=down
   [junit4]   2> 900508 T2552 oasc.DistributedQueue$LatchChildWatcher.process LatchChildWatcher fired on path: /overseer/queue state: SyncConnected type NodeChildrenChanged
   [junit4]   2> 900508 T2593 oasc.ZkController.waitForCoreNodeName look for our core node name
   [junit4]   2> 900509 T2540 oasc.ZkController.waitForCoreNodeName look for our core node name
   [junit4]   2> 900509 T2577 oasc.ZkController.waitForCoreNodeName look for our core node name
   [junit4]   2> 900509 T2609 oasc.ZkController.waitForCoreNodeName look for our core node name
   [junit4]   2> 900510 T2553 oascc.ZkStateReader.updateClusterState Updating cloud state from ZooKeeper... 
   [junit4]   2> 900511 T2553 oasc.Overseer$ClusterStateUpdater.updateState Update state numShards=2 message={
   [junit4]   2> 	  "operation":"state",
   [junit4]   2> 	  "state":"down",
   [junit4]   2> 	  "base_url":"http://127.0.0.1:19448/hg_i/k",
   [junit4]   2> 	  "core":"solrj_collection_shard2_replica1",
   [junit4]   2> 	  "roles":null,
   [junit4]   2> 	  "node_name":"127.0.0.1:19448_hg_i%2Fk",
   [junit4]   2> 	  "shard":"shard2",
   [junit4]   2> 	  "shard_range":null,
   [junit4]   2> 	  "shard_state":"active",
   [junit4]   2> 	  "shard_parent":null,
   [junit4]   2> 	  "collection":"solrj_collection",
   [junit4]   2> 	  "numShards":"2",
   [junit4]   2> 	  "core_node_name":null}
   [junit4]   2> 900521 T2552 oasc.DistributedQueue$LatchChildWatcher.process LatchChildWatcher fired on path: /overseer/queue state: SyncConnected type NodeChildrenChanged
   [junit4]   2> 900523 T2553 oasc.Overseer$ClusterStateUpdater.updateState Update state numShards=2 message={
   [junit4]   2> 	  "operation":"state",
   [junit4]   2> 	  "state":"down",
   [junit4]   2> 	  "base_url":"http://127.0.0.1:19435/hg_i/k",
   [junit4]   2> 	  "core":"solrj_collection_shard2_replica2",
   [junit4]   2> 	  "roles":null,
   [junit4]   2> 	  "node_name":"127.0.0.1:19435_hg_i%2Fk",
   [junit4]   2> 	  "shard":"shard2",
   [junit4]   2> 	  "shard_range":null,
   [junit4]   2> 	  "shard_state":"active",
   [junit4]   2> 	  "shard_parent":null,
   [junit4]   2> 	  "collection":"solrj_collection",
   [junit4]   2> 	  "numShards":"2",
   [junit4]   2> 	  "core_node_name":null}
   [junit4]   2> 900532 T2552 oasc.DistributedQueue$LatchChildWatcher.process LatchChildWatcher fired on path: /overseer/queue state: SyncConnected type NodeChildrenChanged
   [junit4]   2> 900533 T2553 oasc.Overseer$ClusterStateUpdater.updateState Update state numShards=2 message={
   [junit4]   2> 	  "operation":"state",
   [junit4]   2> 	  "state":"down",
   [junit4]   2> 	  "base_url":"http://127.0.0.1:19453/hg_i/k",
   [junit4]   2> 	  "core":"solrj_collection_shard1_replica1",
   [junit4]   2> 	  "roles":null,
   [junit4]   2> 	  "node_name":"127.0.0.1:19453_hg_i%2Fk",
   [junit4]   2> 	  "shard":"shard1",
   [junit4]   2> 	  "shard_range":null,
   [junit4]   2> 	  "shard_state":"active",
   [junit4]   2> 	  "shard_parent":null,
   [junit4]   2> 	  "collection":"solrj_collection",
   [junit4]   2> 	  "numShards":"2",
   [junit4]   2> 	  "core_node_name":null}
   [junit4]   2> 900536 T2552 oasc.DistributedQueue$LatchChildWatcher.process LatchChildWatcher fired on path: /overseer/queue state: SyncConnected type NodeChildrenChanged
   [junit4]   2> 900537 T2553 oasc.Overseer$ClusterStateUpdater.updateState Update state numShards=2 message={
   [junit4]   2> 	  "operation":"state",
   [junit4]   2> 	  "state":"down",
   [junit4]   2> 	  "base_url":"http://127.0.0.1:19445/hg_i/k",
   [junit4]   2> 	  "core":"solrj_collection_shard1_replica2",
   [junit4]   2> 	  "roles":null,
   [junit4]   2> 	  "node_name":"127.0.0.1:19445_hg_i%2Fk",
   [junit4]   2> 	  "shard":"shard1",
   [junit4]   2> 	  "shard_range":null,
   [junit4]   2> 	  "shard_state":"active",
   [junit4]   2> 	  "shard_parent":null,
   [junit4]   2> 	  "collection":"solrj_collection",
   [junit4]   2> 	  "numShards":"2",
   [junit4]   2> 	  "core_node_name":null}
   [junit4]   2> 900539 T2552 oasc.DistributedQueue$LatchChildWatcher.process LatchChildWatcher fired on path: /overseer/queue state: SyncConnected type NodeChildrenChanged
   [junit4]   2> 900642 T2605 oascc.ZkStateReader$2.process A cluster state change: WatchedEvent state:SyncConnected type:NodeDataChanged path:/clusterstate.json, has occurred - updating... (live nodes size: 5)
   [junit4]   2> 900642 T2621 oascc.ZkStateReader$2.process A cluster state change: WatchedEvent state:SyncConnected type:NodeDataChanged path:/clusterstate.json, has occurred - updating... (live nodes size: 5)
   [junit4]   2> 900642 T2573 oascc.ZkStateReader$2.process A cluster state change: WatchedEvent state:SyncConnected type:NodeDataChanged path:/clusterstate.json, has occurred - updating... (live nodes size: 5)
   [junit4]   2> 900642 T2558 oascc.ZkStateReader$2.process A cluster state change: WatchedEvent state:SyncConnected type:NodeDataChanged path:/clusterstate.json, has occurred - updating... (live nodes size: 5)
   [junit4]   2> 900642 T2552 oascc.ZkStateReader$2.process A cluster state change: WatchedEvent state:SyncConnected type:NodeDataChanged path:/clusterstate.json, has occurred - updating... (live nodes size: 5)
   [junit4]   2> 900642 T2589 oascc.ZkStateReader$2.process A cluster state change: WatchedEvent state:SyncConnected type:NodeDataChanged path:/clusterstate.json, has occurred - updating... (live nodes size: 5)
   [junit4]   2> 901510 T2540 oasc.ZkController.waitForShardId waiting to find shard id in clusterstate for solrj_collection_shard2_replica2
   [junit4]   2> 901510 T2593 oasc.ZkController.waitForShardId waiting to find shard id in clusterstate for solrj_collection_shard2_replica1
   [junit4]   2> 901511 T2577 oasc.ZkController.waitForShardId waiting to find shard id in clusterstate for solrj_collection_shard1_replica2
   [junit4]   2> 901511 T2540 oasc.SolrXMLCoresLocator.doPersist Persisted core descriptions to /usr/home/hudson/hudson-slave/workspace/Lucene-Solr-Tests-trunk-Java7/solr/build/solr-core/test/J1/../../../../../../../../../../../usr/home/hudson/hudson-slave/workspace/Lucene-Solr-Tests-trunk-Java7/solr/build/solr-core/test/J1/./org.apache.solr.cloud.CollectionsAPIDistributedZkTest-controljetty-1388642930959/solr.xml
   [junit4]   2> 901511 T2609 oasc.ZkController.waitForShardId waiting to find shard id in clusterstate for solrj_collection_shard1_replica1
   [junit4]   2> 901512 T2540 oasc.CoreContainer.create Creating SolrCore 'solrj_collection_shard2_replica2' using instanceDir: ../../../../../../../../../../../usr/home/hudson/hudson-slave/workspace/Lucene-Solr-Tests-trunk-Java7/solr/build/solr-core/test/J1/./org.apache.solr.cloud.CollectionsAPIDistributedZkTest-controljetty-1388642930959/solrj_collection_shard2_replica2
   [junit4]   2> 901512 T2593 oasc.SolrXMLCoresLocator.doPersist Persisted core descriptions to /usr/home/hudson/hudson-slave/workspace/Lucene-Solr-Tests-trunk-Java7/solr/build/solr-core/test/J1/../../../../../../../../../../../usr/home/hudson/hudson-slave/workspace/Lucene-Solr-Tests-trunk-Java7/solr/build/solr-core/test/J1/./org.apache.solr.cloud.CollectionsAPIDistributedZkTest-jetty3-1388642934586/solr.xml
   [junit4]   2> 901513 T2609 oasc.SolrXMLCoresLocator.doPersist Persisted core descriptions to /usr/home/hudson/hudson-slave/workspace/Lucene-Solr-Tests-trunk-Java7/solr/build/solr-core/test/J1/../../../../../../../../../../../usr/home/hudson/hudson-slave/workspace/Lucene-Solr-Tests-trunk-Java7/solr/build/solr-core/test/J1/./org.apache.solr.cloud.CollectionsAPIDistributedZkTest-jetty4-1388642936103/solr.xml
   [junit4]   2> 901513 T2540 oasc.ZkController.createCollectionZkNode Check for collection zkNode:solrj_collection
   [junit4]   2> 901512 T2577 oasc.SolrXMLCoresLocator.doPersist Persisted core descriptions to /usr/home/hudson/hudson-slave/workspace/Lucene-Solr-Tests-trunk-Java7/solr/build/solr-core/test/J1/../../../../../../../../../../../usr/home/hudson/hudson-slave/workspace/Lucene-Solr-Tests-trunk-Java7/solr/build/solr-core/test/J1/./org.apache.solr.cloud.CollectionsAPIDistributedZkTest-jetty2-1388642932967/solr.xml
   [junit4]   2> 901513 T2609 oasc.CoreContainer.create Creating SolrCore 'solrj_collection_shard1_replica1' using instanceDir: ../../../../../../../../../../../usr/home/hudson/hudson-slave/workspace/Lucene-Solr-Tests-trunk-Java7/solr/build/solr-core/test/J1/./org.apache.solr.cloud.CollectionsAPIDistributedZkTest-jetty4-1388642936103/solrj_collection_shard1_replica1
   [junit4]   2> 901513 T2593 oasc.CoreContainer.create Creating SolrCore 'solrj_collection_shard2_replica1' using instanceDir: ../../../../../../../../../../../usr/home/hudson/hudson-slave/workspace/Lucene-Solr-Tests-trunk-Java7/solr/build/solr-core/test/J1/./org.apache.solr.cloud.CollectionsAPIDistributedZkTest-jetty3-1388642934586/solrj_collection_shard2_replica1
   [junit4]   2> 901514 T2609 oasc.ZkController.createCollectionZkNode Check for collection zkNode:solrj_collection
   [junit4]   2> 901514 T2540 oasc.ZkController.createCollectionZkNode Collection zkNode exists
   [junit4]   2> 901514 T2577 oasc.CoreContainer.create Creating SolrCore 'solrj_collection_shard1_replica2' using instanceDir: ../../../../../../../../../../../usr/home/hudson/hudson-slave/workspace/Lucene-Solr-Tests-trunk-Java7/solr/build/solr-core/test/J1/./org.apache.solr.cloud.CollectionsAPIDistributedZkTest-jetty2-1388642932967/solrj_collection_shard1_replica2
   [junit4]   2> 901516 T2609 oasc.ZkController.createCollectionZkNode Collection zkNode exists
   [junit4]   2> 901516 T2540 oascc.ZkStateReader.readConfigName Load collection config from:/collections/solrj_collection
   [junit4]   2> 901515 T2593 oasc.ZkController.createCollectionZkNode Check for collection zkNode:solrj_collection
   [junit4]   2> 901516 T2609 oascc.ZkStateReader.readConfigName Load collection config from:/collections/solrj_collection
   [junit4]   2> 901516 T2577 oasc.ZkController.createCollectionZkNode Check for collection zkNode:solrj_collection
   [junit4]   2> 901518 T2540 oasc.SolrResourceLoader.<init> new SolrResourceLoader for directory: '../../../../../../../../../../../usr/home/hudson/hudson-slave/workspace/Lucene-Solr-Tests-trunk-Java7/solr/build/solr-core/test/J1/./org.apache.solr.cloud.CollectionsAPIDistributedZkTest-controljetty-1388642930959/solrj_collection_shard2_replica2/'
   [junit4]   2> 901518 T2593 oasc.ZkController.createCollectionZkNode Collection zkNode exists
   [junit4]   2> 901518 T2609 oasc.SolrResourceLoader.<init> new SolrResourceLoader for directory: '../../../../../../../../../../../usr/home/hudson/hudson-slave/workspace/Lucene-Solr-Tests-trunk-Java7/solr/build/solr-core/test/J1/./org.apache.solr.cloud.CollectionsAPIDistributedZkTest-jetty4-1388642936103/solrj_collection_shard1_replica1/'
   [junit4]   2> 901518 T2577 oasc.ZkController.createCollectionZkNode Collection zkNode exists
   [junit4]   2> 901519 T2593 oascc.ZkStateReader.readConfigName Load collection config from:/collections/solrj_collection
   [junit4]   2> 901519 T2577 oascc.ZkStateReader.readConfigName Load collection config from:/collections/solrj_collection
   [junit4]   2> 901521 T2593 oasc.SolrResourceLoader.<init> new SolrResourceLoader for directory: '../../../../../../../../../../../usr/home/hudson/hudson-slave/workspace/Lucene-Solr-Tests-trunk-Java7/solr/build/solr-core/test/J1/./org.apache.solr.cloud.CollectionsAPIDistributedZkTest-jetty3-1388642934586/solrj_collection_shard2_replica1/'
   [junit4]   2> 901521 T2577 oasc.SolrResourceLoader.<init> new SolrResourceLoader for directory: '../../../../../../../../../../../usr/home/hudson/hudson-slave/workspace/Lucene-Solr-Tests-trunk-Java7/solr/build/solr-core/test/J1/./org.apache.solr.cloud.CollectionsAPIDistributedZkTest-jetty2-1388642932967/solrj_collection_shard1_replica2/'
   [junit4]   2> 901592 T2540 oasc.SolrConfig.<init> Using Lucene MatchVersion: LUCENE_50
   [junit4]   2> 901596 T2577 oasc.SolrConfig.<init> Using Lucene MatchVersion: LUCENE_50
   [junit4]   2> 901600 T2609 oasc.SolrConfig.<init> Using Lucene MatchVersion: LUCENE_50
   [junit4]   2> 901605 T2593 oasc.SolrConfig.<init> Using Lucene MatchVersion: LUCENE_50
   [junit4]   2> 901675 T2540 oasc.SolrConfig.<init> Loaded SolrConfig: solrconfig.xml
   [junit4]   2> 901676 T2577 oasc.SolrConfig.<init> Loaded SolrConfig: solrconfig.xml
   [junit4]   2> 901680 T2609 oasc.SolrConfig.<init> Loaded SolrConfig: solrconfig.xml
   [junit4]   2> 901683 T2593 oasc.SolrConfig.<init> Loaded SolrConfig: solrconfig.xml
   [junit4]   2> 901777 T2540 oass.IndexSchema.readSchema Reading Solr Schema from schema.xml
   [junit4]   2> 901777 T2577 oass.IndexSchema.readSchema Reading Solr Schema from schema.xml
   [junit4]   2> 901781 T2609 oass.IndexSchema.readSchema Reading Solr Schema from schema.xml
   [junit4]   2> 901785 T2593 oass.IndexSchema.readSchema Reading Solr Schema from schema.xml
   [junit4]   2> 901790 T2540 oass.IndexSchema.readSchema [solrj_collection_shard2_replica2] Schema name=test
   [junit4]   2> 901790 T2577 oass.IndexSchema.readSchema [solrj_collection_shard1_replica2] Schema name=test
   [junit4]   2> 901794 T2609 oass.IndexSchema.readSchema [solrj_collection_shard1_replica1] Schema name=test
   [junit4]   2> 901797 T2593 oass.IndexSchema.readSchema [solrj_collection_shard2_replica1] Schema name=test
   [junit4]   2> 902604 T2593 oass.OpenExchangeRatesOrgProvider.init Initialized with rates=open-exchange-rates.json, refreshInterval=1440.
   [junit4]   2> 902604 T2609 oass.OpenExchangeRatesOrgProvider.init Initialized with rates=open-exchange-rates.json, refreshInterval=1440.
   [junit4]   2> 902607 T2577 oass.OpenExchangeRatesOrgProvider.init Initialized with rates=open-exchange-rates.json, refreshInterval=1440.
   [junit4]   2> 902607 T2540 oass.OpenExchangeRatesOrgProvider.init Initialized with rates=open-exchange-rates.json, refreshInterval=1440.
   [junit4]   2> 902637 T2609 oass.IndexSchema.readSchema default search field in schema is text
   [junit4]   2> 902638 T2540 oass.IndexSchema.readSchema default search field in schema is text
   [junit4]   2> 902638 T2577 oass.IndexSchema.readSchema default search field in schema is text
   [junit4]   2> 902639 T2593 oass.IndexSchema.readSchema default search field in schema is text
   [junit4]   2> 902642 T2609 oass.IndexSchema.readSchema unique key field: id
   [junit4]   2> 902642 T2540 oass.IndexSchema.readSchema unique key field: id
   [junit4]   2> 902643 T2577 oass.IndexSchema.readSchema unique key field: id
   [junit4]   2> 902643 T2593 oass.IndexSchema.readSchema unique key field: id
   [junit4]   2> 902659 T2540 oass.FileExchangeRateProvider.reload Reloading exchange rates from file currency.xml
   [junit4]   2> 902659 T2577 oass.FileExchangeRateProvider.reload Reloading exchange rates from file currency.xml
   [junit4]   2> 902659 T2593 oass.FileExchangeRateProvider.reload Reloading exchange rates from file currency.xml
   [junit4]   2> 902659 T2609 oass.FileExchangeRateProvider.reload Reloading exchange rates from file currency.xml
   [junit4]   2> 902664 T2540 oass.FileExchangeRateProvider.reload Reloading exchange rates from file currency.xml
   [junit4]   2> 902665 T2577 oass.FileExchangeRateProvider.reload Reloading exchange rates from file currency.xml
   [junit4]   2> 902665 T2593 oass.FileExchangeRateProvider.reload Reloading exchange rates from file currency.xml
   [junit4]   2> 902665 T2609 oass.FileExchangeRateProvider.reload Reloading exchange rates from file currency.xml
   [junit4]   2> 902670 T2540 oass.OpenExchangeRatesOrgProvider.reload Reloading exchange rates from open-exchange-rates.json
   [junit4]   2> 902670 T2577 oass.OpenExchangeRatesOrgProvider.reload Reloading exchange rates from open-exchange-rates.json
   [junit4]   2> 902670 T2593 oass.OpenExchangeRatesOrgProvider.reload Reloading exchange rates from open-exchange-rates.json
   [junit4]   2> 902671 T2540 oass.OpenExchangeRatesOrgProvider$OpenExchangeRates.<init> WARN Unknown key IMPORTANT NOTE
   [junit4]   2> 902671 T2609 oass.OpenExchangeRatesOrgProvider.reload Reloading exchange rates from open-exchange-rates.json
   [junit4]   2> 902673 T2593 oass.OpenExchangeRatesOrgProvider$OpenExchangeRates.<init> WARN Unknown key IMPORTANT NOTE
   [junit4]   2> 902672 T2577 oass.OpenExchangeRatesOrgProvider$OpenExchangeRates.<init> WARN Unknown key IMPORTANT NOTE
   [junit4]   2> 902672 T2540 oass.OpenExchangeRatesOrgProvider$OpenExchangeRates.<init> WARN Expected key, got STRING
   [junit4]   2> 902674 T2609 oass.OpenExchangeRatesOrgProvider$OpenExchangeRates.<init> WARN Unknown key IMPORTANT NOTE
   [junit4]   2> 902674 T2577 oass.OpenExchangeRatesOrgProvider$OpenExchangeRates.<init> WARN Expected key, got STRING
   [junit4]   2> 902673 T2593 oass.OpenExchangeRatesOrgProvider$OpenExchangeRates.<init> WARN Expected key, got STRING
   [junit4]   2> 902675 T2577 oass.OpenExchangeRatesOrgProvider.reload Reloading exchange rates from open-exchange-rates.json
   [junit4]   2> 902674 T2609 oass.OpenExchangeRatesOrgProvider$OpenExchangeRates.<init> WARN Expected key, got STRING
   [junit4]   2> 902674 T2540 oass.OpenExchangeRatesOrgProvider.reload Reloading exchange rates from open-exchange-rates.json
   [junit4]   2> 902676 T2609 oass.OpenExchangeRatesOrgProvider.reload Reloading exchange rates from open-exchange-rates.json
   [junit4]   2> 902675 T2593 oass.OpenExchangeRatesOrgProvider.reload Reloading exchange rates from open-exchange-rates.json
   [junit4]   2> 902676 T2577 oass.OpenExchangeRatesOrgProvider$OpenExchangeRates.<init> WARN Unknown key IMPORTANT NOTE
   [junit4]   2> 902677 T2540 oass.OpenExchangeRatesOrgProvider$OpenExchangeRates.<init> WARN Unknown key IMPORTANT NOTE
   [junit4]   2> 902678 T2609 oass.OpenExchangeRatesOrgProvider$OpenExchangeRates.<init> WARN Unknown key IMPORTANT NOTE
   [junit4]   2> 902677 T2577 oass.OpenExchangeRatesOrgProvider$OpenExchangeRates.<init> WARN Expected key, got STRING
   [junit4]   2> 902678 T2609 oass.OpenExchangeRatesOrgProvider$OpenExchangeRates.<init> WARN Expected key, got STRING
   [junit4]   2> 902678 T2593 oass.OpenExchangeRatesOrgProvider$OpenExchangeRates.<init> WARN Unknown key IMPORTANT NOTE
   [junit4]   2> 902678 T2540 oass.OpenExchangeRatesOrgProvider$OpenExchangeRates.<init> WARN Expected key, got STRING
   [junit4]   2> 902679 T2593 oass.OpenExchangeRatesOrgProvider$OpenExchangeRates.<init> WARN Expected key, got STRING
   [junit4]   2> 902679 T2609 oasc.SolrCore.initDirectoryFactory org.apache.solr.core.MockDirectoryFactory
   [junit4]   2> 902679 T2577 oasc.SolrCore.initDirectoryFactory org.apache.solr.core.MockDirectoryFactory
   [junit4]   2> 902681 T2609 oasc.SolrCore.<init> [solrj_collection_shard1_replica1] Opening new SolrCore at ../../../../../../../../../../../usr/home/hudson/hudson-slave/workspace/Lucene-Solr-Tests-trunk-Java7/solr/build/solr-core/test/J1/./org.apache.solr.cloud.CollectionsAPIDistributedZkTest-jetty4-1388642936103/solrj_collection_shard1_replica1/, dataDir=../../../../../../../../../../../usr/home/hudson/hudson-slave/workspace/Lucene-Solr-Tests-trunk-Java7/solr/build/solr-core/test/J1/./org.apache.solr.cloud.CollectionsAPIDistributedZkTest-jetty4-1388642936103/solrj_collection_shard1_replica1/data/
   [junit4]   2> 902680 T2593 oasc.SolrCore.initDirectoryFactory org.apache.solr.core.MockDirectoryFactory
   [junit4]   2> 902680 T2540 oasc.SolrCore.initDirectoryFactory org.apache.solr.core.MockDirectoryFactory
   [junit4]   2> 902682 T2593 oasc.SolrCore.<init> [solrj_collection_shard2_replica1] Opening new SolrCore at ../../../../../../../../../../../usr/home/hudson/hudson-slave/workspace/Lucene-Solr-Tests-trunk-Java7/solr/build/solr-core/test/J1/./org.apache.solr.cloud.CollectionsAPIDistributedZkTest-jetty3-1388642934586/solrj_collection_shard2_replica1/, dataDir=../../../../../../../../../../../usr/home/hudson/hudson-slave/workspace/Lucene-Solr-Tests-trunk-Java7/solr/build/solr-core/test/J1/./org.apache.solr.cloud.CollectionsAPIDistributedZkTest-jetty3-1388642934586/solrj_collection_shard2_replica1/data/
   [junit4]   2> 902681 T2609 oasc.JmxMonitoredMap.<init> JMX monitoring is enabled. Adding Solr mbeans to JMX Server: com.sun.jmx.mbeanserver.JmxMBeanServer@a2adb88
   [junit4]   2> 902681 T2577 oasc.SolrCore.<init> [solrj_collection_shard1_replica2] Opening new SolrCore at ../../../../../../../../../../../usr/home/hudson/hudson-slave/workspace/Lucene-Solr-Tests-trunk-Java7/solr/build/solr-core/test/J1/./org.apache.solr.cloud.CollectionsAPIDistributedZkTest-jetty2-1388642932967/solrj_collection_shard1_replica2/, dataDir=../../../../../../../../../../../usr/home/hudson/hudson-slave/workspace/Lucene-Solr-Tests-trunk-Java7/solr/build/solr-core/test/J1/./org.apache.solr.cloud.CollectionsAPIDistributedZkTest-jetty2-1388642932967/solrj_collection_shard1_replica2/data/
   [junit4]   2> 902682 T2593 oasc.JmxMonitoredMap.<init> JMX monitoring is enabled. Adding Solr mbeans to JMX Server: com.sun.jmx.mbeanserver.JmxMBeanServer@a2adb88
   [junit4]   2> 902682 T2540 oasc.SolrCore.<init> [solrj_collection_shard2_replica2] Opening new SolrCore at ../../../../../../../../../../../usr/home/hudson/hudson-slave/workspace/Lucene-Solr-Tests-trunk-Java7/solr/build/solr-core/test/J1/./org.apache.solr.cloud.CollectionsAPIDistributedZkTest-controljetty-1388642930959/solrj_collection_shard2_replica2/, dataDir=../../../../../../../../../../../usr/home/hudson/hudson-slave/workspace/Lucene-Solr-Tests-trunk-Java7/solr/build/solr-core/test/J1/./org.apache.solr.cloud.CollectionsAPIDistributedZkTest-controljetty-1388642930959/solrj_collection_shard2_replica2/data/
   [junit4]   2> 902683 T2609 oasc.CachingDirectoryFactory.get return new directory for ../../../../../../../../../../../usr/home/hudson/hudson-slave/workspace/Lucene-Solr-Tests-trunk-Java7/solr/build/solr-core/test/J1/./org.apache.solr.cloud.CollectionsAPIDistributedZkTest-jetty4-1388642936103/solrj_collection_shard1_replica1/data
   [junit4]   2> 902684 T2540 oasc.JmxMonitoredMap.<init> JMX monitoring is enabled. Adding Solr mbeans to JMX Server: com.sun.jmx.mbeanserver.JmxMBeanServer@a2adb88
   [junit4]   2> 902683 T2577 oasc.JmxMonitoredMap.<init> JMX monitoring is enabled. Adding Solr mbeans to JMX Server: com.sun.jmx.mbeanserver.JmxMBeanServer@a2adb88
   [junit4]   2> 902684 T2593 oasc.CachingDirectoryFactory.get return new directory for ../../../../../../../../../../../usr/home/hudson/hudson-slave/workspace/Lucene-Solr-Tests-trunk-Java7/solr/build/solr-core/test/J1/./org.apache.solr.cloud.CollectionsAPIDistributedZkTest-jetty3-1388642934586/solrj_collection_shard2_replica1/data
   [junit4]   2> 902684 T2609 oasc.SolrCore.getNewIndexDir New index directory detected: old=null new=../../../../../../../../../../../usr/home/hudson/hudson-slave/workspace/Lucene-Solr-Tests-trunk-Java7/solr/build/solr-core/test/J1/./org.apache.solr.cloud.CollectionsAPIDistributedZkTest-jetty4-1388642936103/solrj_collection_shard1_replica1/data/index/
   [junit4]   2> 902685 T2540 oasc.CachingDirectoryFactory.get return new directory for ../../../../../../../../../../../usr/home/hudson/hudson-slave/workspace/Lucene-Solr-Tests-trunk-Java7/solr/build/solr-core/test/J1/./org.apache.solr.cloud.CollectionsAPIDistributedZkTest-controljetty-1388642930959/solrj_collection_shard2_replica2/data
   [junit4]   2> 902685 T2593 oasc.SolrCore.getNewIndexDir New index directory detected: old=null new=../../../../../../../../../../../usr/home/hudson/hudson-slave/workspace/Lucene-Solr-Tests-trunk-Java7/solr/build/solr-core/test/J1/./org.apache.solr.cloud.CollectionsAPIDistributedZkTest-jetty3-1388642934586/solrj_collection_shard2_replica1/data/index/
   [junit4]   2> 902686 T2540 oasc.SolrCore.getNewIndexDir New index directory detected: old=null new=../../../../../../../../../../../usr/home/hudson/hudson-slave/workspace/Lucene-Solr-Tests-trunk-Java7/solr/build/solr-core/test/J1/./org.apache.solr.cloud.CollectionsAPIDistributedZkTest-controljetty-1388642930959/solrj_collection_shard2_replica2/data/index/
   [junit4]   2> 902686 T2577 oasc.CachingDirectoryFactory.get return new directory for ../../../../../../../../../../../usr/home/hudson/hudson-slave/workspace/Lucene-Solr-Tests-trunk-Java7/solr/build/solr-core/test/J1/./org.apache.solr.cloud.CollectionsAPIDistributedZkTest-jetty2-1388642932967/solrj_collection_shard1_replica2/data
   [junit4]   2> 902685 T2609 oasc.SolrCore.initIndex WARN [solrj_collection_shard1_replica1] Solr index directory '../../../../../../../../../../../usr/home/hudson/hudson-slave/workspace/Lucene-Solr-Tests-trunk-Java7/solr/build/solr-core/test/J1/./org.apache.solr.cloud.CollectionsAPIDistributedZkTest-jetty4-1388642936103/solrj_collection_shard1_replica1/data/index' doesn't exist. Creating new index...
   [junit4]   2> 902687 T2577 oasc.SolrCore.getNewIndexDir New index directory detected: old=null new=../../../../../../../../../../../usr/home/hudson/hudson-slave/workspace/Lucene-Solr-Tests-trunk-Java7/solr/build/solr-core/test/J1/./org.apache.solr.cloud.CollectionsAPIDistributedZkTest-jetty2-1388642932967/solrj_collection_shard1_replica2/data/index/
   [junit4]   2> 902688 T2609 oasc.CachingDirectoryFactory.get return new directory for ../../../../../../../../../../../usr/home/hudson/hudson-slave/workspace/Lucene-Solr-Tests-trunk-Java7/solr/build/solr-core/test/J1/./org.apache.solr.cloud.CollectionsAPIDistributedZkTest-jetty4-1388642936103/solrj_collection_shard1_replica1/data/index
   [junit4]   2> 902687 T2540 oasc.SolrCore.initIndex WARN [solrj_collection_shard2_replica2] Solr index directory '../../../../../../../../../../../usr/home/hudson/hudson-slave/workspace/Lucene-Solr-Tests-trunk-Java7/solr/build/solr-core/test/J1/./org.apache.solr.cloud.CollectionsAPIDistributedZkTest-controljetty-1388642930959/solrj_collection_shard2_replica2/data/index' doesn't exist. Creating new index...
   [junit4]   2> 902686 T2593 oasc.SolrCore.initIndex WARN [solrj_collection_shard2_replica1] Solr index directory '../../../../../../../../../../../usr/home/hudson/hudson-slave/workspace/Lucene-Solr-Tests-trunk-Java7/solr/build/solr-core/test/J1/./org.apache.solr.cloud.CollectionsAPIDistributedZkTest-jetty3-1388642934586/solrj_collection_shard2_replica1/data/index' doesn't exist. Creating new index...
   [junit4]   2> 902689 T2540 oasc.CachingDirectoryFactory.get return new directory for ../../../../../../../../../../../usr/home/hudson/hudson-slave/workspace/Lucene-Solr-Tests-trunk-Java7/solr/build/solr-core/test/J1/./org.apache.solr.cloud.CollectionsAPIDistributedZkTest-controljetty-1388642930959/solrj_collection_shard2_replica2/data/index
   [junit4]   2> 902688 T2609 oasu.RandomMergePolicy.<init> RandomMergePolicy wrapping class org.apache.lucene.index.TieredMergePolicy: [TieredMergePolicy: maxMergeAtOnce=18, maxMergeAtOnceExplicit=43, maxMergedSegmentMB=71.6826171875, floorSegmentMB=0.44140625, forceMergeDeletesPctAllowed=24.554845577767413, segmentsPerTier=26.0, maxCFSSegmentSizeMB=8.796093022207999E12, noCFSRatio=1.0
   [junit4]   2> 902688 T2577 oasc.SolrCore.initIndex WARN [solrj_collection_shard1_replica2] Solr index directory '../../../../../../../../../../../usr/home/hudson/hudson-slave/workspace/Lucene-Solr-Tests-trunk-Java7/solr/build/solr-core/test/J1/./org.apache.solr.cloud.CollectionsAPIDistributedZkTest-jetty2-1388642932967/solrj_collection_shard1_replica2/data/index' doesn't exist. Creating new index...
   [junit4]   2> 902690 T2540 oasu.RandomMergePolicy.<init> RandomMergePolicy wrapping class org.apache.lucene.index.TieredMergePolicy: [TieredMergePolicy: maxMergeAtOnce=18, maxMergeAtOnceExplicit=43, maxMergedSegmentMB=71.6826171875, floorSegmentMB=0.44140625, forceMergeDeletesPctAllowed=24.554845577767413, segmentsPerTier=26.0, maxCFSSegmentSizeMB=8.796093022207999E12, noCFSRatio=1.0
   [junit4]   2> 902689 T2593 oasc.CachingDirectoryFactory.get return new directory for ../../../../../../../../../../../usr/home/hudson/hudson-slave/workspace/Lucene-Solr-Tests-trunk-Java7/solr/build/solr-core/test/J1/./org.apache.solr.cloud.CollectionsAPIDistributedZkTest-jetty3-1388642934586/solrj_collection_shard2_replica1/data/index
   [junit4]   2> 902690 T2577 oasc.CachingDirectoryFactory.get return new directory for ../../../../../../../../../../../usr/home/hudson/hudson-slave/workspace/Lucene-Solr-Tests-trunk-Java7/solr/build/solr-core/test/J1/./org.apache.solr.cloud.CollectionsAPIDistributedZkTest-jetty2-1388642932967/solrj_collection_shard1_replica2/data/index
   [junit4]   2> 902690 T2609 oasc.SolrDeletionPolicy.onCommit SolrDeletionPolicy.onCommit: commits: num=1
   [junit4]   2> 		commit{dir=MockDirectoryWrapper(org.apache.lucene.store.RAMDirectory@61faffeb lockFactory=org.apache.lucene.store.SingleInstanceLockFactory@cbaab4d),segFN=segments_1,generation=1}
   [junit4]   2> 902692 T2577 oasu.RandomMergePolicy.<init> RandomMergePolicy wrapping class org.apache.lucene.index.TieredMergePolicy: [TieredMergePolicy: maxMergeAtOnce=18, maxMergeAtOnceExplicit=43, maxMergedSegmentMB=71.6826171875, floorSegmentMB=0.44140625, forceMergeDeletesPctAllowed=24.554845577767413, segmentsPerTier=26.0, maxCFSSegmentSizeMB=8.796093022207999E12, noCFSRatio=1.0
   [junit4]   2> 902691 T2540 oasc.SolrDeletionPolicy.onCommit SolrDeletionPolicy.onCommit: commits: num=1
   [junit4]   2> 		commit{dir=MockDirectoryWrapper(org.apache.lucene.store.RAMDirectory@4a9558d9 lockFactory=org.apache.lucene.store.SingleInstanceLockFactory@2bc424d0),segFN=segments_1,generation=1}
   [junit4]   2> 902691 T2593 oasu.RandomMergePolicy.<init> RandomMergePolicy wrapping class org.apache.lucene.index.TieredMergePolicy: [TieredMergePolicy: maxMergeAtOnce=18, maxMergeAtOnceExplicit=43, maxMergedSegmentMB=71.6826171875, floorSegmentMB=0.44140625, forceMergeDeletesPctAllowed=24.554845577767413, segmentsPerTier=26.0, maxCFSSegmentSizeMB=8.796093022207999E12, noCFSRatio=1.0
   [junit4]   2> 902693 T2577 oasc.SolrDeletionPolicy.onCommit SolrDeletionPolicy.onCommit: commits: num=1
   [junit4]   2> 		commit{dir=MockDirectoryWrapper(org.apache.lucene.store.RAMDirectory@540987ba lockFactory=org.apache.lucene.store.SingleInstanceLockFactory@c3c96b0),segFN=segments_1,generation=1}
   [junit4]   2> 902693 T2540 oasc.SolrDeletionPolicy.updateCommits newest commit generation = 1
   [junit4]   2> 902692 T2609 oasc.SolrDeletionPolicy.updateCommits newest commit generation = 1
   [junit4]   2> 902694 T2593 oasc.SolrDeletionPolicy.onCommit SolrDeletionPolicy.onCommit: commits: num=1
   [junit4]   2> 		commit{dir=MockDirectoryWrapper(org.apache.lucene.store.RAMDirectory@6f9f8c7e lockFactory=org.apache.lucene.store.SingleInstanceLockFactory@530c9503),segFN=segments_1,generation=1}
   [junit4]   2> 902693 T2577 oasc.SolrDeletionPolicy.updateCommits newest commit generation = 1
   [junit4]   2> 902695 T2593 oasc.SolrDeletionPolicy.updateCommits newest commit generation = 1
   [junit4]   2> 902699 T2540 oasup.UpdateRequestProcessorChain.init creating updateRequestProcessorChain "nodistrib"
   [junit4]   2> 902699 T2609 oasup.UpdateRequestProcessorChain.init creating updateRequestProcessorChain "nodistrib"
   [junit4]   2> 902700 T2540 oasup.UpdateRequestProcessorChain.init creating updateRequestProcessorChain "dedupe"
   [junit4]   2> 902700 T2609 oasup.UpdateRequestProcessorChain.init creating updateRequestProcessorChain "dedupe"
   [junit4]   2> 902700 T2540 oasup.UpdateRequestProcessorChain.init inserting DistributedUpdateProcessorFactory into updateRequestProcessorChain "dedupe"
   [junit4]   2> 902700 T2577 oasup.UpdateRequestProcessorChain.init creating updateRequestProcessorChain "nodistrib"
   [junit4]   2> 902701 T2540 oasup.UpdateRequestProcessorChain.init creating updateRequestProcessorChain "stored_sig"
   [junit4]   2> 902701 T2609 oasup.UpdateRequestProcessorChain.init inserting DistributedUpdateProcessorFactory into updateRequestProcessorChain "dedupe"
   [junit4]   2> 902701 T2593 oasup.UpdateRequestProcessorChain.init creating updateRequestProcessorChain "nodistrib"
   [junit4]   2> 902702 T2609 oasup.UpdateRequestProcessorChain.init creating updateRequestProcessorChain "stored_sig"
   [junit4]   2> 902702 T2540 oasup.UpdateRequestProcessorChain.init inserting DistributedUpdateProcessorFactory into updateRequestProcessorChain "stored_sig"
   [junit4]   2> 902701 T2577 oasup.UpdateRequestProcessorChain.init creating updateRequestProcessorChain "dedupe"
   [junit4]   2> 902703 T2540 oasup.UpdateRequestProcessorChain.init creating updateRequestProcessorChain "distrib-dup-test-chain-explicit"
   [junit4]   2> 902703 T2609 oasup.UpdateRequestProcessorChain.init inserting DistributedUpdateProcessorFactory into updateRequestProcessorChain "stored_sig"
   [junit4]   2> 902703 T2593 oasup.UpdateRequestProcessorChain.init creating updateRequestProcessorChain "dedupe"
   [junit4]   2> 902704 T2609 oasup.UpdateRequestProcessorChain.init creating updateRequestProcessorChain "distrib-dup-test-chain-explicit"
   [junit4]   2> 902704 T2540 oasup.UpdateRequestProcessorChain.init creating updateRequestProcessorChain "distrib-dup-test-chain-implicit"
   [junit4]   2> 902704 T2577 oasup.UpdateRequestProcessorChain.init inserting DistributedUpdateProcessorFactory into updateRequestProcessorChain "dedupe"
   [junit4]   2> 902705 T2540 oasup.UpdateRequestProcessorChain.init inserting DistributedUpdateProcessorFactory into updateRequestProcessorChain "distrib-dup-test-chain-implicit"
   [junit4]   2> 902705 T2609 oasup.UpdateRequestProcessorChain.init creating updateRequestProcessorChain "distrib-dup-test-chain-implicit"
   [junit4]   2> 902705 T2593 oasup.UpdateRequestProcessorChain.init inserting DistributedUpdateProcessorFactory into updateRequestProcessorChain "dedupe"
   [junit4]   2> 902707 T2609 oasup.UpdateRequestProcessorChain.init inserting DistributedUpdateProcessorFactory into updateRequestProcessorChain "distrib-dup-test-chain-implicit"
   [junit4]   2> 902706 T2540 oasc.SolrCore.loadUpdateProcessorChains no updateRequestProcessorChain defined as default, creating implicit default
   [junit4]   2> 902706 T2577 oasup.UpdateRequestProcessorChain.init creating updateRequestProcessorChain "stored_sig"
   [junit4]   2> 902707 T2609 oasc.SolrCore.loadUpdateProcessorChains no updateRequestProcessorChain defined as default, creating implicit default
   [junit4]   2> 902707 T2593 oasup.UpdateRequestProcessorChain.init creating updateRequestProcessorChain "stored_sig"
   [junit4]   2> 902708 T2577 oasup.UpdateRequestProcessorChain.init inserting DistributedUpdateProcessorFactory into updateRequestProcessorChain "stored_sig"
   [junit4]   2> 902708 T2540 oasc.RequestHandlers.initHandlersFromConfig created standard: solr.StandardRequestHandler
   [junit4]   2> 902709 T2577 oasup.UpdateRequestProcessorChain.init creating updateRequestProcessorChain "distrib-dup-test-chain-explicit"
   [junit4]   2> 902709 T2593 oasup.UpdateRequestProcessorChain.init inserting DistributedUpdateProcessorFactory into updateRequestProcessorChain "stored_sig"
   [junit4]   2> 902708 T2609 oasc.RequestHandlers.initHandlersFromConfig created standard: solr.StandardRequestHandler
   [junit4]   2> 902710 T2593 oasup.UpdateRequestProcessorChain.init creating updateRequestProcessorChain "distrib-dup-test-chain-explicit"
   [junit4]   2> 902710 T2577 oasup.UpdateRequestProcessorChain.init creating updateRequestProcessorChain "distrib-dup-test-chain-implicit"
   [junit4]   2> 902711 T2593 oasup.UpdateRequestProcessorChain.init creating updateRequestProcessorChain "distrib-dup-test-chain-implicit"
   [junit4]   2> 902709 T2540 oasc.RequestHandlers.initHandlersFromConfig created /get: solr.RealTimeGetHandler
   [junit4]   2> 902712 T2540 oasc.RequestHandlers.initHandlersFromConfig adding lazy requestHandler: solr.ReplicationHandler
   [junit4]   2> 902711 T2593 oasup.UpdateRequestProcessorChain.init inserting DistributedUpdateProcessorFactory into updateRequestProcessorChain "distrib-dup-test-chain-implicit"
   [junit4]   2> 902711 T2577 oasup.UpdateRequestProcessorChain.init inserting DistributedUpdateProcessorFactory into updateRequestProcessorChain "distrib-dup-test-chain-implicit"
   [junit4]   2> 902711 T2609 oasc.RequestHandlers.initHandlersFromConfig created /get: solr.RealTimeGetHandler
   [junit4]   2> 902713 T2577 oasc.SolrCore.loadUpdateProcessorChains no updateRequestProcessorChain defined as default, creating implicit default
   [junit4]   2> 902712 T2593 oasc.SolrCore.loadUpdateProcessorChains no updateRequestProcessorChain defined as default, creating implicit default
   [junit4]   2> 902712 T2540 oasc.RequestHandlers.initHandlersFromConfig created /replication: solr.ReplicationHandler
   [junit4]   2> 902714 T2577 oasc.RequestHandlers.initHandlersFromConfig created standard: solr.StandardRequestHandler
   [junit4]   2> 902713 T2609 oasc.RequestHandlers.initHandlersFromConfig adding lazy requestHandler: solr.ReplicationHandler
   [junit4]   2> 902714 T2540 oasc.RequestHandlers.initHandlersFromConfig created /update: solr.UpdateRequestHandler
   [junit4]   2> 902714 T2593 oasc.RequestHandlers.initHandlersFromConfig created standard: solr.StandardRequestHandler
   [junit4]   2> 902715 T2540 oasc.RequestHandlers.initHandlersFromConfig created /admin/: org.apache.solr.handler.admin.AdminHandlers
   [junit4]   2> 902716 T2593 oasc.RequestHandlers.initHandlersFromConfig created /get: solr.RealTimeGetHandler
   [junit4]   2> 902715 T2609 oasc.RequestHandlers.initHandlersFromConfig created /replication: solr.ReplicationHandler
   [junit4]   2> 902715 T2577 oasc.RequestHandlers.initHandlersFromConfig created /get: solr.RealTimeGetHandler
   [junit4]   2> 902717 T2609 oasc.RequestHandlers.initHandlersFromConfig created /update: solr.UpdateRequestHandler
   [junit4]   2> 902716 T2540 oasc.RequestHandlers.initHandlersFromConfig created /admin/file: solr.admin.ShowFileRequestHandler
   [junit4]   2> 902716 T2593 oasc.RequestHandlers.initHandlersFromConfig adding lazy requestHandler: solr.ReplicationHandler
   [junit4]   2> 902718 T2540 oasc.RequestHandlers.initHandlersFromConfig created /admin/fileedit: solr.admin.EditFileRequestHandler
   [junit4]   2> 902717 T2609 oasc.RequestHandlers.initHandlersFromConfig created /admin/: org.apache.solr.handler.admin.AdminHandlers
   [junit4]   2> 902717 T2577 oasc.RequestHandlers.initHandlersFromConfig adding lazy requestHandler: solr.ReplicationHandler
   [junit4]   2> 902718 T2593 oasc.RequestHandlers.initHandlersFromConfig created /replication: solr.ReplicationHandler
   [junit4]   2> 902719 T2577 oasc.RequestHandlers.initHandlersFromConfig created /replication: solr.ReplicationHandler
   [junit4]   2> 902719 T2609 oasc.RequestHandlers.initHandlersFromConfig created /admin/file: solr.admin.ShowFileRequestHandler
   [junit4]   2> 902720 T2577 oasc.RequestHandlers.initHandlersFromConfig created /update: solr.UpdateRequestHandler
   [junit4]   2> 902720 T2593 oasc.RequestHandlers.initHandlersFromConfig created /update: solr.UpdateRequestHandler
   [junit4]   2> 902721 T2577 oasc.RequestHandlers.initHandlersFromConfig created /admin/: org.apache.solr.handler.admin.AdminHandlers
   [junit4]   2> 902720 T2609 oasc.RequestHandlers.initHandlersFromConfig created /admin/fileedit: solr.admin.EditFileRequestHandler
   [junit4]   2> 902721 T2593 oasc.RequestHandlers.initHandlersFromConfig created /admin/: org.apache.solr.handler.admin.AdminHandlers
   [junit4]   2> 902721 T2577 oasc.RequestHandlers.initHandlersFromConfig created /admin/file: solr.admin.ShowFileRequestHandler
   [junit4]   2> 902722 T2593 oasc.RequestHandlers.initHandlersFromConfig created /admin/file: solr.admin.ShowFileRequestHandler
   [junit4]   2> 902722 T2577 oasc.RequestHandlers.initHandlersFromConfig created /admin/fileedit: solr.admin.EditFileRequestHandler
   [junit4]   2> 902723 T2593 oasc.RequestHandlers.initHandlersFromConfig created /admin/fileedit: solr.admin.EditFileRequestHandler
   [junit4]   2> 902746 T2577 oashl.XMLLoader.init xsltCacheLifetimeSeconds=60
   [junit4]   2> 902746 T2593 oashl.XMLLoader.init xsltCacheLifetimeSeconds=60
   [junit4]   2> 902746 T2540 oashl.XMLLoader.init xsltCacheLifetimeSeconds=60
   [junit4]   2> 902747 T2609 oashl.XMLLoader.init xsltCacheLifetimeSeconds=60
   [junit4]   2> 902755 T2577 oasu.CommitTracker.<init> Hard AutoCommit: disabled
   [junit4]   2> 902756 T2577 oasu.CommitTracker.<init> Soft AutoCommit: disabled
   [junit4]   2> 902756 T2593 oasu.CommitTracker.<init> Hard AutoCommit: disabled
   [junit4]   2> 902757 T2593 oasu.CommitTracker.<init> Soft AutoCommit: disabled
   [junit4]   2> 902757 T2609 oasu.CommitTracker.<init> Hard AutoCommit: disabled
   [junit4]   2> 902757 T2540 oasu.CommitTracker.<init> Hard AutoCommit: disabled
   [junit4]   2> 902757 T2577 oasu.RandomMergePolicy.<init> RandomMergePolicy wrapping class org.apache.lucene.index.LogByteSizeMergePolicy: [LogByteSizeMergePolicy: minMergeSize=1677721, mergeFactor=40, maxMergeSize=2147483648, maxMergeSizeForForcedMerge=9223372036854775807, calibrateSizeByDeletes=true, maxMergeDocs=2147483647, maxCFSSegmentSizeMB=8.796093022207999E12, noCFSRatio=0.447198803982763]
   [junit4]   2> 902758 T2540 oasu.CommitTracker.<init> Soft AutoCommit: disabled
   [junit4]   2> 902757 T2609 oasu.CommitTracker.<init> Soft AutoCommit: disabled
   [junit4]   2> 902757 T2593 oasu.RandomMergePolicy.<init> RandomMergePolicy wrapping class org.apache.lucene.index.LogByteSizeMergePolicy: [LogByteSizeMergePolicy: minMergeSize=1677721, mergeFactor=40, maxMergeSize=2147483648, maxMergeSizeForForcedMerge=9223372036854775807, calibrateSizeByDeletes=true, maxMergeDocs=2147483647, maxCFSSegmentSizeMB=8.796093022207999E12, noCFSRatio=0.447198803982763]
   [junit4]   2> 902759 T2609 oasu.RandomMergePolicy.<init> RandomMergePolicy wrapping class org.apache.lucene.index.LogByteSizeMergePolicy: [LogByteSizeMergePolicy: minMergeSize=1677721, mergeFactor=40, maxMergeSize=2147483648, maxMergeSizeForForcedMerge=9223372036854775807, calibrateSizeByDeletes=true, maxMergeDocs=2147483647, maxCFSSegmentSizeMB=8.796093022207999E12, noCFSRatio=0.447198803982763]
   [junit4]   2> 902759 T2540 oasu.RandomMergePolicy.<init> RandomMergePolicy wrapping class org.apache.lucene.index.LogByteSizeMergePolicy: [LogByteSizeMergePolicy: minMergeSize=1677721, mergeFactor=40, maxMergeSize=2147483648, maxMergeSizeForForcedMerge=9223372036854775807, calibrateSizeByDeletes=true, maxMergeDocs=2147483647, maxCFSSegmentSizeMB=8.796093022207999E12, noCFSRatio=0.447198803982763]
   [junit4]   2> 902759 T2577 oasc.SolrDeletionPolicy.onInit SolrDeletionPolicy.onInit: commits: num=1
   [junit4]   2> 		commit{dir=MockDirectoryWrapper(org.apache.lucene.store.RAMDirectory@540987ba lockFactory=org.apache.lucene.store.SingleInstanceLockFactory@c3c96b0),segFN=segments_1,generation=1}
   [junit4]   2> 902760 T2540 oasc.SolrDeletionPolicy.onInit SolrDeletionPolicy.onInit: commits: num=1
   [junit4]   2> 		commit{dir=MockDirectoryWrapper(org.apache.lucene.store.RAMDirectory@4a9558d9 lockFactory=org.apache.lucene.store.SingleInstanceLockFactory@2bc424d0),segFN=segments_1,generation=1}
   [junit4]   2> 902760 T2609 oasc.SolrDeletionPolicy.onInit SolrDeletionPolicy.onInit: commits: num=1
   [junit4]   2> 		commit{dir=MockDirectoryWrapper(org.apache.lucene.store.RAMDirectory@61faffeb lockFactory=org.apache.lucene.store.SingleInstanceLockFactory@cbaab4d),segFN=segments_1,generation=1}
   [junit4]   2> 902760 T2593 oasc.SolrDeletionPolicy.onInit SolrDeletionPolicy.onInit: commits: num=1
   [junit4]   2> 		commit{dir=MockDirectoryWrapper(org.apache.lucene.store.RAMDirectory@6f9f8c7e lockFactory=org.apache.lucene.store.SingleInstanceLockFactory@530c9503),segFN=segments_1,generation=1}
   [junit4]   2> 902761 T2609 oasc.SolrDeletionPolicy.updateCommits newest commit generation = 1
   [junit4]   2> 902761 T2540 oasc.SolrDeletionPolicy.updateCommits newest commit generation = 1
   [junit4]   2> 902761 T2577 oasc.SolrDeletionPolicy.updateCommits newest commit generation = 1
   [junit4]   2> 902763 T2540 oass.SolrIndexSearcher.<init> Opening Searcher@55e94d44 main
   [junit4]   2> 902762 T2609 oass.SolrIndexSearcher.<init> Opening Searcher@b9b735c main
   [junit4]   2> 902762 T2593 oasc.SolrDeletionPolicy.updateCommits newest commit generation = 1
   [junit4]   2> 902763 T2577 oass.SolrIndexSearcher.<init> Opening Searcher@1e481849 main
   [junit4]   2> 902764 T2593 oass.SolrIndexSearcher.<init> Opening Searcher@390bd32d main
   [junit4]   2> 902767 T2629 oasc.SolrCore.registerSearcher [solrj_collection_shard2_replica2] Registered new searcher Searcher@55e94d44 main{StandardDirectoryReader(segments_1:1:nrt)}
   [junit4]   2> 902767 T2630 oasc.SolrCore.registerSearcher [solrj_collection_shard1_replica1] Registered new searcher Searcher@b9b735c main{StandardDirectoryReader(segments_1:1:nrt)}
   [junit4]   2> 902768 T2627 oasc.SolrCore.registerSearcher [solrj_collection_shard1_replica2] Registered new searcher Searcher@1e481849 main{StandardDirectoryReader(segments_1:1:nrt)}
   [junit4]   2> 902768 T2628 oasc.SolrCore.registerSearcher [solrj_collection_shard2_replica1] Registered new searcher Searcher@390bd32d main{StandardDirectoryReader(segments_1:1:nrt)}
   [junit4]   2> 902770 T2540 oasc.CoreContainer.registerCore registering core: solrj_collection_shard2_replica2
   [junit4]   2> 902770 T2609 oasc.CoreContainer.registerCore registering core: solrj_collection_shard1_replica1
   [junit4]   2> 902770 T2540 oasc.ZkController.register Register replica - core:solrj_collection_shard2_replica2 address:http://127.0.0.1:19435/hg_i/k collection:solrj_collection shard:shard2
   [junit4]   2> 902771 T2609 oasc.ZkController.register Register replica - core:solrj_collection_shard1_replica1 address:http://127.0.0.1:19453/hg_i/k collection:solrj_collection shard:shard1
   [junit4]   2> 902771 T2593 oasc.CoreContainer.registerCore registering core: solrj_collection_shard2_replica1
   [junit4]   2> 902771 T2577 oasc.CoreContainer.registerCore registering core: solrj_collection_shard1_replica2
   [junit4]   2> 902772 T2593 oasc.ZkController.register Register replica - core:solrj_collection_shard2_replica1 address:http://127.0.0.1:19448/hg_i/k collection:solrj_collection shard:shard2
   [junit4]   2> 902772 T2609 oascc.SolrZkClient.makePath makePath: /collections/solrj_collection/leader_elect/shard1/election
   [junit4]   2> 902772 T2540 oascc.SolrZkClient.makePath makePath: /collections/solrj_collection/leader_elect/shard2/election
   [junit4]   2> 902772 T2577 oasc.ZkController.register Register replica - core:solrj_collection_shard1_replica2 address:http://127.0.0.1:19445/hg_i/k collection:solrj_col

[...truncated too long message...]

3/nodes_used_collection_shard2_replica1/data
   [junit4]   2> 1019230 T2729 oasc.CachingDirectoryFactory.closeCacheValue looking to close ../../../../../../../../../../../usr/home/hudson/hudson-slave/workspace/Lucene-Solr-Tests-trunk-Java7/solr/build/solr-core/test/J1/./org.apache.solr.cloud.CollectionsAPIDistributedZkTest-jetty4-1388642936103/nodes_used_collection_shard2_replica1/data/index [CachedDir<<refCount=0;path=../../../../../../../../../../../usr/home/hudson/hudson-slave/workspace/Lucene-Solr-Tests-trunk-Java7/solr/build/solr-core/test/J1/./org.apache.solr.cloud.CollectionsAPIDistributedZkTest-jetty4-1388642936103/nodes_used_collection_shard2_replica1/data/index;done=false>>]
   [junit4]   2> 1019230 T2729 oasc.CachingDirectoryFactory.close Closing directory: ../../../../../../../../../../../usr/home/hudson/hudson-slave/workspace/Lucene-Solr-Tests-trunk-Java7/solr/build/solr-core/test/J1/./org.apache.solr.cloud.CollectionsAPIDistributedZkTest-jetty4-1388642936103/nodes_used_collection_shard2_replica1/data/index
   [junit4]   2> 1019231 T2729 oascc.SolrZkClient.makePath makePath: /collections/nodes_used_collection/leaders/shard2
   [junit4]   2> 1019231 T2729 oasc.SolrException.log ERROR There was a problem trying to register as the leader:org.apache.zookeeper.KeeperException$SessionExpiredException: KeeperErrorCode = Session expired for /collections
   [junit4]   2> 		at org.apache.zookeeper.KeeperException.create(KeeperException.java:127)
   [junit4]   2> 		at org.apache.zookeeper.KeeperException.create(KeeperException.java:51)
   [junit4]   2> 		at org.apache.zookeeper.ZooKeeper.exists(ZooKeeper.java:1041)
   [junit4]   2> 		at org.apache.solr.common.cloud.SolrZkClient$3.execute(SolrZkClient.java:205)
   [junit4]   2> 		at org.apache.solr.common.cloud.SolrZkClient$3.execute(SolrZkClient.java:202)
   [junit4]   2> 		at org.apache.solr.common.cloud.ZkCmdExecutor.retryOperation(ZkCmdExecutor.java:73)
   [junit4]   2> 		at org.apache.solr.common.cloud.SolrZkClient.exists(SolrZkClient.java:202)
   [junit4]   2> 		at org.apache.solr.common.cloud.SolrZkClient.makePath(SolrZkClient.java:413)
   [junit4]   2> 		at org.apache.solr.common.cloud.SolrZkClient.makePath(SolrZkClient.java:382)
   [junit4]   2> 		at org.apache.solr.common.cloud.SolrZkClient.makePath(SolrZkClient.java:369)
   [junit4]   2> 		at org.apache.solr.cloud.ShardLeaderElectionContextBase.runLeaderProcess(ElectionContext.java:112)
   [junit4]   2> 		at org.apache.solr.cloud.ShardLeaderElectionContext.runLeaderProcess(ElectionContext.java:273)
   [junit4]   2> 		at org.apache.solr.cloud.LeaderElector.runIamLeaderProcess(LeaderElector.java:165)
   [junit4]   2> 		at org.apache.solr.cloud.LeaderElector.checkIfIamLeader(LeaderElector.java:109)
   [junit4]   2> 		at org.apache.solr.cloud.LeaderElector.access$000(LeaderElector.java:55)
   [junit4]   2> 		at org.apache.solr.cloud.LeaderElector$1.process(LeaderElector.java:138)
   [junit4]   2> 		at org.apache.zookeeper.ClientCnxn$EventThread.processEvent(ClientCnxn.java:519)
   [junit4]   2> 		at org.apache.zookeeper.ClientCnxn$EventThread.run(ClientCnxn.java:495)
   [junit4]   2> 	
   [junit4]   2> 1019232 T2729 oasc.LeaderElector$1.process WARN  org.apache.zookeeper.KeeperException$SessionExpiredException: KeeperErrorCode = Session expired for /collections/nodes_used_collection/leader_elect/shard2/election/91006103103995921-core_node3-n_0000000002
   [junit4]   2> 	at org.apache.zookeeper.KeeperException.create(KeeperException.java:127)
   [junit4]   2> 	at org.apache.zookeeper.KeeperException.create(KeeperException.java:51)
   [junit4]   2> 	at org.apache.zookeeper.ZooKeeper.delete(ZooKeeper.java:873)
   [junit4]   2> 	at org.apache.solr.common.cloud.SolrZkClient$2.execute(SolrZkClient.java:173)
   [junit4]   2> 	at org.apache.solr.common.cloud.SolrZkClient$2.execute(SolrZkClient.java:170)
   [junit4]   2> 	at org.apache.solr.common.cloud.ZkCmdExecutor.retryOperation(ZkCmdExecutor.java:73)
   [junit4]   2> 	at org.apache.solr.common.cloud.SolrZkClient.delete(SolrZkClient.java:170)
   [junit4]   2> 	at org.apache.solr.cloud.ElectionContext.cancelElection(ElectionContext.java:67)
   [junit4]   2> 	at org.apache.solr.cloud.ShardLeaderElectionContext.runLeaderProcess(ElectionContext.java:276)
   [junit4]   2> 	at org.apache.solr.cloud.LeaderElector.runIamLeaderProcess(LeaderElector.java:165)
   [junit4]   2> 	at org.apache.solr.cloud.LeaderElector.checkIfIamLeader(LeaderElector.java:109)
   [junit4]   2> 	at org.apache.solr.cloud.LeaderElector.access$000(LeaderElector.java:55)
   [junit4]   2> 	at org.apache.solr.cloud.LeaderElector$1.process(LeaderElector.java:138)
   [junit4]   2> 	at org.apache.zookeeper.ClientCnxn$EventThread.processEvent(ClientCnxn.java:519)
   [junit4]   2> 	at org.apache.zookeeper.ClientCnxn$EventThread.run(ClientCnxn.java:495)
   [junit4]   2> 
   [junit4]   2> 1019232 T2729 oascc.ZkStateReader$3.process WARN ZooKeeper watch triggered, but Solr cannot talk to ZK
   [junit4]   2> 1019233 T2729 oascc.ZkStateReader$2.process A cluster state change: WatchedEvent state:SyncConnected type:NodeDataChanged path:/clusterstate.json, has occurred - updating... (live nodes size: 3)
   [junit4]   2> 1019233 T2729 oascc.ZkStateReader$2.process WARN ZooKeeper watch triggered, but Solr cannot talk to ZK
   [junit4]   2> 1019233 T2729 oasc.LeaderElector$1.process WARN  org.apache.zookeeper.KeeperException$SessionExpiredException: KeeperErrorCode = Session expired for /overseer_elect/election
   [junit4]   2> 	at org.apache.zookeeper.KeeperException.create(KeeperException.java:127)
   [junit4]   2> 	at org.apache.zookeeper.KeeperException.create(KeeperException.java:51)
   [junit4]   2> 	at org.apache.zookeeper.ZooKeeper.getChildren(ZooKeeper.java:1468)
   [junit4]   2> 	at org.apache.solr.common.cloud.SolrZkClient$6.execute(SolrZkClient.java:256)
   [junit4]   2> 	at org.apache.solr.common.cloud.SolrZkClient$6.execute(SolrZkClient.java:253)
   [junit4]   2> 	at org.apache.solr.common.cloud.ZkCmdExecutor.retryOperation(ZkCmdExecutor.java:73)
   [junit4]   2> 	at org.apache.solr.common.cloud.SolrZkClient.getChildren(SolrZkClient.java:253)
   [junit4]   2> 	at org.apache.solr.cloud.LeaderElector.checkIfIamLeader(LeaderElector.java:93)
   [junit4]   2> 	at org.apache.solr.cloud.LeaderElector.access$000(LeaderElector.java:55)
   [junit4]   2> 	at org.apache.solr.cloud.LeaderElector$1.process(LeaderElector.java:138)
   [junit4]   2> 	at org.apache.zookeeper.ClientCnxn$EventThread.processEvent(ClientCnxn.java:519)
   [junit4]   2> 	at org.apache.zookeeper.ClientCnxn$EventThread.run(ClientCnxn.java:495)
   [junit4]   2> 
   [junit4]   2> NOTE: test params are: codec=Lucene41, sim=DefaultSimilarity, locale=hr_HR, timezone=Pacific/Palau
   [junit4]   2> NOTE: FreeBSD 9.1-RELEASE-p3 amd64/Oracle Corporation 1.7.0_25 (64-bit)/cpus=16,threads=2,free=253226272,total=521142272
   [junit4]   2> NOTE: All tests run in this JVM: [PreAnalyzedUpdateProcessorTest, HighlighterTest, DistributedQueryComponentCustomSortTest, CoreContainerCoreInitFailuresTest, TestSolrCoreProperties, TimeZoneUtilsTest, ChaosMonkeySafeLeaderTest, StandardRequestHandlerTest, PathHierarchyTokenizerFactoryTest, TestFuzzyAnalyzedSuggestions, BasicDistributedZk2Test, TestJmxIntegration, TestImplicitCoreProperties, TestStressReorder, BasicZkTest, TestSolrJ, NumericFieldsTest, DistributedSuggestComponentTest, TestNRTOpen, FieldFacetTest, TestSimpleQParserPlugin, ChangedSchemaMergeTest, CurrencyFieldOpenExchangeTest, DirectSolrSpellCheckerTest, AddBlockUpdateTest, TestIBSimilarityFactory, TestSolrXmlPersistence, TestStressUserVersions, ZkSolrClientTest, ChaosMonkeyNothingIsSafeTest, TestCopyFieldCollectionResource, SortByFunctionTest, FieldFacetExtrasTest, IndexBasedSpellCheckerTest, HardAutoCommitTest, SolrTestCaseJ4Test, AlternateDirectoryTest, RequestHandlersTest, MigrateRouteKeyTest, SolrRequestParserTest, SpellingQueryConverterTest, TestRTGBase, StressHdfsTest, TestCoreDiscovery, TestUtils, TestClassNameShortening, TestSolr4Spatial, PreAnalyzedFieldTest, TestPhraseSuggestions, SpellCheckComponentTest, TestZkChroot, FileUtilsTest, TestQuerySenderListener, TestFastLRUCache, TestFiltering, TestCloudManagedSchema, TestPartialUpdateDeduplication, OpenExchangeRatesOrgProviderTest, TestSolrXml, TestDistribDocBasedVersion, SolrPluginUtilsTest, TestMultiCoreConfBootstrap, TestUniqueKeyFieldResource, SolrCmdDistributorTest, CollectionsAPIDistributedZkTest]
   [junit4] Completed on J1 in 126.74s, 1 test, 1 failure <<< FAILURES!

[...truncated 728 lines...]
BUILD FAILED
/usr/home/hudson/hudson-slave/workspace/Lucene-Solr-Tests-trunk-Java7/build.xml:453: The following error occurred while executing this line:
/usr/home/hudson/hudson-slave/workspace/Lucene-Solr-Tests-trunk-Java7/build.xml:433: The following error occurred while executing this line:
/usr/home/hudson/hudson-slave/workspace/Lucene-Solr-Tests-trunk-Java7/build.xml:39: The following error occurred while executing this line:
/usr/home/hudson/hudson-slave/workspace/Lucene-Solr-Tests-trunk-Java7/extra-targets.xml:37: The following error occurred while executing this line:
/usr/home/hudson/hudson-slave/workspace/Lucene-Solr-Tests-trunk-Java7/solr/build.xml:189: The following error occurred while executing this line:
/usr/home/hudson/hudson-slave/workspace/Lucene-Solr-Tests-trunk-Java7/solr/common-build.xml:491: The following error occurred while executing this line:
/usr/home/hudson/hudson-slave/workspace/Lucene-Solr-Tests-trunk-Java7/lucene/common-build.xml:1304: The following error occurred while executing this line:
/usr/home/hudson/hudson-slave/workspace/Lucene-Solr-Tests-trunk-Java7/lucene/common-build.xml:937: There were test failures: 358 suites, 1577 tests, 1 failure, 35 ignored (6 assumptions)

Total time: 70 minutes 2 seconds
Build step 'Invoke Ant' marked build as failure
Archiving artifacts
Recording test results
Email was triggered for: Failure
Sending email for trigger: Failure



Mime
View raw message