lucene-dev mailing list archives

Site index · List index
Message view « Date » · « Thread »
Top « Date » · « Thread »
From Policeman Jenkins Server <jenk...@thetaphi.de>
Subject [JENKINS] Lucene-Solr-4.x-Linux (32bit/ibm-j9-jdk7) - Build # 8829 - Still Failing!
Date Thu, 02 Jan 2014 16:23:15 GMT
Build: http://jenkins.thetaphi.de/job/Lucene-Solr-4.x-Linux/8829/
Java: 32bit/ibm-j9-jdk7 -Xjit:exclude={org/apache/lucene/util/fst/FST.pack(IIF)Lorg/apache/lucene/util/fst/FST;}

3 tests failed.
REGRESSION:  org.apache.solr.handler.component.DistributedQueryElevationComponentTest.testDistribSearch

Error Message:
.responseHeader.params.sort!=rows (unordered or missing)

Stack Trace:
junit.framework.AssertionFailedError: .responseHeader.params.sort!=rows (unordered or missing)
	at __randomizedtesting.SeedInfo.seed([F6E59B1B32109D9B:77031503454FFDA7]:0)
	at junit.framework.Assert.fail(Assert.java:50)
	at org.apache.solr.BaseDistributedSearchTestCase.compareSolrResponses(BaseDistributedSearchTestCase.java:822)
	at org.apache.solr.BaseDistributedSearchTestCase.compareResponses(BaseDistributedSearchTestCase.java:841)
	at org.apache.solr.BaseDistributedSearchTestCase.query(BaseDistributedSearchTestCase.java:544)
	at org.apache.solr.BaseDistributedSearchTestCase.query(BaseDistributedSearchTestCase.java:521)
	at org.apache.solr.handler.component.DistributedQueryElevationComponentTest.doTest(DistributedQueryElevationComponentTest.java:81)
	at org.apache.solr.BaseDistributedSearchTestCase.testDistribSearch(BaseDistributedSearchTestCase.java:849)
	at sun.reflect.NativeMethodAccessorImpl.invoke0(Native Method)
	at sun.reflect.NativeMethodAccessorImpl.invoke(NativeMethodAccessorImpl.java:88)
	at sun.reflect.DelegatingMethodAccessorImpl.invoke(DelegatingMethodAccessorImpl.java:55)
	at java.lang.reflect.Method.invoke(Method.java:613)
	at com.carrotsearch.randomizedtesting.RandomizedRunner.invoke(RandomizedRunner.java:1559)
	at com.carrotsearch.randomizedtesting.RandomizedRunner.access$600(RandomizedRunner.java:79)
	at com.carrotsearch.randomizedtesting.RandomizedRunner$6.evaluate(RandomizedRunner.java:737)
	at com.carrotsearch.randomizedtesting.RandomizedRunner$7.evaluate(RandomizedRunner.java:773)
	at com.carrotsearch.randomizedtesting.RandomizedRunner$8.evaluate(RandomizedRunner.java:787)
	at com.carrotsearch.randomizedtesting.rules.SystemPropertiesRestoreRule$1.evaluate(SystemPropertiesRestoreRule.java:53)
	at org.apache.lucene.util.TestRuleSetupTeardownChained$1.evaluate(TestRuleSetupTeardownChained.java:50)
	at org.apache.lucene.util.TestRuleFieldCacheSanity$1.evaluate(TestRuleFieldCacheSanity.java:51)
	at org.apache.lucene.util.AbstractBeforeAfterRule$1.evaluate(AbstractBeforeAfterRule.java:46)
	at com.carrotsearch.randomizedtesting.rules.SystemPropertiesInvariantRule$1.evaluate(SystemPropertiesInvariantRule.java:55)
	at org.apache.lucene.util.TestRuleThreadAndTestName$1.evaluate(TestRuleThreadAndTestName.java:49)
	at org.apache.lucene.util.TestRuleIgnoreAfterMaxFailures$1.evaluate(TestRuleIgnoreAfterMaxFailures.java:70)
	at org.apache.lucene.util.TestRuleMarkFailure$1.evaluate(TestRuleMarkFailure.java:48)
	at com.carrotsearch.randomizedtesting.rules.StatementAdapter.evaluate(StatementAdapter.java:36)
	at com.carrotsearch.randomizedtesting.ThreadLeakControl$StatementRunner.run(ThreadLeakControl.java:358)
	at com.carrotsearch.randomizedtesting.ThreadLeakControl.forkTimeoutingTask(ThreadLeakControl.java:782)
	at com.carrotsearch.randomizedtesting.ThreadLeakControl$3.evaluate(ThreadLeakControl.java:442)
	at com.carrotsearch.randomizedtesting.RandomizedRunner.runSingleTest(RandomizedRunner.java:746)
	at com.carrotsearch.randomizedtesting.RandomizedRunner$3.evaluate(RandomizedRunner.java:648)
	at com.carrotsearch.randomizedtesting.RandomizedRunner$4.evaluate(RandomizedRunner.java:682)
	at com.carrotsearch.randomizedtesting.RandomizedRunner$5.evaluate(RandomizedRunner.java:693)
	at com.carrotsearch.randomizedtesting.rules.StatementAdapter.evaluate(StatementAdapter.java:36)
	at com.carrotsearch.randomizedtesting.rules.SystemPropertiesRestoreRule$1.evaluate(SystemPropertiesRestoreRule.java:53)
	at org.apache.lucene.util.AbstractBeforeAfterRule$1.evaluate(AbstractBeforeAfterRule.java:46)
	at org.apache.lucene.util.TestRuleStoreClassName$1.evaluate(TestRuleStoreClassName.java:42)
	at com.carrotsearch.randomizedtesting.rules.SystemPropertiesInvariantRule$1.evaluate(SystemPropertiesInvariantRule.java:55)
	at com.carrotsearch.randomizedtesting.rules.NoShadowingOrOverridesOnMethodsRule$1.evaluate(NoShadowingOrOverridesOnMethodsRule.java:39)
	at com.carrotsearch.randomizedtesting.rules.NoShadowingOrOverridesOnMethodsRule$1.evaluate(NoShadowingOrOverridesOnMethodsRule.java:39)
	at com.carrotsearch.randomizedtesting.rules.StatementAdapter.evaluate(StatementAdapter.java:36)
	at org.apache.lucene.util.TestRuleAssertionsRequired$1.evaluate(TestRuleAssertionsRequired.java:43)
	at org.apache.lucene.util.TestRuleMarkFailure$1.evaluate(TestRuleMarkFailure.java:48)
	at org.apache.lucene.util.TestRuleIgnoreAfterMaxFailures$1.evaluate(TestRuleIgnoreAfterMaxFailures.java:70)
	at org.apache.lucene.util.TestRuleIgnoreTestSuites$1.evaluate(TestRuleIgnoreTestSuites.java:55)
	at com.carrotsearch.randomizedtesting.rules.StatementAdapter.evaluate(StatementAdapter.java:36)
	at com.carrotsearch.randomizedtesting.ThreadLeakControl$StatementRunner.run(ThreadLeakControl.java:358)
	at java.lang.Thread.run(Thread.java:780)


REGRESSION:  org.apache.solr.handler.component.TermVectorComponentDistributedTest.testDistribSearch

Error Message:
.termVectors.0.test_basictv!=test_postv (unordered or missing)

Stack Trace:
junit.framework.AssertionFailedError: .termVectors.0.test_basictv!=test_postv (unordered or missing)
	at __randomizedtesting.SeedInfo.seed([F6E59B1B32109D9B:77031503454FFDA7]:0)
	at junit.framework.Assert.fail(Assert.java:50)
	at org.apache.solr.BaseDistributedSearchTestCase.compareSolrResponses(BaseDistributedSearchTestCase.java:822)
	at org.apache.solr.BaseDistributedSearchTestCase.compareResponses(BaseDistributedSearchTestCase.java:841)
	at org.apache.solr.BaseDistributedSearchTestCase.query(BaseDistributedSearchTestCase.java:544)
	at org.apache.solr.BaseDistributedSearchTestCase.query(BaseDistributedSearchTestCase.java:521)
	at org.apache.solr.handler.component.TermVectorComponentDistributedTest.doTest(TermVectorComponentDistributedTest.java:155)
	at org.apache.solr.BaseDistributedSearchTestCase.testDistribSearch(BaseDistributedSearchTestCase.java:855)
	at sun.reflect.NativeMethodAccessorImpl.invoke0(Native Method)
	at sun.reflect.NativeMethodAccessorImpl.invoke(NativeMethodAccessorImpl.java:88)
	at sun.reflect.DelegatingMethodAccessorImpl.invoke(DelegatingMethodAccessorImpl.java:55)
	at java.lang.reflect.Method.invoke(Method.java:613)
	at com.carrotsearch.randomizedtesting.RandomizedRunner.invoke(RandomizedRunner.java:1559)
	at com.carrotsearch.randomizedtesting.RandomizedRunner.access$600(RandomizedRunner.java:79)
	at com.carrotsearch.randomizedtesting.RandomizedRunner$6.evaluate(RandomizedRunner.java:737)
	at com.carrotsearch.randomizedtesting.RandomizedRunner$7.evaluate(RandomizedRunner.java:773)
	at com.carrotsearch.randomizedtesting.RandomizedRunner$8.evaluate(RandomizedRunner.java:787)
	at com.carrotsearch.randomizedtesting.rules.SystemPropertiesRestoreRule$1.evaluate(SystemPropertiesRestoreRule.java:53)
	at org.apache.lucene.util.TestRuleSetupTeardownChained$1.evaluate(TestRuleSetupTeardownChained.java:50)
	at org.apache.lucene.util.TestRuleFieldCacheSanity$1.evaluate(TestRuleFieldCacheSanity.java:51)
	at org.apache.lucene.util.AbstractBeforeAfterRule$1.evaluate(AbstractBeforeAfterRule.java:46)
	at com.carrotsearch.randomizedtesting.rules.SystemPropertiesInvariantRule$1.evaluate(SystemPropertiesInvariantRule.java:55)
	at org.apache.lucene.util.TestRuleThreadAndTestName$1.evaluate(TestRuleThreadAndTestName.java:49)
	at org.apache.lucene.util.TestRuleIgnoreAfterMaxFailures$1.evaluate(TestRuleIgnoreAfterMaxFailures.java:70)
	at org.apache.lucene.util.TestRuleMarkFailure$1.evaluate(TestRuleMarkFailure.java:48)
	at com.carrotsearch.randomizedtesting.rules.StatementAdapter.evaluate(StatementAdapter.java:36)
	at com.carrotsearch.randomizedtesting.ThreadLeakControl$StatementRunner.run(ThreadLeakControl.java:358)
	at com.carrotsearch.randomizedtesting.ThreadLeakControl.forkTimeoutingTask(ThreadLeakControl.java:782)
	at com.carrotsearch.randomizedtesting.ThreadLeakControl$3.evaluate(ThreadLeakControl.java:442)
	at com.carrotsearch.randomizedtesting.RandomizedRunner.runSingleTest(RandomizedRunner.java:746)
	at com.carrotsearch.randomizedtesting.RandomizedRunner$3.evaluate(RandomizedRunner.java:648)
	at com.carrotsearch.randomizedtesting.RandomizedRunner$4.evaluate(RandomizedRunner.java:682)
	at com.carrotsearch.randomizedtesting.RandomizedRunner$5.evaluate(RandomizedRunner.java:693)
	at com.carrotsearch.randomizedtesting.rules.StatementAdapter.evaluate(StatementAdapter.java:36)
	at com.carrotsearch.randomizedtesting.rules.SystemPropertiesRestoreRule$1.evaluate(SystemPropertiesRestoreRule.java:53)
	at org.apache.lucene.util.AbstractBeforeAfterRule$1.evaluate(AbstractBeforeAfterRule.java:46)
	at org.apache.lucene.util.TestRuleStoreClassName$1.evaluate(TestRuleStoreClassName.java:42)
	at com.carrotsearch.randomizedtesting.rules.SystemPropertiesInvariantRule$1.evaluate(SystemPropertiesInvariantRule.java:55)
	at com.carrotsearch.randomizedtesting.rules.NoShadowingOrOverridesOnMethodsRule$1.evaluate(NoShadowingOrOverridesOnMethodsRule.java:39)
	at com.carrotsearch.randomizedtesting.rules.NoShadowingOrOverridesOnMethodsRule$1.evaluate(NoShadowingOrOverridesOnMethodsRule.java:39)
	at com.carrotsearch.randomizedtesting.rules.StatementAdapter.evaluate(StatementAdapter.java:36)
	at org.apache.lucene.util.TestRuleAssertionsRequired$1.evaluate(TestRuleAssertionsRequired.java:43)
	at org.apache.lucene.util.TestRuleMarkFailure$1.evaluate(TestRuleMarkFailure.java:48)
	at org.apache.lucene.util.TestRuleIgnoreAfterMaxFailures$1.evaluate(TestRuleIgnoreAfterMaxFailures.java:70)
	at org.apache.lucene.util.TestRuleIgnoreTestSuites$1.evaluate(TestRuleIgnoreTestSuites.java:55)
	at com.carrotsearch.randomizedtesting.rules.StatementAdapter.evaluate(StatementAdapter.java:36)
	at com.carrotsearch.randomizedtesting.ThreadLeakControl$StatementRunner.run(ThreadLeakControl.java:358)
	at java.lang.Thread.run(Thread.java:780)


REGRESSION:  org.apache.solr.update.processor.SignatureUpdateProcessorFactoryTest.testDupeDetection

Error Message:
expected:<1> but was:<2>

Stack Trace:
java.lang.AssertionError: expected:<1> but was:<2>
	at __randomizedtesting.SeedInfo.seed([F6E59B1B32109D9B:ADD560D331573EE7]:0)
	at org.junit.Assert.fail(Assert.java:93)
	at org.junit.Assert.failNotEquals(Assert.java:647)
	at org.junit.Assert.assertEquals(Assert.java:128)
	at org.junit.Assert.assertEquals(Assert.java:472)
	at org.junit.Assert.assertEquals(Assert.java:456)
	at org.apache.solr.update.processor.SignatureUpdateProcessorFactoryTest.checkNumDocs(SignatureUpdateProcessorFactoryTest.java:71)
	at org.apache.solr.update.processor.SignatureUpdateProcessorFactoryTest.testDupeDetection(SignatureUpdateProcessorFactoryTest.java:119)
	at sun.reflect.NativeMethodAccessorImpl.invoke0(Native Method)
	at sun.reflect.NativeMethodAccessorImpl.invoke(NativeMethodAccessorImpl.java:88)
	at sun.reflect.DelegatingMethodAccessorImpl.invoke(DelegatingMethodAccessorImpl.java:55)
	at java.lang.reflect.Method.invoke(Method.java:613)
	at com.carrotsearch.randomizedtesting.RandomizedRunner.invoke(RandomizedRunner.java:1559)
	at com.carrotsearch.randomizedtesting.RandomizedRunner.access$600(RandomizedRunner.java:79)
	at com.carrotsearch.randomizedtesting.RandomizedRunner$6.evaluate(RandomizedRunner.java:737)
	at com.carrotsearch.randomizedtesting.RandomizedRunner$7.evaluate(RandomizedRunner.java:773)
	at com.carrotsearch.randomizedtesting.RandomizedRunner$8.evaluate(RandomizedRunner.java:787)
	at com.carrotsearch.randomizedtesting.rules.SystemPropertiesRestoreRule$1.evaluate(SystemPropertiesRestoreRule.java:53)
	at org.apache.lucene.util.TestRuleSetupTeardownChained$1.evaluate(TestRuleSetupTeardownChained.java:50)
	at org.apache.lucene.util.TestRuleFieldCacheSanity$1.evaluate(TestRuleFieldCacheSanity.java:51)
	at org.apache.lucene.util.AbstractBeforeAfterRule$1.evaluate(AbstractBeforeAfterRule.java:46)
	at com.carrotsearch.randomizedtesting.rules.SystemPropertiesInvariantRule$1.evaluate(SystemPropertiesInvariantRule.java:55)
	at org.apache.lucene.util.TestRuleThreadAndTestName$1.evaluate(TestRuleThreadAndTestName.java:49)
	at org.apache.lucene.util.TestRuleIgnoreAfterMaxFailures$1.evaluate(TestRuleIgnoreAfterMaxFailures.java:70)
	at org.apache.lucene.util.TestRuleMarkFailure$1.evaluate(TestRuleMarkFailure.java:48)
	at com.carrotsearch.randomizedtesting.rules.StatementAdapter.evaluate(StatementAdapter.java:36)
	at com.carrotsearch.randomizedtesting.ThreadLeakControl$StatementRunner.run(ThreadLeakControl.java:358)
	at com.carrotsearch.randomizedtesting.ThreadLeakControl.forkTimeoutingTask(ThreadLeakControl.java:782)
	at com.carrotsearch.randomizedtesting.ThreadLeakControl$3.evaluate(ThreadLeakControl.java:442)
	at com.carrotsearch.randomizedtesting.RandomizedRunner.runSingleTest(RandomizedRunner.java:746)
	at com.carrotsearch.randomizedtesting.RandomizedRunner$3.evaluate(RandomizedRunner.java:648)
	at com.carrotsearch.randomizedtesting.RandomizedRunner$4.evaluate(RandomizedRunner.java:682)
	at com.carrotsearch.randomizedtesting.RandomizedRunner$5.evaluate(RandomizedRunner.java:693)
	at com.carrotsearch.randomizedtesting.rules.StatementAdapter.evaluate(StatementAdapter.java:36)
	at com.carrotsearch.randomizedtesting.rules.SystemPropertiesRestoreRule$1.evaluate(SystemPropertiesRestoreRule.java:53)
	at org.apache.lucene.util.AbstractBeforeAfterRule$1.evaluate(AbstractBeforeAfterRule.java:46)
	at org.apache.lucene.util.TestRuleStoreClassName$1.evaluate(TestRuleStoreClassName.java:42)
	at com.carrotsearch.randomizedtesting.rules.SystemPropertiesInvariantRule$1.evaluate(SystemPropertiesInvariantRule.java:55)
	at com.carrotsearch.randomizedtesting.rules.NoShadowingOrOverridesOnMethodsRule$1.evaluate(NoShadowingOrOverridesOnMethodsRule.java:39)
	at com.carrotsearch.randomizedtesting.rules.NoShadowingOrOverridesOnMethodsRule$1.evaluate(NoShadowingOrOverridesOnMethodsRule.java:39)
	at com.carrotsearch.randomizedtesting.rules.StatementAdapter.evaluate(StatementAdapter.java:36)
	at org.apache.lucene.util.TestRuleAssertionsRequired$1.evaluate(TestRuleAssertionsRequired.java:43)
	at org.apache.lucene.util.TestRuleMarkFailure$1.evaluate(TestRuleMarkFailure.java:48)
	at org.apache.lucene.util.TestRuleIgnoreAfterMaxFailures$1.evaluate(TestRuleIgnoreAfterMaxFailures.java:70)
	at org.apache.lucene.util.TestRuleIgnoreTestSuites$1.evaluate(TestRuleIgnoreTestSuites.java:55)
	at com.carrotsearch.randomizedtesting.rules.StatementAdapter.evaluate(StatementAdapter.java:36)
	at com.carrotsearch.randomizedtesting.ThreadLeakControl$StatementRunner.run(ThreadLeakControl.java:358)
	at java.lang.Thread.run(Thread.java:780)




Build Log:
[...truncated 10275 lines...]
   [junit4] Suite: org.apache.solr.handler.component.TermVectorComponentDistributedTest
   [junit4]   2> 250447 T691 oas.BaseDistributedSearchTestCase.initHostContext Setting hostContext system property: /
   [junit4]   2> 250450 T691 oas.SolrTestCaseJ4.setUp ###Starting testDistribSearch
   [junit4]   2> 250451 T691 oejs.Server.doStart jetty-8.1.10.v20130312
   [junit4]   2> 250456 T691 oejs.AbstractConnector.doStart Started SelectChannelConnector@127.0.0.1:40962
   [junit4]   2> 250457 T691 oass.SolrDispatchFilter.init SolrDispatchFilter.init()
   [junit4]   2> 250458 T691 oasc.SolrResourceLoader.locateSolrHome JNDI not configured for solr (NoInitialContextEx)
   [junit4]   2> 250458 T691 oasc.SolrResourceLoader.locateSolrHome using system property solr.solr.home: /mnt/ssd/jenkins/workspace/Lucene-Solr-4.x-Linux/solr/build/solr-core/test-files/solr
   [junit4]   2> 250459 T691 oasc.SolrResourceLoader.<init> new SolrResourceLoader for directory: '/mnt/ssd/jenkins/workspace/Lucene-Solr-4.x-Linux/solr/build/solr-core/test-files/solr/'
   [junit4]   2> 250467 T691 oasc.ConfigSolr.fromFile Loading container configuration from /mnt/ssd/jenkins/workspace/Lucene-Solr-4.x-Linux/solr/build/solr-core/test-files/solr/solr.xml
   [junit4]   2> 250503 T691 oasc.CoreContainer.<init> New CoreContainer 1325467853
   [junit4]   2> 250504 T691 oasc.CoreContainer.load Loading cores into CoreContainer [instanceDir=/mnt/ssd/jenkins/workspace/Lucene-Solr-4.x-Linux/solr/build/solr-core/test-files/solr/]
   [junit4]   2> 250505 T691 oashc.HttpShardHandlerFactory.getParameter Setting socketTimeout to: 90000
   [junit4]   2> 250506 T691 oashc.HttpShardHandlerFactory.getParameter Setting urlScheme to: http://
   [junit4]   2> 250506 T691 oashc.HttpShardHandlerFactory.getParameter Setting connTimeout to: 15000
   [junit4]   2> 250507 T691 oashc.HttpShardHandlerFactory.getParameter Setting maxConnectionsPerHost to: 20
   [junit4]   2> 250508 T691 oashc.HttpShardHandlerFactory.getParameter Setting corePoolSize to: 0
   [junit4]   2> 250508 T691 oashc.HttpShardHandlerFactory.getParameter Setting maximumPoolSize to: 2147483647
   [junit4]   2> 250509 T691 oashc.HttpShardHandlerFactory.getParameter Setting maxThreadIdleTime to: 5
   [junit4]   2> 250509 T691 oashc.HttpShardHandlerFactory.getParameter Setting sizeOfQueue to: -1
   [junit4]   2> 250510 T691 oashc.HttpShardHandlerFactory.getParameter Setting fairnessPolicy to: false
   [junit4]   2> 250515 T691 oasl.LogWatcher.createWatcher SLF4J impl is org.slf4j.impl.Log4jLoggerFactory
   [junit4]   2> 250516 T691 oasl.LogWatcher.newRegisteredLogWatcher Registering Log Listener [Log4j (org.slf4j.impl.Log4jLoggerFactory)]
   [junit4]   2> 250516 T691 oasc.CoreContainer.load Host Name: 127.0.0.1
   [junit4]   2> 250521 T701 oasc.CoreContainer.create Creating SolrCore 'collection1' using instanceDir: /mnt/ssd/jenkins/workspace/Lucene-Solr-4.x-Linux/solr/build/solr-core/test-files/solr/collection1
   [junit4]   2> 250521 T701 oasc.SolrResourceLoader.<init> new SolrResourceLoader for directory: '/mnt/ssd/jenkins/workspace/Lucene-Solr-4.x-Linux/solr/build/solr-core/test-files/solr/collection1/'
   [junit4]   2> 250522 T701 oasc.SolrResourceLoader.replaceClassLoader Adding 'file:/mnt/ssd/jenkins/workspace/Lucene-Solr-4.x-Linux/solr/build/solr-core/test-files/solr/collection1/lib/classes/' to classloader
   [junit4]   2> 250523 T701 oasc.SolrResourceLoader.replaceClassLoader Adding 'file:/mnt/ssd/jenkins/workspace/Lucene-Solr-4.x-Linux/solr/build/solr-core/test-files/solr/collection1/lib/README' to classloader
   [junit4]   2> 250561 T701 oasc.SolrConfig.<init> Using Lucene MatchVersion: LUCENE_47
   [junit4]   2> 250604 T701 oasc.SolrConfig.<init> Loaded SolrConfig: solrconfig.xml
   [junit4]   2> 250605 T701 oass.IndexSchema.readSchema Reading Solr Schema from schema.xml
   [junit4]   2> 250611 T701 oass.IndexSchema.readSchema [collection1] Schema name=test
   [junit4]   2> 250987 T701 oass.ByteField.init WARN ByteField is deprecated and will be removed in 5.0. You should use TrieIntField instead.
   [junit4]   2> 250987 T701 oass.ShortField.init WARN ShortField is deprecated and will be removed in 5.0. You should use TrieIntField instead.
   [junit4]   2> 250988 T701 oass.OpenExchangeRatesOrgProvider.init Initialized with rates=open-exchange-rates.json, refreshInterval=1440.
   [junit4]   2> 250997 T701 oass.IndexSchema.readSchema default search field in schema is text
   [junit4]   2> 251001 T701 oass.IndexSchema.readSchema unique key field: id
   [junit4]   2> 251010 T701 oass.FileExchangeRateProvider.reload Reloading exchange rates from file currency.xml
   [junit4]   2> 251016 T701 oass.FileExchangeRateProvider.reload Reloading exchange rates from file currency.xml
   [junit4]   2> 251021 T701 oass.OpenExchangeRatesOrgProvider.reload Reloading exchange rates from open-exchange-rates.json
   [junit4]   2> 251022 T701 oass.OpenExchangeRatesOrgProvider$OpenExchangeRates.<init> WARN Unknown key IMPORTANT NOTE
   [junit4]   2> 251022 T701 oass.OpenExchangeRatesOrgProvider$OpenExchangeRates.<init> WARN Expected key, got STRING
   [junit4]   2> 251023 T701 oass.OpenExchangeRatesOrgProvider.reload Reloading exchange rates from open-exchange-rates.json
   [junit4]   2> 251024 T701 oass.OpenExchangeRatesOrgProvider$OpenExchangeRates.<init> WARN Unknown key IMPORTANT NOTE
   [junit4]   2> 251024 T701 oass.OpenExchangeRatesOrgProvider$OpenExchangeRates.<init> WARN Expected key, got STRING
   [junit4]   2> 251025 T701 oasc.SolrCore.initDirectoryFactory org.apache.solr.core.MockDirectoryFactory
   [junit4]   2> 251025 T701 oasc.SolrCore.<init> [collection1] Opening new SolrCore at /mnt/ssd/jenkins/workspace/Lucene-Solr-4.x-Linux/solr/build/solr-core/test-files/solr/collection1/, dataDir=./org.apache.solr.handler.component.TermVectorComponentDistributedTest-1388677727008/control/data/
   [junit4]   2> 251026 T701 oasc.JmxMonitoredMap.<init> JMX monitoring is enabled. Adding Solr mbeans to JMX Server: com.sun.jmx.mbeanserver.JmxMBeanServer@171a256a
   [junit4]   2> 251027 T701 oasc.CachingDirectoryFactory.get return new directory for ./org.apache.solr.handler.component.TermVectorComponentDistributedTest-1388677727008/control/data
   [junit4]   2> 251028 T701 oasc.SolrCore.getNewIndexDir New index directory detected: old=null new=./org.apache.solr.handler.component.TermVectorComponentDistributedTest-1388677727008/control/data/index/
   [junit4]   2> 251028 T701 oasc.SolrCore.initIndex WARN [collection1] Solr index directory './org.apache.solr.handler.component.TermVectorComponentDistributedTest-1388677727008/control/data/index' doesn't exist. Creating new index...
   [junit4]   2> 251029 T701 oasc.CachingDirectoryFactory.get return new directory for ./org.apache.solr.handler.component.TermVectorComponentDistributedTest-1388677727008/control/data/index
   [junit4]   2> 251030 T701 oasu.RandomMergePolicy.<init> RandomMergePolicy wrapping class org.apache.lucene.index.TieredMergePolicy: [TieredMergePolicy: maxMergeAtOnce=32, maxMergeAtOnceExplicit=21, maxMergedSegmentMB=95.31640625, floorSegmentMB=0.302734375, forceMergeDeletesPctAllowed=6.091186427705378, segmentsPerTier=13.0, maxCFSSegmentSizeMB=8.796093022207999E12, noCFSRatio=0.27330632210337547
   [junit4]   2> 251031 T701 oasc.SolrDeletionPolicy.onCommit SolrDeletionPolicy.onCommit: commits: num=1
   [junit4]   2> 		commit{dir=RateLimitedDirectoryWrapper(MockDirectoryWrapper(org.apache.lucene.store.RAMDirectory@c5fc38c1 lockFactory=org.apache.lucene.store.SingleInstanceLockFactory@1ef71c8)),segFN=segments_1,generation=1}
   [junit4]   2> 251031 T701 oasc.SolrDeletionPolicy.updateCommits newest commit generation = 1
   [junit4]   2> 251032 T701 oasc.SolrCore.initWriters created xml: solr.XMLResponseWriter
   [junit4]   2> 251038 T701 oasup.UpdateRequestProcessorChain.init creating updateRequestProcessorChain "dedupe"
   [junit4]   2> 251038 T701 oasup.UpdateRequestProcessorChain.init inserting DistributedUpdateProcessorFactory into updateRequestProcessorChain "dedupe"
   [junit4]   2> 251039 T701 oasup.UpdateRequestProcessorChain.init creating updateRequestProcessorChain "dedupe-allfields"
   [junit4]   2> 251039 T701 oasup.UpdateRequestProcessorChain.init inserting DistributedUpdateProcessorFactory into updateRequestProcessorChain "dedupe-allfields"
   [junit4]   2> 251040 T701 oasup.UpdateRequestProcessorChain.init creating updateRequestProcessorChain "stored_sig"
   [junit4]   2> 251040 T701 oasup.UpdateRequestProcessorChain.init inserting DistributedUpdateProcessorFactory into updateRequestProcessorChain "stored_sig"
   [junit4]   2> 251041 T701 oasup.UpdateRequestProcessorChain.init creating updateRequestProcessorChain "uniq-fields"
   [junit4]   2> 251041 T701 oasup.UniqFieldsUpdateProcessorFactory.init WARN Use of the 'fields' init param in UniqFieldsUpdateProcessorFactory is deprecated, please use 'fieldName' (or another FieldMutatingUpdateProcessorFactory selector option) instead
   [junit4]   2> 251042 T701 oasup.UniqFieldsUpdateProcessorFactory.init Replacing 'fields' init param with (individual) 'fieldName' params
   [junit4]   2> 251042 T701 oasup.UpdateRequestProcessorChain.init inserting DistributedUpdateProcessorFactory into updateRequestProcessorChain "uniq-fields"
   [junit4]   2> 251043 T701 oasup.UpdateRequestProcessorChain.init creating updateRequestProcessorChain "distrib-dup-test-chain-explicit"
   [junit4]   2> 251044 T701 oasup.UpdateRequestProcessorChain.init creating updateRequestProcessorChain "distrib-dup-test-chain-implicit"
   [junit4]   2> 251044 T701 oasup.UpdateRequestProcessorChain.init inserting DistributedUpdateProcessorFactory into updateRequestProcessorChain "distrib-dup-test-chain-implicit"
   [junit4]   2> 251045 T701 oasc.SolrCore.loadUpdateProcessorChains no updateRequestProcessorChain defined as default, creating implicit default
   [junit4]   2> 251045 T701 oasc.RequestHandlers.initHandlersFromConfig adding lazy requestHandler: solr.ReplicationHandler
   [junit4]   2> 251046 T701 oasc.RequestHandlers.initHandlersFromConfig created /replication: solr.ReplicationHandler
   [junit4]   2> 251047 T701 oasc.RequestHandlers.initHandlersFromConfig created standard: solr.StandardRequestHandler
   [junit4]   2> 251048 T701 oasc.RequestHandlers.initHandlersFromConfig created /get: solr.RealTimeGetHandler
   [junit4]   2> 251048 T701 oasc.RequestHandlers.initHandlersFromConfig created dismax: solr.SearchHandler
   [junit4]   2> 251049 T701 oasc.RequestHandlers.initHandlersFromConfig created mock: org.apache.solr.core.MockQuerySenderListenerReqHandler
   [junit4]   2> 251050 T701 oasc.RequestHandlers.initHandlersFromConfig created /admin/: org.apache.solr.handler.admin.AdminHandlers
   [junit4]   2> 251051 T701 oasc.RequestHandlers.initHandlersFromConfig created /admin/file: solr.admin.ShowFileRequestHandler
   [junit4]   2> 251052 T701 oasc.RequestHandlers.initHandlersFromConfig created defaults: solr.StandardRequestHandler
   [junit4]   2> 251052 T701 oasc.RequestHandlers.initHandlersFromConfig adding lazy requestHandler: solr.StandardRequestHandler
   [junit4]   2> 251053 T701 oasc.RequestHandlers.initHandlersFromConfig created lazy: solr.StandardRequestHandler
   [junit4]   2> 251053 T701 oasc.RequestHandlers.initHandlersFromConfig created /update: solr.UpdateRequestHandler
   [junit4]   2> 251054 T701 oasc.RequestHandlers.initHandlersFromConfig created /terms: org.apache.solr.handler.component.SearchHandler
   [junit4]   2> 251055 T701 oasc.RequestHandlers.initHandlersFromConfig created spellCheckCompRH: org.apache.solr.handler.component.SearchHandler
   [junit4]   2> 251056 T701 oasc.RequestHandlers.initHandlersFromConfig created spellCheckCompRH_Direct: org.apache.solr.handler.component.SearchHandler
   [junit4]   2> 251057 T701 oasc.RequestHandlers.initHandlersFromConfig created spellCheckWithWordbreak: org.apache.solr.handler.component.SearchHandler
   [junit4]   2> 251057 T701 oasc.RequestHandlers.initHandlersFromConfig created spellCheckWithWordbreak_Direct: org.apache.solr.handler.component.SearchHandler
   [junit4]   2> 251058 T701 oasc.RequestHandlers.initHandlersFromConfig created spellCheckCompRH1: org.apache.solr.handler.component.SearchHandler
   [junit4]   2> 251059 T701 oasc.RequestHandlers.initHandlersFromConfig created mltrh: org.apache.solr.handler.component.SearchHandler
   [junit4]   2> 251060 T701 oasc.RequestHandlers.initHandlersFromConfig created tvrh: org.apache.solr.handler.component.SearchHandler
   [junit4]   2> 251061 T701 oasc.RequestHandlers.initHandlersFromConfig created /mlt: solr.MoreLikeThisHandler
   [junit4]   2> 251061 T701 oasc.RequestHandlers.initHandlersFromConfig created /debug/dump: solr.DumpRequestHandler
   [junit4]   2> 251063 T701 oashl.XMLLoader.init xsltCacheLifetimeSeconds=60
   [junit4]   2> 251065 T701 oasc.SolrCore.initDeprecatedSupport WARN solrconfig.xml uses deprecated <admin/gettableFiles>, Please update your config to use the ShowFileRequestHandler.
   [junit4]   2> 251068 T701 oasu.CommitTracker.<init> Hard AutoCommit: disabled
   [junit4]   2> 251069 T701 oasu.CommitTracker.<init> Soft AutoCommit: disabled
   [junit4]   2> 251070 T701 oasu.RandomMergePolicy.<init> RandomMergePolicy wrapping class org.apache.lucene.index.TieredMergePolicy: [TieredMergePolicy: maxMergeAtOnce=16, maxMergeAtOnceExplicit=27, maxMergedSegmentMB=50.8154296875, floorSegmentMB=1.6240234375, forceMergeDeletesPctAllowed=13.936565227630485, segmentsPerTier=19.0, maxCFSSegmentSizeMB=8.796093022207999E12, noCFSRatio=0.5006210243806076
   [junit4]   2> 251071 T701 oasc.SolrDeletionPolicy.onInit SolrDeletionPolicy.onInit: commits: num=1
   [junit4]   2> 		commit{dir=RateLimitedDirectoryWrapper(MockDirectoryWrapper(org.apache.lucene.store.RAMDirectory@c5fc38c1 lockFactory=org.apache.lucene.store.SingleInstanceLockFactory@1ef71c8)),segFN=segments_1,generation=1}
   [junit4]   2> 251071 T701 oasc.SolrDeletionPolicy.updateCommits newest commit generation = 1
   [junit4]   2> 251072 T701 oass.SolrIndexSearcher.<init> Opening Searcher@4668b47f main
   [junit4]   2> 251073 T701 oashc.SpellCheckComponent.inform Initializing spell checkers
   [junit4]   2> 251148 T701 oass.DirectSolrSpellChecker.init init: {name=direct,classname=DirectSolrSpellChecker,field=lowerfilt,minQueryLength=3}
   [junit4]   2> 251184 T702 oasc.SolrCore.registerSearcher [collection1] Registered new searcher Searcher@4668b47f main{StandardDirectoryReader(segments_1:1:nrt)}
   [junit4]   2> 251216 T701 oasc.CoreContainer.registerCore registering core: collection1
   [junit4]   2> 251217 T691 oass.SolrDispatchFilter.init user.dir=/mnt/ssd/jenkins/workspace/Lucene-Solr-4.x-Linux/solr/build/solr-core/test/J1
   [junit4]   2> 251218 T691 oass.SolrDispatchFilter.init SolrDispatchFilter.init() done
   [junit4]   2> 251220 T691 oejs.Server.doStart jetty-8.1.10.v20130312
   [junit4]   2> 251223 T691 oejs.AbstractConnector.doStart Started SelectChannelConnector@127.0.0.1:56018
   [junit4]   2> 251224 T691 oass.SolrDispatchFilter.init SolrDispatchFilter.init()
   [junit4]   2> 251225 T691 oasc.SolrResourceLoader.locateSolrHome JNDI not configured for solr (NoInitialContextEx)
   [junit4]   2> 251226 T691 oasc.SolrResourceLoader.locateSolrHome using system property solr.solr.home: /mnt/ssd/jenkins/workspace/Lucene-Solr-4.x-Linux/solr/build/solr-core/test-files/solr
   [junit4]   2> 251227 T691 oasc.SolrResourceLoader.<init> new SolrResourceLoader for directory: '/mnt/ssd/jenkins/workspace/Lucene-Solr-4.x-Linux/solr/build/solr-core/test-files/solr/'
   [junit4]   2> 251252 T691 oasc.ConfigSolr.fromFile Loading container configuration from /mnt/ssd/jenkins/workspace/Lucene-Solr-4.x-Linux/solr/build/solr-core/test-files/solr/solr.xml
   [junit4]   2> 251313 T691 oasc.CoreContainer.<init> New CoreContainer 1681331382
   [junit4]   2> 251314 T691 oasc.CoreContainer.load Loading cores into CoreContainer [instanceDir=/mnt/ssd/jenkins/workspace/Lucene-Solr-4.x-Linux/solr/build/solr-core/test-files/solr/]
   [junit4]   2> 251317 T691 oashc.HttpShardHandlerFactory.getParameter Setting socketTimeout to: 90000
   [junit4]   2> 251318 T691 oashc.HttpShardHandlerFactory.getParameter Setting urlScheme to: http://
   [junit4]   2> 251319 T691 oashc.HttpShardHandlerFactory.getParameter Setting connTimeout to: 15000
   [junit4]   2> 251320 T691 oashc.HttpShardHandlerFactory.getParameter Setting maxConnectionsPerHost to: 20
   [junit4]   2> 251321 T691 oashc.HttpShardHandlerFactory.getParameter Setting corePoolSize to: 0
   [junit4]   2> 251322 T691 oashc.HttpShardHandlerFactory.getParameter Setting maximumPoolSize to: 2147483647
   [junit4]   2> 251323 T691 oashc.HttpShardHandlerFactory.getParameter Setting maxThreadIdleTime to: 5
   [junit4]   2> 251325 T691 oashc.HttpShardHandlerFactory.getParameter Setting sizeOfQueue to: -1
   [junit4]   2> 251326 T691 oashc.HttpShardHandlerFactory.getParameter Setting fairnessPolicy to: false
   [junit4]   2> 251331 T691 oasl.LogWatcher.createWatcher SLF4J impl is org.slf4j.impl.Log4jLoggerFactory
   [junit4]   2> 251332 T691 oasl.LogWatcher.newRegisteredLogWatcher Registering Log Listener [Log4j (org.slf4j.impl.Log4jLoggerFactory)]
   [junit4]   2> 251333 T691 oasc.CoreContainer.load Host Name: 127.0.0.1
   [junit4]   2> 251336 T713 oasc.CoreContainer.create Creating SolrCore 'collection1' using instanceDir: /mnt/ssd/jenkins/workspace/Lucene-Solr-4.x-Linux/solr/build/solr-core/test-files/solr/collection1
   [junit4]   2> 251336 T713 oasc.SolrResourceLoader.<init> new SolrResourceLoader for directory: '/mnt/ssd/jenkins/workspace/Lucene-Solr-4.x-Linux/solr/build/solr-core/test-files/solr/collection1/'
   [junit4]   2> 251337 T713 oasc.SolrResourceLoader.replaceClassLoader Adding 'file:/mnt/ssd/jenkins/workspace/Lucene-Solr-4.x-Linux/solr/build/solr-core/test-files/solr/collection1/lib/classes/' to classloader
   [junit4]   2> 251337 T713 oasc.SolrResourceLoader.replaceClassLoader Adding 'file:/mnt/ssd/jenkins/workspace/Lucene-Solr-4.x-Linux/solr/build/solr-core/test-files/solr/collection1/lib/README' to classloader
   [junit4]   2> 251380 T713 oasc.SolrConfig.<init> Using Lucene MatchVersion: LUCENE_47
   [junit4]   2> 251430 T713 oasc.SolrConfig.<init> Loaded SolrConfig: solrconfig.xml
   [junit4]   2> 251431 T713 oass.IndexSchema.readSchema Reading Solr Schema from schema.xml
   [junit4]   2> 251437 T713 oass.IndexSchema.readSchema [collection1] Schema name=test
   [junit4]   2> 251832 T713 oass.ByteField.init WARN ByteField is deprecated and will be removed in 5.0. You should use TrieIntField instead.
   [junit4]   2> 251840 T713 oass.ShortField.init WARN ShortField is deprecated and will be removed in 5.0. You should use TrieIntField instead.
   [junit4]   2> 251841 T713 oass.OpenExchangeRatesOrgProvider.init Initialized with rates=open-exchange-rates.json, refreshInterval=1440.
   [junit4]   2> 251848 T713 oass.IndexSchema.readSchema default search field in schema is text
   [junit4]   2> 251851 T713 oass.IndexSchema.readSchema unique key field: id
   [junit4]   2> 251857 T713 oass.FileExchangeRateProvider.reload Reloading exchange rates from file currency.xml
   [junit4]   2> 251860 T713 oass.FileExchangeRateProvider.reload Reloading exchange rates from file currency.xml
   [junit4]   2> 251863 T713 oass.OpenExchangeRatesOrgProvider.reload Reloading exchange rates from open-exchange-rates.json
   [junit4]   2> 251864 T713 oass.OpenExchangeRatesOrgProvider$OpenExchangeRates.<init> WARN Unknown key IMPORTANT NOTE
   [junit4]   2> 251864 T713 oass.OpenExchangeRatesOrgProvider$OpenExchangeRates.<init> WARN Expected key, got STRING
   [junit4]   2> 251865 T713 oass.OpenExchangeRatesOrgProvider.reload Reloading exchange rates from open-exchange-rates.json
   [junit4]   2> 251865 T713 oass.OpenExchangeRatesOrgProvider$OpenExchangeRates.<init> WARN Unknown key IMPORTANT NOTE
   [junit4]   2> 251865 T713 oass.OpenExchangeRatesOrgProvider$OpenExchangeRates.<init> WARN Expected key, got STRING
   [junit4]   2> 251866 T713 oasc.SolrCore.initDirectoryFactory org.apache.solr.core.MockDirectoryFactory
   [junit4]   2> 251866 T713 oasc.SolrCore.<init> [collection1] Opening new SolrCore at /mnt/ssd/jenkins/workspace/Lucene-Solr-4.x-Linux/solr/build/solr-core/test-files/solr/collection1/, dataDir=./org.apache.solr.handler.component.TermVectorComponentDistributedTest-1388677727008/shard0/data/
   [junit4]   2> 251866 T713 oasc.JmxMonitoredMap.<init> JMX monitoring is enabled. Adding Solr mbeans to JMX Server: com.sun.jmx.mbeanserver.JmxMBeanServer@171a256a
   [junit4]   2> 251867 T713 oasc.CachingDirectoryFactory.get return new directory for ./org.apache.solr.handler.component.TermVectorComponentDistributedTest-1388677727008/shard0/data
   [junit4]   2> 251868 T713 oasc.SolrCore.getNewIndexDir New index directory detected: old=null new=./org.apache.solr.handler.component.TermVectorComponentDistributedTest-1388677727008/shard0/data/index/
   [junit4]   2> 251868 T713 oasc.SolrCore.initIndex WARN [collection1] Solr index directory './org.apache.solr.handler.component.TermVectorComponentDistributedTest-1388677727008/shard0/data/index' doesn't exist. Creating new index...
   [junit4]   2> 251869 T713 oasc.CachingDirectoryFactory.get return new directory for ./org.apache.solr.handler.component.TermVectorComponentDistributedTest-1388677727008/shard0/data/index
   [junit4]   2> 251869 T713 oasu.RandomMergePolicy.<init> RandomMergePolicy wrapping class org.apache.lucene.index.TieredMergePolicy: [TieredMergePolicy: maxMergeAtOnce=32, maxMergeAtOnceExplicit=21, maxMergedSegmentMB=95.31640625, floorSegmentMB=0.302734375, forceMergeDeletesPctAllowed=6.091186427705378, segmentsPerTier=13.0, maxCFSSegmentSizeMB=8.796093022207999E12, noCFSRatio=0.27330632210337547
   [junit4]   2> 251870 T713 oasc.SolrDeletionPolicy.onCommit SolrDeletionPolicy.onCommit: commits: num=1
   [junit4]   2> 		commit{dir=RateLimitedDirectoryWrapper(MockDirectoryWrapper(org.apache.lucene.store.RAMDirectory@3831f765 lockFactory=org.apache.lucene.store.SingleInstanceLockFactory@7f23bf4f)),segFN=segments_1,generation=1}
   [junit4]   2> 251870 T713 oasc.SolrDeletionPolicy.updateCommits newest commit generation = 1
   [junit4]   2> 251871 T713 oasc.SolrCore.initWriters created xml: solr.XMLResponseWriter
   [junit4]   2> 251875 T713 oasup.UpdateRequestProcessorChain.init creating updateRequestProcessorChain "dedupe"
   [junit4]   2> 251876 T713 oasup.UpdateRequestProcessorChain.init inserting DistributedUpdateProcessorFactory into updateRequestProcessorChain "dedupe"
   [junit4]   2> 251876 T713 oasup.UpdateRequestProcessorChain.init creating updateRequestProcessorChain "dedupe-allfields"
   [junit4]   2> 251877 T713 oasup.UpdateRequestProcessorChain.init inserting DistributedUpdateProcessorFactory into updateRequestProcessorChain "dedupe-allfields"
   [junit4]   2> 251877 T713 oasup.UpdateRequestProcessorChain.init creating updateRequestProcessorChain "stored_sig"
   [junit4]   2> 251877 T713 oasup.UpdateRequestProcessorChain.init inserting DistributedUpdateProcessorFactory into updateRequestProcessorChain "stored_sig"
   [junit4]   2> 251878 T713 oasup.UpdateRequestProcessorChain.init creating updateRequestProcessorChain "uniq-fields"
   [junit4]   2> 251878 T713 oasup.UniqFieldsUpdateProcessorFactory.init WARN Use of the 'fields' init param in UniqFieldsUpdateProcessorFactory is deprecated, please use 'fieldName' (or another FieldMutatingUpdateProcessorFactory selector option) instead
   [junit4]   2> 251878 T713 oasup.UniqFieldsUpdateProcessorFactory.init Replacing 'fields' init param with (individual) 'fieldName' params
   [junit4]   2> 251879 T713 oasup.UpdateRequestProcessorChain.init inserting DistributedUpdateProcessorFactory into updateRequestProcessorChain "uniq-fields"
   [junit4]   2> 251879 T713 oasup.UpdateRequestProcessorChain.init creating updateRequestProcessorChain "distrib-dup-test-chain-explicit"
   [junit4]   2> 251879 T713 oasup.UpdateRequestProcessorChain.init creating updateRequestProcessorChain "distrib-dup-test-chain-implicit"
   [junit4]   2> 251880 T713 oasup.UpdateRequestProcessorChain.init inserting DistributedUpdateProcessorFactory into updateRequestProcessorChain "distrib-dup-test-chain-implicit"
   [junit4]   2> 251880 T713 oasc.SolrCore.loadUpdateProcessorChains no updateRequestProcessorChain defined as default, creating implicit default
   [junit4]   2> 251880 T713 oasc.RequestHandlers.initHandlersFromConfig adding lazy requestHandler: solr.ReplicationHandler
   [junit4]   2> 251881 T713 oasc.RequestHandlers.initHandlersFromConfig created /replication: solr.ReplicationHandler
   [junit4]   2> 251882 T713 oasc.RequestHandlers.initHandlersFromConfig created standard: solr.StandardRequestHandler
   [junit4]   2> 251882 T713 oasc.RequestHandlers.initHandlersFromConfig created /get: solr.RealTimeGetHandler
   [junit4]   2> 251883 T713 oasc.RequestHandlers.initHandlersFromConfig created dismax: solr.SearchHandler
   [junit4]   2> 251884 T713 oasc.RequestHandlers.initHandlersFromConfig created mock: org.apache.solr.core.MockQuerySenderListenerReqHandler
   [junit4]   2> 251884 T713 oasc.RequestHandlers.initHandlersFromConfig created /admin/: org.apache.solr.handler.admin.AdminHandlers
   [junit4]   2> 251885 T713 oasc.RequestHandlers.initHandlersFromConfig created /admin/file: solr.admin.ShowFileRequestHandler
   [junit4]   2> 251885 T713 oasc.RequestHandlers.initHandlersFromConfig created defaults: solr.StandardRequestHandler
   [junit4]   2> 251886 T713 oasc.RequestHandlers.initHandlersFromConfig adding lazy requestHandler: solr.StandardRequestHandler
   [junit4]   2> 251886 T713 oasc.RequestHandlers.initHandlersFromConfig created lazy: solr.StandardRequestHandler
   [junit4]   2> 251887 T713 oasc.RequestHandlers.initHandlersFromConfig created /update: solr.UpdateRequestHandler
   [junit4]   2> 251887 T713 oasc.RequestHandlers.initHandlersFromConfig created /terms: org.apache.solr.handler.component.SearchHandler
   [junit4]   2> 251888 T713 oasc.RequestHandlers.initHandlersFromConfig created spellCheckCompRH: org.apache.solr.handler.component.SearchHandler
   [junit4]   2> 251889 T713 oasc.RequestHandlers.initHandlersFromConfig created spellCheckCompRH_Direct: org.apache.solr.handler.component.SearchHandler
   [junit4]   2> 251889 T713 oasc.RequestHandlers.initHandlersFromConfig created spellCheckWithWordbreak: org.apache.solr.handler.component.SearchHandler
   [junit4]   2> 251890 T713 oasc.RequestHandlers.initHandlersFromConfig created spellCheckWithWordbreak_Direct: org.apache.solr.handler.component.SearchHandler
   [junit4]   2> 251891 T713 oasc.RequestHandlers.initHandlersFromConfig created spellCheckCompRH1: org.apache.solr.handler.component.SearchHandler
   [junit4]   2> 251891 T713 oasc.RequestHandlers.initHandlersFromConfig created mltrh: org.apache.solr.handler.component.SearchHandler
   [junit4]   2> 251892 T713 oasc.RequestHandlers.initHandlersFromConfig created tvrh: org.apache.solr.handler.component.SearchHandler
   [junit4]   2> 251893 T713 oasc.RequestHandlers.initHandlersFromConfig created /mlt: solr.MoreLikeThisHandler
   [junit4]   2> 251893 T713 oasc.RequestHandlers.initHandlersFromConfig created /debug/dump: solr.DumpRequestHandler
   [junit4]   2> 251895 T713 oashl.XMLLoader.init xsltCacheLifetimeSeconds=60
   [junit4]   2> 251896 T713 oasc.SolrCore.initDeprecatedSupport WARN solrconfig.xml uses deprecated <admin/gettableFiles>, Please update your config to use the ShowFileRequestHandler.
   [junit4]   2> 251898 T713 oasu.CommitTracker.<init> Hard AutoCommit: disabled
   [junit4]   2> 251898 T713 oasu.CommitTracker.<init> Soft AutoCommit: disabled
   [junit4]   2> 251899 T713 oasu.RandomMergePolicy.<init> RandomMergePolicy wrapping class org.apache.lucene.index.TieredMergePolicy: [TieredMergePolicy: maxMergeAtOnce=16, maxMergeAtOnceExplicit=27, maxMergedSegmentMB=50.8154296875, floorSegmentMB=1.6240234375, forceMergeDeletesPctAllowed=13.936565227630485, segmentsPerTier=19.0, maxCFSSegmentSizeMB=8.796093022207999E12, noCFSRatio=0.5006210243806076
   [junit4]   2> 251900 T713 oasc.SolrDeletionPolicy.onInit SolrDeletionPolicy.onInit: commits: num=1
   [junit4]   2> 		commit{dir=RateLimitedDirectoryWrapper(MockDirectoryWrapper(org.apache.lucene.store.RAMDirectory@3831f765 lockFactory=org.apache.lucene.store.SingleInstanceLockFactory@7f23bf4f)),segFN=segments_1,generation=1}
   [junit4]   2> 251900 T713 oasc.SolrDeletionPolicy.updateCommits newest commit generation = 1
   [junit4]   2> 251901 T713 oass.SolrIndexSearcher.<init> Opening Searcher@78992bf main
   [junit4]   2> 251901 T713 oashc.SpellCheckComponent.inform Initializing spell checkers
   [junit4]   2> 251905 T713 oass.DirectSolrSpellChecker.init init: {name=direct,classname=DirectSolrSpellChecker,field=lowerfilt,minQueryLength=3}
   [junit4]   2> 251935 T714 oasc.SolrCore.registerSearcher [collection1] Registered new searcher Searcher@78992bf main{StandardDirectoryReader(segments_1:1:nrt)}
   [junit4]   2> 251948 T713 oasc.CoreContainer.registerCore registering core: collection1
   [junit4]   2> 251949 T691 oass.SolrDispatchFilter.init user.dir=/mnt/ssd/jenkins/workspace/Lucene-Solr-4.x-Linux/solr/build/solr-core/test/J1
   [junit4]   2> 251950 T691 oass.SolrDispatchFilter.init SolrDispatchFilter.init() done
   [junit4]   2> ASYNC  NEW_CORE C260 name=collection1 org.apache.solr.core.SolrCore@5a55ef28
   [junit4]   2> 251963 T698 C260 oasup.LogUpdateProcessor.finish [collection1] webapp= path=/update params={wt=javabin&version=2} {add=[0 (1456134137856393216)]} 0 4
   [junit4]   2> ASYNC  NEW_CORE C261 name=collection1 org.apache.solr.core.SolrCore@953a5d08
   [junit4]   2> 251975 T711 C261 oasup.LogUpdateProcessor.finish [collection1] webapp= path=/update params={wt=javabin&version=2} {add=[0 (1456134137871073280)]} 0 2
   [junit4]   2> 251981 T699 C260 oasup.LogUpdateProcessor.finish [collection1] webapp= path=/update params={version=2&wt=javabin} {add=[1 (1456134137877364736)]} 0 2
   [junit4]   2> 251986 T705 C261 oasup.LogUpdateProcessor.finish [collection1] webapp= path=/update params={version=2&wt=javabin} {add=[1 (1456134137882607616)]} 0 2
   [junit4]   2> 251990 T700 C260 oasup.LogUpdateProcessor.finish [collection1] webapp= path=/update params={wt=javabin&version=2} {add=[2 (1456134137887850496)]} 0 1
   [junit4]   2> 251994 T707 C261 oasup.LogUpdateProcessor.finish [collection1] webapp= path=/update params={version=2&wt=javabin} {add=[2 (1456134137892044800)]} 0 1
   [junit4]   2> 251997 T697 C260 oasup.LogUpdateProcessor.finish [collection1] webapp= path=/update params={version=2&wt=javabin} {add=[3 (1456134137895190528)]} 0 1
   [junit4]   2> 252001 T712 C261 oasup.LogUpdateProcessor.finish [collection1] webapp= path=/update params={version=2&wt=javabin} {add=[3 (1456134137899384832)]} 0 1
   [junit4]   2> 252004 T698 C260 oasup.LogUpdateProcessor.finish [collection1] webapp= path=/update params={wt=javabin&version=2} {add=[4 (1456134137903579136)]} 0 1
   [junit4]   2> 252007 T711 C261 oasup.LogUpdateProcessor.finish [collection1] webapp= path=/update params={wt=javabin&version=2} {add=[4 (1456134137906724864)]} 0 0
   [junit4]   2> 252011 T699 C260 oasup.LogUpdateProcessor.finish [collection1] webapp= path=/update params={version=2&wt=javabin} {add=[5 (1456134137909870592)]} 0 1
   [junit4]   2> 252014 T705 C261 oasup.LogUpdateProcessor.finish [collection1] webapp= path=/update params={wt=javabin&version=2} {add=[5 (1456134137914064896)]} 0 0
   [junit4]   2> 252017 T700 C260 oasup.LogUpdateProcessor.finish [collection1] webapp= path=/update params={version=2&wt=javabin} {add=[6 (1456134137917210624)]} 0 0
   [junit4]   2> 252020 T707 C261 oasup.LogUpdateProcessor.finish [collection1] webapp= path=/update params={wt=javabin&version=2} {add=[6 (1456134137920356352)]} 0 0
   [junit4]   2> 252024 T697 C260 oasup.LogUpdateProcessor.finish [collection1] webapp= path=/update params={version=2&wt=javabin} {add=[7 (1456134137923502080)]} 0 1
   [junit4]   2> 252027 T711 C261 oasup.LogUpdateProcessor.finish [collection1] webapp= path=/update params={wt=javabin&version=2} {add=[7 (1456134137926647808)]} 0 1
   [junit4]   2> 252030 T698 C260 oasup.LogUpdateProcessor.finish [collection1] webapp= path=/update params={version=2&wt=javabin} {add=[8 (1456134137929793536)]} 0 1
   [junit4]   2> 252033 T705 C261 oasup.LogUpdateProcessor.finish [collection1] webapp= path=/update params={version=2&wt=javabin} {add=[8 (1456134137932939264)]} 0 1
   [junit4]   2> 252036 T699 C260 oasup.LogUpdateProcessor.finish [collection1] webapp= path=/update params={version=2&wt=javabin} {add=[9 (1456134137936084992)]} 0 1
   [junit4]   2> 252039 T707 C261 oasup.LogUpdateProcessor.finish [collection1] webapp= path=/update params={version=2&wt=javabin} {add=[9 (1456134137940279296)]} 0 1
   [junit4]   2> 252042 T700 C260 oasu.DirectUpdateHandler2.commit start commit{,optimize=false,openSearcher=true,waitSearcher=true,expungeDeletes=false,softCommit=false,prepareCommit=false}
   [junit4]   2> 252047 T700 C260 oasc.SolrDeletionPolicy.onCommit SolrDeletionPolicy.onCommit: commits: num=2
   [junit4]   2> 		commit{dir=RateLimitedDirectoryWrapper(MockDirectoryWrapper(org.apache.lucene.store.RAMDirectory@c5fc38c1 lockFactory=org.apache.lucene.store.SingleInstanceLockFactory@1ef71c8)),segFN=segments_1,generation=1}
   [junit4]   2> 		commit{dir=RateLimitedDirectoryWrapper(MockDirectoryWrapper(org.apache.lucene.store.RAMDirectory@c5fc38c1 lockFactory=org.apache.lucene.store.SingleInstanceLockFactory@1ef71c8)),segFN=segments_2,generation=2}
   [junit4]   2> 252047 T700 C260 oasc.SolrDeletionPolicy.updateCommits newest commit generation = 2
   [junit4]   2> 252049 T700 C260 oass.SolrIndexSearcher.<init> Opening Searcher@704cfaf3 main
   [junit4]   2> 252050 T700 C260 oasu.DirectUpdateHandler2.commit end_commit_flush
   [junit4]   2> 252053 T702 oasc.SolrCore.registerSearcher [collection1] Registered new searcher Searcher@704cfaf3 main{StandardDirectoryReader(segments_2:3:nrt _0(4.7):c10)}
   [junit4]   2> 252053 T700 C260 oasup.LogUpdateProcessor.finish [collection1] webapp= path=/update params={version=2&waitSearcher=true&wt=javabin&softCommit=false&commit=true} {commit=} 0 11
   [junit4]   2> 252056 T712 C261 oasu.DirectUpdateHandler2.commit start commit{,optimize=false,openSearcher=true,waitSearcher=true,expungeDeletes=false,softCommit=false,prepareCommit=false}
   [junit4]   2> 252062 T712 C261 oasc.SolrDeletionPolicy.onCommit SolrDeletionPolicy.onCommit: commits: num=2
   [junit4]   2> 		commit{dir=RateLimitedDirectoryWrapper(MockDirectoryWrapper(org.apache.lucene.store.RAMDirectory@3831f765 lockFactory=org.apache.lucene.store.SingleInstanceLockFactory@7f23bf4f)),segFN=segments_1,generation=1}
   [junit4]   2> 		commit{dir=RateLimitedDirectoryWrapper(MockDirectoryWrapper(org.apache.lucene.store.RAMDirectory@3831f765 lockFactory=org.apache.lucene.store.SingleInstanceLockFactory@7f23bf4f)),segFN=segments_2,generation=2}
   [junit4]   2> 252063 T712 C261 oasc.SolrDeletionPolicy.updateCommits newest commit generation = 2
   [junit4]   2> 252066 T712 C261 oass.SolrIndexSearcher.<init> Opening Searcher@d89363d7 main
   [junit4]   2> 252068 T712 C261 oasu.DirectUpdateHandler2.commit end_commit_flush
   [junit4]   2> 252070 T714 oasc.SolrCore.registerSearcher [collection1] Registered new searcher Searcher@d89363d7 main{StandardDirectoryReader(segments_2:3:nrt _0(4.7):c10)}
   [junit4]   2> 252071 T712 C261 oasup.LogUpdateProcessor.finish [collection1] webapp= path=/update params={version=2&waitSearcher=true&softCommit=false&wt=javabin&commit=true} {commit=} 0 15
   [junit4]   2> 252081 T697 C260 oasc.SolrCore.execute [collection1] webapp= path=/select params={wt=javabin&tv=true&version=2&sort=id+desc&distrib=false&shards.qt=tvrh&tv.tf=true&q=id:0&qt=tvrh} hits=1 status=0 QTime=7 
   [junit4]   2> 252088 T705 C261 oasc.SolrCore.execute [collection1] webapp= path=/select params={qt=tvrh&rows=10&isShard=true&distrib=false&version=2&start=0&tv=true&q=id:0&fsv=true&NOW=1388677728642&tv.tf=true&shard.url=127.0.0.1:56018/|[ff01::213]:33332/|[ff01::083]:33332/&shards.qt=tvrh&sort=id+desc&wt=javabin&fl=id} hits=1 status=0 QTime=0 
   [junit4]   2> 252094 T707 C261 oasc.SolrCore.execute [collection1] webapp= path=/select params={ids=0&tv=true&wt=javabin&qt=tvrh&q=id:0&NOW=1388677728642&isShard=true&tv.tf=true&shard.url=127.0.0.1:56018/|[ff01::213]:33332/|[ff01::083]:33332/&distrib=false&shards.qt=tvrh&version=2} status=0 QTime=1 
   [junit4]   2> 252096 T711 C261 oasc.SolrCore.execute [collection1] webapp= path=/select params={q=id:0&qt=tvrh&tv.tf=true&shards.qt=tvrh&version=2&sort=id+desc&tv=true&wt=javabin&shards=127.0.0.1:56018/|[ff01::213]:33332/|[ff01::083]:33332/} hits=1 status=0 QTime=11 
   [junit4]   2> 252101 T699 C260 oasc.SolrCore.execute [collection1] webapp= path=/select params={version=2&tv.fl=test_basictv,test_offtv&sort=id+asc&distrib=false&shards.qt=tvrh&tv.tf=true&q=id:0&qt=tvrh&fl=*,score&wt=javabin&tv=true} hits=1 status=0 QTime=1 
   [junit4]   2> 252109 T705 C261 oasc.SolrCore.execute [collection1] webapp= path=/select params={version=2&tv.fl=test_basictv,test_offtv&distrib=false&isShard=true&rows=10&qt=tvrh&tv=true&start=0&sort=id+asc&shards.qt=tvrh&shard.url=127.0.0.1:56018/|[ff01::114]:33332/&tv.tf=true&NOW=1388677728661&fsv=true&q=id:0&fl=id,score&wt=javabin} hits=1 status=0 QTime=0 
   [junit4]   2> 252115 T707 C261 oasc.SolrCore.execute [collection1] webapp= path=/select params={distrib=false&version=2&tv.fl=test_basictv,test_offtv&qt=tvrh&isShard=true&tv=true&shard.url=127.0.0.1:56018/|[ff01::114]:33332/&shards.qt=tvrh&q=id:0&NOW=1388677728661&tv.tf=true&fl=*,score&ids=0&wt=javabin} status=0 QTime=2 
   [junit4]   2> 252116 T712 C261 oasc.SolrCore.execute [collection1] webapp= path=/select params={fl=*,score&tv=true&wt=javabin&shards=127.0.0.1:56018/|[ff01::114]:33332/&shards.qt=tvrh&version=2&tv.fl=test_basictv,test_offtv&sort=id+asc&q=id:0&qt=tvrh&tv.tf=true} hits=1 status=0 QTime=12 
   [junit4]   2> 252120 T700 C260 oasc.SolrCore.execute [collection1] webapp= path=/select params={q=id:0&qt=tvrh&tv.tf=true&distrib=false&shards.qt=tvrh&version=2&tv.fl=test_basictv&tv.fl=test_offtv&sort=id+asc&tv=true&wt=javabin&fl=*,score} hits=1 status=0 QTime=1 
   [junit4]   2> 252128 T705 C261 oasc.SolrCore.execute [collection1] webapp= path=/select params={fl=id,score&wt=javabin&sort=id+asc&shard.url=[ff01::114]:33332/|[ff01::083]:33332/|127.0.0.1:56018/&shards.qt=tvrh&NOW=1388677728680&tv.tf=true&q=id:0&fsv=true&tv=true&start=0&version=2&tv.fl=test_basictv&tv.fl=test_offtv&distrib=false&isShard=true&qt=tvrh&rows=10} hits=1 status=0 QTime=0 
   [junit4]   2> 252132 T707 C261 oasc.SolrCore.execute [collection1] webapp= path=/select params={tv=true&qt=tvrh&isShard=true&distrib=false&version=2&tv.fl=test_basictv&tv.fl=test_offtv&ids=0&wt=javabin&fl=*,score&q=id:0&tv.tf=true&NOW=1388677728680&shards.qt=tvrh&shard.url=[ff01::114]:33332/|[ff01::083]:33332/|127.0.0.1:56018/} status=0 QTime=0 
   [junit4]   2> 252134 T711 C261 oasc.SolrCore.execute [collection1] webapp= path=/select params={shards.qt=tvrh&version=2&tv.fl=test_basictv&tv.fl=test_offtv&sort=id+asc&q=id:0&qt=tvrh&tv.tf=true&fl=*,score&tv=true&wt=javabin&shards=[ff01::114]:33332/|[ff01::083]:33332/|127.0.0.1:56018/} hits=1 status=0 QTime=11 
   [junit4]   2> 252137 T698 C260 oasc.SolrCore.execute [collection1] webapp= path=/select params={q=id:0&qt=tvrh&tv.tf=true&distrib=false&shards.qt=tvrh&version=2&sort=id+desc&wt=javabin&tv=true&fl=*,score} hits=1 status=0 QTime=0 
   [junit4]   2> 252152 T705 C261 oasc.SolrCore.execute [collection1] webapp= path=/select params={qt=tvrh&rows=10&isShard=true&distrib=false&version=2&start=0&tv=true&q=id:0&fsv=true&NOW=1388677728700&tv.tf=true&shard.url=127.0.0.1:56018/|[ff01::114]:33332/|[ff01::083]:33332/|[ff01::213]:33332/&shards.qt=tvrh&sort=id+desc&wt=javabin&fl=id,score} hits=1 status=0 QTime=1 
   [junit4]   2> 252166 T707 C261 oasc.SolrCore.execute [collection1] webapp= path=/select params={tv=true&isShard=true&qt=tvrh&version=2&distrib=false&wt=javabin&ids=0&fl=*,score&tv.tf=true&NOW=1388677728700&q=id:0&shards.qt=tvrh&shard.url=127.0.0.1:56018/|[ff01::114]:33332/|[ff01::083]:33332/|[ff01::213]:33332/} status=0 QTime=0 
   [junit4]   2> 252168 T712 C261 oasc.SolrCore.execute [collection1] webapp= path=/select params={q=id:0&qt=tvrh&tv.tf=true&shards.qt=tvrh&version=2&sort=id+desc&wt=javabin&shards=127.0.0.1:56018/|[ff01::114]:33332/|[ff01::083]:33332/|[ff01::213]:33332/&tv=true&fl=*,score} hits=1 status=0 QTime=25 
   [junit4]   2> 252174 T697 C260 oasc.SolrCore.execute [collection1] webapp= path=/select params={q=id:0&qt=tvrh&tv.tf=true&distrib=false&shards.qt=tvrh&version=2&sort=id+desc&tv=true&wt=javabin&fl=score,test_basictv,[docid],test_postv,val:sum(3,4)} hits=1 status=0 QTime=1 
   [junit4]   2> 252181 T705 C261 oasc.SolrCore.execute [collection1] webapp= path=/select params={wt=javabin&fl=id,score&NOW=1388677728734&tv.tf=true&q=id:0&fsv=true&sort=id+desc&shard.url=127.0.0.1:56018/|[ff01::083]:33332/&shards.qt=tvrh&tv=true&start=0&isShard=true&qt=tvrh&rows=10&version=2&distrib=false} hits=1 status=0 QTime=0 
   [junit4]   2> 252186 T712 C261 oasc.SolrCore.execute [collection1] webapp= path=/select params={tv=true&version=2&distrib=false&isShard=true&qt=tvrh&fl=score,test_basictv,[docid],test_postv,val:sum(3,4)&fl=id&wt=javabin&ids=0&shards.qt=tvrh&shard.url=127.0.0.1:56018/|[ff01::083]:33332/&tv.tf=true&NOW=1388677728734&q=id:0} status=0 QTime=0 
   [junit4]   2> 252187 T711 C261 oasc.SolrCore.execute [collection1] webapp= path=/select params={q=id:0&qt=tvrh&tv.tf=true&shards.qt=tvrh&version=2&sort=id+desc&wt=javabin&shards=127.0.0.1:56018/|[ff01::083]:33332/&tv=true&fl=score,test_basictv,[docid],test_postv,val:sum(3,4)} hits=1 status=0 QTime=10 
   [junit4]   2> 252189 T691 oas.BaseDistributedSearchTestCase.compareSolrResponses ERROR Mismatched responses:
   [junit4]   2> 	{responseHeader={status=0,QTime=10},response={numFound=1,start=0,maxScore=2.609438,docs=[SolrDocument{test_basictv=[This is a title and another title], test_postv=[This is a title and another title], [docid]=0, val=7.0, score=2.609438}]},termVectors={uniqueKeyFieldName=id,0={uniqueKey=0,test_basictv={anoth={tf=1},titl={tf=2}},test_postv={anoth={tf=1},titl={tf=2}}}}}
   [junit4]   2> 	{responseHeader={status=0,QTime=1},response={numFound=1,start=0,maxScore=2.609438,docs=[SolrDocument{test_basictv=[This is a title and another title], test_postv=[This is a title and another title], score=2.609438, [docid]=0, val=7.0}]},termVectors={uniqueKeyFieldName=id,0={uniqueKey=0,test_postv={anoth={tf=1},titl={tf=2}},test_basictv={anoth={tf=1},titl={tf=2}}}}}
   [junit4]   2> 252214 T691 oasc.CoreContainer.shutdown Shutting down CoreContainer instance=1325467853
   [junit4]   2> 252215 T691 oasc.SolrCore.close [collection1]  CLOSING SolrCore org.apache.solr.core.SolrCore@5a55ef28
   [junit4]   2> 252231 T691 oasu.DirectUpdateHandler2.close closing DirectUpdateHandler2{commits=1,autocommits=0,soft autocommits=0,optimizes=0,rollbacks=0,expungeDeletes=0,docsPending=0,adds=0,deletesById=0,deletesByQuery=0,errors=0,cumulative_adds=10,cumulative_deletesById=0,cumulative_deletesByQuery=0,cumulative_errors=0,transaction_logs_total_size=1285,transaction_logs_total_number=1}
   [junit4]   2> 252232 T691 oasu.SolrCoreState.decrefSolrCoreState Closing SolrCoreState
   [junit4]   2> 252233 T691 oasu.DefaultSolrCoreState.closeIndexWriter SolrCoreState ref count has reached 0 - closing IndexWriter
   [junit4]   2> 252234 T691 oasu.DefaultSolrCoreState.closeIndexWriter closing IndexWriter with IndexWriterCloser
   [junit4]   2> 252238 T691 oasc.SolrCore.closeSearcher [collection1] Closing main searcher on request.
   [junit4]   2> 252239 T691 oasc.CachingDirectoryFactory.close Closing MockDirectoryFactory - 2 directories currently being tracked
   [junit4]   2> 252240 T691 oasc.CachingDirectoryFactory.closeCacheValue looking to close ./org.apache.solr.handler.component.TermVectorComponentDistributedTest-1388677727008/control/data [CachedDir<<refCount=0;path=./org.apache.solr.handler.component.TermVectorComponentDistributedTest-1388677727008/control/data;done=false>>]
   [junit4]   2> 252241 T691 oasc.CachingDirectoryFactory.close Closing directory: ./org.apache.solr.handler.component.TermVectorComponentDistributedTest-1388677727008/control/data
   [junit4]   2> 252242 T691 oasc.CachingDirectoryFactory.closeCacheValue looking to close ./org.apache.solr.handler.component.TermVectorComponentDistributedTest-1388677727008/control/data/index [CachedDir<<refCount=0;path=./org.apache.solr.handler.component.TermVectorComponentDistributedTest-1388677727008/control/data/index;done=false>>]
   [junit4]   2> 252243 T691 oasc.CachingDirectoryFactory.close Closing directory: ./org.apache.solr.handler.component.TermVectorComponentDistributedTest-1388677727008/control/data/index
   [junit4]   2> 252245 T691 oejsh.ContextHandler.doStop stopped o.e.j.s.ServletContextHandler{/,null}
   [junit4]   2> 252318 T691 oasc.CoreContainer.shutdown Shutting down CoreContainer instance=1681331382
   [junit4]   2> 252319 T691 oasc.SolrCore.close [collection1]  CLOSING SolrCore org.apache.solr.core.SolrCore@953a5d08
   [junit4]   2> 252345 T691 oasu.DirectUpdateHandler2.close closing DirectUpdateHandler2{commits=1,autocommits=0,soft autocommits=0,optimizes=0,rollbacks=0,expungeDeletes=0,docsPending=0,adds=0,deletesById=0,deletesByQuery=0,errors=0,cumulative_adds=10,cumulative_deletesById=0,cumulative_deletesByQuery=0,cumulative_errors=0,transaction_logs_total_size=1285,transaction_logs_total_number=1}
   [junit4]   2> 252346 T691 oasu.SolrCoreState.decrefSolrCoreState Closing SolrCoreState
   [junit4]   2> 252347 T691 oasu.DefaultSolrCoreState.closeIndexWriter SolrCoreState ref count has reached 0 - closing IndexWriter
   [junit4]   2> 252347 T691 oasu.DefaultSolrCoreState.closeIndexWriter closing IndexWriter with IndexWriterCloser
   [junit4]   2> 252349 T691 oasc.SolrCore.closeSearcher [collection1] Closing main searcher on request.
   [junit4]   2> 252349 T691 oasc.CachingDirectoryFactory.close Closing MockDirectoryFactory - 2 directories currently being tracked
   [junit4]   2> 252350 T691 oasc.CachingDirectoryFactory.closeCacheValue looking to close ./org.apache.solr.handler.component.TermVectorComponentDistributedTest-1388677727008/shard0/data/index [CachedDir<<refCount=0;path=./org.apache.solr.handler.component.TermVectorComponentDistributedTest-1388677727008/shard0/data/index;done=false>>]
   [junit4]   2> 252350 T691 oasc.CachingDirectoryFactory.close Closing directory: ./org.apache.solr.handler.component.TermVectorComponentDistributedTest-1388677727008/shard0/data/index
   [junit4]   2> 252351 T691 oasc.CachingDirectoryFactory.closeCacheValue looking to close ./org.apache.solr.handler.component.TermVectorComponentDistributedTest-1388677727008/shard0/data [CachedDir<<refCount=0;path=./org.apache.solr.handler.component.TermVectorComponentDistributedTest-1388677727008/shard0/data;done=false>>]
   [junit4]   2> 252352 T691 oasc.CachingDirectoryFactory.close Closing directory: ./org.apache.solr.handler.component.TermVectorComponentDistributedTest-1388677727008/shard0/data
   [junit4]   2> 252353 T691 oejsh.ContextHandler.doStop stopped o.e.j.s.ServletContextHandler{/,null}
   [junit4]   2> 252412 T691 oas.SolrTestCaseJ4.tearDown ###Ending testDistribSearch
   [junit4]   2> NOTE: reproduce with: ant test  -Dtestcase=TermVectorComponentDistributedTest -Dtests.method=testDistribSearch -Dtests.seed=F6E59B1B32109D9B -Dtests.multiplier=3 -Dtests.slow=true -Dtests.locale=ar_SD -Dtests.timezone=America/North_Dakota/Center -Dtests.file.encoding=UTF-8
   [junit4] FAILURE 1.98s J1 | TermVectorComponentDistributedTest.testDistribSearch <<<
   [junit4]    > Throwable #1: junit.framework.AssertionFailedError: .termVectors.0.test_basictv!=test_postv (unordered or missing)
   [junit4]    > 	at __randomizedtesting.SeedInfo.seed([F6E59B1B32109D9B:77031503454FFDA7]:0)
   [junit4]    > 	at junit.framework.Assert.fail(Assert.java:50)
   [junit4]    > 	at org.apache.solr.BaseDistributedSearchTestCase.compareSolrResponses(BaseDistributedSearchTestCase.java:822)
   [junit4]    > 	at org.apache.solr.BaseDistributedSearchTestCase.compareResponses(BaseDistributedSearchTestCase.java:841)
   [junit4]    > 	at org.apache.solr.BaseDistributedSearchTestCase.query(BaseDistributedSearchTestCase.java:544)
   [junit4]    > 	at org.apache.solr.BaseDistributedSearchTestCase.query(BaseDistributedSearchTestCase.java:521)
   [junit4]    > 	at org.apache.solr.handler.component.TermVectorComponentDistributedTest.doTest(TermVectorComponentDistributedTest.java:155)
   [junit4]    > 	at org.apache.solr.BaseDistributedSearchTestCase.testDistribSearch(BaseDistributedSearchTestCase.java:855)
   [junit4]    > 	at java.lang.Thread.run(Thread.java:780)
   [junit4]   2> 252425 T691 oas.SolrTestCaseJ4.deleteCore ###deleteCore
   [junit4]   2> NOTE: test params are: codec=Lucene41, sim=DefaultSimilarity, locale=ar_SD, timezone=America/North_Dakota/Center
   [junit4]   2> NOTE: Linux 3.8.0-34-generic x86/IBM Corporation 1.7.0 (32-bit)/cpus=8,threads=1,free=144228072,total=244383744
   [junit4]   2> NOTE: All tests run in this JVM: [PrimUtilsTest, SpellingQueryConverterTest, TestWordDelimiterFilterFactory, TestStressLucene, TestSolrDeletionPolicy2, NoCacheHeaderTest, TestUtils, PingRequestHandlerTest, DebugComponentTest, CurrencyFieldOpenExchangeTest, DocValuesMissingTest, TestCustomSort, TestFoldingMultitermQuery, PluginInfoTest, TestDynamicFieldCollectionResource, TestFastOutputStream, HdfsChaosMonkeySafeLeaderTest, TestRangeQuery, RAMDirectoryFactoryTest, ChangedSchemaMergeTest, TestRecovery, RequiredFieldsTest, HdfsRecoveryZkTest, TestFastWriter, DocumentAnalysisRequestHandlerTest, DirectSolrConnectionTest, TestBinaryResponseWriter, SolrCmdDistributorTest, SpellCheckCollatorTest, CachingDirectoryFactoryTest, BlockDirectoryTest, TestStressReorder, TestArbitraryIndexDir, TestPhraseSuggestions, ChaosMonkeyNothingIsSafeTest, CoreContainerCoreInitFailuresTest, NotRequiredUniqueKeyTest, TermVectorComponentDistributedTest]
   [junit4] Completed on J1 in 2.00s, 1 test, 1 failure <<< FAILURES!

[...truncated 200 lines...]
   [junit4] Suite: org.apache.solr.update.processor.SignatureUpdateProcessorFactoryTest
   [junit4]   2> 634824 T1448 oas.SolrTestCaseJ4.initCore ####initCore
   [junit4]   2> Creating dataDir: /mnt/ssd/jenkins/workspace/Lucene-Solr-4.x-Linux/solr/build/solr-core/test/J1/./solrtest-SignatureUpdateProcessorFactoryTest-1388678111382
   [junit4]   2> 634825 T1448 oasc.SolrResourceLoader.<init> new SolrResourceLoader for directory: '/mnt/ssd/jenkins/workspace/Lucene-Solr-4.x-Linux/solr/build/solr-core/test-files/solr/collection1/'
   [junit4]   2> 634826 T1448 oasc.SolrResourceLoader.replaceClassLoader Adding 'file:/mnt/ssd/jenkins/workspace/Lucene-Solr-4.x-Linux/solr/build/solr-core/test-files/solr/collection1/lib/classes/' to classloader
   [junit4]   2> 634826 T1448 oasc.SolrResourceLoader.replaceClassLoader Adding 'file:/mnt/ssd/jenkins/workspace/Lucene-Solr-4.x-Linux/solr/build/solr-core/test-files/solr/collection1/lib/README' to classloader
   [junit4]   2> 634872 T1448 oasc.SolrConfig.<init> Using Lucene MatchVersion: LUCENE_47
   [junit4]   2> 634918 T1448 oasc.SolrConfig.<init> Loaded SolrConfig: solrconfig.xml
   [junit4]   2> 634918 T1448 oass.IndexSchema.readSchema Reading Solr Schema from schema12.xml
   [junit4]   2> 634924 T1448 oass.IndexSchema.readSchema [null] Schema name=test
   [junit4]   2> 635224 T1448 oass.IndexSchema.readSchema default search field in schema is text
   [junit4]   2> 635227 T1448 oass.IndexSchema.readSchema unique key field: id
   [junit4]   2> 635228 T1448 oass.IndexSchema.readSchema WARN Field text is not multivalued and destination for multiple copyFields (2)
   [junit4]   2> 635235 T1448 oass.FileExchangeRateProvider.reload Reloading exchange rates from file currency.xml
   [junit4]   2> 635239 T1448 oass.FileExchangeRateProvider.reload Reloading exchange rates from file currency.xml
   [junit4]   2> 635243 T1448 oasc.SolrResourceLoader.locateSolrHome JNDI not configured for solr (NoInitialContextEx)
   [junit4]   2> 635243 T1448 oasc.SolrResourceLoader.locateSolrHome using system property solr.solr.home: /mnt/ssd/jenkins/workspace/Lucene-Solr-4.x-Linux/solr/build/solr-core/test-files/solr
   [junit4]   2> 635243 T1448 oasc.SolrResourceLoader.<init> new SolrResourceLoader for directory: '/mnt/ssd/jenkins/workspace/Lucene-Solr-4.x-Linux/solr/build/solr-core/test-files/solr/'
   [junit4]   2> 635251 T1448 oasc.SolrResourceLoader.locateSolrHome JNDI not configured for solr (NoInitialContextEx)
   [junit4]   2> 635252 T1448 oasc.SolrResourceLoader.locateSolrHome using system property solr.solr.home: /mnt/ssd/jenkins/workspace/Lucene-Solr-4.x-Linux/solr/build/solr-core/test-files/solr
   [junit4]   2> 635252 T1448 oasc.SolrResourceLoader.<init> new SolrResourceLoader for deduced Solr Home: '/mnt/ssd/jenkins/workspace/Lucene-Solr-4.x-Linux/solr/build/solr-core/test-files/solr/'
   [junit4]   2> 635291 T1448 oasc.CoreContainer.<init> New CoreContainer -97209429
   [junit4]   2> 635291 T1448 oasc.CoreContainer.load Loading cores into CoreContainer [instanceDir=/mnt/ssd/jenkins/workspace/Lucene-Solr-4.x-Linux/solr/build/solr-core/test-files/solr/]
   [junit4]   2> 635292 T1448 oashc.HttpShardHandlerFactory.getParameter Setting socketTimeout to: 0
   [junit4]   2> 635292 T1448 oashc.HttpShardHandlerFactory.getParameter Setting urlScheme to: http://
   [junit4]   2> 635293 T1448 oashc.HttpShardHandlerFactory.getParameter Setting connTimeout to: 0
   [junit4]   2> 635293 T1448 oashc.HttpShardHandlerFactory.getParameter Setting maxConnectionsPerHost to: 20
   [junit4]   2> 635294 T1448 oashc.HttpShardHandlerFactory.getParameter Setting corePoolSize to: 0
   [junit4]   2> 635294 T1448 oashc.HttpShardHandlerFactory.getParameter Setting maximumPoolSize to: 2147483647
   [junit4]   2> 635294 T1448 oashc.HttpShardHandlerFactory.getParameter Setting maxThreadIdleTime to: 5
   [junit4]   2> 635295 T1448 oashc.HttpShardHandlerFactory.getParameter Setting sizeOfQueue to: -1
   [junit4]   2> 635295 T1448 oashc.HttpShardHandlerFactory.getParameter Setting fairnessPolicy to: false
   [junit4]   2> 635300 T1448 oasl.LogWatcher.createWatcher SLF4J impl is org.slf4j.impl.Log4jLoggerFactory
   [junit4]   2> 635300 T1448 oasl.LogWatcher.newRegisteredLogWatcher Registering Log Listener [Log4j (org.slf4j.impl.Log4jLoggerFactory)]
   [junit4]   2> 635300 T1448 oasc.CoreContainer.load Host Name: 
   [junit4]   2> 635303 T1449 oasc.CoreContainer.create Creating SolrCore 'collection1' using instanceDir: /mnt/ssd/jenkins/workspace/Lucene-Solr-4.x-Linux/solr/build/solr-core/test-files/solr/collection1
   [junit4]   2> 635304 T1449 oasc.SolrResourceLoader.<init> new SolrResourceLoader for directory: '/mnt/ssd/jenkins/workspace/Lucene-Solr-4.x-Linux/solr/build/solr-core/test-files/solr/collection1/'
   [junit4]   2> 635306 T1449 oasc.SolrResourceLoader.replaceClassLoader Adding 'file:/mnt/ssd/jenkins/workspace/Lucene-Solr-4.x-Linux/solr/build/solr-core/test-files/solr/collection1/lib/classes/' to classloader
   [junit4]   2> 635307 T1449 oasc.SolrResourceLoader.replaceClassLoader Adding 'file:/mnt/ssd/jenkins/workspace/Lucene-Solr-4.x-Linux/solr/build/solr-core/test-files/solr/collection1/lib/README' to classloader
   [junit4]   2> 635352 T1449 oasc.SolrConfig.<init> Using Lucene MatchVersion: LUCENE_47
   [junit4]   2> 635394 T1449 oasc.SolrConfig.<init> Loaded SolrConfig: solrconfig.xml
   [junit4]   2> 635394 T1449 oass.IndexSchema.readSchema Reading Solr Schema from schema12.xml
   [junit4]   2> 635400 T1449 oass.IndexSchema.readSchema [collection1] Schema name=test
   [junit4]   2> 635691 T1449 oass.IndexSchema.readSchema default search field in schema is text
   [junit4]   2> 635694 T1449 oass.IndexSchema.readSchema unique key field: id
   [junit4]   2> 635695 T1449 oass.IndexSchema.readSchema WARN Field text is not multivalued and destination for multiple copyFields (2)
   [junit4]   2> 635702 T1449 oass.FileExchangeRateProvider.reload Reloading exchange rates from file currency.xml
   [junit4]   2> 635705 T1449 oass.FileExchangeRateProvider.reload Reloading exchange rates from file currency.xml
   [junit4]   2> 635708 T1449 oasc.SolrCore.initDirectoryFactory org.apache.solr.core.MockDirectoryFactory
   [junit4]   2> 635708 T1449 oasc.SolrCore.<init> [collection1] Opening new SolrCore at /mnt/ssd/jenkins/workspace/Lucene-Solr-4.x-Linux/solr/build/solr-core/test-files/solr/collection1/, dataDir=/mnt/ssd/jenkins/workspace/Lucene-Solr-4.x-Linux/solr/build/solr-core/test/J1/./solrtest-SignatureUpdateProcessorFactoryTest-1388678111382/
   [junit4]   2> 635709 T1449 oasc.JmxMonitoredMap.<init> JMX monitoring is enabled. Adding Solr mbeans to JMX Server: com.sun.jmx.mbeanserver.JmxMBeanServer@171a256a
   [junit4]   2> 635710 T1449 oasc.CachingDirectoryFactory.get return new directory for /mnt/ssd/jenkins/workspace/Lucene-Solr-4.x-Linux/solr/build/solr-core/test/J1/./solrtest-SignatureUpdateProcessorFactoryTest-1388678111382
   [junit4]   2> 635710 T1449 oasc.SolrCore.getNewIndexDir New index directory detected: old=null new=/mnt/ssd/jenkins/workspace/Lucene-Solr-4.x-Linux/solr/build/solr-core/test/J1/./solrtest-SignatureUpdateProcessorFactoryTest-1388678111382/index/
   [junit4]   2> 635710 T1449 oasc.SolrCore.initIndex WARN [collection1] Solr index directory '/mnt/ssd/jenkins/workspace/Lucene-Solr-4.x-Linux/solr/build/solr-core/test/J1/./solrtest-SignatureUpdateProcessorFactoryTest-1388678111382/index' doesn't exist. Creating new index...
   [junit4]   2> 635711 T1449 oasc.CachingDirectoryFactory.get return new directory for /mnt/ssd/jenkins/workspace/Lucene-Solr-4.x-Linux/solr/build/solr-core/test/J1/./solrtest-SignatureUpdateProcessorFactoryTest-1388678111382/index
   [junit4]   2> 635711 T1449 oasu.RandomMergePolicy.<init> RandomMergePolicy wrapping class org.apache.lucene.index.LogDocMergePolicy: [LogDocMergePolicy: minMergeSize=1000, mergeFactor=11, maxMergeSize=9223372036854775807, maxMergeSizeForForcedMerge=9223372036854775807, calibrateSizeByDeletes=true, maxMergeDocs=2147483647, maxCFSSegmentSizeMB=8.796093022207999E12, noCFSRatio=0.0]
   [junit4]   2> 635712 T1449 oasc.SolrDeletionPolicy.onCommit SolrDeletionPolicy.onCommit: commits: num=1
   [junit4]   2> 		commit{dir=RateLimitedDirectoryWrapper(MockDirectoryWrapper(org.apache.lucene.store.RAMDirectory@23201a28 lockFactory=org.apache.lucene.store.SingleInstanceLockFactory@f23f4638)),segFN=segments_1,generation=1}
   [junit4]   2> 635712 T1449 oasc.SolrDeletionPolicy.updateCommits newest commit generation = 1
   [junit4]   2> 635713 T1449 oasc.SolrCore.initWriters created xml: solr.XMLResponseWriter
   [junit4]   2> 635715 T1449 oasup.UpdateRequestProcessorChain.init creating updateRequestProcessorChain "dedupe"
   [junit4]   2> 635715 T1449 oasup.UpdateRequestProcessorChain.init inserting DistributedUpdateProcessorFactory into updateRequestProcessorChain "dedupe"
   [junit4]   2> 635715 T1449 oasup.UpdateRequestProcessorChain.init creating updateRequestProcessorChain "dedupe-allfields"
   [junit4]   2> 635716 T1449 oasup.UpdateRequestProcessorChain.init inserting DistributedUpdateProcessorFactory into updateRequestProcessorChain "dedupe-allfields"
   [junit4]   2> 635716 T1449 oasup.UpdateRequestProcessorChain.init creating updateRequestProcessorChain "stored_sig"
   [junit4]   2> 635716 T1449 oasup.UpdateRequestProcessorChain.init inserting DistributedUpdateProcessorFactory into updateRequestProcessorChain "stored_sig"
   [junit4]   2> 635717 T1449 oasup.UpdateRequestProcessorChain.init creating updateRequestProcessorChain "uniq-fields"
   [junit4]   2> 635717 T1449 oasup.UniqFieldsUpdateProcessorFactory.init WARN Use of the 'fields' init param in UniqFieldsUpdateProcessorFactory is deprecated, please use 'fieldName' (or another FieldMutatingUpdateProcessorFactory selector option) instead
   [junit4]   2> 635718 T1449 oasup.UniqFieldsUpdateProcessorFactory.init Replacing 'fields' init param with (individual) 'fieldName' params
   [junit4]   2> 635718 T1449 oasup.UpdateRequestProcessorChain.init inserting DistributedUpdateProcessorFactory into updateRequestProcessorChain "uniq-fields"
   [junit4]   2> 635718 T1449 oasup.UpdateRequestProcessorChain.init creating updateRequestProcessorChain "distrib-dup-test-chain-explicit"
   [junit4]   2> 635719 T1449 oasup.UpdateRequestProcessorChain.init creating updateRequestProcessorChain "distrib-dup-test-chain-implicit"
   [junit4]   2> 635719 T1449 oasup.UpdateRequestProcessorChain.init inserting DistributedUpdateProcessorFactory into updateRequestProcessorChain "distrib-dup-test-chain-implicit"
   [junit4]   2> 635720 T1449 oasc.SolrCore.loadUpdateProcessorChains no updateRequestProcessorChain defined as default, creating implicit default
   [junit4]   2> 635720 T1449 oasc.RequestHandlers.initHandlersFromConfig adding lazy requestHandler: solr.ReplicationHandler
   [junit4]   2> 635720 T1449 oasc.RequestHandlers.initHandlersFromConfig created /replication: solr.ReplicationHandler
   [junit4]   2> 635721 T1449 oasc.RequestHandlers.initHandlersFromConfig created standard: solr.StandardRequestHandler
   [junit4]   2> 635721 T1449 oasc.RequestHandlers.initHandlersFromConfig created /get: solr.RealTimeGetHandler
   [junit4]   2> 635722 T1449 oasc.RequestHandlers.initHandlersFromConfig created dismax: solr.SearchHandler
   [junit4]   2> 635722 T1449 oasc.RequestHandlers.initHandlersFromConfig created mock: org.apache.solr.core.MockQuerySenderListenerReqHandler
   [junit4]   2> 635722 T1449 oasc.RequestHandlers.initHandlersFromConfig created /admin/: org.apache.solr.handler.admin.AdminHandlers
   [junit4]   2> 635723 T1449 oasc.RequestHandlers.initHandlersFromConfig created /admin/file: solr.admin.ShowFileRequestHandler
   [junit4]   2> 635723 T1449 oasc.RequestHandlers.initHandlersFromConfig created defaults: solr.StandardRequestHandler
   [junit4]   2> 635724 T1449 oasc.RequestHandlers.initHandlersFromConfig adding lazy requestHandler: solr.StandardRequestHandler
   [junit4]   2> 635724 T1449 oasc.RequestHandlers.initHandlersFromConfig created lazy: solr.StandardRequestHandler
   [junit4]   2> 635724 T1449 oasc.RequestHandlers.initHandlersFromConfig created /update: solr.UpdateRequestHandler
   [junit4]   2> 635725 T1449 oasc.RequestHandlers.initHandlersFromConfig created /terms: org.apache.solr.handler.component.SearchHandler
   [junit4]   2> 635725 T1449 oasc.RequestHandlers.initHandlersFromConfig created spellCheckCompRH: org.apache.solr.handler.component.SearchHandler
   [junit4]   2> 635726 T1449 oasc.RequestHandlers.initHandlersFromConfig created spellCheckCompRH_Direct: org.apache.solr.handler.component.SearchHandler
   [junit4]   2> 635726 T1449 oasc.RequestHandlers.initHandlersFromConfig created spellCheckWithWordbreak: org.apache.solr.handler.component.SearchHandler
   [junit4]   2> 635726 T1449 oasc.RequestHandlers.initHandlersFromConfig created spellCheckWithWordbreak_Direct: org.apache.solr.handler.component.SearchHandler
   [junit4]   2> 635727 T1449 oasc.RequestHandlers.initHandlersFromConfig created spellCheckCompRH1: org.apache.solr.handler.component.SearchHandler
   [junit4]   2> 635727 T1449 oasc.RequestHandlers.initHandlersFromConfig created mltrh: org.apache.solr.handler.component.SearchHandler
   [junit4]   2> 635728 T1449 oasc.RequestHandlers.initHandlersFromConfig created tvrh: org.apache.solr.handler.component.SearchHandler
   [junit4]   2> 635728 T1449 oasc.RequestHandlers.initHandlersFromConfig created /mlt: solr.MoreLikeThisHandler
   [junit4]   2> 635729 T1449 oasc.RequestHandlers.initHandlersFromConfig created /debug/dump: solr.DumpRequestHandler
   [junit4]   2> 635730 T1449 oashl.XMLLoader.init xsltCacheLifetimeSeconds=60
   [junit4]   2> 635731 T1449 oasc.SolrCore.initDeprecatedSupport WARN solrconfig.xml uses deprecated <admin/gettableFiles>, Please update your config to use the ShowFileRequestHandler.
   [junit4]   2> 635733 T1449 oasu.CommitTracker.<init> Hard AutoCommit: disabled
   [junit4]   2> 635733 T1449 oasu.CommitTracker.<init> Soft AutoCommit: disabled
   [junit4]   2> 635734 T1449 oasu.RandomMergePolicy.<init> RandomMergePolicy wrapping class org.apache.lucene.index.LogDocMergePolicy: [LogDocMergePolicy: minMergeSize=1000, mergeFactor=29, maxMergeSize=9223372036854775807, maxMergeSizeForForcedMerge=9223372036854775807, calibrateSizeByDeletes=false, maxMergeDocs=2147483647, maxCFSSegmentSizeMB=8.796093022207999E12, noCFSRatio=0.818671272093795]
   [junit4]   2> 635734 T1449 oasc.SolrDeletionPolicy.onInit SolrDeletionPolicy.onInit: commits: num=1
   [junit4]   2> 		commit{dir=RateLimitedDirectoryWrapper(MockDirectoryWrapper(org.apache.lucene.store.RAMDirectory@23201a28 lockFactory=org.apache.lucene.store.SingleInstanceLockFactory@f23f4638)),segFN=segments_1,generation=1}
   [junit4]   2> 635735 T1449 oasc.SolrDeletionPolicy.updateCommits newest commit generation = 1
   [junit4]   2> 635735 T1449 oass.SolrIndexSearcher.<init> Opening Searcher@6fb14e49 main
   [junit4]   2> 635736 T1449 oashc.SpellCheckComponent.inform Initializing spell checkers
   [junit4]   2> 635739 T1449 oass.DirectSolrSpellChecker.init init: {name=direct,classname=DirectSolrSpellChecker,field=lowerfilt,minQueryLength=3}
   [junit4]   2> 635757 T1450 oasc.SolrCore.registerSearcher [collection1] Registered new searcher Searcher@6fb14e49 main{StandardDirectoryReader(segments_1:1:nrt)}
   [junit4]   2> 635760 T1449 oasc.CoreContainer.registerCore registering core: collection1
   [junit4]   2> 635762 T1448 oas.SolrTestCaseJ4.initCore ####initCore end
   [junit4]   2> 635767 T1448 oas.SolrTestCaseJ4.setUp ###Starting testNonStringFieldsValues
   [junit4]   2> ASYNC  NEW_CORE C703 name=collection1 org.apache.solr.core.SolrCore@df18c6c4
   [junit4]   2> 635775 T1448 C703 oasu.DirectUpdateHandler2.deleteAll [collection1] REMOVING ALL DOCUMENTS FROM INDEX
   [junit4]   2> 635776 T1448 C703 oasup.LogUpdateProcessor.finish [collection1] webapp=null path=null params={} {deleteByQuery=*:*} 0 2
   [junit4]   2> 635787 T1448 C703 oasu.DirectUpdateHandler2.commit start commit{,optimize=false,openSearcher=true,waitSearcher=true,expungeDeletes=false,softCommit=false,prepareCommit=false}
   [junit4]   2> 635788 T1448 C703 oasc.SolrDeletionPolicy.onCommit SolrDeletionPolicy.onCommit: commits: num=2
   [junit4]   2> 		commit{dir=RateLimitedDirectoryWrapper(MockDirectoryWrapper(org.apache.lucene.store.RAMDirectory@23201a28 lockFactory=org.apache.lucene.store.SingleInstanceLockFactory@f23f4638)),segFN=segments_1,generation=1}
   [junit4]   2> 		commit{dir=RateLimitedDirectoryWrapper(MockDirectoryWrapper(org.apache.lucene.store.RAMDirectory@23201a28 lockFactory=org.apache.lucene.store.SingleInstanceLockFactory@f23f4638)),segFN=segments_2,generation=2}
   [junit4]   2> 635789 T1448 C703 oasc.SolrDeletionPolicy.updateCommits newest commit generation = 2
   [junit4]   2> 635789 T1448 C703 oass.SolrIndexSearcher.<init> Opening Searcher@2806ef20 main
   [junit4]   2> 635790 T1448 C703 oasu.DirectUpdateHandler2.commit end_commit_flush
   [junit4]   2> 635791 T1450 oasc.SolrCore.registerSearcher [collection1] Registered new searcher Searcher@2806ef20 main{StandardDirectoryReader(segments_2:2:nrt)}
   [junit4]   2> 635792 T1448 C703 oasup.LogUpdateProcessor.finish [collection1] webapp=null path=null params={} {commit=} 0 5
   [junit4]   2> 635794 T1448 oashl.XMLLoader.init xsltCacheLifetimeSeconds=60
   [junit4]   2> 635821 T1448 oasu.DirectUpdateHandler2.commit start commit{,optimize=false,openSearcher=true,waitSearcher=true,expungeDeletes=false,softCommit=false,prepareCommit=false}
   [junit4]   2> 635823 T1448 oasc.SolrDeletionPolicy.onCommit SolrDeletionPolicy.onCommit: commits: num=2
   [junit4]   2> 		commit{dir=RateLimitedDirectoryWrapper(MockDirectoryWrapper(org.apache.lucene.store.RAMDirectory@23201a28 lockFactory=org.apache.lucene.store.SingleInstanceLockFactory@f23f4638)),segFN=segments_2,generation=2}
   [junit4]   2> 		commit{dir=RateLimitedDirectoryWrapper(MockDirectoryWrapper(org.apache.lucene.store.RAMDirectory@23201a28 lockFactory=org.apache.lucene.store.SingleInstanceLockFactory@f23f4638)),segFN=segments_3,generation=3}
   [junit4]   2> 635823 T1448 oasc.SolrDeletionPolicy.updateCommits newest commit generation = 3
   [junit4]   2> 635825 T1448 oass.SolrIndexSearcher.<init> Opening Searcher@440b94f7 main
   [junit4]   2> 635825 T1448 oasu.DirectUpdateHandler2.commit end_commit_flush
   [junit4]   2> 635827 T1450 oasc.SolrCore.registerSearcher [collection1] Registered new searcher Searcher@440b94f7 main{StandardDirectoryReader(segments_3:4:nrt _0(4.7):C5/1:delGen=1)}
   [junit4]   2> 635827 T1448 oas.SolrTestCaseJ4.tearDown ###Ending testNonStringFieldsValues
   [junit4]   2> 635836 T1448 oas.SolrTestCaseJ4.setUp ###Starting testNonIndexedSignatureField
   [junit4]   2> 635844 T1448 C703 oasu.DirectUpdateHandler2.deleteAll [collection1] REMOVING ALL DOCUMENTS FROM INDEX
   [junit4]   2> 635845 T1448 C703 oasup.LogUpdateProcessor.finish [collection1] webapp=null path=null params={} {deleteByQuery=*:*} 0 1
   [junit4]   2> 635851 T1448 C703 oasu.DirectUpdateHandler2.commit start commit{,optimize=false,openSearcher=true,waitSearcher=true,expungeDeletes=false,softCommit=false,prepareCommit=false}
   [junit4]   2> 635852 T1448 C703 oasc.SolrDeletionPolicy.onCommit SolrDeletionPolicy.onCommit: commits: num=2
   [junit4]   2> 		commit{dir=RateLimitedDirectoryWrapper(MockDirectoryWrapper(org.apache.lucene.store.RAMDirectory@23201a28 lockFactory=org.apache.lucene.store.SingleInstanceLockFactory@f23f4638)),segFN=segments_3,generation=3}
   [junit4]   2> 		commit{dir=RateLimitedDirectoryWrapper(MockDirectoryWrapper(org.apache.lucene.store.RAMDirectory@23201a28 lockFactory=org.apache.lucene.store.SingleInstanceLockFactory@f23f4638)),segFN=segments_4,generation=4}
   [junit4]   2> 635853 T1448 C703 oasc.SolrDeletionPolicy.updateCommits newest commit generation = 4
   [junit4]   2> 635853 T1448 C703 oass.SolrIndexSearcher.<init> Opening Searcher@3d36aed6 main
   [junit4]   2> 635854 T1448 C703 oasu.DirectUpdateHandler2.commit end_commit_flush
   [junit4]   2> 635855 T1450 oasc.SolrCore.registerSearcher [collection1] Registered new searcher Searcher@3d36aed6 main{StandardDirectoryReader(segments_4:5:nrt)}
   [junit4]   2> 635856 T1448 C703 oasup.LogUpdateProcessor.finish [collection1] webapp=null path=null params={} {commit=} 0 5
   [junit4]   2> 635862 T1448 oasu.DirectUpdateHandler2.commit start commit{,optimize=false,openSearcher=true,waitSearcher=true,expungeDeletes=false,softCommit=false,prepareCommit=false}
   [junit4]   2> 635864 T1448 oasc.SolrDeletionPolicy.onCommit SolrDeletionPolicy.onCommit: commits: num=2
   [junit4]   2> 		commit{dir=RateLimitedDirectoryWrapper(MockDirectoryWrapper(org.apache.lucene.store.RAMDirectory@23201a28 lockFactory=org.apache.lucene.store.SingleInstanceLockFactory@f23f4638)),segFN=segments_4,generation=4}
   [junit4]   2> 		commit{dir=RateLimitedDirectoryWrapper(MockDirectoryWrapper(org.apache.lucene.store.RAMDirectory@23201a28 lockFactory=org.apache.lucene.store.SingleInstanceLockFactory@f23f4638)),segFN=segments_5,generation=5}
   [junit4]   2> 635865 T1448 oasc.SolrDeletionPolicy.updateCommits newest commit generation = 5
   [junit4]   2> 635866 T1448 oass.SolrIndexSearcher.<init> Opening Searcher@87bc4eec main
   [junit4]   2> 635866 T1448 oasu.DirectUpdateHandler2.commit end_commit_flush
   [junit4]   2> 635868 T1450 oasc.SolrCore.registerSearcher [collection1] Registered new searcher Searcher@87bc4eec main{StandardDirectoryReader(segments_5:7:nrt _1(4.7):C2)}
   [junit4]   2> 635869 T1448 oas.SolrTestCaseJ4.tearDown ###Ending testNonIndexedSignatureField
   [junit4]   2> 635874 T1448 oas.SolrTestCaseJ4.setUp ###Starting testDupeAllFieldsDetection
   [junit4]   2> 635879 T1448 C703 oasu.DirectUpdateHandler2.deleteAll [collection1] REMOVING ALL DOCUMENTS FROM INDEX
   [junit4]   2> 635880 T1448 C703 oasup.LogUpdateProcessor.finish [collection1] webapp=null path=null params={} {deleteByQuery=*:*} 0 1
   [junit4]   2> 635885 T1448 C703 oasu.DirectUpdateHandler2.commit start commit{,optimize=false,openSearcher=true,waitSearcher=true,expungeDeletes=false,softCommit=false,prepareCommit=false}
   [junit4]   2> 635886 T1448 C703 oasc.SolrDeletionPolicy.onCommit SolrDeletionPolicy.onCommit: commits: num=2
   [junit4]   2> 		commit{dir=RateLimitedDirectoryWrapper(MockDirectoryWrapper(org.apache.lucene.store.RAMDirectory@23201a28 lockFactory=org.apache.lucene.store.SingleInstanceLockFactory@f23f4638)),segFN=segments_5,generation=5}
   [junit4]   2> 		commit{dir=RateLimitedDirectoryWrapper(MockDirectoryWrapper(org.apache.lucene.store.RAMDirectory@23201a28 lockFactory=org.apache.lucene.store.SingleInstanceLockFactory@f23f4638)),segFN=segments_6,generation=6}
   [junit4]   2> 635887 T1448 C703 oasc.SolrDeletionPolicy.updateCommits newest commit generation = 6
   [junit4]   2> 635888 T1448 C703 oass.SolrIndexSearcher.<init> Opening Searcher@3ef6e53f main
   [junit4]   2> 635888 T1448 C703 oasu.DirectUpdateHandler2.commit end_commit_flush
   [junit4]   2> 635890 T1450 oasc.SolrCore.registerSearcher [collection1] Registered new searcher Searcher@3ef6e53f main{StandardDirectoryReader(segments_6:8:nrt)}
   [junit4]   2> 635890 T1448 C703 oasup.LogUpdateProcessor.finish [collection1] webapp=null path=null params={} {commit=} 0 5
   [junit4]   2> 635895 T1448 oasu.DirectUpdateHandler2.commit start commit{,optimize=false,openSearcher=true,waitSearcher=true,expungeDeletes=false,softCommit=false,prepareCommit=false}
   [junit4]   2> 635897 T1448 oasc.SolrDeletionPolicy.onCommit SolrDeletionPolicy.onCommit: commits: num=2
   [junit4]   2> 		commit{dir=RateLimitedDirectoryWrapper(MockDirectoryWrapper(org.apache.lucene.store.RAMDirectory@23201a28 lockFactory=org.apache.lucene.store.SingleInstanceLockFactory@f23f4638)),segFN=segments_6,generation=6}
   [junit4]   2> 		commit{dir=RateLimitedDirectoryWrapper(MockDirectoryWrapper(org.apache.lucene.store.RAMDirectory@23201a28 lockFactory=org.apache.lucene.store.SingleInstanceLockFactory@f23f4638)),segFN=segments_7,generation=7}
   [junit4]   2> 635897 T1448 oasc.SolrDeletionPolicy.updateCommits newest commit generation = 7
   [junit4]   2> 635899 T1448 oass.SolrIndexSearcher.<init> Opening Searcher@6df15b0c main
   [junit4]   2> 635899 T1448 oasu.DirectUpdateHandler2.commit end_commit_flush
   [junit4]   2> 635901 T1450 oasc.SolrCore.registerSearcher [collection1] Registered new searcher Searcher@6df15b0c main{StandardDirectoryReader(segments_7:10:nrt _2(4.7):C3)}
   [junit4]   2> 635902 T1

[...truncated too long message...]

ocommits=0,optimizes=0,rollbacks=0,expungeDeletes=0,docsPending=0,adds=0,deletesById=0,deletesByQuery=0,errors=0,cumulative_adds=2,cumulative_deletesById=0,cumulative_deletesByQuery=1,cumulative_errors=0}
   [junit4]   2> 1099483 T5010 oasu.SolrCoreState.decrefSolrCoreState Closing SolrCoreState
   [junit4]   2> 1099484 T5010 oasu.DefaultSolrCoreState.closeIndexWriter SolrCoreState ref count has reached 0 - closing IndexWriter
   [junit4]   2> 1099484 T5010 oasu.DefaultSolrCoreState.closeIndexWriter closing IndexWriter with IndexWriterCloser
   [junit4]   2> 1099485 T5010 oasc.SolrCore.closeSearcher [collection1] Closing main searcher on request.
   [junit4]   2> 1099486 T5010 oasc.CachingDirectoryFactory.close Closing MockDirectoryFactory - 2 directories currently being tracked
   [junit4]   2> 1099486 T5010 oasc.CachingDirectoryFactory.closeCacheValue looking to close ./org.apache.solr.handler.component.DistributedQueryElevationComponentTest-1388678573840/shard1/data/index [CachedDir<<refCount=0;path=./org.apache.solr.handler.component.DistributedQueryElevationComponentTest-1388678573840/shard1/data/index;done=false>>]
   [junit4]   2> 1099487 T5010 oasc.CachingDirectoryFactory.close Closing directory: ./org.apache.solr.handler.component.DistributedQueryElevationComponentTest-1388678573840/shard1/data/index
   [junit4]   2> 1099487 T5010 oasc.CachingDirectoryFactory.closeCacheValue looking to close ./org.apache.solr.handler.component.DistributedQueryElevationComponentTest-1388678573840/shard1/data [CachedDir<<refCount=0;path=./org.apache.solr.handler.component.DistributedQueryElevationComponentTest-1388678573840/shard1/data;done=false>>]
   [junit4]   2> 1099488 T5010 oasc.CachingDirectoryFactory.close Closing directory: ./org.apache.solr.handler.component.DistributedQueryElevationComponentTest-1388678573840/shard1/data
   [junit4]   2> 1099489 T5010 oejsh.ContextHandler.doStop stopped o.e.j.s.ServletContextHandler{/,null}
   [junit4]   2> 1099562 T5010 oasc.CoreContainer.shutdown Shutting down CoreContainer instance=1687693403
   [junit4]   2> 1099563 T5010 oasc.SolrCore.close [collection1]  CLOSING SolrCore org.apache.solr.core.SolrCore@79a3fd2a
   [junit4]   2> 1099568 T5010 oasu.DirectUpdateHandler2.close closing DirectUpdateHandler2{commits=1,autocommits=0,soft autocommits=0,optimizes=0,rollbacks=0,expungeDeletes=0,docsPending=0,adds=0,deletesById=0,deletesByQuery=0,errors=0,cumulative_adds=3,cumulative_deletesById=0,cumulative_deletesByQuery=1,cumulative_errors=0}
   [junit4]   2> 1099568 T5010 oasu.SolrCoreState.decrefSolrCoreState Closing SolrCoreState
   [junit4]   2> 1099569 T5010 oasu.DefaultSolrCoreState.closeIndexWriter SolrCoreState ref count has reached 0 - closing IndexWriter
   [junit4]   2> 1099570 T5010 oasu.DefaultSolrCoreState.closeIndexWriter closing IndexWriter with IndexWriterCloser
   [junit4]   2> 1099570 T5010 oasc.SolrCore.closeSearcher [collection1] Closing main searcher on request.
   [junit4]   2> 1099571 T5010 oasc.CachingDirectoryFactory.close Closing MockDirectoryFactory - 2 directories currently being tracked
   [junit4]   2> 1099572 T5010 oasc.CachingDirectoryFactory.closeCacheValue looking to close ./org.apache.solr.handler.component.DistributedQueryElevationComponentTest-1388678573840/shard2/data [CachedDir<<refCount=0;path=./org.apache.solr.handler.component.DistributedQueryElevationComponentTest-1388678573840/shard2/data;done=false>>]
   [junit4]   2> 1099572 T5010 oasc.CachingDirectoryFactory.close Closing directory: ./org.apache.solr.handler.component.DistributedQueryElevationComponentTest-1388678573840/shard2/data
   [junit4]   2> 1099573 T5010 oasc.CachingDirectoryFactory.closeCacheValue looking to close ./org.apache.solr.handler.component.DistributedQueryElevationComponentTest-1388678573840/shard2/data/index [CachedDir<<refCount=0;path=./org.apache.solr.handler.component.DistributedQueryElevationComponentTest-1388678573840/shard2/data/index;done=false>>]
   [junit4]   2> 1099574 T5010 oasc.CachingDirectoryFactory.close Closing directory: ./org.apache.solr.handler.component.DistributedQueryElevationComponentTest-1388678573840/shard2/data/index
   [junit4]   2> 1099574 T5010 oejsh.ContextHandler.doStop stopped o.e.j.s.ServletContextHandler{/,null}
   [junit4]   2> 1099628 T5010 oas.SolrTestCaseJ4.tearDown ###Ending testDistribSearch
   [junit4]   2> NOTE: reproduce with: ant test  -Dtestcase=DistributedQueryElevationComponentTest -Dtests.method=testDistribSearch -Dtests.seed=F6E59B1B32109D9B -Dtests.multiplier=3 -Dtests.slow=true -Dtests.locale=es_PE -Dtests.timezone=Asia/Bahrain -Dtests.file.encoding=UTF-8
   [junit4] FAILURE 1.73s J0 | DistributedQueryElevationComponentTest.testDistribSearch <<<
   [junit4]    > Throwable #1: junit.framework.AssertionFailedError: .responseHeader.params.sort!=rows (unordered or missing)
   [junit4]    > 	at __randomizedtesting.SeedInfo.seed([F6E59B1B32109D9B:77031503454FFDA7]:0)
   [junit4]    > 	at junit.framework.Assert.fail(Assert.java:50)
   [junit4]    > 	at org.apache.solr.BaseDistributedSearchTestCase.compareSolrResponses(BaseDistributedSearchTestCase.java:822)
   [junit4]    > 	at org.apache.solr.BaseDistributedSearchTestCase.compareResponses(BaseDistributedSearchTestCase.java:841)
   [junit4]    > 	at org.apache.solr.BaseDistributedSearchTestCase.query(BaseDistributedSearchTestCase.java:544)
   [junit4]    > 	at org.apache.solr.BaseDistributedSearchTestCase.query(BaseDistributedSearchTestCase.java:521)
   [junit4]    > 	at org.apache.solr.handler.component.DistributedQueryElevationComponentTest.doTest(DistributedQueryElevationComponentTest.java:81)
   [junit4]    > 	at org.apache.solr.BaseDistributedSearchTestCase.testDistribSearch(BaseDistributedSearchTestCase.java:849)
   [junit4]    > 	at java.lang.Thread.run(Thread.java:780)
   [junit4]   2> 1099654 T5010 oas.SolrTestCaseJ4.deleteCore ###deleteCore
   [junit4]   2> NOTE: test params are: codec=Lucene45, sim=RandomSimilarityProvider(queryNorm=false,coord=crazy): {}, locale=es_PE, timezone=Asia/Bahrain
   [junit4]   2> NOTE: Linux 3.8.0-34-generic x86/IBM Corporation 1.7.0 (32-bit)/cpus=8,threads=1,free=63961136,total=255131648
   [junit4]   2> NOTE: All tests run in this JVM: [RegexBoostProcessorTest, TestPerFieldSimilarity, LegacyHTMLStripCharFilterTest, TestQueryUtils, CoreAdminHandlerTest, TestFunctionQuery, DateMathParserTest, ShowFileRequestHandlerTest, DistributedSuggestComponentTest, TestFieldTypeResource, TestSchemaVersionResource, UUIDFieldTest, ReturnFieldsTest, TestCoreContainer, TestFaceting, URLClassifyProcessorTest, HdfsSyncSliceTest, TestExtendedDismaxParser, TestJmxMonitoredMap, TestFieldCollectionResource, ClusterStateTest, TestLFUCache, IndexSchemaTest, StressHdfsTest, OverseerCollectionProcessorTest, UpdateRequestProcessorFactoryTest, LukeRequestHandlerTest, TestValueSourceCache, AutoCommitTest, TestLMJelinekMercerSimilarityFactory, SolrCoreTest, SuggesterTest, TestSearchPerf, TestSolrDeletionPolicy1, SuggesterFSTTest, AssignTest, TestBadConfig, SuggestComponentTest, PolyFieldTest, TestUniqueKeyFieldResource, TestSolrQueryParserDefaultOperatorResource, DirectUpdateHandlerOptimizeTest, FastVectorHighlighterTest, TestBM25SimilarityFactory, SystemInfoHandlerTest, TestClassNameShortening, TestManagedSchemaFieldResource, SpatialFilterTest, TestReversedWildcardFilterFactory, TestSolrXmlPersistence, TestLuceneMatchVersion, TestCopyFieldCollectionResource, TestPHPSerializedResponseWriter, TestCloudManagedSchema, EchoParamsTest, AddBlockUpdateTest, TestDocSet, SolrXmlInZkTest, TestGroupingSearch, TestSolrXMLSerializer, DistributedQueryComponentCustomSortTest, HdfsBasicDistributedZkTest, TestReplicationHandler, TestSerializedLuceneMatchVersion, ScriptEngineTest, TestConfig, CSVRequestHandlerTest, UnloadDistributedZkTest, FileBasedSpellCheckerTest, TestRandomDVFaceting, HdfsCollectionsAPIDistributedZkTest, UpdateParamsTest, CopyFieldTest, TestMaxScoreQueryParser, BJQParserTest, TestFileDictionaryLookup, StatelessScriptUpdateProcessorFactoryTest, DOMUtilTest, TestNoOpRegenerator, TestSimpleQParserPlugin, ShardRoutingTest, TestSolrQueryParserResource, BasicDistributedZkTest, ChaosMonkeySafeLeaderTest, SyncSliceTest, ClusterStateUpdateTest, ZkCLITest, SliceStateUpdateTest, TestDistributedGrouping, DistributedSpellCheckComponentTest, TestJoin, BadIndexSchemaTest, TestSort, BasicFunctionalityTest, TestLazyCores, DirectUpdateHandlerTest, HighlighterTest, SoftAutoCommitTest, DistributedQueryElevationComponentTest]
   [junit4] Completed on J0 in 1.76s, 1 test, 1 failure <<< FAILURES!

[...truncated 455 lines...]
BUILD FAILED
/mnt/ssd/jenkins/workspace/Lucene-Solr-4.x-Linux/build.xml:459: The following error occurred while executing this line:
/mnt/ssd/jenkins/workspace/Lucene-Solr-4.x-Linux/build.xml:452: The following error occurred while executing this line:
/mnt/ssd/jenkins/workspace/Lucene-Solr-4.x-Linux/build.xml:39: The following error occurred while executing this line:
/mnt/ssd/jenkins/workspace/Lucene-Solr-4.x-Linux/extra-targets.xml:37: The following error occurred while executing this line:
/mnt/ssd/jenkins/workspace/Lucene-Solr-4.x-Linux/solr/build.xml:189: The following error occurred while executing this line:
/mnt/ssd/jenkins/workspace/Lucene-Solr-4.x-Linux/solr/common-build.xml:491: The following error occurred while executing this line:
/mnt/ssd/jenkins/workspace/Lucene-Solr-4.x-Linux/lucene/common-build.xml:1307: The following error occurred while executing this line:
/mnt/ssd/jenkins/workspace/Lucene-Solr-4.x-Linux/lucene/common-build.xml:940: There were test failures: 348 suites, 1522 tests, 3 failures, 35 ignored (6 assumptions)

Total time: 70 minutes 10 seconds
Build step 'Invoke Ant' marked build as failure
Description set: Java: 32bit/ibm-j9-jdk7 -Xjit:exclude={org/apache/lucene/util/fst/FST.pack(IIF)Lorg/apache/lucene/util/fst/FST;}
Archiving artifacts
Recording test results
Email was triggered for: Failure
Sending email for trigger: Failure



Mime
View raw message