lucene-dev mailing list archives

Site index · List index
Message view « Date » · « Thread »
Top « Date » · « Thread »
From "Uwe Schindler" <...@thetaphi.de>
Subject RE: [JENKINS] Lucene-Solr-trunk-Linux (32bit/jdk1.7.0_51) - Build # 9828 - Failure!
Date Tue, 18 Mar 2014 07:09:25 GMT
Build #9828 (17.03.2014 22:35:20)
http://jenkins.thetaphi.de/job/Lucene-Solr-trunk-Linux/9828/

Java: 32bit/jdk1.7.0_51 -server -XX:+UseG1GC
Build-Artefacts:
	junit4-J0-20140317_230107_233.events	8.17 GB	[fingerprint] view
	junit4-J1-20140317_230107_233.events	61.65 MB	[fingerprint] view

This build created a 8.17 GB big events file and failed with out of space. How can this happen?

Uwe

-----
Uwe Schindler
H.-H.-Meier-Allee 63, D-28213 Bremen
http://www.thetaphi.de
eMail: uwe@thetaphi.de


> -----Original Message-----
> From: Policeman Jenkins Server [mailto:jenkins@thetaphi.de]
> Sent: Tuesday, March 18, 2014 2:26 AM
> To: dev@lucene.apache.org; steffkes@apache.org; rmuir@apache.org
> Subject: [JENKINS] Lucene-Solr-trunk-Linux (32bit/jdk1.7.0_51) - Build # 9828
> - Failure!
> 
> Build: http://jenkins.thetaphi.de/job/Lucene-Solr-trunk-Linux/9828/
> Java: 32bit/jdk1.7.0_51 -server -XX:+UseG1GC
> 
> All tests passed
> 
> Build Log:
> [...truncated 12076 lines...]
>    [junit4] JVM J0: stderr was not empty, see:
> /mnt/ssd/jenkins/workspace/Lucene-Solr-trunk-Linux/solr/build/solr-
> core/test/temp/junit4-J0-20140317_230107_233.syserr
>    [junit4] >>> JVM J0: stderr (verbatim) ----
>    [junit4] WARN: Unhandled exception in event serialization. ->
> com.carrotsearch.ant.tasks.junit4.dependencies.com.google.gson.JsonIOExc
> eption: java.io.IOException: No space left on device
>    [junit4] 	at
> com.carrotsearch.ant.tasks.junit4.dependencies.com.google.gson.Gson.toJs
> on(Gson.java:514)
>    [junit4] 	at
> com.carrotsearch.ant.tasks.junit4.events.Serializer.serialize(Serializer.java:61
> )
>    [junit4] 	at
> com.carrotsearch.ant.tasks.junit4.slave.SlaveMain$4.write(SlaveMain.java:3
> 76)
>    [junit4] 	at
> java.io.BufferedOutputStream.flushBuffer(BufferedOutputStream.java:82)
>    [junit4] 	at
> java.io.BufferedOutputStream.flush(BufferedOutputStream.java:140)
>    [junit4] 	at java.io.PrintStream.flush(PrintStream.java:338)
>    [junit4] 	at
> sun.nio.cs.StreamEncoder.implFlush(StreamEncoder.java:297)
>    [junit4] 	at sun.nio.cs.StreamEncoder.flush(StreamEncoder.java:141)
>    [junit4] 	at
> java.io.OutputStreamWriter.flush(OutputStreamWriter.java:229)
>    [junit4] 	at
> org.apache.log4j.helpers.QuietWriter.flush(QuietWriter.java:59)
>    [junit4] 	at
> org.apache.log4j.WriterAppender.subAppend(WriterAppender.java:324)
>    [junit4] 	at
> org.apache.log4j.WriterAppender.append(WriterAppender.java:162)
>    [junit4] 	at
> org.apache.log4j.AppenderSkeleton.doAppend(AppenderSkeleton.java:251)
>    [junit4] 	at
> org.apache.log4j.helpers.AppenderAttachableImpl.appendLoopOnAppende
> rs(AppenderAttachableImpl.java:66)
>    [junit4] 	at
> org.apache.log4j.Category.callAppenders(Category.java:206)
>    [junit4] 	at org.apache.log4j.Category.forcedLog(Category.java:391)
>    [junit4] 	at org.apache.log4j.Category.log(Category.java:856)
>    [junit4] 	at
> org.slf4j.impl.Log4jLoggerAdapter.warn(Log4jLoggerAdapter.java:478)
>    [junit4] 	at
> org.apache.solr.cloud.ChaosMonkeyNothingIsSafeTest$FullThrottleStopableI
> ndexingThread$1.handleError(ChaosMonkeyNothingIsSafeTest.java:284)
>    [junit4] 	at
> org.apache.solr.client.solrj.impl.ConcurrentUpdateSolrServer$Runner.run(C
> oncurrentUpdateSolrServer.java:256)
>    [junit4] 	at
> java.util.concurrent.ThreadPoolExecutor.runWorker(ThreadPoolExecutor.jav
> a:1145)
>    [junit4] 	at
> java.util.concurrent.ThreadPoolExecutor$Worker.run(ThreadPoolExecutor.ja
> va:615)
>    [junit4] 	at java.lang.Thread.run(Thread.java:744)
>    [junit4] Caused by: java.io.IOException: No space left on device
>    [junit4] 	at java.io.RandomAccessFile.writeBytes0(Native Method)
>    [junit4] 	at
> java.io.RandomAccessFile.writeBytes(RandomAccessFile.java:520)
>    [junit4] 	at
> java.io.RandomAccessFile.write(RandomAccessFile.java:550)
>    [junit4] 	at
> com.carrotsearch.ant.tasks.junit4.slave.RandomAccessFileOutputStream.wri
> te(RandomAccessFileOutputStream.java:28)
>    [junit4] 	at
> java.io.BufferedOutputStream.write(BufferedOutputStream.java:122)
>    [junit4] 	at
> sun.nio.cs.StreamEncoder.writeBytes(StreamEncoder.java:221)
>    [junit4] 	at
> sun.nio.cs.StreamEncoder.implWrite(StreamEncoder.java:282)
>    [junit4] 	at sun.nio.cs.StreamEncoder.write(StreamEncoder.java:125)
>    [junit4] 	at sun.nio.cs.StreamEncoder.write(StreamEncoder.java:113)
>    [junit4] 	at
> java.io.OutputStreamWriter.write(OutputStreamWriter.java:194)
>    [junit4] 	at
> com.carrotsearch.ant.tasks.junit4.dependencies.com.google.gson.stream.Js
> onWriter.string(JsonWriter.java:535)
>    [junit4] 	at
> com.carrotsearch.ant.tasks.junit4.dependencies.com.google.gson.stream.Js
> onWriter.value(JsonWriter.java:364)
>    [junit4] 	at
> com.carrotsearch.ant.tasks.junit4.dependencies.com.google.gson.internal.bi
> nd.TypeAdapters$22.write(TypeAdapters.java:626)
>    [junit4] 	at
> com.carrotsearch.ant.tasks.junit4.dependencies.com.google.gson.internal.bi
> nd.TypeAdapters$22.write(TypeAdapters.java:578)
>    [junit4] 	at
> com.carrotsearch.ant.tasks.junit4.dependencies.com.google.gson.internal.St
> reams.write(Streams.java:67)
>    [junit4] 	at
> com.carrotsearch.ant.tasks.junit4.dependencies.com.google.gson.GsonToMi
> niGsonTypeAdapterFactory$3.write(GsonToMiniGsonTypeAdapterFactory.ja
> va:98)
>    [junit4] 	at
> com.carrotsearch.ant.tasks.junit4.dependencies.com.google.gson.internal.bi
> nd.TypeAdapterRuntimeTypeWrapper.write(TypeAdapterRuntimeTypeWra
> pper.java:66)
>    [junit4] 	at
> com.carrotsearch.ant.tasks.junit4.dependencies.com.google.gson.internal.bi
> nd.ReflectiveTypeAdapterFactory$1.write(ReflectiveTypeAdapterFactory.jav
> a:82)
>    [junit4] 	at
> com.carrotsearch.ant.tasks.junit4.dependencies.com.google.gson.internal.bi
> nd.ReflectiveTypeAdapterFactory$Adapter.write(ReflectiveTypeAdapterFact
> ory.java:194)
>    [junit4] 	at
> com.carrotsearch.ant.tasks.junit4.dependencies.com.google.gson.Gson.toJs
> on(Gson.java:512)
>    [junit4] 	... 22 more
>    [junit4]
>    [junit4] WARN: Event serializer exception. -> java.io.IOException: Serializer
> already closed.
>    [junit4] 	at
> com.carrotsearch.ant.tasks.junit4.events.Serializer.serialize(Serializer.java:41
> )
>    [junit4] 	at
> com.carrotsearch.ant.tasks.junit4.slave.RunListenerEmitter.testFailure(RunLi
> stenerEmitter.java:54)
>    [junit4] 	at
> com.carrotsearch.ant.tasks.junit4.slave.NoExceptionRunListenerDecorator.t
> estFailure(NoExceptionRunListenerDecorator.java:55)
>    [junit4] 	at
> com.carrotsearch.ant.tasks.junit4.slave.BeforeAfterRunListenerDecorator.te
> stFailure(BeforeAfterRunListenerDecorator.java:60)
>    [junit4] 	at
> com.carrotsearch.ant.tasks.junit4.slave.OrderedRunNotifier$4.notifyListener
> (OrderedRunNotifier.java:129)
>    [junit4] 	at
> com.carrotsearch.ant.tasks.junit4.slave.OrderedRunNotifier$SafeNotifier.ru
> n(OrderedRunNotifier.java:63)
>    [junit4] 	at
> com.carrotsearch.ant.tasks.junit4.slave.OrderedRunNotifier.fireTestFailure(
> OrderedRunNotifier.java:126)
>    [junit4] 	at
> com.carrotsearch.randomizedtesting.ThreadLeakControl$2.evaluate(ThreadL
> eakControl.java:406)
>    [junit4] 	at
> com.carrotsearch.randomizedtesting.RandomizedRunner.runSuite(Randomi
> zedRunner.java:641)
>    [junit4] 	at
> com.carrotsearch.randomizedtesting.RandomizedRunner.access$200(Rando
> mizedRunner.java:128)
>    [junit4] 	at
> com.carrotsearch.randomizedtesting.RandomizedRunner$1.run(Randomized
> Runner.java:558)
>    [junit4]
>    [junit4] WARN: Event serializer exception. -> java.io.IOException: Serializer
> already closed.
>    [junit4] 	at
> com.carrotsearch.ant.tasks.junit4.events.Serializer.serialize(Serializer.java:41
> )
>    [junit4] 	at
> com.carrotsearch.ant.tasks.junit4.slave.RunListenerEmitter.testFinished(Run
> ListenerEmitter.java:113)
>    [junit4] 	at
> com.carrotsearch.ant.tasks.junit4.slave.NoExceptionRunListenerDecorator.t
> estFinished(NoExceptionRunListenerDecorator.java:47)
>    [junit4] 	at
> com.carrotsearch.ant.tasks.junit4.slave.BeforeAfterRunListenerDecorator.te
> stFinished(BeforeAfterRunListenerDecorator.java:51)
>    [junit4] 	at
> com.carrotsearch.ant.tasks.junit4.slave.OrderedRunNotifier$7.notifyListener
> (OrderedRunNotifier.java:179)
>    [junit4] 	at
> com.carrotsearch.ant.tasks.junit4.slave.OrderedRunNotifier$SafeNotifier.ru
> n(OrderedRunNotifier.java:63)
>    [junit4] 	at
> com.carrotsearch.ant.tasks.junit4.slave.OrderedRunNotifier.fireTestFinished
> (OrderedRunNotifier.java:176)
>    [junit4] 	at
> com.carrotsearch.randomizedtesting.ThreadLeakControl$2.evaluate(ThreadL
> eakControl.java:410)
>    [junit4] 	at
> com.carrotsearch.randomizedtesting.RandomizedRunner.runSuite(Randomi
> zedRunner.java:641)
>    [junit4] 	at
> com.carrotsearch.randomizedtesting.RandomizedRunner.access$200(Rando
> mizedRunner.java:128)
>    [junit4] 	at
> com.carrotsearch.randomizedtesting.RandomizedRunner$1.run(Randomized
> Runner.java:558)
>    [junit4]
>    [junit4] WARN: Event serializer exception. -> java.io.IOException: Serializer
> already closed.
>    [junit4] 	at
> com.carrotsearch.ant.tasks.junit4.events.Serializer.serialize(Serializer.java:41
> )
>    [junit4] 	at
> com.carrotsearch.ant.tasks.junit4.slave.RunListenerEmitter.testFailure(RunLi
> stenerEmitter.java:52)
>    [junit4] 	at
> com.carrotsearch.ant.tasks.junit4.slave.NoExceptionRunListenerDecorator.t
> estFailure(NoExceptionRunListenerDecorator.java:55)
>    [junit4] 	at
> com.carrotsearch.ant.tasks.junit4.slave.BeforeAfterRunListenerDecorator.te
> stFailure(BeforeAfterRunListenerDecorator.java:60)
>    [junit4] 	at
> com.carrotsearch.ant.tasks.junit4.slave.OrderedRunNotifier$4.notifyListener
> (OrderedRunNotifier.java:129)
>    [junit4] 	at
> com.carrotsearch.ant.tasks.junit4.slave.OrderedRunNotifier$SafeNotifier.ru
> n(OrderedRunNotifier.java:63)
>    [junit4] 	at
> com.carrotsearch.ant.tasks.junit4.slave.OrderedRunNotifier.fireTestFailure(
> OrderedRunNotifier.java:126)
>    [junit4] 	at
> com.carrotsearch.randomizedtesting.RandomizedRunner.fireTestFailure(Ran
> domizedRunner.java:753)
>    [junit4] 	at
> com.carrotsearch.randomizedtesting.RandomizedRunner.runSuite(Randomi
> zedRunner.java:654)
>    [junit4] 	at
> com.carrotsearch.randomizedtesting.RandomizedRunner.access$200(Rando
> mizedRunner.java:128)
>    [junit4] 	at
> com.carrotsearch.randomizedtesting.RandomizedRunner$1.run(Randomized
> Runner.java:558)
>    [junit4]
>    [junit4] WARN: Event serializer exception. -> java.io.IOException: Serializer
> already closed.
>    [junit4] 	at
> com.carrotsearch.ant.tasks.junit4.events.Serializer.serialize(Serializer.java:41
> )
>    [junit4] 	at
> com.carrotsearch.ant.tasks.junit4.slave.RunListenerEmitter.testRunFinished(
> RunListenerEmitter.java:120)
>    [junit4] 	at
> com.carrotsearch.ant.tasks.junit4.slave.NoExceptionRunListenerDecorator.t
> estRunFinished(NoExceptionRunListenerDecorator.java:31)
>    [junit4] 	at
> com.carrotsearch.ant.tasks.junit4.slave.BeforeAfterRunListenerDecorator.te
> stRunFinished(BeforeAfterRunListenerDecorator.java:33)
>    [junit4] 	at
> com.carrotsearch.ant.tasks.junit4.slave.OrderedRunNotifier$2.notifyListener
> (OrderedRunNotifier.java:94)
>    [junit4] 	at
> com.carrotsearch.ant.tasks.junit4.slave.OrderedRunNotifier$SafeNotifier.ru
> n(OrderedRunNotifier.java:63)
>    [junit4] 	at
> com.carrotsearch.ant.tasks.junit4.slave.OrderedRunNotifier.fireTestRunFinis
> hed(OrderedRunNotifier.java:91)
>    [junit4] 	at
> com.carrotsearch.ant.tasks.junit4.slave.SlaveMain.execute(SlaveMain.java:1
> 81)
>    [junit4] 	at
> com.carrotsearch.ant.tasks.junit4.slave.SlaveMain.main(SlaveMain.java:276)
>    [junit4] 	at
> com.carrotsearch.ant.tasks.junit4.slave.SlaveMainSafe.main(SlaveMainSafe.j
> ava:12)
>    [junit4]
>    [junit4] WARN: Exception at main loop level. ->
> java.lang.RuntimeException: java.io.IOException: Serializer already closed.
>    [junit4] 	at
> com.carrotsearch.ant.tasks.junit4.slave.StdInLineIterator.computeNext(StdI
> nLineIterator.java:34)
>    [junit4] 	at
> com.carrotsearch.ant.tasks.junit4.slave.StdInLineIterator.computeNext(StdI
> nLineIterator.java:13)
>    [junit4] 	at
> com.carrotsearch.ant.tasks.junit4.dependencies.com.google.common.collec
> t.AbstractIterator.tryToComputeNext(AbstractIterator.java:143)
>    [junit4] 	at
> com.carrotsearch.ant.tasks.junit4.dependencies.com.google.common.collec
> t.AbstractIterator.hasNext(AbstractIterator.java:138)
>    [junit4] 	at
> com.carrotsearch.ant.tasks.junit4.dependencies.com.google.common.collec
> t.Iterators$5.hasNext(Iterators.java:542)
>    [junit4] 	at
> com.carrotsearch.ant.tasks.junit4.slave.SlaveMain.execute(SlaveMain.java:1
> 69)
>    [junit4] 	at
> com.carrotsearch.ant.tasks.junit4.slave.SlaveMain.main(SlaveMain.java:276)
>    [junit4] 	at
> com.carrotsearch.ant.tasks.junit4.slave.SlaveMainSafe.main(SlaveMainSafe.j
> ava:12)
>    [junit4] Caused by: java.io.IOException: Serializer already closed.
>    [junit4] 	at
> com.carrotsearch.ant.tasks.junit4.events.Serializer.serialize(Serializer.java:41
> )
>    [junit4] 	at
> com.carrotsearch.ant.tasks.junit4.slave.StdInLineIterator.computeNext(StdI
> nLineIterator.java:28)
>    [junit4] 	... 7 more
>    [junit4] <<< JVM J0: EOF ----
> 
> [...truncated 2 lines...]
>    [junit4] ERROR: JVM J0 ended with an exception, command line:
> /var/lib/jenkins/tools/java/32bit/jdk1.7.0_51/jre/bin/java -server -
> XX:+UseG1GC -XX:+HeapDumpOnOutOfMemoryError -
> XX:HeapDumpPath=/mnt/ssd/jenkins/workspace/Lucene-Solr-trunk-
> Linux/heapdumps -Dtests.prefix=tests -Dtests.seed=D0DA9EC3A93F0E07 -
> Xmx512M -Dtests.iters= -Dtests.verbose=false -Dtests.infostream=false -
> Dtests.codec=random -Dtests.postingsformat=random -
> Dtests.docvaluesformat=random -Dtests.locale=random -
> Dtests.timezone=random -Dtests.directory=random -
> Dtests.linedocsfile=europarl.lines.txt.gz -Dtests.luceneMatchVersion=5.0 -
> Dtests.cleanthreads=perClass -
> Djava.util.logging.config.file=/mnt/ssd/jenkins/workspace/Lucene-Solr-
> trunk-Linux/lucene/tools/junit4/logging.properties -Dtests.nightly=false -
> Dtests.weekly=false -Dtests.slow=true -Dtests.asserts.gracious=false -
> Dtests.multiplier=3 -DtempDir=. -Djava.io.tmpdir=. -
> Djunit4.tempDir=/mnt/ssd/jenkins/workspace/Lucene-Solr-trunk-
> Linux/solr/build/solr-core/test/temp -
> Dclover.db.dir=/mnt/ssd/jenkins/workspace/Lucene-Solr-trunk-
> Linux/lucene/build/clover/db -
> Djava.security.manager=org.apache.lucene.util.TestSecurityManager -
> Djava.security.policy=/mnt/ssd/jenkins/workspace/Lucene-Solr-trunk-
> Linux/lucene/tools/junit4/tests.policy -Dlucene.version=5.0-SNAPSHOT -
> Djetty.testMode=1 -Djetty.insecurerandom=1 -
> Dsolr.directoryFactory=org.apache.solr.core.MockDirectoryFactory -
> Djava.awt.headless=true -Djdk.map.althashing.threshold=0 -
> Dtests.filterstacks=true -Dtests.disableHdfs=true -Dfile.encoding=ISO-8859-1
> -classpath /mnt/ssd/jenkins/workspace/Lucene-Solr-trunk-
> Linux/solr/build/solr-
> core/classes/test:/mnt/ssd/jenkins/workspace/Lucene-Solr-trunk-
> Linux/solr/build/solr-test-
> framework/classes/java:/mnt/ssd/jenkins/workspace/Lucene-Solr-trunk-
> Linux/solr/test-framework/lib/junit4-ant-
> 2.1.1.jar:/mnt/ssd/jenkins/workspace/Lucene-Solr-trunk-
> Linux/solr/core/src/test-files:/mnt/ssd/jenkins/workspace/Lucene-Solr-
> trunk-Linux/lucene/build/test-
> framework/classes/java:/mnt/ssd/jenkins/workspace/Lucene-Solr-trunk-
> Linux/lucene/build/codecs/classes/java:/mnt/ssd/jenkins/workspace/Lucen
> e-Solr-trunk-Linux/solr/build/solr-
> solrj/classes/java:/mnt/ssd/jenkins/workspace/Lucene-Solr-trunk-
> Linux/solr/build/solr-
> core/classes/java:/mnt/ssd/jenkins/workspace/Lucene-Solr-trunk-
> Linux/lucene/build/analysis/common/lucene-analyzers-common-5.0-
> SNAPSHOT.jar:/mnt/ssd/jenkins/workspace/Lucene-Solr-trunk-
> Linux/lucene/build/analysis/kuromoji/lucene-analyzers-kuromoji-5.0-
> SNAPSHOT.jar:/mnt/ssd/jenkins/workspace/Lucene-Solr-trunk-
> Linux/lucene/build/analysis/phonetic/lucene-analyzers-phonetic-5.0-
> SNAPSHOT.jar:/mnt/ssd/jenkins/workspace/Lucene-Solr-trunk-
> Linux/lucene/build/codecs/lucene-codecs-5.0-
> SNAPSHOT.jar:/mnt/ssd/jenkins/workspace/Lucene-Solr-trunk-
> Linux/lucene/build/highlighter/lucene-highlighter-5.0-
> SNAPSHOT.jar:/mnt/ssd/jenkins/workspace/Lucene-Solr-trunk-
> Linux/lucene/build/memory/lucene-memory-5.0-
> SNAPSHOT.jar:/mnt/ssd/jenkins/workspace/Lucene-Solr-trunk-
> Linux/lucene/build/misc/lucene-misc-5.0-
> SNAPSHOT.jar:/mnt/ssd/jenkins/workspace/Lucene-Solr-trunk-
> Linux/lucene/build/spatial/lucene-spatial-5.0-
> SNAPSHOT.jar:/mnt/ssd/jenkins/workspace/Lucene-Solr-trunk-
> Linux/lucene/build/expressions/lucene-expressions-5.0-
> SNAPSHOT.jar:/mnt/ssd/jenkins/workspace/Lucene-Solr-trunk-
> Linux/lucene/build/suggest/lucene-suggest-5.0-
> SNAPSHOT.jar:/mnt/ssd/jenkins/workspace/Lucene-Solr-trunk-
> Linux/lucene/build/grouping/lucene-grouping-5.0-
> SNAPSHOT.jar:/mnt/ssd/jenkins/workspace/Lucene-Solr-trunk-
> Linux/lucene/build/queries/lucene-queries-5.0-
> SNAPSHOT.jar:/mnt/ssd/jenkins/workspace/Lucene-Solr-trunk-
> Linux/lucene/build/queryparser/lucene-queryparser-5.0-
> SNAPSHOT.jar:/mnt/ssd/jenkins/workspace/Lucene-Solr-trunk-
> Linux/lucene/build/join/lucene-join-5.0-
> SNAPSHOT.jar:/mnt/ssd/jenkins/workspace/Lucene-Solr-trunk-
> Linux/solr/core/lib/antlr-runtime-
> 3.5.jar:/mnt/ssd/jenkins/workspace/Lucene-Solr-trunk-
> Linux/solr/core/lib/asm-4.1.jar:/mnt/ssd/jenkins/workspace/Lucene-Solr-
> trunk-Linux/solr/core/lib/asm-commons-
> 4.1.jar:/mnt/ssd/jenkins/workspace/Lucene-Solr-trunk-
> Linux/solr/core/lib/commons-cli-
> 1.2.jar:/mnt/ssd/jenkins/workspace/Lucene-Solr-trunk-
> Linux/solr/core/lib/commons-codec-
> 1.9.jar:/mnt/ssd/jenkins/workspace/Lucene-Solr-trunk-
> Linux/solr/core/lib/commons-configuration-
> 1.6.jar:/mnt/ssd/jenkins/workspace/Lucene-Solr-trunk-
> Linux/solr/core/lib/commons-fileupload-
> 1.2.1.jar:/mnt/ssd/jenkins/workspace/Lucene-Solr-trunk-
> Linux/solr/core/lib/commons-lang-
> 2.6.jar:/mnt/ssd/jenkins/workspace/Lucene-Solr-trunk-
> Linux/solr/core/lib/concurrentlinkedhashmap-lru-
> 1.2.jar:/mnt/ssd/jenkins/workspace/Lucene-Solr-trunk-
> Linux/solr/core/lib/dom4j-1.6.1.jar:/mnt/ssd/jenkins/workspace/Lucene-
> Solr-trunk-Linux/solr/core/lib/guava-
> 14.0.1.jar:/mnt/ssd/jenkins/workspace/Lucene-Solr-trunk-
> Linux/solr/core/lib/hadoop-annotations-
> 2.2.0.jar:/mnt/ssd/jenkins/workspace/Lucene-Solr-trunk-
> Linux/solr/core/lib/hadoop-auth-
> 2.2.0.jar:/mnt/ssd/jenkins/workspace/Lucene-Solr-trunk-
> Linux/solr/core/lib/hadoop-common-
> 2.2.0.jar:/mnt/ssd/jenkins/workspace/Lucene-Solr-trunk-
> Linux/solr/core/lib/hadoop-hdfs-
> 2.2.0.jar:/mnt/ssd/jenkins/workspace/Lucene-Solr-trunk-
> Linux/solr/core/lib/hppc-0.5.2.jar:/mnt/ssd/jenkins/workspace/Lucene-Solr-
> trunk-Linux/solr/core/lib/joda-time-
> 2.2.jar:/mnt/ssd/jenkins/workspace/Lucene-Solr-trunk-
> Linux/solr/core/lib/org.restlet-
> 2.1.1.jar:/mnt/ssd/jenkins/workspace/Lucene-Solr-trunk-
> Linux/solr/core/lib/org.restlet.ext.servlet-
> 2.1.1.jar:/mnt/ssd/jenkins/workspace/Lucene-Solr-trunk-
> Linux/solr/core/lib/protobuf-java-
> 2.5.0.jar:/mnt/ssd/jenkins/workspace/Lucene-Solr-trunk-
> Linux/solr/core/lib/spatial4j-0.4.1.jar:/mnt/ssd/jenkins/workspace/Lucene-
> Solr-trunk-Linux/solr/solrj/lib/commons-io-
> 2.1.jar:/mnt/ssd/jenkins/workspace/Lucene-Solr-trunk-
> Linux/solr/solrj/lib/httpclient-4.3.1.jar:/mnt/ssd/jenkins/workspace/Lucene-
> Solr-trunk-Linux/solr/solrj/lib/httpcore-
> 4.3.jar:/mnt/ssd/jenkins/workspace/Lucene-Solr-trunk-
> Linux/solr/solrj/lib/httpmime-
> 4.3.1.jar:/mnt/ssd/jenkins/workspace/Lucene-Solr-trunk-
> Linux/solr/solrj/lib/jcl-over-slf4j-
> 1.7.6.jar:/mnt/ssd/jenkins/workspace/Lucene-Solr-trunk-
> Linux/solr/solrj/lib/jul-to-slf4j-
> 1.7.6.jar:/mnt/ssd/jenkins/workspace/Lucene-Solr-trunk-
> Linux/solr/solrj/lib/log4j-1.2.16.jar:/mnt/ssd/jenkins/workspace/Lucene-
> Solr-trunk-Linux/solr/solrj/lib/noggit-
> 0.5.jar:/mnt/ssd/jenkins/workspace/Lucene-Solr-trunk-
> Linux/solr/solrj/lib/slf4j-api-1.7.6.jar:/mnt/ssd/jenkins/workspace/Lucene-
> Solr-trunk-Linux/solr/solrj/lib/slf4j-log4j12-
> 1.7.6.jar:/mnt/ssd/jenkins/workspace/Lucene-Solr-trunk-
> Linux/solr/solrj/lib/wstx-asl-3.2.7.jar:/mnt/ssd/jenkins/workspace/Lucene-
> Solr-trunk-Linux/solr/solrj/lib/zookeeper-
> 3.4.5.jar:/mnt/ssd/jenkins/workspace/Lucene-Solr-trunk-
> Linux/solr/example/lib/jetty-continuation-
> 8.1.10.v20130312.jar:/mnt/ssd/jenkins/workspace/Lucene-Solr-trunk-
> Linux/solr/example/lib/jetty-deploy-
> 8.1.10.v20130312.jar:/mnt/ssd/jenkins/workspace/Lucene-Solr-trunk-
> Linux/solr/example/lib/jetty-http-
> 8.1.10.v20130312.jar:/mnt/ssd/jenkins/workspace/Lucene-Solr-trunk-
> Linux/solr/example/lib/jetty-io-
> 8.1.10.v20130312.jar:/mnt/ssd/jenkins/workspace/Lucene-Solr-trunk-
> Linux/solr/example/lib/jetty-jmx-
> 8.1.10.v20130312.jar:/mnt/ssd/jenkins/workspace/Lucene-Solr-trunk-
> Linux/solr/example/lib/jetty-security-
> 8.1.10.v20130312.jar:/mnt/ssd/jenkins/workspace/Lucene-Solr-trunk-
> Linux/solr/example/lib/jetty-server-
> 8.1.10.v20130312.jar:/mnt/ssd/jenkins/workspace/Lucene-Solr-trunk-
> Linux/solr/example/lib/jetty-servlet-
> 8.1.10.v20130312.jar:/mnt/ssd/jenkins/workspace/Lucene-Solr-trunk-
> Linux/solr/example/lib/jetty-util-
> 8.1.10.v20130312.jar:/mnt/ssd/jenkins/workspace/Lucene-Solr-trunk-
> Linux/solr/example/lib/jetty-webapp-
> 8.1.10.v20130312.jar:/mnt/ssd/jenkins/workspace/Lucene-Solr-trunk-
> Linux/solr/example/lib/jetty-xml-
> 8.1.10.v20130312.jar:/mnt/ssd/jenkins/workspace/Lucene-Solr-trunk-
> Linux/solr/example/lib/servlet-api-
> 3.0.jar:/mnt/ssd/jenkins/workspace/Lucene-Solr-trunk-
> Linux/solr/example/example-DIH/solr/db/lib/derby-
> 10.9.1.0.jar:/mnt/ssd/jenkins/workspace/Lucene-Solr-trunk-
> Linux/solr/example/example-DIH/solr/db/lib/hsqldb-
> 1.8.0.10.jar:/mnt/ssd/jenkins/workspace/Lucene-Solr-trunk-
> Linux/lucene/build/core/classes/java:/mnt/ssd/jenkins/workspace/Lucene-
> Solr-trunk-Linux/lucene/test-framework/lib/junit-
> 4.10.jar:/mnt/ssd/jenkins/workspace/Lucene-Solr-trunk-Linux/lucene/test-
> framework/lib/randomizedtesting-runner-
> 2.1.1.jar:/mnt/ssd/jenkins/workspace/Lucene-Solr-trunk-
> Linux/solr/core/test-lib/antlr-runtime-
> 3.5.jar:/mnt/ssd/jenkins/workspace/Lucene-Solr-trunk-Linux/solr/core/test-
> lib/asm-4.1.jar:/mnt/ssd/jenkins/workspace/Lucene-Solr-trunk-
> Linux/solr/core/test-lib/asm-commons-
> 4.1.jar:/mnt/ssd/jenkins/workspace/Lucene-Solr-trunk-Linux/solr/core/test-
> lib/cglib-nodep-2.2.jar:/mnt/ssd/jenkins/workspace/Lucene-Solr-trunk-
> Linux/solr/core/test-lib/commons-collections-
> 3.2.1.jar:/mnt/ssd/jenkins/workspace/Lucene-Solr-trunk-
> Linux/solr/core/test-lib/dom4j-
> 1.6.1.jar:/mnt/ssd/jenkins/workspace/Lucene-Solr-trunk-
> Linux/solr/core/test-lib/easymock-
> 3.0.jar:/mnt/ssd/jenkins/workspace/Lucene-Solr-trunk-Linux/solr/core/test-
> lib/hadoop-common-2.2.0-tests.jar:/mnt/ssd/jenkins/workspace/Lucene-
> Solr-trunk-Linux/solr/core/test-lib/hadoop-hdfs-2.2.0-
> tests.jar:/mnt/ssd/jenkins/workspace/Lucene-Solr-trunk-
> Linux/solr/core/test-lib/hppc-0.5.2.jar:/mnt/ssd/jenkins/workspace/Lucene-
> Solr-trunk-Linux/solr/core/test-lib/javax.servlet-api-
> 3.0.1.jar:/mnt/ssd/jenkins/workspace/Lucene-Solr-trunk-
> Linux/solr/core/test-lib/jersey-core-
> 1.8.jar:/mnt/ssd/jenkins/workspace/Lucene-Solr-trunk-Linux/solr/core/test-
> lib/jetty-6.1.26.jar:/mnt/ssd/jenkins/workspace/Lucene-Solr-trunk-
> Linux/solr/core/test-lib/jetty-util-
> 6.1.26.jar:/mnt/ssd/jenkins/workspace/Lucene-Solr-trunk-
> Linux/solr/core/test-lib/objenesis-
> 1.2.jar:/var/lib/jenkins/tools/hudson.tasks.Ant_AntInstallation/ANT_1.8.2/li
> b/ant-launcher.jar:/var/lib/jenkins/.ant/lib/ivy-
> 2.3.0.jar:/var/lib/jenkins/tools/hudson.tasks.Ant_AntInstallation/ANT_1.8.2/
> lib/ant-
> jai.jar:/var/lib/jenkins/tools/hudson.tasks.Ant_AntInstallation/ANT_1.8.2/lib
> /ant-
> swing.jar:/var/lib/jenkins/tools/hudson.tasks.Ant_AntInstallation/ANT_1.8.2
> /lib/ant-apache-
> oro.jar:/var/lib/jenkins/tools/hudson.tasks.Ant_AntInstallation/ANT_1.8.2/li
> b/ant-
> jmf.jar:/var/lib/jenkins/tools/hudson.tasks.Ant_AntInstallation/ANT_1.8.2/li
> b/ant-apache-
> xalan2.jar:/var/lib/jenkins/tools/hudson.tasks.Ant_AntInstallation/ANT_1.8.
> 2/lib/ant-
> javamail.jar:/var/lib/jenkins/tools/hudson.tasks.Ant_AntInstallation/ANT_1.
> 8.2/lib/ant-apache-
> resolver.jar:/var/lib/jenkins/tools/hudson.tasks.Ant_AntInstallation/ANT_1.
> 8.2/lib/ant-
> testutil.jar:/var/lib/jenkins/tools/hudson.tasks.Ant_AntInstallation/ANT_1.8.
> 2/lib/ant-commons-
> logging.jar:/var/lib/jenkins/tools/hudson.tasks.Ant_AntInstallation/ANT_1.8.
> 2/lib/ant-apache-
> log4j.jar:/var/lib/jenkins/tools/hudson.tasks.Ant_AntInstallation/ANT_1.8.2/
> lib/ant-
> junit.jar:/var/lib/jenkins/tools/hudson.tasks.Ant_AntInstallation/ANT_1.8.2/
> lib/ant-
> jsch.jar:/var/lib/jenkins/tools/hudson.tasks.Ant_AntInstallation/ANT_1.8.2/li
> b/ant-commons-
> net.jar:/var/lib/jenkins/tools/hudson.tasks.Ant_AntInstallation/ANT_1.8.2/li
> b/ant-apache-
> bsf.jar:/var/lib/jenkins/tools/hudson.tasks.Ant_AntInstallation/ANT_1.8.2/li
> b/ant-
> jdepend.jar:/var/lib/jenkins/tools/hudson.tasks.Ant_AntInstallation/ANT_1.
> 8.2/lib/ant-
> netrexx.jar:/var/lib/jenkins/tools/hudson.tasks.Ant_AntInstallation/ANT_1.
> 8.2/lib/ant-apache-
> regexp.jar:/var/lib/jenkins/tools/hudson.tasks.Ant_AntInstallation/ANT_1.8.
> 2/lib/ant-
> junit4.jar:/var/lib/jenkins/tools/hudson.tasks.Ant_AntInstallation/ANT_1.8.2
> /lib/ant.jar:/var/lib/jenkins/tools/hudson.tasks.Ant_AntInstallation/ANT_1.8
> .2/lib/ant-apache-
> bcel.jar:/var/lib/jenkins/tools/hudson.tasks.Ant_AntInstallation/ANT_1.8.2/l
> ib/ant-
> antlr.jar:/var/lib/jenkins/tools/java/32bit/jdk1.7.0_51/lib/tools.jar:/var/lib/je
> nkins/.ivy2/cache/com.carrotsearch.randomizedtesting/junit4-
> ant/jars/junit4-ant-2.1.1.jar -ea:org.apache.lucene... -ea:org.apache.solr...
> com.carrotsearch.ant.tasks.junit4.slave.SlaveMainSafe -eventsfile
> /mnt/ssd/jenkins/workspace/Lucene-Solr-trunk-Linux/solr/build/solr-
> core/test/temp/junit4-J0-20140317_230107_233.events
> @/mnt/ssd/jenkins/workspace/Lucene-Solr-trunk-Linux/solr/build/solr-
> core/test/temp/junit4-J0-20140317_230107_233.suites
>    [junit4] ERROR: JVM J0 ended with an exception: Forked process returned
> with error code: 240. Very likely a JVM crash.  Process output piped in logs
> above.
>    [junit4] 	at
> com.carrotsearch.ant.tasks.junit4.JUnit4.executeSlave(JUnit4.java:1458)
>    [junit4] 	at
> com.carrotsearch.ant.tasks.junit4.JUnit4.access$000(JUnit4.java:133)
>    [junit4] 	at
> com.carrotsearch.ant.tasks.junit4.JUnit4$2.call(JUnit4.java:945)
>    [junit4] 	at
> com.carrotsearch.ant.tasks.junit4.JUnit4$2.call(JUnit4.java:942)
>    [junit4] 	at java.util.concurrent.FutureTask.run(FutureTask.java:262)
>    [junit4] 	at
> java.util.concurrent.ThreadPoolExecutor.runWorker(ThreadPoolExecutor.jav
> a:1145)
>    [junit4] 	at
> java.util.concurrent.ThreadPoolExecutor$Worker.run(ThreadPoolExecutor.ja
> va:615)
>    [junit4] 	at java.lang.Thread.run(Thread.java:744)
> 
> BUILD FAILED
> /mnt/ssd/jenkins/workspace/Lucene-Solr-trunk-Linux/build.xml:467: The
> following error occurred while executing this line:
> /mnt/ssd/jenkins/workspace/Lucene-Solr-trunk-Linux/build.xml:447: The
> following error occurred while executing this line:
> /mnt/ssd/jenkins/workspace/Lucene-Solr-trunk-Linux/build.xml:45: The
> following error occurred while executing this line:
> /mnt/ssd/jenkins/workspace/Lucene-Solr-trunk-Linux/extra-targets.xml:37:
> The following error occurred while executing this line:
> /mnt/ssd/jenkins/workspace/Lucene-Solr-trunk-Linux/solr/build.xml:189:
> The following error occurred while executing this line:
> /mnt/ssd/jenkins/workspace/Lucene-Solr-trunk-Linux/solr/common-
> build.xml:490: The following error occurred while executing this line:
> /mnt/ssd/jenkins/workspace/Lucene-Solr-trunk-Linux/lucene/common-
> build.xml:1275: The following error occurred while executing this line:
> /mnt/ssd/jenkins/workspace/Lucene-Solr-trunk-Linux/lucene/common-
> build.xml:907: At least one slave process threw an exception, first: Forked
> process returned with error code: 240. Very likely a JVM crash.  Process
> output piped in logs above.
> 
> Total time: 165 minutes 4 seconds
> Build step 'Invoke Ant' marked build as failure Description set: Java:
> 32bit/jdk1.7.0_51 -server -XX:+UseG1GC Archiving artifacts Recording test
> results Email was triggered for: Failure Sending email for trigger: Failure
> 



---------------------------------------------------------------------
To unsubscribe, e-mail: dev-unsubscribe@lucene.apache.org
For additional commands, e-mail: dev-help@lucene.apache.org


Mime
View raw message