lucene-dev mailing list archives

Site index · List index
Message view « Date » · « Thread »
Top « Date » · « Thread »
From Policeman Jenkins Server <jenk...@thetaphi.de>
Subject [JENKINS] Lucene-Solr-4.x-Linux (32bit/jdk1.7.0_60-ea-b07) - Build # 9721 - Still Failing!
Date Mon, 17 Mar 2014 16:49:11 GMT
Build: http://jenkins.thetaphi.de/job/Lucene-Solr-4.x-Linux/9721/
Java: 32bit/jdk1.7.0_60-ea-b07 -client -XX:+UseSerialGC

1 tests failed.
REGRESSION:  org.apache.solr.client.solrj.impl.CloudSolrServerTest.testDistribSearch

Error Message:
java.util.concurrent.TimeoutException: Could not connect to ZooKeeper 127.0.0.1:36219 within
45000 ms

Stack Trace:
org.apache.solr.common.SolrException: java.util.concurrent.TimeoutException: Could not connect
to ZooKeeper 127.0.0.1:36219 within 45000 ms
	at __randomizedtesting.SeedInfo.seed([9508EFB1D027CB81:14EE61A9A778ABBD]:0)
	at org.apache.solr.common.cloud.SolrZkClient.<init>(SolrZkClient.java:150)
	at org.apache.solr.common.cloud.SolrZkClient.<init>(SolrZkClient.java:101)
	at org.apache.solr.common.cloud.SolrZkClient.<init>(SolrZkClient.java:91)
	at org.apache.solr.cloud.AbstractZkTestCase.buildZooKeeper(AbstractZkTestCase.java:89)
	at org.apache.solr.cloud.AbstractZkTestCase.buildZooKeeper(AbstractZkTestCase.java:83)
	at org.apache.solr.cloud.AbstractDistribZkTestBase.setUp(AbstractDistribZkTestBase.java:70)
	at org.apache.solr.cloud.AbstractFullDistribZkTestBase.setUp(AbstractFullDistribZkTestBase.java:201)
	at org.apache.solr.client.solrj.impl.CloudSolrServerTest.setUp(CloudSolrServerTest.java:78)
	at sun.reflect.NativeMethodAccessorImpl.invoke0(Native Method)
	at sun.reflect.NativeMethodAccessorImpl.invoke(NativeMethodAccessorImpl.java:57)
	at sun.reflect.DelegatingMethodAccessorImpl.invoke(DelegatingMethodAccessorImpl.java:43)
	at java.lang.reflect.Method.invoke(Method.java:606)
	at com.carrotsearch.randomizedtesting.RandomizedRunner.invoke(RandomizedRunner.java:1617)
	at com.carrotsearch.randomizedtesting.RandomizedRunner$7.evaluate(RandomizedRunner.java:860)
	at com.carrotsearch.randomizedtesting.RandomizedRunner$8.evaluate(RandomizedRunner.java:876)
	at com.carrotsearch.randomizedtesting.rules.SystemPropertiesRestoreRule$1.evaluate(SystemPropertiesRestoreRule.java:53)
	at org.apache.lucene.util.TestRuleSetupTeardownChained$1.evaluate(TestRuleSetupTeardownChained.java:50)
	at org.apache.lucene.util.TestRuleFieldCacheSanity$1.evaluate(TestRuleFieldCacheSanity.java:51)
	at org.apache.lucene.util.AbstractBeforeAfterRule$1.evaluate(AbstractBeforeAfterRule.java:46)
	at com.carrotsearch.randomizedtesting.rules.SystemPropertiesInvariantRule$1.evaluate(SystemPropertiesInvariantRule.java:55)
	at org.apache.lucene.util.TestRuleThreadAndTestName$1.evaluate(TestRuleThreadAndTestName.java:49)
	at org.apache.lucene.util.TestRuleIgnoreAfterMaxFailures$1.evaluate(TestRuleIgnoreAfterMaxFailures.java:70)
	at org.apache.lucene.util.TestRuleMarkFailure$1.evaluate(TestRuleMarkFailure.java:48)
	at com.carrotsearch.randomizedtesting.rules.StatementAdapter.evaluate(StatementAdapter.java:36)
	at com.carrotsearch.randomizedtesting.ThreadLeakControl$StatementRunner.run(ThreadLeakControl.java:359)
	at com.carrotsearch.randomizedtesting.ThreadLeakControl.forkTimeoutingTask(ThreadLeakControl.java:783)
	at com.carrotsearch.randomizedtesting.ThreadLeakControl$3.evaluate(ThreadLeakControl.java:443)
	at com.carrotsearch.randomizedtesting.RandomizedRunner.runSingleTest(RandomizedRunner.java:835)
	at com.carrotsearch.randomizedtesting.RandomizedRunner$3.evaluate(RandomizedRunner.java:737)
	at com.carrotsearch.randomizedtesting.RandomizedRunner$4.evaluate(RandomizedRunner.java:771)
	at com.carrotsearch.randomizedtesting.RandomizedRunner$5.evaluate(RandomizedRunner.java:782)
	at com.carrotsearch.randomizedtesting.rules.StatementAdapter.evaluate(StatementAdapter.java:36)
	at com.carrotsearch.randomizedtesting.rules.SystemPropertiesRestoreRule$1.evaluate(SystemPropertiesRestoreRule.java:53)
	at org.apache.lucene.util.AbstractBeforeAfterRule$1.evaluate(AbstractBeforeAfterRule.java:46)
	at org.apache.lucene.util.TestRuleStoreClassName$1.evaluate(TestRuleStoreClassName.java:42)
	at com.carrotsearch.randomizedtesting.rules.SystemPropertiesInvariantRule$1.evaluate(SystemPropertiesInvariantRule.java:55)
	at com.carrotsearch.randomizedtesting.rules.NoShadowingOrOverridesOnMethodsRule$1.evaluate(NoShadowingOrOverridesOnMethodsRule.java:39)
	at com.carrotsearch.randomizedtesting.rules.NoShadowingOrOverridesOnMethodsRule$1.evaluate(NoShadowingOrOverridesOnMethodsRule.java:39)
	at com.carrotsearch.randomizedtesting.rules.StatementAdapter.evaluate(StatementAdapter.java:36)
	at org.apache.lucene.util.TestRuleAssertionsRequired$1.evaluate(TestRuleAssertionsRequired.java:43)
	at org.apache.lucene.util.TestRuleMarkFailure$1.evaluate(TestRuleMarkFailure.java:48)
	at org.apache.lucene.util.TestRuleIgnoreAfterMaxFailures$1.evaluate(TestRuleIgnoreAfterMaxFailures.java:70)
	at org.apache.lucene.util.TestRuleIgnoreTestSuites$1.evaluate(TestRuleIgnoreTestSuites.java:55)
	at com.carrotsearch.randomizedtesting.rules.StatementAdapter.evaluate(StatementAdapter.java:36)
	at com.carrotsearch.randomizedtesting.ThreadLeakControl$StatementRunner.run(ThreadLeakControl.java:359)
	at java.lang.Thread.run(Thread.java:744)
Caused by: java.util.concurrent.TimeoutException: Could not connect to ZooKeeper 127.0.0.1:36219
within 45000 ms
	at org.apache.solr.common.cloud.ConnectionManager.waitForConnected(ConnectionManager.java:223)
	at org.apache.solr.common.cloud.SolrZkClient.<init>(SolrZkClient.java:142)
	... 45 more




Build Log:
[...truncated 11595 lines...]
   [junit4] Suite: org.apache.solr.client.solrj.impl.CloudSolrServerTest
   [junit4]   2> log4j:WARN No such property [conversionPattern] in org.apache.solr.util.SolrLogLayout.
   [junit4]   2> 367 T15 oas.SolrTestCaseJ4.buildSSLConfig Randomized ssl (true) and clientAuth
(true)
   [junit4]   2> 386 T15 oas.BaseDistributedSearchTestCase.initHostContext Setting hostContext
system property: /e_/r
   [junit4]   2> 388 T15 oasc.AbstractZkTestCase.<clinit> WARN TEST_HOME() does not
exist - solrj test?
   [junit4]   2> 393 T15 oas.SolrTestCaseJ4.setUp ###Starting testDistribSearch
   [junit4]   2> Creating dataDir: /mnt/ssd/jenkins/workspace/Lucene-Solr-4.x-Linux/solr/build/solr-solrj/test/J0/./solrtest-CloudSolrServerTest-1395074827907
   [junit4]   2> 396 T15 oasc.ZkTestServer.run STARTING ZK TEST SERVER
   [junit4]   2> 398 T16 oasc.ZkTestServer$ZKServerMain.runFromConfig Starting server
   [junit4]   2> 497 T15 oasc.ZkTestServer.run start zk server on port:36219
   [junit4]   2> 542 T15 oascc.ConnectionManager.waitForConnected Waiting for client to
connect to ZooKeeper
   [junit4]   2> 52839 T19 oazsp.FileTxnLog.commit WARN fsync-ing the write ahead log in
SyncThread:0 took 52280ms which will adversely effect operation latency. See the ZooKeeper
troubleshooting guide
   [junit4]   2> 52852 T17 oazs.NIOServerCnxn.doIO WARN caught end of stream exception
EndOfStreamException: Unable to read additional data from client sessionid 0x144d0f086c10000,
likely client has closed socket
   [junit4]   2> 	at org.apache.zookeeper.server.NIOServerCnxn.doIO(NIOServerCnxn.java:220)
   [junit4]   2> 	at org.apache.zookeeper.server.NIOServerCnxnFactory.run(NIOServerCnxnFactory.java:208)
   [junit4]   2> 	at java.lang.Thread.run(Thread.java:744)
   [junit4]   2> 
   [junit4]   2> 52854 T17 oazs.NIOServerCnxnFactory.run WARN Ignoring unexpected runtime
exception java.nio.channels.CancelledKeyException
   [junit4]   2> 	at sun.nio.ch.SelectionKeyImpl.ensureValid(SelectionKeyImpl.java:73)
   [junit4]   2> 	at sun.nio.ch.SelectionKeyImpl.readyOps(SelectionKeyImpl.java:87)
   [junit4]   2> 	at org.apache.zookeeper.server.NIOServerCnxnFactory.run(NIOServerCnxnFactory.java:187)
   [junit4]   2> 	at java.lang.Thread.run(Thread.java:744)
   [junit4]   2> 
   [junit4]   2> 52855 T17 oazs.NIOServerCnxnFactory.run WARN Ignoring unexpected runtime
exception java.nio.channels.CancelledKeyException
   [junit4]   2> 	at sun.nio.ch.SelectionKeyImpl.ensureValid(SelectionKeyImpl.java:73)
   [junit4]   2> 	at sun.nio.ch.SelectionKeyImpl.readyOps(SelectionKeyImpl.java:87)
   [junit4]   2> 	at org.apache.zookeeper.server.NIOServerCnxnFactory.run(NIOServerCnxnFactory.java:187)
   [junit4]   2> 	at java.lang.Thread.run(Thread.java:744)
   [junit4]   2> 
   [junit4]   2> 52856 T17 oazs.NIOServerCnxnFactory.run WARN Ignoring unexpected runtime
exception java.nio.channels.CancelledKeyException
   [junit4]   2> 	at sun.nio.ch.SelectionKeyImpl.ensureValid(SelectionKeyImpl.java:73)
   [junit4]   2> 	at sun.nio.ch.SelectionKeyImpl.readyOps(SelectionKeyImpl.java:87)
   [junit4]   2> 	at org.apache.zookeeper.server.NIOServerCnxnFactory.run(NIOServerCnxnFactory.java:187)
   [junit4]   2> 	at java.lang.Thread.run(Thread.java:744)
   [junit4]   2> 
   [junit4]   2> 52857 T22 oascc.ConnectionManager.process Watcher org.apache.solr.common.cloud.ConnectionManager@e6a317
name:ZooKeeperConnection Watcher:127.0.0.1:36219 got event WatchedEvent state:SyncConnected
type:None path:null path:null type:None
   [junit4]   2> 52858 T22 oascc.ConnectionManager.process Client->ZooKeeper status
change trigger but we are already closed
   [junit4]   2> 52858 T17 oazs.NIOServerCnxn.doIO WARN caught end of stream exception
EndOfStreamException: Unable to read additional data from client sessionid 0x144d0f086c10004,
likely client has closed socket
   [junit4]   2> 	at org.apache.zookeeper.server.NIOServerCnxn.doIO(NIOServerCnxn.java:220)
   [junit4]   2> 	at org.apache.zookeeper.server.NIOServerCnxnFactory.run(NIOServerCnxnFactory.java:208)
   [junit4]   2> 	at java.lang.Thread.run(Thread.java:744)
   [junit4]   2> 
   [junit4]   2> 52861 T15 oas.SolrTestCaseJ4.tearDown ###Ending testDistribSearch
   [junit4]   2> 52863 T15 oasc.ZkTestServer.send4LetterWord connecting to 127.0.0.1:36219
36219
   [junit4]   1> client port:0.0.0.0/0.0.0.0:0
   [junit4]   2> NOTE: reproduce with: ant test  -Dtestcase=CloudSolrServerTest -Dtests.method=testDistribSearch
-Dtests.seed=9508EFB1D027CB81 -Dtests.multiplier=3 -Dtests.slow=true -Dtests.locale=ru -Dtests.timezone=Africa/Lusaka
-Dtests.file.encoding=ISO-8859-1
   [junit4] ERROR   57.6s J0 | CloudSolrServerTest.testDistribSearch <<<
   [junit4]    > Throwable #1: org.apache.solr.common.SolrException: java.util.concurrent.TimeoutException:
Could not connect to ZooKeeper 127.0.0.1:36219 within 45000 ms
   [junit4]    > 	at __randomizedtesting.SeedInfo.seed([9508EFB1D027CB81:14EE61A9A778ABBD]:0)
   [junit4]    > 	at org.apache.solr.common.cloud.SolrZkClient.<init>(SolrZkClient.java:150)
   [junit4]    > 	at org.apache.solr.common.cloud.SolrZkClient.<init>(SolrZkClient.java:101)
   [junit4]    > 	at org.apache.solr.common.cloud.SolrZkClient.<init>(SolrZkClient.java:91)
   [junit4]    > 	at org.apache.solr.cloud.AbstractZkTestCase.buildZooKeeper(AbstractZkTestCase.java:89)
   [junit4]    > 	at org.apache.solr.cloud.AbstractZkTestCase.buildZooKeeper(AbstractZkTestCase.java:83)
   [junit4]    > 	at org.apache.solr.cloud.AbstractDistribZkTestBase.setUp(AbstractDistribZkTestBase.java:70)
   [junit4]    > 	at org.apache.solr.cloud.AbstractFullDistribZkTestBase.setUp(AbstractFullDistribZkTestBase.java:201)
   [junit4]    > 	at org.apache.solr.client.solrj.impl.CloudSolrServerTest.setUp(CloudSolrServerTest.java:78)
   [junit4]    > 	at java.lang.Thread.run(Thread.java:744)
   [junit4]    > Caused by: java.util.concurrent.TimeoutException: Could not connect to
ZooKeeper 127.0.0.1:36219 within 45000 ms
   [junit4]    > 	at org.apache.solr.common.cloud.ConnectionManager.waitForConnected(ConnectionManager.java:223)
   [junit4]    > 	at org.apache.solr.common.cloud.SolrZkClient.<init>(SolrZkClient.java:142)
   [junit4]    > 	... 45 more
   [junit4]   2> 58018 T15 oas.SolrTestCaseJ4.setUp ###Starting testShutdown
   [junit4]   2> Creating dataDir: /mnt/ssd/jenkins/workspace/Lucene-Solr-4.x-Linux/solr/build/solr-solrj/test/J0/./solrtest-CloudSolrServerTest-1395074885531
   [junit4]   2> 58018 T15 oasc.ZkTestServer.run STARTING ZK TEST SERVER
   [junit4]   2> 58019 T23 oasc.ZkTestServer$ZKServerMain.runFromConfig Starting server
   [junit4]   2> 58119 T15 oasc.ZkTestServer.run start zk server on port:33750
   [junit4]   2> 58121 T15 oascc.ConnectionManager.waitForConnected Waiting for client
to connect to ZooKeeper
   [junit4]   2> 58125 T29 oascc.ConnectionManager.process Watcher org.apache.solr.common.cloud.ConnectionManager@8ce272
name:ZooKeeperConnection Watcher:127.0.0.1:33750 got event WatchedEvent state:SyncConnected
type:None path:null path:null type:None
   [junit4]   2> 58126 T15 oascc.ConnectionManager.waitForConnected Client is connected
to ZooKeeper
   [junit4]   2> 58128 T15 oascc.SolrZkClient.makePath makePath: /solr
   [junit4]   2> 58148 T15 oascc.ConnectionManager.waitForConnected Waiting for client
to connect to ZooKeeper
   [junit4]   2> 58150 T31 oascc.ConnectionManager.process Watcher org.apache.solr.common.cloud.ConnectionManager@4e1c6f
name:ZooKeeperConnection Watcher:127.0.0.1:33750/solr got event WatchedEvent state:SyncConnected
type:None path:null path:null type:None
   [junit4]   2> 58150 T15 oascc.ConnectionManager.waitForConnected Client is connected
to ZooKeeper
   [junit4]   2> 58156 T15 oascc.SolrZkClient.makePath makePath: /collections/collection1
   [junit4]   2> 58162 T15 oascc.SolrZkClient.makePath makePath: /collections/collection1/shards
   [junit4]   2> 58168 T15 oascc.SolrZkClient.makePath makePath: /collections/control_collection
   [junit4]   2> 58171 T15 oascc.SolrZkClient.makePath makePath: /collections/control_collection/shards
   [junit4]   2> 58174 T15 oasc.AbstractZkTestCase.putConfig put /mnt/ssd/jenkins/workspace/Lucene-Solr-4.x-Linux/solr/solrj/src/test-files/solrj/solr/collection1/conf/solrconfig.xml
to /configs/conf1/solrconfig.xml
   [junit4]   2> 58186 T15 oascc.SolrZkClient.makePath makePath: /configs/conf1/solrconfig.xml
   [junit4]   2> 58192 T15 oasc.AbstractZkTestCase.putConfig put /mnt/ssd/jenkins/workspace/Lucene-Solr-4.x-Linux/solr/solrj/src/test-files/solrj/solr/collection1/conf/schema.xml
to /configs/conf1/schema.xml
   [junit4]   2> 58193 T15 oascc.SolrZkClient.makePath makePath: /configs/conf1/schema.xml
   [junit4]   2> 58198 T15 oasc.AbstractZkTestCase.putConfig skipping /mnt/ssd/jenkins/workspace/Lucene-Solr-4.x-Linux/solr/solrj/src/test-files/solrj/solr/collection1/conf/solrconfig.snippet.randomindexconfig.xml
because it doesn't exist
   [junit4]   2> 58198 T15 oasc.AbstractZkTestCase.putConfig skipping /mnt/ssd/jenkins/workspace/Lucene-Solr-4.x-Linux/solr/solrj/src/test-files/solrj/solr/collection1/conf/stopwords.txt
because it doesn't exist
   [junit4]   2> 58199 T15 oasc.AbstractZkTestCase.putConfig skipping /mnt/ssd/jenkins/workspace/Lucene-Solr-4.x-Linux/solr/solrj/src/test-files/solrj/solr/collection1/conf/protwords.txt
because it doesn't exist
   [junit4]   2> 58199 T15 oasc.AbstractZkTestCase.putConfig skipping /mnt/ssd/jenkins/workspace/Lucene-Solr-4.x-Linux/solr/solrj/src/test-files/solrj/solr/collection1/conf/currency.xml
because it doesn't exist
   [junit4]   2> 58200 T15 oasc.AbstractZkTestCase.putConfig skipping /mnt/ssd/jenkins/workspace/Lucene-Solr-4.x-Linux/solr/solrj/src/test-files/solrj/solr/collection1/conf/enumsConfig.xml
because it doesn't exist
   [junit4]   2> 58201 T15 oasc.AbstractZkTestCase.putConfig skipping /mnt/ssd/jenkins/workspace/Lucene-Solr-4.x-Linux/solr/solrj/src/test-files/solrj/solr/collection1/conf/open-exchange-rates.json
because it doesn't exist
   [junit4]   2> 58201 T15 oasc.AbstractZkTestCase.putConfig skipping /mnt/ssd/jenkins/workspace/Lucene-Solr-4.x-Linux/solr/solrj/src/test-files/solrj/solr/collection1/conf/mapping-ISOLatin1Accent.txt
because it doesn't exist
   [junit4]   2> 58202 T15 oasc.AbstractZkTestCase.putConfig skipping /mnt/ssd/jenkins/workspace/Lucene-Solr-4.x-Linux/solr/solrj/src/test-files/solrj/solr/collection1/conf/old_synonyms.txt
because it doesn't exist
   [junit4]   2> 58202 T15 oasc.AbstractZkTestCase.putConfig skipping /mnt/ssd/jenkins/workspace/Lucene-Solr-4.x-Linux/solr/solrj/src/test-files/solrj/solr/collection1/conf/synonyms.txt
because it doesn't exist
   [junit4]   2> 58211 T15 oascc.ConnectionManager.waitForConnected Waiting for client
to connect to ZooKeeper
   [junit4]   2> 58213 T33 oascc.ConnectionManager.process Watcher org.apache.solr.common.cloud.ConnectionManager@16c349e
name:ZooKeeperConnection Watcher:127.0.0.1:33750/solr got event WatchedEvent state:SyncConnected
type:None path:null path:null type:None
   [junit4]   2> 58214 T15 oascc.ConnectionManager.waitForConnected Client is connected
to ZooKeeper
   [junit4]   2> 58419 T15 oascc.ConnectionManager.waitForConnected Waiting for client
to connect to ZooKeeper
   [junit4]   2> 58421 T34 oaz.ClientCnxnSocketNIO.connect ERROR Unable to open socket
to ff01:0:0:0:0:0:0:114/ff01:0:0:0:0:0:0:114:33332
   [junit4]   2> 58421 T34 oaz.ClientCnxn$SendThread.run WARN Session 0x0 for server null,
unexpected error, closing socket connection and attempting reconnect java.net.SocketException:
Network is unreachable
   [junit4]   2> 	at sun.nio.ch.Net.connect0(Native Method)
   [junit4]   2> 	at sun.nio.ch.Net.connect(Net.java:465)
   [junit4]   2> 	at sun.nio.ch.Net.connect(Net.java:457)
   [junit4]   2> 	at sun.nio.ch.SocketChannelImpl.connect(SocketChannelImpl.java:670)
   [junit4]   2> 	at org.apache.zookeeper.ClientCnxnSocketNIO.registerAndConnect(ClientCnxnSocketNIO.java:266)
   [junit4]   2> 	at org.apache.zookeeper.ClientCnxnSocketNIO.connect(ClientCnxnSocketNIO.java:276)
   [junit4]   2> 	at org.apache.zookeeper.ClientCnxn$SendThread.startConnect(ClientCnxn.java:958)
   [junit4]   2> 	at org.apache.zookeeper.ClientCnxn$SendThread.run(ClientCnxn.java:993)
   [junit4]   2> 
   [junit4]   2> 59523 T34 oaz.ClientCnxnSocketNIO.connect ERROR Unable to open socket
to ff01:0:0:0:0:0:0:114/ff01:0:0:0:0:0:0:114:33332
   [junit4]   2> 59632 T15 oas.SolrTestCaseJ4.tearDown ###Ending testShutdown
   [junit4]   2> 59633 T15 oasc.ZkTestServer.send4LetterWord connecting to 127.0.0.1:33750
33750
   [junit4]   1> client port:0.0.0.0/0.0.0.0:0
   [junit4]   2> 59871 T15 oas.SolrTestCaseJ4.deleteCore ###deleteCore
   [junit4]   2> 59711 T14 ccr.ThreadLeakControl.checkThreadLeaks WARNING Will linger awaiting
termination of 1 leaked thread(s).
   [junit4]   2> NOTE: test params are: codec=Lucene46: {}, docValues:{}, sim=RandomSimilarityProvider(queryNorm=true,coord=yes):
{}, locale=ru, timezone=Africa/Lusaka
   [junit4]   2> NOTE: Linux 3.8.0-36-generic i386/Oracle Corporation 1.7.0_60-ea (32-bit)/cpus=8,threads=1,free=7595032,total=20488192
   [junit4]   2> NOTE: All tests run in this JVM: [TestXMLEscaping, ModifiableSolrParamsTest,
DocumentAnalysisResponseTest, CloudSolrServerTest]
   [junit4] Completed on J0 in 60.69s, 2 tests, 1 error <<< FAILURES!

[...truncated 131 lines...]
BUILD FAILED
/mnt/ssd/jenkins/workspace/Lucene-Solr-4.x-Linux/build.xml:467: The following error occurred
while executing this line:
/mnt/ssd/jenkins/workspace/Lucene-Solr-4.x-Linux/build.xml:447: The following error occurred
while executing this line:
/mnt/ssd/jenkins/workspace/Lucene-Solr-4.x-Linux/build.xml:45: The following error occurred
while executing this line:
/mnt/ssd/jenkins/workspace/Lucene-Solr-4.x-Linux/extra-targets.xml:37: The following error
occurred while executing this line:
/mnt/ssd/jenkins/workspace/Lucene-Solr-4.x-Linux/solr/build.xml:202: The following error occurred
while executing this line:
/mnt/ssd/jenkins/workspace/Lucene-Solr-4.x-Linux/solr/common-build.xml:490: The following
error occurred while executing this line:
/mnt/ssd/jenkins/workspace/Lucene-Solr-4.x-Linux/lucene/common-build.xml:1276: The following
error occurred while executing this line:
/mnt/ssd/jenkins/workspace/Lucene-Solr-4.x-Linux/lucene/common-build.xml:908: There were test
failures: 49 suites, 283 tests, 1 error

Total time: 55 minutes 13 seconds
Build step 'Invoke Ant' marked build as failure
Description set: Java: 32bit/jdk1.7.0_60-ea-b07 -client -XX:+UseSerialGC
Archiving artifacts
Recording test results
Email was triggered for: Failure
Sending email for trigger: Failure



Mime
View raw message