lucene-dev mailing list archives

Site index · List index
Message view « Date » · « Thread »
Top « Date » · « Thread »
From Policeman Jenkins Server <jenk...@thetaphi.de>
Subject [JENKINS] Lucene-Solr-trunk-Windows (32bit/jdk1.7.0_51) - Build # 3896 - Failure!
Date Wed, 26 Mar 2014 12:08:40 GMT
Build: http://jenkins.thetaphi.de/job/Lucene-Solr-trunk-Windows/3896/
Java: 32bit/jdk1.7.0_51 -server -XX:+UseConcMarkSweepGC

8 tests failed.
REGRESSION:  org.apache.solr.cloud.DeleteReplicaTest.testDistribSearch

Error Message:
java.util.concurrent.TimeoutException: Could not connect to ZooKeeper 127.0.0.1:51701 within 45000 ms

Stack Trace:
org.apache.solr.common.SolrException: java.util.concurrent.TimeoutException: Could not connect to ZooKeeper 127.0.0.1:51701 within 45000 ms
	at org.apache.solr.common.cloud.SolrZkClient.<init>(SolrZkClient.java:150)
	at org.apache.solr.common.cloud.SolrZkClient.<init>(SolrZkClient.java:101)
	at org.apache.solr.common.cloud.SolrZkClient.<init>(SolrZkClient.java:91)
	at org.apache.solr.cloud.AbstractZkTestCase.buildZooKeeper(AbstractZkTestCase.java:91)
	at org.apache.solr.cloud.AbstractZkTestCase.buildZooKeeper(AbstractZkTestCase.java:85)
	at org.apache.solr.cloud.AbstractDistribZkTestBase.setUp(AbstractDistribZkTestBase.java:77)
	at org.apache.solr.cloud.AbstractFullDistribZkTestBase.setUp(AbstractFullDistribZkTestBase.java:201)
	at org.apache.solr.cloud.DeleteReplicaTest.setUp(DeleteReplicaTest.java:55)
	at sun.reflect.NativeMethodAccessorImpl.invoke0(Native Method)
	at sun.reflect.NativeMethodAccessorImpl.invoke(NativeMethodAccessorImpl.java:57)
	at sun.reflect.DelegatingMethodAccessorImpl.invoke(DelegatingMethodAccessorImpl.java:43)
	at java.lang.reflect.Method.invoke(Method.java:606)
	at com.carrotsearch.randomizedtesting.RandomizedRunner.invoke(RandomizedRunner.java:1617)
	at com.carrotsearch.randomizedtesting.RandomizedRunner$7.evaluate(RandomizedRunner.java:860)
	at com.carrotsearch.randomizedtesting.RandomizedRunner$8.evaluate(RandomizedRunner.java:876)
	at com.carrotsearch.randomizedtesting.rules.SystemPropertiesRestoreRule$1.evaluate(SystemPropertiesRestoreRule.java:53)
	at org.apache.lucene.util.TestRuleSetupTeardownChained$1.evaluate(TestRuleSetupTeardownChained.java:50)
	at org.apache.lucene.util.TestRuleFieldCacheSanity$1.evaluate(TestRuleFieldCacheSanity.java:51)
	at org.apache.lucene.util.AbstractBeforeAfterRule$1.evaluate(AbstractBeforeAfterRule.java:46)
	at com.carrotsearch.randomizedtesting.rules.SystemPropertiesInvariantRule$1.evaluate(SystemPropertiesInvariantRule.java:55)
	at org.apache.lucene.util.TestRuleThreadAndTestName$1.evaluate(TestRuleThreadAndTestName.java:49)
	at org.apache.lucene.util.TestRuleIgnoreAfterMaxFailures$1.evaluate(TestRuleIgnoreAfterMaxFailures.java:70)
	at org.apache.lucene.util.TestRuleMarkFailure$1.evaluate(TestRuleMarkFailure.java:48)
	at com.carrotsearch.randomizedtesting.rules.StatementAdapter.evaluate(StatementAdapter.java:36)
	at com.carrotsearch.randomizedtesting.ThreadLeakControl$StatementRunner.run(ThreadLeakControl.java:359)
	at com.carrotsearch.randomizedtesting.ThreadLeakControl.forkTimeoutingTask(ThreadLeakControl.java:783)
	at com.carrotsearch.randomizedtesting.ThreadLeakControl$3.evaluate(ThreadLeakControl.java:443)
	at com.carrotsearch.randomizedtesting.RandomizedRunner.runSingleTest(RandomizedRunner.java:835)
	at com.carrotsearch.randomizedtesting.RandomizedRunner$3.evaluate(RandomizedRunner.java:737)
	at com.carrotsearch.randomizedtesting.RandomizedRunner$4.evaluate(RandomizedRunner.java:771)
	at com.carrotsearch.randomizedtesting.RandomizedRunner$5.evaluate(RandomizedRunner.java:782)
	at com.carrotsearch.randomizedtesting.rules.StatementAdapter.evaluate(StatementAdapter.java:36)
	at com.carrotsearch.randomizedtesting.rules.SystemPropertiesRestoreRule$1.evaluate(SystemPropertiesRestoreRule.java:53)
	at org.apache.lucene.util.AbstractBeforeAfterRule$1.evaluate(AbstractBeforeAfterRule.java:46)
	at org.apache.lucene.util.TestRuleStoreClassName$1.evaluate(TestRuleStoreClassName.java:42)
	at com.carrotsearch.randomizedtesting.rules.SystemPropertiesInvariantRule$1.evaluate(SystemPropertiesInvariantRule.java:55)
	at com.carrotsearch.randomizedtesting.rules.NoShadowingOrOverridesOnMethodsRule$1.evaluate(NoShadowingOrOverridesOnMethodsRule.java:39)
	at com.carrotsearch.randomizedtesting.rules.NoShadowingOrOverridesOnMethodsRule$1.evaluate(NoShadowingOrOverridesOnMethodsRule.java:39)
	at com.carrotsearch.randomizedtesting.rules.StatementAdapter.evaluate(StatementAdapter.java:36)
	at org.apache.lucene.util.TestRuleAssertionsRequired$1.evaluate(TestRuleAssertionsRequired.java:43)
	at org.apache.lucene.util.TestRuleMarkFailure$1.evaluate(TestRuleMarkFailure.java:48)
	at org.apache.lucene.util.TestRuleIgnoreAfterMaxFailures$1.evaluate(TestRuleIgnoreAfterMaxFailures.java:70)
	at org.apache.lucene.util.TestRuleIgnoreTestSuites$1.evaluate(TestRuleIgnoreTestSuites.java:55)
	at com.carrotsearch.randomizedtesting.rules.StatementAdapter.evaluate(StatementAdapter.java:36)
	at com.carrotsearch.randomizedtesting.ThreadLeakControl$StatementRunner.run(ThreadLeakControl.java:359)
	at java.lang.Thread.run(Thread.java:744)
Caused by: java.util.concurrent.TimeoutException: Could not connect to ZooKeeper 127.0.0.1:51701 within 45000 ms
	at org.apache.solr.common.cloud.ConnectionManager.waitForConnected(ConnectionManager.java:223)
	at org.apache.solr.common.cloud.SolrZkClient.<init>(SolrZkClient.java:142)
	... 45 more


REGRESSION:  org.apache.solr.cloud.OverseerStatusTest.testDistribSearch

Error Message:
java.util.concurrent.TimeoutException: Could not connect to ZooKeeper 127.0.0.1:51710 within 45000 ms

Stack Trace:
org.apache.solr.common.SolrException: java.util.concurrent.TimeoutException: Could not connect to ZooKeeper 127.0.0.1:51710 within 45000 ms
	at org.apache.solr.common.cloud.SolrZkClient.<init>(SolrZkClient.java:150)
	at org.apache.solr.common.cloud.SolrZkClient.<init>(SolrZkClient.java:101)
	at org.apache.solr.common.cloud.SolrZkClient.<init>(SolrZkClient.java:91)
	at org.apache.solr.cloud.AbstractZkTestCase.buildZooKeeper(AbstractZkTestCase.java:91)
	at org.apache.solr.cloud.AbstractZkTestCase.buildZooKeeper(AbstractZkTestCase.java:85)
	at org.apache.solr.cloud.AbstractDistribZkTestBase.setUp(AbstractDistribZkTestBase.java:77)
	at org.apache.solr.cloud.AbstractFullDistribZkTestBase.setUp(AbstractFullDistribZkTestBase.java:201)
	at org.apache.solr.cloud.BasicDistributedZkTest.setUp(BasicDistributedZkTest.java:124)
	at org.apache.solr.cloud.OverseerStatusTest.setUp(OverseerStatusTest.java:44)
	at sun.reflect.NativeMethodAccessorImpl.invoke0(Native Method)
	at sun.reflect.NativeMethodAccessorImpl.invoke(NativeMethodAccessorImpl.java:57)
	at sun.reflect.DelegatingMethodAccessorImpl.invoke(DelegatingMethodAccessorImpl.java:43)
	at java.lang.reflect.Method.invoke(Method.java:606)
	at com.carrotsearch.randomizedtesting.RandomizedRunner.invoke(RandomizedRunner.java:1617)
	at com.carrotsearch.randomizedtesting.RandomizedRunner$7.evaluate(RandomizedRunner.java:860)
	at com.carrotsearch.randomizedtesting.RandomizedRunner$8.evaluate(RandomizedRunner.java:876)
	at com.carrotsearch.randomizedtesting.rules.SystemPropertiesRestoreRule$1.evaluate(SystemPropertiesRestoreRule.java:53)
	at org.apache.lucene.util.TestRuleSetupTeardownChained$1.evaluate(TestRuleSetupTeardownChained.java:50)
	at org.apache.lucene.util.TestRuleFieldCacheSanity$1.evaluate(TestRuleFieldCacheSanity.java:51)
	at org.apache.lucene.util.AbstractBeforeAfterRule$1.evaluate(AbstractBeforeAfterRule.java:46)
	at com.carrotsearch.randomizedtesting.rules.SystemPropertiesInvariantRule$1.evaluate(SystemPropertiesInvariantRule.java:55)
	at org.apache.lucene.util.TestRuleThreadAndTestName$1.evaluate(TestRuleThreadAndTestName.java:49)
	at org.apache.lucene.util.TestRuleIgnoreAfterMaxFailures$1.evaluate(TestRuleIgnoreAfterMaxFailures.java:70)
	at org.apache.lucene.util.TestRuleMarkFailure$1.evaluate(TestRuleMarkFailure.java:48)
	at com.carrotsearch.randomizedtesting.rules.StatementAdapter.evaluate(StatementAdapter.java:36)
	at com.carrotsearch.randomizedtesting.ThreadLeakControl$StatementRunner.run(ThreadLeakControl.java:359)
	at com.carrotsearch.randomizedtesting.ThreadLeakControl.forkTimeoutingTask(ThreadLeakControl.java:783)
	at com.carrotsearch.randomizedtesting.ThreadLeakControl$3.evaluate(ThreadLeakControl.java:443)
	at com.carrotsearch.randomizedtesting.RandomizedRunner.runSingleTest(RandomizedRunner.java:835)
	at com.carrotsearch.randomizedtesting.RandomizedRunner$3.evaluate(RandomizedRunner.java:737)
	at com.carrotsearch.randomizedtesting.RandomizedRunner$4.evaluate(RandomizedRunner.java:771)
	at com.carrotsearch.randomizedtesting.RandomizedRunner$5.evaluate(RandomizedRunner.java:782)
	at com.carrotsearch.randomizedtesting.rules.StatementAdapter.evaluate(StatementAdapter.java:36)
	at com.carrotsearch.randomizedtesting.rules.SystemPropertiesRestoreRule$1.evaluate(SystemPropertiesRestoreRule.java:53)
	at org.apache.lucene.util.AbstractBeforeAfterRule$1.evaluate(AbstractBeforeAfterRule.java:46)
	at org.apache.lucene.util.TestRuleStoreClassName$1.evaluate(TestRuleStoreClassName.java:42)
	at com.carrotsearch.randomizedtesting.rules.SystemPropertiesInvariantRule$1.evaluate(SystemPropertiesInvariantRule.java:55)
	at com.carrotsearch.randomizedtesting.rules.NoShadowingOrOverridesOnMethodsRule$1.evaluate(NoShadowingOrOverridesOnMethodsRule.java:39)
	at com.carrotsearch.randomizedtesting.rules.NoShadowingOrOverridesOnMethodsRule$1.evaluate(NoShadowingOrOverridesOnMethodsRule.java:39)
	at com.carrotsearch.randomizedtesting.rules.StatementAdapter.evaluate(StatementAdapter.java:36)
	at org.apache.lucene.util.TestRuleAssertionsRequired$1.evaluate(TestRuleAssertionsRequired.java:43)
	at org.apache.lucene.util.TestRuleMarkFailure$1.evaluate(TestRuleMarkFailure.java:48)
	at org.apache.lucene.util.TestRuleIgnoreAfterMaxFailures$1.evaluate(TestRuleIgnoreAfterMaxFailures.java:70)
	at org.apache.lucene.util.TestRuleIgnoreTestSuites$1.evaluate(TestRuleIgnoreTestSuites.java:55)
	at com.carrotsearch.randomizedtesting.rules.StatementAdapter.evaluate(StatementAdapter.java:36)
	at com.carrotsearch.randomizedtesting.ThreadLeakControl$StatementRunner.run(ThreadLeakControl.java:359)
	at java.lang.Thread.run(Thread.java:744)
Caused by: java.util.concurrent.TimeoutException: Could not connect to ZooKeeper 127.0.0.1:51710 within 45000 ms
	at org.apache.solr.common.cloud.ConnectionManager.waitForConnected(ConnectionManager.java:223)
	at org.apache.solr.common.cloud.SolrZkClient.<init>(SolrZkClient.java:142)
	... 46 more


REGRESSION:  org.apache.solr.cloud.RemoteQueryErrorTest.testDistribSearch

Error Message:
java.util.concurrent.TimeoutException: Could not connect to ZooKeeper 127.0.0.1:51720 within 45000 ms

Stack Trace:
org.apache.solr.common.SolrException: java.util.concurrent.TimeoutException: Could not connect to ZooKeeper 127.0.0.1:51720 within 45000 ms
	at org.apache.solr.common.cloud.SolrZkClient.<init>(SolrZkClient.java:150)
	at org.apache.solr.common.cloud.SolrZkClient.<init>(SolrZkClient.java:101)
	at org.apache.solr.common.cloud.SolrZkClient.<init>(SolrZkClient.java:91)
	at org.apache.solr.cloud.AbstractZkTestCase.buildZooKeeper(AbstractZkTestCase.java:91)
	at org.apache.solr.cloud.AbstractZkTestCase.buildZooKeeper(AbstractZkTestCase.java:85)
	at org.apache.solr.cloud.AbstractDistribZkTestBase.setUp(AbstractDistribZkTestBase.java:77)
	at org.apache.solr.cloud.AbstractFullDistribZkTestBase.setUp(AbstractFullDistribZkTestBase.java:201)
	at sun.reflect.NativeMethodAccessorImpl.invoke0(Native Method)
	at sun.reflect.NativeMethodAccessorImpl.invoke(NativeMethodAccessorImpl.java:57)
	at sun.reflect.DelegatingMethodAccessorImpl.invoke(DelegatingMethodAccessorImpl.java:43)
	at java.lang.reflect.Method.invoke(Method.java:606)
	at com.carrotsearch.randomizedtesting.RandomizedRunner.invoke(RandomizedRunner.java:1617)
	at com.carrotsearch.randomizedtesting.RandomizedRunner$7.evaluate(RandomizedRunner.java:860)
	at com.carrotsearch.randomizedtesting.RandomizedRunner$8.evaluate(RandomizedRunner.java:876)
	at com.carrotsearch.randomizedtesting.rules.SystemPropertiesRestoreRule$1.evaluate(SystemPropertiesRestoreRule.java:53)
	at org.apache.lucene.util.TestRuleSetupTeardownChained$1.evaluate(TestRuleSetupTeardownChained.java:50)
	at org.apache.lucene.util.TestRuleFieldCacheSanity$1.evaluate(TestRuleFieldCacheSanity.java:51)
	at org.apache.lucene.util.AbstractBeforeAfterRule$1.evaluate(AbstractBeforeAfterRule.java:46)
	at com.carrotsearch.randomizedtesting.rules.SystemPropertiesInvariantRule$1.evaluate(SystemPropertiesInvariantRule.java:55)
	at org.apache.lucene.util.TestRuleThreadAndTestName$1.evaluate(TestRuleThreadAndTestName.java:49)
	at org.apache.lucene.util.TestRuleIgnoreAfterMaxFailures$1.evaluate(TestRuleIgnoreAfterMaxFailures.java:70)
	at org.apache.lucene.util.TestRuleMarkFailure$1.evaluate(TestRuleMarkFailure.java:48)
	at com.carrotsearch.randomizedtesting.rules.StatementAdapter.evaluate(StatementAdapter.java:36)
	at com.carrotsearch.randomizedtesting.ThreadLeakControl$StatementRunner.run(ThreadLeakControl.java:359)
	at com.carrotsearch.randomizedtesting.ThreadLeakControl.forkTimeoutingTask(ThreadLeakControl.java:783)
	at com.carrotsearch.randomizedtesting.ThreadLeakControl$3.evaluate(ThreadLeakControl.java:443)
	at com.carrotsearch.randomizedtesting.RandomizedRunner.runSingleTest(RandomizedRunner.java:835)
	at com.carrotsearch.randomizedtesting.RandomizedRunner$3.evaluate(RandomizedRunner.java:737)
	at com.carrotsearch.randomizedtesting.RandomizedRunner$4.evaluate(RandomizedRunner.java:771)
	at com.carrotsearch.randomizedtesting.RandomizedRunner$5.evaluate(RandomizedRunner.java:782)
	at com.carrotsearch.randomizedtesting.rules.StatementAdapter.evaluate(StatementAdapter.java:36)
	at com.carrotsearch.randomizedtesting.rules.SystemPropertiesRestoreRule$1.evaluate(SystemPropertiesRestoreRule.java:53)
	at org.apache.lucene.util.AbstractBeforeAfterRule$1.evaluate(AbstractBeforeAfterRule.java:46)
	at org.apache.lucene.util.TestRuleStoreClassName$1.evaluate(TestRuleStoreClassName.java:42)
	at com.carrotsearch.randomizedtesting.rules.SystemPropertiesInvariantRule$1.evaluate(SystemPropertiesInvariantRule.java:55)
	at com.carrotsearch.randomizedtesting.rules.NoShadowingOrOverridesOnMethodsRule$1.evaluate(NoShadowingOrOverridesOnMethodsRule.java:39)
	at com.carrotsearch.randomizedtesting.rules.NoShadowingOrOverridesOnMethodsRule$1.evaluate(NoShadowingOrOverridesOnMethodsRule.java:39)
	at com.carrotsearch.randomizedtesting.rules.StatementAdapter.evaluate(StatementAdapter.java:36)
	at org.apache.lucene.util.TestRuleAssertionsRequired$1.evaluate(TestRuleAssertionsRequired.java:43)
	at org.apache.lucene.util.TestRuleMarkFailure$1.evaluate(TestRuleMarkFailure.java:48)
	at org.apache.lucene.util.TestRuleIgnoreAfterMaxFailures$1.evaluate(TestRuleIgnoreAfterMaxFailures.java:70)
	at org.apache.lucene.util.TestRuleIgnoreTestSuites$1.evaluate(TestRuleIgnoreTestSuites.java:55)
	at com.carrotsearch.randomizedtesting.rules.StatementAdapter.evaluate(StatementAdapter.java:36)
	at com.carrotsearch.randomizedtesting.ThreadLeakControl$StatementRunner.run(ThreadLeakControl.java:359)
	at java.lang.Thread.run(Thread.java:744)
Caused by: java.util.concurrent.TimeoutException: Could not connect to ZooKeeper 127.0.0.1:51720 within 45000 ms
	at org.apache.solr.common.cloud.ConnectionManager.waitForConnected(ConnectionManager.java:223)
	at org.apache.solr.common.cloud.SolrZkClient.<init>(SolrZkClient.java:142)
	... 44 more


REGRESSION:  org.apache.solr.cloud.TestModifyConfFiles.testDistribSearch

Error Message:
java.util.concurrent.TimeoutException: Could not connect to ZooKeeper 127.0.0.1:51729 within 45000 ms

Stack Trace:
org.apache.solr.common.SolrException: java.util.concurrent.TimeoutException: Could not connect to ZooKeeper 127.0.0.1:51729 within 45000 ms
	at org.apache.solr.common.cloud.SolrZkClient.<init>(SolrZkClient.java:150)
	at org.apache.solr.common.cloud.SolrZkClient.<init>(SolrZkClient.java:101)
	at org.apache.solr.common.cloud.SolrZkClient.<init>(SolrZkClient.java:91)
	at org.apache.solr.cloud.AbstractZkTestCase.buildZooKeeper(AbstractZkTestCase.java:91)
	at org.apache.solr.cloud.AbstractZkTestCase.buildZooKeeper(AbstractZkTestCase.java:85)
	at org.apache.solr.cloud.AbstractDistribZkTestBase.setUp(AbstractDistribZkTestBase.java:77)
	at org.apache.solr.cloud.AbstractFullDistribZkTestBase.setUp(AbstractFullDistribZkTestBase.java:201)
	at sun.reflect.NativeMethodAccessorImpl.invoke0(Native Method)
	at sun.reflect.NativeMethodAccessorImpl.invoke(NativeMethodAccessorImpl.java:57)
	at sun.reflect.DelegatingMethodAccessorImpl.invoke(DelegatingMethodAccessorImpl.java:43)
	at java.lang.reflect.Method.invoke(Method.java:606)
	at com.carrotsearch.randomizedtesting.RandomizedRunner.invoke(RandomizedRunner.java:1617)
	at com.carrotsearch.randomizedtesting.RandomizedRunner$7.evaluate(RandomizedRunner.java:860)
	at com.carrotsearch.randomizedtesting.RandomizedRunner$8.evaluate(RandomizedRunner.java:876)
	at com.carrotsearch.randomizedtesting.rules.SystemPropertiesRestoreRule$1.evaluate(SystemPropertiesRestoreRule.java:53)
	at org.apache.lucene.util.TestRuleSetupTeardownChained$1.evaluate(TestRuleSetupTeardownChained.java:50)
	at org.apache.lucene.util.TestRuleFieldCacheSanity$1.evaluate(TestRuleFieldCacheSanity.java:51)
	at org.apache.lucene.util.AbstractBeforeAfterRule$1.evaluate(AbstractBeforeAfterRule.java:46)
	at com.carrotsearch.randomizedtesting.rules.SystemPropertiesInvariantRule$1.evaluate(SystemPropertiesInvariantRule.java:55)
	at org.apache.lucene.util.TestRuleThreadAndTestName$1.evaluate(TestRuleThreadAndTestName.java:49)
	at org.apache.lucene.util.TestRuleIgnoreAfterMaxFailures$1.evaluate(TestRuleIgnoreAfterMaxFailures.java:70)
	at org.apache.lucene.util.TestRuleMarkFailure$1.evaluate(TestRuleMarkFailure.java:48)
	at com.carrotsearch.randomizedtesting.rules.StatementAdapter.evaluate(StatementAdapter.java:36)
	at com.carrotsearch.randomizedtesting.ThreadLeakControl$StatementRunner.run(ThreadLeakControl.java:359)
	at com.carrotsearch.randomizedtesting.ThreadLeakControl.forkTimeoutingTask(ThreadLeakControl.java:783)
	at com.carrotsearch.randomizedtesting.ThreadLeakControl$3.evaluate(ThreadLeakControl.java:443)
	at com.carrotsearch.randomizedtesting.RandomizedRunner.runSingleTest(RandomizedRunner.java:835)
	at com.carrotsearch.randomizedtesting.RandomizedRunner$3.evaluate(RandomizedRunner.java:737)
	at com.carrotsearch.randomizedtesting.RandomizedRunner$4.evaluate(RandomizedRunner.java:771)
	at com.carrotsearch.randomizedtesting.RandomizedRunner$5.evaluate(RandomizedRunner.java:782)
	at com.carrotsearch.randomizedtesting.rules.StatementAdapter.evaluate(StatementAdapter.java:36)
	at com.carrotsearch.randomizedtesting.rules.SystemPropertiesRestoreRule$1.evaluate(SystemPropertiesRestoreRule.java:53)
	at org.apache.lucene.util.AbstractBeforeAfterRule$1.evaluate(AbstractBeforeAfterRule.java:46)
	at org.apache.lucene.util.TestRuleStoreClassName$1.evaluate(TestRuleStoreClassName.java:42)
	at com.carrotsearch.randomizedtesting.rules.SystemPropertiesInvariantRule$1.evaluate(SystemPropertiesInvariantRule.java:55)
	at com.carrotsearch.randomizedtesting.rules.NoShadowingOrOverridesOnMethodsRule$1.evaluate(NoShadowingOrOverridesOnMethodsRule.java:39)
	at com.carrotsearch.randomizedtesting.rules.NoShadowingOrOverridesOnMethodsRule$1.evaluate(NoShadowingOrOverridesOnMethodsRule.java:39)
	at com.carrotsearch.randomizedtesting.rules.StatementAdapter.evaluate(StatementAdapter.java:36)
	at org.apache.lucene.util.TestRuleAssertionsRequired$1.evaluate(TestRuleAssertionsRequired.java:43)
	at org.apache.lucene.util.TestRuleMarkFailure$1.evaluate(TestRuleMarkFailure.java:48)
	at org.apache.lucene.util.TestRuleIgnoreAfterMaxFailures$1.evaluate(TestRuleIgnoreAfterMaxFailures.java:70)
	at org.apache.lucene.util.TestRuleIgnoreTestSuites$1.evaluate(TestRuleIgnoreTestSuites.java:55)
	at com.carrotsearch.randomizedtesting.rules.StatementAdapter.evaluate(StatementAdapter.java:36)
	at com.carrotsearch.randomizedtesting.ThreadLeakControl$StatementRunner.run(ThreadLeakControl.java:359)
	at java.lang.Thread.run(Thread.java:744)
Caused by: java.util.concurrent.TimeoutException: Could not connect to ZooKeeper 127.0.0.1:51729 within 45000 ms
	at org.apache.solr.common.cloud.ConnectionManager.waitForConnected(ConnectionManager.java:223)
	at org.apache.solr.common.cloud.SolrZkClient.<init>(SolrZkClient.java:142)
	... 44 more


REGRESSION:  org.apache.solr.cloud.TestRequestStatusCollectionAPI.testDistribSearch

Error Message:
java.util.concurrent.TimeoutException: Could not connect to ZooKeeper 127.0.0.1:51738 within 45000 ms

Stack Trace:
org.apache.solr.common.SolrException: java.util.concurrent.TimeoutException: Could not connect to ZooKeeper 127.0.0.1:51738 within 45000 ms
	at org.apache.solr.common.cloud.SolrZkClient.<init>(SolrZkClient.java:150)
	at org.apache.solr.common.cloud.SolrZkClient.<init>(SolrZkClient.java:101)
	at org.apache.solr.common.cloud.SolrZkClient.<init>(SolrZkClient.java:91)
	at org.apache.solr.cloud.AbstractZkTestCase.buildZooKeeper(AbstractZkTestCase.java:91)
	at org.apache.solr.cloud.AbstractZkTestCase.buildZooKeeper(AbstractZkTestCase.java:85)
	at org.apache.solr.cloud.AbstractDistribZkTestBase.setUp(AbstractDistribZkTestBase.java:77)
	at org.apache.solr.cloud.AbstractFullDistribZkTestBase.setUp(AbstractFullDistribZkTestBase.java:201)
	at org.apache.solr.cloud.BasicDistributedZkTest.setUp(BasicDistributedZkTest.java:124)
	at org.apache.solr.cloud.TestRequestStatusCollectionAPI.setUp(TestRequestStatusCollectionAPI.java:40)
	at sun.reflect.NativeMethodAccessorImpl.invoke0(Native Method)
	at sun.reflect.NativeMethodAccessorImpl.invoke(NativeMethodAccessorImpl.java:57)
	at sun.reflect.DelegatingMethodAccessorImpl.invoke(DelegatingMethodAccessorImpl.java:43)
	at java.lang.reflect.Method.invoke(Method.java:606)
	at com.carrotsearch.randomizedtesting.RandomizedRunner.invoke(RandomizedRunner.java:1617)
	at com.carrotsearch.randomizedtesting.RandomizedRunner$7.evaluate(RandomizedRunner.java:860)
	at com.carrotsearch.randomizedtesting.RandomizedRunner$8.evaluate(RandomizedRunner.java:876)
	at com.carrotsearch.randomizedtesting.rules.SystemPropertiesRestoreRule$1.evaluate(SystemPropertiesRestoreRule.java:53)
	at org.apache.lucene.util.TestRuleSetupTeardownChained$1.evaluate(TestRuleSetupTeardownChained.java:50)
	at org.apache.lucene.util.TestRuleFieldCacheSanity$1.evaluate(TestRuleFieldCacheSanity.java:51)
	at org.apache.lucene.util.AbstractBeforeAfterRule$1.evaluate(AbstractBeforeAfterRule.java:46)
	at com.carrotsearch.randomizedtesting.rules.SystemPropertiesInvariantRule$1.evaluate(SystemPropertiesInvariantRule.java:55)
	at org.apache.lucene.util.TestRuleThreadAndTestName$1.evaluate(TestRuleThreadAndTestName.java:49)
	at org.apache.lucene.util.TestRuleIgnoreAfterMaxFailures$1.evaluate(TestRuleIgnoreAfterMaxFailures.java:70)
	at org.apache.lucene.util.TestRuleMarkFailure$1.evaluate(TestRuleMarkFailure.java:48)
	at com.carrotsearch.randomizedtesting.rules.StatementAdapter.evaluate(StatementAdapter.java:36)
	at com.carrotsearch.randomizedtesting.ThreadLeakControl$StatementRunner.run(ThreadLeakControl.java:359)
	at com.carrotsearch.randomizedtesting.ThreadLeakControl.forkTimeoutingTask(ThreadLeakControl.java:783)
	at com.carrotsearch.randomizedtesting.ThreadLeakControl$3.evaluate(ThreadLeakControl.java:443)
	at com.carrotsearch.randomizedtesting.RandomizedRunner.runSingleTest(RandomizedRunner.java:835)
	at com.carrotsearch.randomizedtesting.RandomizedRunner$3.evaluate(RandomizedRunner.java:737)
	at com.carrotsearch.randomizedtesting.RandomizedRunner$4.evaluate(RandomizedRunner.java:771)
	at com.carrotsearch.randomizedtesting.RandomizedRunner$5.evaluate(RandomizedRunner.java:782)
	at com.carrotsearch.randomizedtesting.rules.StatementAdapter.evaluate(StatementAdapter.java:36)
	at com.carrotsearch.randomizedtesting.rules.SystemPropertiesRestoreRule$1.evaluate(SystemPropertiesRestoreRule.java:53)
	at org.apache.lucene.util.AbstractBeforeAfterRule$1.evaluate(AbstractBeforeAfterRule.java:46)
	at org.apache.lucene.util.TestRuleStoreClassName$1.evaluate(TestRuleStoreClassName.java:42)
	at com.carrotsearch.randomizedtesting.rules.SystemPropertiesInvariantRule$1.evaluate(SystemPropertiesInvariantRule.java:55)
	at com.carrotsearch.randomizedtesting.rules.NoShadowingOrOverridesOnMethodsRule$1.evaluate(NoShadowingOrOverridesOnMethodsRule.java:39)
	at com.carrotsearch.randomizedtesting.rules.NoShadowingOrOverridesOnMethodsRule$1.evaluate(NoShadowingOrOverridesOnMethodsRule.java:39)
	at com.carrotsearch.randomizedtesting.rules.StatementAdapter.evaluate(StatementAdapter.java:36)
	at org.apache.lucene.util.TestRuleAssertionsRequired$1.evaluate(TestRuleAssertionsRequired.java:43)
	at org.apache.lucene.util.TestRuleMarkFailure$1.evaluate(TestRuleMarkFailure.java:48)
	at org.apache.lucene.util.TestRuleIgnoreAfterMaxFailures$1.evaluate(TestRuleIgnoreAfterMaxFailures.java:70)
	at org.apache.lucene.util.TestRuleIgnoreTestSuites$1.evaluate(TestRuleIgnoreTestSuites.java:55)
	at com.carrotsearch.randomizedtesting.rules.StatementAdapter.evaluate(StatementAdapter.java:36)
	at com.carrotsearch.randomizedtesting.ThreadLeakControl$StatementRunner.run(ThreadLeakControl.java:359)
	at java.lang.Thread.run(Thread.java:744)
Caused by: java.util.concurrent.TimeoutException: Could not connect to ZooKeeper 127.0.0.1:51738 within 45000 ms
	at org.apache.solr.common.cloud.ConnectionManager.waitForConnected(ConnectionManager.java:223)
	at org.apache.solr.common.cloud.SolrZkClient.<init>(SolrZkClient.java:142)
	... 46 more


REGRESSION:  org.apache.solr.cloud.TestShortCircuitedRequests.testDistribSearch

Error Message:
java.util.concurrent.TimeoutException: Could not connect to ZooKeeper 127.0.0.1:51747 within 45000 ms

Stack Trace:
org.apache.solr.common.SolrException: java.util.concurrent.TimeoutException: Could not connect to ZooKeeper 127.0.0.1:51747 within 45000 ms
	at org.apache.solr.common.cloud.SolrZkClient.<init>(SolrZkClient.java:150)
	at org.apache.solr.common.cloud.SolrZkClient.<init>(SolrZkClient.java:101)
	at org.apache.solr.common.cloud.SolrZkClient.<init>(SolrZkClient.java:91)
	at org.apache.solr.cloud.AbstractZkTestCase.buildZooKeeper(AbstractZkTestCase.java:91)
	at org.apache.solr.cloud.AbstractZkTestCase.buildZooKeeper(AbstractZkTestCase.java:85)
	at org.apache.solr.cloud.AbstractDistribZkTestBase.setUp(AbstractDistribZkTestBase.java:77)
	at org.apache.solr.cloud.AbstractFullDistribZkTestBase.setUp(AbstractFullDistribZkTestBase.java:201)
	at sun.reflect.NativeMethodAccessorImpl.invoke0(Native Method)
	at sun.reflect.NativeMethodAccessorImpl.invoke(NativeMethodAccessorImpl.java:57)
	at sun.reflect.DelegatingMethodAccessorImpl.invoke(DelegatingMethodAccessorImpl.java:43)
	at java.lang.reflect.Method.invoke(Method.java:606)
	at com.carrotsearch.randomizedtesting.RandomizedRunner.invoke(RandomizedRunner.java:1617)
	at com.carrotsearch.randomizedtesting.RandomizedRunner$7.evaluate(RandomizedRunner.java:860)
	at com.carrotsearch.randomizedtesting.RandomizedRunner$8.evaluate(RandomizedRunner.java:876)
	at com.carrotsearch.randomizedtesting.rules.SystemPropertiesRestoreRule$1.evaluate(SystemPropertiesRestoreRule.java:53)
	at org.apache.lucene.util.TestRuleSetupTeardownChained$1.evaluate(TestRuleSetupTeardownChained.java:50)
	at org.apache.lucene.util.TestRuleFieldCacheSanity$1.evaluate(TestRuleFieldCacheSanity.java:51)
	at org.apache.lucene.util.AbstractBeforeAfterRule$1.evaluate(AbstractBeforeAfterRule.java:46)
	at com.carrotsearch.randomizedtesting.rules.SystemPropertiesInvariantRule$1.evaluate(SystemPropertiesInvariantRule.java:55)
	at org.apache.lucene.util.TestRuleThreadAndTestName$1.evaluate(TestRuleThreadAndTestName.java:49)
	at org.apache.lucene.util.TestRuleIgnoreAfterMaxFailures$1.evaluate(TestRuleIgnoreAfterMaxFailures.java:70)
	at org.apache.lucene.util.TestRuleMarkFailure$1.evaluate(TestRuleMarkFailure.java:48)
	at com.carrotsearch.randomizedtesting.rules.StatementAdapter.evaluate(StatementAdapter.java:36)
	at com.carrotsearch.randomizedtesting.ThreadLeakControl$StatementRunner.run(ThreadLeakControl.java:359)
	at com.carrotsearch.randomizedtesting.ThreadLeakControl.forkTimeoutingTask(ThreadLeakControl.java:783)
	at com.carrotsearch.randomizedtesting.ThreadLeakControl$3.evaluate(ThreadLeakControl.java:443)
	at com.carrotsearch.randomizedtesting.RandomizedRunner.runSingleTest(RandomizedRunner.java:835)
	at com.carrotsearch.randomizedtesting.RandomizedRunner$3.evaluate(RandomizedRunner.java:737)
	at com.carrotsearch.randomizedtesting.RandomizedRunner$4.evaluate(RandomizedRunner.java:771)
	at com.carrotsearch.randomizedtesting.RandomizedRunner$5.evaluate(RandomizedRunner.java:782)
	at com.carrotsearch.randomizedtesting.rules.StatementAdapter.evaluate(StatementAdapter.java:36)
	at com.carrotsearch.randomizedtesting.rules.SystemPropertiesRestoreRule$1.evaluate(SystemPropertiesRestoreRule.java:53)
	at org.apache.lucene.util.AbstractBeforeAfterRule$1.evaluate(AbstractBeforeAfterRule.java:46)
	at org.apache.lucene.util.TestRuleStoreClassName$1.evaluate(TestRuleStoreClassName.java:42)
	at com.carrotsearch.randomizedtesting.rules.SystemPropertiesInvariantRule$1.evaluate(SystemPropertiesInvariantRule.java:55)
	at com.carrotsearch.randomizedtesting.rules.NoShadowingOrOverridesOnMethodsRule$1.evaluate(NoShadowingOrOverridesOnMethodsRule.java:39)
	at com.carrotsearch.randomizedtesting.rules.NoShadowingOrOverridesOnMethodsRule$1.evaluate(NoShadowingOrOverridesOnMethodsRule.java:39)
	at com.carrotsearch.randomizedtesting.rules.StatementAdapter.evaluate(StatementAdapter.java:36)
	at org.apache.lucene.util.TestRuleAssertionsRequired$1.evaluate(TestRuleAssertionsRequired.java:43)
	at org.apache.lucene.util.TestRuleMarkFailure$1.evaluate(TestRuleMarkFailure.java:48)
	at org.apache.lucene.util.TestRuleIgnoreAfterMaxFailures$1.evaluate(TestRuleIgnoreAfterMaxFailures.java:70)
	at org.apache.lucene.util.TestRuleIgnoreTestSuites$1.evaluate(TestRuleIgnoreTestSuites.java:55)
	at com.carrotsearch.randomizedtesting.rules.StatementAdapter.evaluate(StatementAdapter.java:36)
	at com.carrotsearch.randomizedtesting.ThreadLeakControl$StatementRunner.run(ThreadLeakControl.java:359)
	at java.lang.Thread.run(Thread.java:744)
Caused by: java.util.concurrent.TimeoutException: Could not connect to ZooKeeper 127.0.0.1:51747 within 45000 ms
	at org.apache.solr.common.cloud.ConnectionManager.waitForConnected(ConnectionManager.java:223)
	at org.apache.solr.common.cloud.SolrZkClient.<init>(SolrZkClient.java:142)
	... 44 more


REGRESSION:  org.apache.solr.store.blockcache.BlockDirectoryTest.testRandomAccessWritesLargeCache

Error Message:
Unable to delete file: .\org.apache.solr.store.hdfs.HdfsDirectory-1395835647633\normal\7703910222670253347

Stack Trace:
java.io.IOException: Unable to delete file: .\org.apache.solr.store.hdfs.HdfsDirectory-1395835647633\normal\7703910222670253347
	at org.apache.commons.io.FileUtils.forceDelete(FileUtils.java:1919)
	at org.apache.commons.io.FileUtils.cleanDirectory(FileUtils.java:1399)
	at org.apache.commons.io.FileUtils.deleteDirectory(FileUtils.java:1331)
	at org.apache.commons.io.FileUtils.forceDelete(FileUtils.java:1910)
	at org.apache.commons.io.FileUtils.cleanDirectory(FileUtils.java:1399)
	at org.apache.commons.io.FileUtils.deleteDirectory(FileUtils.java:1331)
	at org.apache.solr.store.blockcache.BlockDirectoryTest.tearDown(BlockDirectoryTest.java:119)
	at sun.reflect.NativeMethodAccessorImpl.invoke0(Native Method)
	at sun.reflect.NativeMethodAccessorImpl.invoke(NativeMethodAccessorImpl.java:57)
	at sun.reflect.DelegatingMethodAccessorImpl.invoke(DelegatingMethodAccessorImpl.java:43)
	at java.lang.reflect.Method.invoke(Method.java:606)
	at com.carrotsearch.randomizedtesting.RandomizedRunner.invoke(RandomizedRunner.java:1617)
	at com.carrotsearch.randomizedtesting.RandomizedRunner$8.evaluate(RandomizedRunner.java:884)
	at org.apache.lucene.util.TestRuleSetupTeardownChained$1.evaluate(TestRuleSetupTeardownChained.java:50)
	at org.apache.lucene.util.TestRuleFieldCacheSanity$1.evaluate(TestRuleFieldCacheSanity.java:51)
	at org.apache.lucene.util.AbstractBeforeAfterRule$1.evaluate(AbstractBeforeAfterRule.java:46)
	at com.carrotsearch.randomizedtesting.rules.SystemPropertiesInvariantRule$1.evaluate(SystemPropertiesInvariantRule.java:55)
	at org.apache.lucene.util.TestRuleThreadAndTestName$1.evaluate(TestRuleThreadAndTestName.java:49)
	at org.apache.lucene.util.TestRuleIgnoreAfterMaxFailures$1.evaluate(TestRuleIgnoreAfterMaxFailures.java:70)
	at org.apache.lucene.util.TestRuleMarkFailure$1.evaluate(TestRuleMarkFailure.java:48)
	at com.carrotsearch.randomizedtesting.rules.StatementAdapter.evaluate(StatementAdapter.java:36)
	at com.carrotsearch.randomizedtesting.ThreadLeakControl$StatementRunner.run(ThreadLeakControl.java:359)
	at com.carrotsearch.randomizedtesting.ThreadLeakControl.forkTimeoutingTask(ThreadLeakControl.java:783)
	at com.carrotsearch.randomizedtesting.ThreadLeakControl$3.evaluate(ThreadLeakControl.java:443)
	at com.carrotsearch.randomizedtesting.RandomizedRunner.runSingleTest(RandomizedRunner.java:835)
	at com.carrotsearch.randomizedtesting.RandomizedRunner$3.evaluate(RandomizedRunner.java:737)
	at com.carrotsearch.randomizedtesting.RandomizedRunner$4.evaluate(RandomizedRunner.java:771)
	at com.carrotsearch.randomizedtesting.RandomizedRunner$5.evaluate(RandomizedRunner.java:782)
	at org.apache.lucene.util.AbstractBeforeAfterRule$1.evaluate(AbstractBeforeAfterRule.java:46)
	at org.apache.lucene.util.TestRuleStoreClassName$1.evaluate(TestRuleStoreClassName.java:42)
	at com.carrotsearch.randomizedtesting.rules.SystemPropertiesInvariantRule$1.evaluate(SystemPropertiesInvariantRule.java:55)
	at com.carrotsearch.randomizedtesting.rules.NoShadowingOrOverridesOnMethodsRule$1.evaluate(NoShadowingOrOverridesOnMethodsRule.java:39)
	at com.carrotsearch.randomizedtesting.rules.NoShadowingOrOverridesOnMethodsRule$1.evaluate(NoShadowingOrOverridesOnMethodsRule.java:39)
	at com.carrotsearch.randomizedtesting.rules.StatementAdapter.evaluate(StatementAdapter.java:36)
	at org.apache.lucene.util.TestRuleAssertionsRequired$1.evaluate(TestRuleAssertionsRequired.java:43)
	at org.apache.lucene.util.TestRuleMarkFailure$1.evaluate(TestRuleMarkFailure.java:48)
	at org.apache.lucene.util.TestRuleIgnoreAfterMaxFailures$1.evaluate(TestRuleIgnoreAfterMaxFailures.java:70)
	at org.apache.lucene.util.TestRuleIgnoreTestSuites$1.evaluate(TestRuleIgnoreTestSuites.java:55)
	at com.carrotsearch.randomizedtesting.rules.StatementAdapter.evaluate(StatementAdapter.java:36)
	at com.carrotsearch.randomizedtesting.ThreadLeakControl$StatementRunner.run(ThreadLeakControl.java:359)
	at java.lang.Thread.run(Thread.java:744)


REGRESSION:  org.apache.solr.store.blockcache.BlockDirectoryTest.testRandomAccessWrites

Error Message:
Unable to delete file: .\org.apache.solr.store.hdfs.HdfsDirectory-1395835649890\normal\2302417517640997748

Stack Trace:
java.io.IOException: Unable to delete file: .\org.apache.solr.store.hdfs.HdfsDirectory-1395835649890\normal\2302417517640997748
	at org.apache.commons.io.FileUtils.forceDelete(FileUtils.java:1919)
	at org.apache.commons.io.FileUtils.cleanDirectory(FileUtils.java:1399)
	at org.apache.commons.io.FileUtils.deleteDirectory(FileUtils.java:1331)
	at org.apache.commons.io.FileUtils.forceDelete(FileUtils.java:1910)
	at org.apache.commons.io.FileUtils.cleanDirectory(FileUtils.java:1399)
	at org.apache.commons.io.FileUtils.deleteDirectory(FileUtils.java:1331)
	at org.apache.solr.store.blockcache.BlockDirectoryTest.tearDown(BlockDirectoryTest.java:119)
	at sun.reflect.NativeMethodAccessorImpl.invoke0(Native Method)
	at sun.reflect.NativeMethodAccessorImpl.invoke(NativeMethodAccessorImpl.java:57)
	at sun.reflect.DelegatingMethodAccessorImpl.invoke(DelegatingMethodAccessorImpl.java:43)
	at java.lang.reflect.Method.invoke(Method.java:606)
	at com.carrotsearch.randomizedtesting.RandomizedRunner.invoke(RandomizedRunner.java:1617)
	at com.carrotsearch.randomizedtesting.RandomizedRunner$8.evaluate(RandomizedRunner.java:884)
	at org.apache.lucene.util.TestRuleSetupTeardownChained$1.evaluate(TestRuleSetupTeardownChained.java:50)
	at org.apache.lucene.util.TestRuleFieldCacheSanity$1.evaluate(TestRuleFieldCacheSanity.java:51)
	at org.apache.lucene.util.AbstractBeforeAfterRule$1.evaluate(AbstractBeforeAfterRule.java:46)
	at com.carrotsearch.randomizedtesting.rules.SystemPropertiesInvariantRule$1.evaluate(SystemPropertiesInvariantRule.java:55)
	at org.apache.lucene.util.TestRuleThreadAndTestName$1.evaluate(TestRuleThreadAndTestName.java:49)
	at org.apache.lucene.util.TestRuleIgnoreAfterMaxFailures$1.evaluate(TestRuleIgnoreAfterMaxFailures.java:70)
	at org.apache.lucene.util.TestRuleMarkFailure$1.evaluate(TestRuleMarkFailure.java:48)
	at com.carrotsearch.randomizedtesting.rules.StatementAdapter.evaluate(StatementAdapter.java:36)
	at com.carrotsearch.randomizedtesting.ThreadLeakControl$StatementRunner.run(ThreadLeakControl.java:359)
	at com.carrotsearch.randomizedtesting.ThreadLeakControl.forkTimeoutingTask(ThreadLeakControl.java:783)
	at com.carrotsearch.randomizedtesting.ThreadLeakControl$3.evaluate(ThreadLeakControl.java:443)
	at com.carrotsearch.randomizedtesting.RandomizedRunner.runSingleTest(RandomizedRunner.java:835)
	at com.carrotsearch.randomizedtesting.RandomizedRunner$3.evaluate(RandomizedRunner.java:737)
	at com.carrotsearch.randomizedtesting.RandomizedRunner$4.evaluate(RandomizedRunner.java:771)
	at com.carrotsearch.randomizedtesting.RandomizedRunner$5.evaluate(RandomizedRunner.java:782)
	at org.apache.lucene.util.AbstractBeforeAfterRule$1.evaluate(AbstractBeforeAfterRule.java:46)
	at org.apache.lucene.util.TestRuleStoreClassName$1.evaluate(TestRuleStoreClassName.java:42)
	at com.carrotsearch.randomizedtesting.rules.SystemPropertiesInvariantRule$1.evaluate(SystemPropertiesInvariantRule.java:55)
	at com.carrotsearch.randomizedtesting.rules.NoShadowingOrOverridesOnMethodsRule$1.evaluate(NoShadowingOrOverridesOnMethodsRule.java:39)
	at com.carrotsearch.randomizedtesting.rules.NoShadowingOrOverridesOnMethodsRule$1.evaluate(NoShadowingOrOverridesOnMethodsRule.java:39)
	at com.carrotsearch.randomizedtesting.rules.StatementAdapter.evaluate(StatementAdapter.java:36)
	at org.apache.lucene.util.TestRuleAssertionsRequired$1.evaluate(TestRuleAssertionsRequired.java:43)
	at org.apache.lucene.util.TestRuleMarkFailure$1.evaluate(TestRuleMarkFailure.java:48)
	at org.apache.lucene.util.TestRuleIgnoreAfterMaxFailures$1.evaluate(TestRuleIgnoreAfterMaxFailures.java:70)
	at org.apache.lucene.util.TestRuleIgnoreTestSuites$1.evaluate(TestRuleIgnoreTestSuites.java:55)
	at com.carrotsearch.randomizedtesting.rules.StatementAdapter.evaluate(StatementAdapter.java:36)
	at com.carrotsearch.randomizedtesting.ThreadLeakControl$StatementRunner.run(ThreadLeakControl.java:359)
	at java.lang.Thread.run(Thread.java:744)




Build Log:
[...truncated 11158 lines...]
   [junit4] Suite: org.apache.solr.cloud.DeleteReplicaTest
   [junit4]   2> 3447141 T11624 oas.SolrTestCaseJ4.buildSSLConfig Randomized ssl (true) and clientAuth (true)
   [junit4]   2> 3447141 T11624 oas.BaseDistributedSearchTestCase.initHostContext Setting hostContext system property: /
   [junit4]   2> 3447146 T11624 oas.SolrTestCaseJ4.setUp ###Starting testDistribSearch
   [junit4]   2> Creating dataDir: C:\Users\JenkinsSlave\workspace\Lucene-Solr-trunk-Windows\solr\build\solr-core\test\J0\.\solrtest-DeleteReplicaTest-1395835297800
   [junit4]   2> 3447151 T11624 oasc.ZkTestServer.run STARTING ZK TEST SERVER
   [junit4]   2> 3447153 T11625 oasc.ZkTestServer$ZKServerMain.runFromConfig Starting server
   [junit4]   2> 3447252 T11624 oasc.ZkTestServer.run start zk server on port:51701
   [junit4]   2> 3447255 T11624 oascc.ConnectionManager.waitForConnected Waiting for client to connect to ZooKeeper
   [junit4]   2> 3447258 T11628 oazs.SyncRequestProcessor.run ERROR Severe unrecoverable error, exiting java.io.IOException: There is not enough space on the disk
   [junit4]   2> 	at sun.nio.ch.FileDispatcherImpl.pwrite0(Native Method)
   [junit4]   2> 	at sun.nio.ch.FileDispatcherImpl.pwrite(FileDispatcherImpl.java:80)
   [junit4]   2> 	at sun.nio.ch.IOUtil.writeFromNativeBuffer(IOUtil.java:89)
   [junit4]   2> 	at sun.nio.ch.IOUtil.write(IOUtil.java:51)
   [junit4]   2> 	at sun.nio.ch.FileChannelImpl.writeInternal(FileChannelImpl.java:738)
   [junit4]   2> 	at sun.nio.ch.FileChannelImpl.write(FileChannelImpl.java:720)
   [junit4]   2> 	at org.apache.zookeeper.server.persistence.Util.padLogFile(Util.java:219)
   [junit4]   2> 	at org.apache.zookeeper.server.persistence.FileTxnLog.padFile(FileTxnLog.java:237)
   [junit4]   2> 	at org.apache.zookeeper.server.persistence.FileTxnLog.append(FileTxnLog.java:215)
   [junit4]   2> 	at org.apache.zookeeper.server.persistence.FileTxnSnapLog.append(FileTxnSnapLog.java:314)
   [junit4]   2> 	at org.apache.zookeeper.server.ZKDatabase.append(ZKDatabase.java:476)
   [junit4]   2> 	at org.apache.zookeeper.server.SyncRequestProcessor.run(SyncRequestProcessor.java:140)
   [junit4]   2> 
   [junit4]   2> 135 T11628 ccr.RandomizedRunner$QueueUncaughtExceptionsHandler.uncaughtException WARNING Uncaught exception in thread: Thread[SyncThread:0,5,TGRP-DeleteReplicaTest] java.lang.SecurityException: java.lang.System#exit(11) calls are not allowed because they terminate the test runner's JVM.
   [junit4]   2> 	at __randomizedtesting.SeedInfo.seed([E46DFB6310126FB0]:0)
   [junit4]   2> 	at org.apache.lucene.util.TestSecurityManager$1.run(TestSecurityManager.java:82)
   [junit4]   2> 	at org.apache.lucene.util.TestSecurityManager$1.run(TestSecurityManager.java:51)
   [junit4]   2> 	at java.security.AccessController.doPrivileged(Native Method)
   [junit4]   2> 	at org.apache.lucene.util.TestSecurityManager.checkExit(TestSecurityManager.java:51)
   [junit4]   2> 	at java.lang.Runtime.exit(Runtime.java:107)
   [junit4]   2> 	at java.lang.System.exit(System.java:962)
   [junit4]   2> 	at org.apache.zookeeper.server.SyncRequestProcessor.run(SyncRequestProcessor.java:185)
   [junit4]   2> 
   [junit4]   2> !!!! WARNING: best effort to remove C:\Users\JenkinsSlave\workspace\Lucene-Solr-trunk-Windows\solr\build\solr-core\test\J0\.\org.apache.solr.cloud.DeleteReplicaTest-1395835297797\zookeeper\server1\data\version-2\log.1 FAILED !!!!!
   [junit4]   2> !!!! WARNING: best effort to remove C:\Users\JenkinsSlave\workspace\Lucene-Solr-trunk-Windows\solr\build\solr-core\test\J0\.\org.apache.solr.cloud.DeleteReplicaTest-1395835297797\zookeeper\server1\data\version-2 FAILED !!!!!
   [junit4]   2> !!!! WARNING: best effort to remove C:\Users\JenkinsSlave\workspace\Lucene-Solr-trunk-Windows\solr\build\solr-core\test\J0\.\org.apache.solr.cloud.DeleteReplicaTest-1395835297797\zookeeper\server1\data FAILED !!!!!
   [junit4]   2> !!!! WARNING: best effort to remove C:\Users\JenkinsSlave\workspace\Lucene-Solr-trunk-Windows\solr\build\solr-core\test\J0\.\org.apache.solr.cloud.DeleteReplicaTest-1395835297797\zookeeper\server1 FAILED !!!!!
   [junit4]   2> !!!! WARNING: best effort to remove C:\Users\JenkinsSlave\workspace\Lucene-Solr-trunk-Windows\solr\build\solr-core\test\J0\.\org.apache.solr.cloud.DeleteReplicaTest-1395835297797\zookeeper FAILED !!!!!
   [junit4]   2> !!!! WARNING: best effort to remove C:\Users\JenkinsSlave\workspace\Lucene-Solr-trunk-Windows\solr\build\solr-core\test\J0\.\org.apache.solr.cloud.DeleteReplicaTest-1395835297797 FAILED !!!!!
   [junit4]   2> 3493199 T11624 oas.SolrTestCaseJ4.tearDown ###Ending testDistribSearch
   [junit4]   2> 3493202 T11624 oasc.ZkTestServer.send4LetterWord connecting to 127.0.0.1:51701 51701
   [junit4]   1> client port:0.0.0.0/0.0.0.0:0
   [junit4]   2> NOTE: reproduce with: ant test  -Dtestcase=DeleteReplicaTest -Dtests.method=testDistribSearch -Dtests.seed=E46DFB6310126FB0 -Dtests.slow=true -Dtests.locale=fi -Dtests.timezone=Pacific/Wallis -Dtests.file.encoding=Cp1252
   [junit4] ERROR   48.4s | DeleteReplicaTest.testDistribSearch <<<
   [junit4]    > Throwable #1: org.apache.solr.common.SolrException: java.util.concurrent.TimeoutException: Could not connect to ZooKeeper 127.0.0.1:51701 within 45000 ms
   [junit4]    > 	at org.apache.solr.common.cloud.SolrZkClient.<init>(SolrZkClient.java:150)
   [junit4]    > 	at org.apache.solr.common.cloud.SolrZkClient.<init>(SolrZkClient.java:101)
   [junit4]    > 	at org.apache.solr.common.cloud.SolrZkClient.<init>(SolrZkClient.java:91)
   [junit4]    > 	at org.apache.solr.cloud.AbstractZkTestCase.buildZooKeeper(AbstractZkTestCase.java:91)
   [junit4]    > 	at org.apache.solr.cloud.AbstractZkTestCase.buildZooKeeper(AbstractZkTestCase.java:85)
   [junit4]    > 	at org.apache.solr.cloud.AbstractDistribZkTestBase.setUp(AbstractDistribZkTestBase.java:77)
   [junit4]    > 	at org.apache.solr.cloud.AbstractFullDistribZkTestBase.setUp(AbstractFullDistribZkTestBase.java:201)
   [junit4]    > 	at org.apache.solr.cloud.DeleteReplicaTest.setUp(DeleteReplicaTest.java:55)
   [junit4]    > 	at java.lang.Thread.run(Thread.java:744)
   [junit4]    > Caused by: java.util.concurrent.TimeoutException: Could not connect to ZooKeeper 127.0.0.1:51701 within 45000 ms
   [junit4]    > 	at org.apache.solr.common.cloud.ConnectionManager.waitForConnected(ConnectionManager.java:223)
   [junit4]    > 	at org.apache.solr.common.cloud.SolrZkClient.<init>(SolrZkClient.java:142)
   [junit4]    > 	... 45 moreThrowable #2: java.lang.NullPointerException
   [junit4]    > 	at org.apache.solr.cloud.DeleteReplicaTest.tearDown(DeleteReplicaTest.java:64)
   [junit4]    > 	at java.lang.Thread.run(Thread.java:744)Throwable #3: com.carrotsearch.randomizedtesting.UncaughtExceptionError: Captured an uncaught exception in thread: Thread[id=11628, name=SyncThread:0, state=RUNNABLE, group=TGRP-DeleteReplicaTest]
   [junit4]    > Caused by: java.lang.SecurityException: java.lang.System#exit(11) calls are not allowed because they terminate the test runner's JVM.
   [junit4]    > 	at __randomizedtesting.SeedInfo.seed([E46DFB6310126FB0]:0)
   [junit4]    > 	at org.apache.lucene.util.TestSecurityManager$1.run(TestSecurityManager.java:82)
   [junit4]    > 	at org.apache.lucene.util.TestSecurityManager$1.run(TestSecurityManager.java:51)
   [junit4]    > 	at java.security.AccessController.doPrivileged(Native Method)
   [junit4]    > 	at org.apache.lucene.util.TestSecurityManager.checkExit(TestSecurityManager.java:51)
   [junit4]    > 	at java.lang.Runtime.exit(Runtime.java:107)
   [junit4]    > 	at java.lang.System.exit(System.java:962)
   [junit4]    > 	at org.apache.zookeeper.server.SyncRequestProcessor.run(SyncRequestProcessor.java:185)
   [junit4]   2> 3495503 T11624 oas.SolrTestCaseJ4.deleteCore ###deleteCore
   [junit4]   2> NOTE: test params are: codec=Lucene46: {}, docValues:{}, sim=RandomSimilarityProvider(queryNorm=true,coord=crazy): {}, locale=fi, timezone=Pacific/Wallis
   [junit4]   2> NOTE: Windows 7 6.1 x86/Oracle Corporation 1.7.0_51 (32-bit)/cpus=2,threads=1,free=74520984,total=389775360
   [junit4]   2> NOTE: All tests run in this JVM: [ShardSplitTest, JsonLoaderTest, TestStressReorder, TestCSVLoader, TestStressRecovery, TestSolrCoreProperties, SynonymTokenizerTest, TestSchemaResource, TermVectorComponentTest, PreAnalyzedUpdateProcessorTest, InfoHandlerTest, TestDFRSimilarityFactory, TestManagedSchemaFieldResource, TestFunctionQuery, TestManagedResourceStorage, OverseerTest, TestDynamicFieldCollectionResource, SuggesterTest, DocValuesTest, DistribCursorPagingTest, ZkCLITest, HighlighterConfigTest, DocValuesMultiTest, TestSolr4Spatial, TestDistributedGrouping, MoreLikeThisHandlerTest, StandardRequestHandlerTest, DirectUpdateHandlerOptimizeTest, CoreAdminRequestStatusTest, SearchHandlerTest, PluginInfoTest, BadIndexSchemaTest, SchemaVersionSpecificBehaviorTest, TestRecovery, SolrIndexConfigTest, DistributedQueryComponentOptimizationTest, TestDocBasedVersionConstraints, TestStressUserVersions, PrimUtilsTest, ShardRoutingTest, RegexBoostProcessorTest, PingRequestHandlerTest, TestDynamicFieldResource, LegacyHTMLStripCharFilterTest, BadCopyFieldTest, TestInfoStreamLogging, SSLMigrationTest, TestBM25SimilarityFactory, DefaultValueUpdateProcessorTest, CollectionsAPIAsyncDistributedZkTest, TestManagedResource, FileUtilsTest, TestShardHandlerFactory, TestQuerySenderListener, TestWordDelimiterFilterFactory, DistributedQueryElevationComponentTest, TestRandomFaceting, HdfsSyncSliceTest, AddSchemaFieldsUpdateProcessorFactoryTest, SolrXmlInZkTest, TestFieldSortValues, TestFiltering, EnumFieldTest, ModifyConfFileTest, SolrPluginUtilsTest, TestCollationFieldDocValues, TestReplicationHandler, SliceStateUpdateTest, BlockCacheTest, OverseerRolesTest, TestPartialUpdateDeduplication, TestWriterPerf, SliceStateTest, TestStandardQParsers, DebugComponentTest, CustomCollectionTest, TestLMDirichletSimilarityFactory, EchoParamsTest, ShowFileRequestHandlerTest, CoreContainerCoreInitFailuresTest, TestMiniSolrCloudCluster, TestSimpleQParserPlugin, SuggesterTSTTest, FunctionTest, CoreAdminCreateDiscoverTest, RangeFacetTest, TestExceedMaxTermLength, UnloadDistributedZkTest, ZkNodePropsTest, TestExpandComponent, TestHashPartitioner, MigrateRouteKeyTest, XmlUpdateRequestHandlerTest, UUIDFieldTest, TestTrie, XsltUpdateRequestHandlerTest, AutoCommitTest, TestBadConfig, DistributedDebugComponentTest, TestSearcherReuse, DistributedTermsComponentTest, TestSolrQueryParserDefaultOperatorResource, TestCloudManagedSchemaAddField, SpellCheckCollatorTest, TestSolrDeletionPolicy2, SimpleFacetsTest, ChangedSchemaMergeTest, OpenCloseCoreStressTest, TestSearchPerf, TestReversedWildcardFilterFactory, TestManagedStopFilterFactory, DocValuesMissingTest, SortByFunctionTest, TestComponentsName, TestPostingsSolrHighlighter, FieldFacetExtrasTest, TestQueryTypes, DOMUtilTest, TestXIncludeConfig, TestFoldingMultitermQuery, CursorMarkTest, LeaderElectionIntegrationTest, SolrIndexSplitterTest, CurrencyFieldOpenExchangeTest, TestAnalyzeInfixSuggestions, DistributedSuggestComponentTest, TestHighFrequencyDictionaryFactory, AbstractAnalyticsFacetTest, QueryResultKeyTest, TestFreeTextSuggestions, TestIBSimilarityFactory, UpdateRequestProcessorFactoryTest, SoftAutoCommitTest, ScriptEngineTest, TriLevelCompositeIdRoutingTest, FieldMutatingUpdateProcessorTest, DistributedExpandComponentTest, HdfsBasicDistributedZkTest, TestAnalyzedSuggestions, DeleteShardTest, PrimitiveFieldTypeTest, TestFastOutputStream, ConnectionManagerTest, TestNonNRTOpen, WordBreakSolrSpellCheckerTest, QueryEqualityTest, HdfsDirectoryTest, TestBlendedInfixSuggestions, TestExtendedDismaxParser, TestDocSet, RecoveryZkTest, TestNonDefinedSimilarityFactory, TestLMJelinekMercerSimilarityFactory, ResponseLogComponentTest, TestInitQParser, DateMathParserTest, TestCollationField, TestSolrJ, QueryParsingTest, TestJoin, TermVectorComponentDistributedTest, TestSolrXmlPersistence, HardAutoCommitTest, TestSurroundQueryParser, ParsingFieldUpdateProcessorsTest, TestFieldTypeResource, TestReloadAndDeleteDocs, TestManagedSchema, MultiTermTest, DistanceFunctionTest, QueryElevationComponentTest, TestCloudManagedSchema, SimplePostToolTest, ChaosMonkeyNothingIsSafeTest, CoreAdminHandlerTest, HdfsWriteToMultipleCollectionsTest, ReturnFieldsTest, TestNoOpRegenerator, CopyFieldTest, RAMDirectoryFactoryTest, PeerSyncTest, TestCoreContainer, BasicDistributedZk2Test, PreAnalyzedFieldTest, TestConfigSets, TestSweetSpotSimilarityFactory, TestDistribDocBasedVersion, AssignTest, SolrCmdDistributorTest, TestNRTOpen, TestJmxIntegration, BasicDistributedZkTest, ChaosMonkeySafeLeaderTest, CollectionsAPIDistributedZkTest, SyncSliceTest, BasicZkTest, FullSolrCloudDistribCmdsTest, ClusterStateUpdateTest, LeaderElectionTest, ZkSolrClientTest, TestZkChroot, TestRandomDVFaceting, ShardRoutingCustomTest, TestDistributedSearch, TestFaceting, DistributedSpellCheckComponentTest, ZkControllerTest, TestRealTimeGet, TestMultiCoreConfBootstrap, TestReload, TestStressVersions, TestRangeQuery, SolrCoreTest, StatsComponentTest, SpellCheckComponentTest, TestGroupingSearch, ConvertedLegacyTest, TestSort, BasicFunctionalityTest, TestLazyCores, DirectUpdateHandlerTest, OverseerCollectionProcessorTest, TestIndexSearcher, HighlighterTest, CurrencyFieldXmlFileTest, TestCoreDiscovery, AnalysisAfterCoreReloadTest, SignatureUpdateProcessorFactoryTest, SuggesterFSTTest, SolrRequestParserTest, TestStressLucene, SpatialFilterTest, SuggesterWFSTTest, PolyFieldTest, NoCacheHeaderTest, SolrCoreCheckLockOnStartupTest, TestPseudoReturnFields, TestUpdate, TestAtomicUpdateErrorCases, StatelessScriptUpdateProcessorFactoryTest, TestRemoteStreaming, TestSolrDeletionPolicy1, SolrInfoMBeanTest, CacheHeaderTest, IndexBasedSpellCheckerTest, LukeRequestHandlerTest, DisMaxRequestHandlerTest, TestQueryUtils, DirectSolrSpellCheckerTest, DocumentAnalysisRequestHandlerTest, TestOmitPositions, FileBasedSpellCheckerTest, TermsComponentTest, RequestHandlersTest, DocumentBuilderTest, TestValueSourceCache, PathHierarchyTokenizerFactoryTest, TestIndexingPerformance, RequiredFieldsTest, FieldAnalysisRequestHandlerTest, TestSolrQueryParser, TestArbitraryIndexDir, FastVectorHighlighterTest, IndexSchemaRuntimeFieldTest, LoggingHandlerTest, IndexSchemaTest, JSONWriterTest, TestCSVResponseWriter, MBeansHandlerTest, UniqFieldsUpdateProcessorFactoryTest, BinaryUpdateRequestHandlerTest, TestPHPSerializedResponseWriter, CSVRequestHandlerTest, TestBinaryResponseWriter, TestLFUCache, SOLR749Test, UpdateParamsTest, AlternateDirectoryTest, TestSolrIndexConfig, TestQuerySenderNoQuery, BadComponentTest, TestMergePolicyConfig, SampleTest, TestBinaryField, NumericFieldsTest, MinimalSchemaTest, TestElisionMultitermQuery, TestConfig, OutputWriterTest, TestFuzzyAnalyzedSuggestions, ExternalFileFieldSortTest, DirectSolrConnectionTest, NotRequiredUniqueKeyTest, TestLuceneMatchVersion, TestPhraseSuggestions, SpellPossibilityIteratorTest, TestCharFilters, TestCodecSupport, TestPerFieldSimilarity, TestNumberUtils, TestDefaultSimilarityFactory, TestFastWriter, TestJmxMonitoredMap, TimeZoneUtilsTest, ResourceLoaderTest, OpenExchangeRatesOrgProviderTest, URLClassifyProcessorTest, TestFastLRUCache, TestSolrXMLSerializer, TestSystemIdResolver, TestSuggestSpellingConverter, DateFieldTest, SpellingQueryConverterTest, ClusterStateTest, TestLRUCache, TestUtils, TestDocumentBuilder, SystemInfoHandlerTest, CircularListTest, TestRTGBase, CursorPagingTest, SolrTestCaseJ4Test, TestCursorMarkWithoutUniqueKey, TestDistributedMissingSort, TestHighlightDedupGrouping, AbstractAnalyticsStatsTest, NoFacetTest, ExpressionTest, QueryFacetTest, AliasIntegrationTest, AsyncMigrateRouteKeyTest, DeleteInactiveReplicaTest, DeleteReplicaTest]
   [junit4] Completed in 48.41s, 1 test, 1 error <<< FAILURES!

[...truncated 1 lines...]
   [junit4] Suite: org.apache.solr.cloud.OverseerStatusTest
   [junit4]   2> 3495637 T11633 oas.BaseDistributedSearchTestCase.initHostContext Setting hostContext system property: /
   [junit4]   2> 3495644 T11633 oas.SolrTestCaseJ4.setUp ###Starting testDistribSearch
   [junit4]   2> Creating dataDir: C:\Users\JenkinsSlave\workspace\Lucene-Solr-trunk-Windows\solr\build\solr-core\test\J0\.\solrtest-OverseerStatusTest-1395835346298
   [junit4]   2> 3495649 T11633 oasc.ZkTestServer.run STARTING ZK TEST SERVER
   [junit4]   2> 3495650 T11634 oasc.ZkTestServer$ZKServerMain.runFromConfig Starting server
   [junit4]   2> 3495751 T11633 oasc.ZkTestServer.run start zk server on port:51710
   [junit4]   2> 3495755 T11633 oascc.ConnectionManager.waitForConnected Waiting for client to connect to ZooKeeper
   [junit4]   2> 3495760 T11637 oazs.SyncRequestProcessor.run ERROR Severe unrecoverable error, exiting java.io.IOException: There is not enough space on the disk
   [junit4]   2> 	at sun.nio.ch.FileDispatcherImpl.pwrite0(Native Method)
   [junit4]   2> 	at sun.nio.ch.FileDispatcherImpl.pwrite(FileDispatcherImpl.java:80)
   [junit4]   2> 	at sun.nio.ch.IOUtil.writeFromNativeBuffer(IOUtil.java:89)
   [junit4]   2> 	at sun.nio.ch.IOUtil.write(IOUtil.java:51)
   [junit4]   2> 	at sun.nio.ch.FileChannelImpl.writeInternal(FileChannelImpl.java:738)
   [junit4]   2> 	at sun.nio.ch.FileChannelImpl.write(FileChannelImpl.java:720)
   [junit4]   2> 	at org.apache.zookeeper.server.persistence.Util.padLogFile(Util.java:219)
   [junit4]   2> 	at org.apache.zookeeper.server.persistence.FileTxnLog.padFile(FileTxnLog.java:237)
   [junit4]   2> 	at org.apache.zookeeper.server.persistence.FileTxnLog.append(FileTxnLog.java:215)
   [junit4]   2> 	at org.apache.zookeeper.server.persistence.FileTxnSnapLog.append(FileTxnSnapLog.java:314)
   [junit4]   2> 	at org.apache.zookeeper.server.ZKDatabase.append(ZKDatabase.java:476)
   [junit4]   2> 	at org.apache.zookeeper.server.SyncRequestProcessor.run(SyncRequestProcessor.java:140)
   [junit4]   2> 
   [junit4]   2> 126 T11637 ccr.RandomizedRunner$QueueUncaughtExceptionsHandler.uncaughtException WARNING Uncaught exception in thread: Thread[SyncThread:0,5,TGRP-OverseerStatusTest] java.lang.SecurityException: java.lang.System#exit(11) calls are not allowed because they terminate the test runner's JVM.
   [junit4]   2> 	at __randomizedtesting.SeedInfo.seed([E46DFB6310126FB0]:0)
   [junit4]   2> 	at org.apache.lucene.util.TestSecurityManager$1.run(TestSecurityManager.java:82)
   [junit4]   2> 	at org.apache.lucene.util.TestSecurityManager$1.run(TestSecurityManager.java:51)
   [junit4]   2> 	at java.security.AccessController.doPrivileged(Native Method)
   [junit4]   2> 	at org.apache.lucene.util.TestSecurityManager.checkExit(TestSecurityManager.java:51)
   [junit4]   2> 	at java.lang.Runtime.exit(Runtime.java:107)
   [junit4]   2> 	at java.lang.System.exit(System.java:962)
   [junit4]   2> 	at org.apache.zookeeper.server.SyncRequestProcessor.run(SyncRequestProcessor.java:185)
   [junit4]   2> 
   [junit4]   2> !!!! WARNING: best effort to remove C:\Users\JenkinsSlave\workspace\Lucene-Solr-trunk-Windows\solr\build\solr-core\test\J0\.\org.apache.solr.cloud.OverseerStatusTest-1395835346295\zookeeper\server1\data\version-2\log.1 FAILED !!!!!
   [junit4]   2> !!!! WARNING: best effort to remove C:\Users\JenkinsSlave\workspace\Lucene-Solr-trunk-Windows\solr\build\solr-core\test\J0\.\org.apache.solr.cloud.OverseerStatusTest-1395835346295\zookeeper\server1\data\version-2 FAILED !!!!!
   [junit4]   2> !!!! WARNING: best effort to remove C:\Users\JenkinsSlave\workspace\Lucene-Solr-trunk-Windows\solr\build\solr-core\test\J0\.\org.apache.solr.cloud.OverseerStatusTest-1395835346295\zookeeper\server1\data FAILED !!!!!
   [junit4]   2> !!!! WARNING: best effort to remove C:\Users\JenkinsSlave\workspace\Lucene-Solr-trunk-Windows\solr\build\solr-core\test\J0\.\org.apache.solr.cloud.OverseerStatusTest-1395835346295\zookeeper\server1 FAILED !!!!!
   [junit4]   2> !!!! WARNING: best effort to remove C:\Users\JenkinsSlave\workspace\Lucene-Solr-trunk-Windows\solr\build\solr-core\test\J0\.\org.apache.solr.cloud.OverseerStatusTest-1395835346295\zookeeper FAILED !!!!!
   [junit4]   2> !!!! WARNING: best effort to remove C:\Users\JenkinsSlave\workspace\Lucene-Solr-trunk-Windows\solr\build\solr-core\test\J0\.\org.apache.solr.cloud.OverseerStatusTest-1395835346295 FAILED !!!!!
   [junit4]   2> 3541583 T11633 oas.SolrTestCaseJ4.tearDown ###Ending testDistribSearch
   [junit4]   2> 3541591 T11633 oasc.ZkTestServer.send4LetterWord connecting to 127.0.0.1:51710 51710
   [junit4]   1> client port:0.0.0.0/0.0.0.0:0
   [junit4]   2> NOTE: reproduce with: ant test  -Dtestcase=OverseerStatusTest -Dtests.method=testDistribSearch -Dtests.seed=E46DFB6310126FB0 -Dtests.slow=true -Dtests.locale=pt_BR -Dtests.timezone=Australia/Yancowinna -Dtests.file.encoding=Cp1252
   [junit4] ERROR   48.5s | OverseerStatusTest.testDistribSearch <<<
   [junit4]    > Throwable #1: org.apache.solr.common.SolrException: java.util.concurrent.TimeoutException: Could not connect to ZooKeeper 127.0.0.1:51710 within 45000 ms
   [junit4]    > 	at org.apache.solr.common.cloud.SolrZkClient.<init>(SolrZkClient.java:150)
   [junit4]    > 	at org.apache.solr.common.cloud.SolrZkClient.<init>(SolrZkClient.java:101)
   [junit4]    > 	at org.apache.solr.common.cloud.SolrZkClient.<init>(SolrZkClient.java:91)
   [junit4]    > 	at org.apache.solr.cloud.AbstractZkTestCase.buildZooKeeper(AbstractZkTestCase.java:91)
   [junit4]    > 	at org.apache.solr.cloud.AbstractZkTestCase.buildZooKeeper(AbstractZkTestCase.java:85)
   [junit4]    > 	at org.apache.solr.cloud.AbstractDistribZkTestBase.setUp(AbstractDistribZkTestBase.java:77)
   [junit4]    > 	at org.apache.solr.cloud.AbstractFullDistribZkTestBase.setUp(AbstractFullDistribZkTestBase.java:201)
   [junit4]    > 	at org.apache.solr.cloud.BasicDistributedZkTest.setUp(BasicDistributedZkTest.java:124)
   [junit4]    > 	at org.apache.solr.cloud.OverseerStatusTest.setUp(OverseerStatusTest.java:44)
   [junit4]    > 	at java.lang.Thread.run(Thread.java:744)
   [junit4]    > Caused by: java.util.concurrent.TimeoutException: Could not connect to ZooKeeper 127.0.0.1:51710 within 45000 ms
   [junit4]    > 	at org.apache.solr.common.cloud.ConnectionManager.waitForConnected(ConnectionManager.java:223)
   [junit4]    > 	at org.apache.solr.common.cloud.SolrZkClient.<init>(SolrZkClient.java:142)
   [junit4]    > 	... 46 moreThrowable #2: com.carrotsearch.randomizedtesting.UncaughtExceptionError: Captured an uncaught exception in thread: Thread[id=11637, name=SyncThread:0, state=RUNNABLE, group=TGRP-OverseerStatusTest]
   [junit4]    > Caused by: java.lang.SecurityException: java.lang.System#exit(11) calls are not allowed because they terminate the test runner's JVM.
   [junit4]    > 	at __randomizedtesting.SeedInfo.seed([E46DFB6310126FB0]:0)
   [junit4]    > 	at org.apache.lucene.util.TestSecurityManager$1.run(TestSecurityManager.java:82)
   [junit4]    > 	at org.apache.lucene.util.TestSecurityManager$1.run(TestSecurityManager.java:51)
   [junit4]    > 	at java.security.AccessController.doPrivileged(Native Method)
   [junit4]    > 	at org.apache.lucene.util.TestSecurityManager.checkExit(TestSecurityManager.java:51)
   [junit4]    > 	at java.lang.Runtime.exit(Runtime.java:107)
   [junit4]    > 	at java.lang.System.exit(System.java:962)
   [junit4]    > 	at org.apache.zookeeper.server.SyncRequestProcessor.run(SyncRequestProcessor.java:185)
   [junit4]   2> 3544116 T11633 oas.SolrTestCaseJ4.deleteCore ###deleteCore
   [junit4]   2> NOTE: test params are: codec=Asserting, sim=RandomSimilarityProvider(queryNorm=false,coord=no): {}, locale=pt_BR, timezone=Australia/Yancowinna
   [junit4]   2> NOTE: Windows 7 6.1 x86/Oracle Corporation 1.7.0_51 (32-bit)/cpus=2,threads=1,free=129151208,total=389775360
   [junit4]   2> NOTE: All tests run in this JVM: [ShardSplitTest, JsonLoaderTest, TestStressReorder, TestCSVLoader, TestStressRecovery, TestSolrCoreProperties, SynonymTokenizerTest, TestSchemaResource, TermVectorComponentTest, PreAnalyzedUpdateProcessorTest, InfoHandlerTest, TestDFRSimilarityFactory, TestManagedSchemaFieldResource, TestFunctionQuery, TestManagedResourceStorage, OverseerTest, TestDynamicFieldCollectionResource, SuggesterTest, DocValuesTest, DistribCursorPagingTest, ZkCLITest, HighlighterConfigTest, DocValuesMultiTest, TestSolr4Spatial, TestDistributedGrouping, MoreLikeThisHandlerTest, StandardRequestHandlerTest, DirectUpdateHandlerOptimizeTest, CoreAdminRequestStatusTest, SearchHandlerTest, PluginInfoTest, BadIndexSchemaTest, SchemaVersionSpecificBehaviorTest, TestRecovery, SolrIndexConfigTest, DistributedQueryComponentOptimizationTest, TestDocBasedVersionConstraints, TestStressUserVersions, PrimUtilsTest, ShardRoutingTest, RegexBoostProcessorTest, PingRequestHandlerTest, TestDynamicFieldResource, LegacyHTMLStripCharFilterTest, BadCopyFieldTest, TestInfoStreamLogging, SSLMigrationTest, TestBM25SimilarityFactory, DefaultValueUpdateProcessorTest, CollectionsAPIAsyncDistributedZkTest, TestManagedResource, FileUtilsTest, TestShardHandlerFactory, TestQuerySenderListener, TestWordDelimiterFilterFactory, DistributedQueryElevationComponentTest, TestRandomFaceting, HdfsSyncSliceTest, AddSchemaFieldsUpdateProcessorFactoryTest, SolrXmlInZkTest, TestFieldSortValues, TestFiltering, EnumFieldTest, ModifyConfFileTest, SolrPluginUtilsTest, TestCollationFieldDocValues, TestReplicationHandler, SliceStateUpdateTest, BlockCacheTest, OverseerRolesTest, TestPartialUpdateDeduplication, TestWriterPerf, SliceStateTest, TestStandardQParsers, DebugComponentTest, CustomCollectionTest, TestLMDirichletSimilarityFactory, EchoParamsTest, ShowFileRequestHandlerTest, CoreContainerCoreInitFailuresTest, TestMiniSolrCloudCluster, TestSimpleQParserPlugin, SuggesterTSTTest, FunctionTest, CoreAdminCreateDiscoverTest, RangeFacetTest, TestExceedMaxTermLength, UnloadDistributedZkTest, ZkNodePropsTest, TestExpandComponent, TestHashPartitioner, MigrateRouteKeyTest, XmlUpdateRequestHandlerTest, UUIDFieldTest, TestTrie, XsltUpdateRequestHandlerTest, AutoCommitTest, TestBadConfig, DistributedDebugComponentTest, TestSearcherReuse, DistributedTermsComponentTest, TestSolrQueryParserDefaultOperatorResource, TestCloudManagedSchemaAddField, SpellCheckCollatorTest, TestSolrDeletionPolicy2, SimpleFacetsTest, ChangedSchemaMergeTest, OpenCloseCoreStressTest, TestSearchPerf, TestReversedWildcardFilterFactory, TestManagedStopFilterFactory, DocValuesMissingTest, SortByFunctionTest, TestComponentsName, TestPostingsSolrHighlighter, FieldFacetExtrasTest, TestQueryTypes, DOMUtilTest, TestXIncludeConfig, TestFoldingMultitermQuery, CursorMarkTest, LeaderElectionIntegrationTest, SolrIndexSplitterTest, CurrencyFieldOpenExchangeTest, TestAnalyzeInfixSuggestions, DistributedSuggestComponentTest, TestHighFrequencyDictionaryFactory, AbstractAnalyticsFacetTest, QueryResultKeyTest, TestFreeTextSuggestions, TestIBSimilarityFactory, UpdateRequestProcessorFactoryTest, SoftAutoCommitTest, ScriptEngineTest, TriLevelCompositeIdRoutingTest, FieldMutatingUpdateProcessorTest, DistributedExpandComponentTest, HdfsBasicDistributedZkTest, TestAnalyzedSuggestions, DeleteShardTest, PrimitiveFieldTypeTest, TestFastOutputStream, ConnectionManagerTest, TestNonNRTOpen, WordBreakSolrSpellCheckerTest, QueryEqualityTest, HdfsDirectoryTest, TestBlendedInfixSuggestions, TestExtendedDismaxParser, TestDocSet, RecoveryZkTest, TestNonDefinedSimilarityFactory, TestLMJelinekMercerSimilarityFactory, ResponseLogComponentTest, TestInitQParser, DateMathParserTest, TestCollationField, TestSolrJ, QueryParsingTest, TestJoin, TermVectorComponentDistributedTest, TestSolrXmlPersistence, HardAutoCommitTest, TestSurroundQueryParser, ParsingFieldUpdateProcessorsTest, TestFieldTypeResource, TestReloadAndDeleteDocs, TestManagedSchema, MultiTermTest, DistanceFunctionTest, QueryElevationComponentTest, TestCloudManagedSchema, SimplePostToolTest, ChaosMonkeyNothingIsSafeTest, CoreAdminHandlerTest, HdfsWriteToMultipleCollectionsTest, ReturnFieldsTest, TestNoOpRegenerator, CopyFieldTest, RAMDirectoryFactoryTest, PeerSyncTest, TestCoreContainer, BasicDistributedZk2Test, PreAnalyzedFieldTest, TestConfigSets, TestSweetSpotSimilarityFactory, TestDistribDocBasedVersion, AssignTest, SolrCmdDistributorTest, TestNRTOpen, TestJmxIntegration, BasicDistributedZkTest, ChaosMonkeySafeLeaderTest, CollectionsAPIDistributedZkTest, SyncSliceTest, BasicZkTest, FullSolrCloudDistribCmdsTest, ClusterStateUpdateTest, LeaderElectionTest, ZkSolrClientTest, TestZkChroot, TestRandomDVFaceting, ShardRoutingCustomTest, TestDistributedSearch, TestFaceting, DistributedSpellCheckComponentTest, ZkControllerTest, TestRealTimeGet, TestMultiCoreConfBootstrap, TestReload, TestStressVersions, TestRangeQuery, SolrCoreTest, StatsComponentTest, SpellCheckComponentTest, TestGroupingSearch, ConvertedLegacyTest, TestSort, BasicFunctionalityTest, TestLazyCores, DirectUpdateHandlerTest, OverseerCollectionProcessorTest, TestIndexSearcher, HighlighterTest, CurrencyFieldXmlFileTest, TestCoreDiscovery, AnalysisAfterCoreReloadTest, SignatureUpdateProcessorFactoryTest, SuggesterFSTTest, SolrRequestParserTest, TestStressLucene, SpatialFilterTest, SuggesterWFSTTest, PolyFieldTest, NoCacheHeaderTest, SolrCoreCheckLockOnStartupTest, TestPseudoReturnFields, TestUpdate, TestAtomicUpdateErrorCases, StatelessScriptUpdateProcessorFactoryTest, TestRemoteStreaming, TestSolrDeletionPolicy1, SolrInfoMBeanTest, CacheHeaderTest, IndexBasedSpellCheckerTest, LukeRequestHandlerTest, DisMaxRequestHandlerTest, TestQueryUtils, DirectSolrSpellCheckerTest, DocumentAnalysisRequestHandlerTest, TestOmitPositions, FileBasedSpellCheckerTest, TermsComponentTest, RequestHandlersTest, DocumentBuilderTest, TestValueSourceCache, PathHierarchyTokenizerFactoryTest, TestIndexingPerformance, RequiredFieldsTest, FieldAnalysisRequestHandlerTest, TestSolrQueryParser, TestArbitraryIndexDir, FastVectorHighlighterTest, IndexSchemaRuntimeFieldTest, LoggingHandlerTest, IndexSchemaTest, JSONWriterTest, TestCSVResponseWriter, MBeansHandlerTest, UniqFieldsUpdateProcessorFactoryTest, BinaryUpdateRequestHandlerTest, TestPHPSerializedResponseWriter, CSVRequestHandlerTest, TestBinaryResponseWriter, TestLFUCache, SOLR749Test, UpdateParamsTest, AlternateDirectoryTest, TestSolrIndexConfig, TestQuerySenderNoQuery, BadComponentTest, TestMergePolicyConfig, SampleTest, TestBinaryField, NumericFieldsTest, MinimalSchemaTest, TestElisionMultitermQuery, TestConfig, OutputWriterTest, TestFuzzyAnalyzedSuggestions, ExternalFileFieldSortTest, DirectSolrConnectionTest, NotRequiredUniqueKeyTest, TestLuceneMatchVersion, TestPhraseSuggestions, SpellPossibilityIteratorTest, TestCharFilters, TestCodecSupport, TestPerFieldSimilarity, TestNumberUtils, TestDefaultSimilarityFactory, TestFastWriter, TestJmxMonitoredMap, TimeZoneUtilsTest, ResourceLoaderTest, OpenExchangeRatesOrgProviderTest, URLClassifyProcessorTest, TestFastLRUCache, TestSolrXMLSerializer, TestSystemIdResolver, TestSuggestSpellingConverter, DateFieldTest, SpellingQueryConverterTest, ClusterStateTest, TestLRUCache, TestUtils, TestDocumentBuilder, SystemInfoHandlerTest, CircularListTest, TestRTGBase, CursorPagingTest, SolrTestCaseJ4Test, TestCursorMarkWithoutUniqueKey, TestDistributedMissingSort, TestHighlightDedupGrouping, AbstractAnalyticsStatsTest, NoFacetTest, ExpressionTest, QueryFacetTest, AliasIntegrationTest, AsyncMigrateRouteKeyTest, DeleteInactiveReplicaTest, DeleteReplicaTest, OverseerStatusTest]
   [junit4] Completed in 48.52s, 1 test, 1 error <<< FAILURES!

[...truncated 1 lines...]
   [junit4] Suite: org.apache.solr.cloud.RemoteQueryErrorTest
   [junit4]   2> 3544398 T11643 oas.SolrTestCaseJ4.buildSSLConfig Randomized ssl (false) and clientAuth (true)
   [junit4]   2> 3544398 T11643 oas.BaseDistributedSearchTestCase.initHostContext Setting hostContext system property: /
   [junit4]   2> 3544405 T11643 oas.SolrTestCaseJ4.setUp ###Starting testDistribSearch
   [junit4]   2> Creating dataDir: C:\Users\JenkinsSlave\workspace\Lucene-Solr-trunk-Windows\solr\build\solr-core\test\J0\.\solrtest-RemoteQueryErrorTest-1395835395058
   [junit4]   2> 3544408 T11643 oasc.ZkTestServer.run STARTING ZK TEST SERVER
   [junit4]   2> 3544409 T11644 oasc.ZkTestServer$ZKServerMain.runFromConfig Starting server
   [junit4]   2> 3544520 T11643 oasc.ZkTestServer.run start zk server on port:51720
   [junit4]   2> 3544524 T11643 oascc.ConnectionManager.waitForConnected Waiting for client to connect to ZooKeeper
   [junit4]   2> 3544538 T11647 oazs.SyncRequestProcessor.run ERROR Severe unrecoverable error, exiting java.io.IOException: There is not enough space on the disk
   [junit4]   2> 	at sun.nio.ch.FileDispatcherImpl.pwrite0(Native Method)
   [junit4]   2> 	at sun.nio.ch.FileDispatcherImpl.pwrite(FileDispatcherImpl.java:80)
   [junit4]   2> 	at sun.nio.ch.IOUtil.writeFromNativeBuffer(IOUtil.java:89)
   [junit4]   2> 	at sun.nio.ch.IOUtil.write(IOUtil.java:51)
   [junit4]   2> 	at sun.nio.ch.FileChannelImpl.writeInternal(FileChannelImpl.java:738)
   [junit4]   2> 	at sun.nio.ch.FileChannelImpl.write(FileChannelImpl.java:720)
   [junit4]   2> 	at org.apache.zookeeper.server.persistence.Util.padLogFile(Util.java:219)
   [junit4]   2> 	at org.apache.zookeeper.server.persistence.FileTxnLog.padFile(FileTxnLog.java:237)
   [junit4]   2> 	at org.apache.zookeeper.server.persistence.FileTxnLog.append(FileTxnLog.java:215)
   [junit4]   2> 	at org.apache.zookeeper.server.persistence.FileTxnSnapLog.append(FileTxnSnapLog.java:314)
   [junit4]   2> 	at org.apache.zookeeper.server.ZKDatabase.append(ZKDatabase.java:476)
   [junit4]   2> 	at org.apache.zookeeper.server.SyncRequestProcessor.run(SyncRequestProcessor.java:140)
   [junit4]   2> 
   [junit4]   2> 144 T11647 ccr.RandomizedRunner$QueueUncaughtExceptionsHandler.uncaughtException WARNING Uncaught exception in thread: Thread[SyncThread:0,5,TGRP-RemoteQueryErrorTest] java.lang.SecurityException: java.lang.System#exit(11) calls are not allowed because they terminate the test runner's JVM.
   [junit4]   2> 	at __randomizedtesting.SeedInfo.seed([E46DFB6310126FB0]:0)
   [junit4]   2> 	at org.apache.lucene.util.TestSecurityManager$1.run(TestSecurityManager.java:82)
   [junit4]   2> 	at org.apache.lucene.util.TestSecurityManager$1.run(TestSecurityManager.java:51)
   [junit4]   2> 	at java.security.AccessController.doPrivileged(Native Method)
   [junit4]   2> 	at org.apache.lucene.util.TestSecurityManager.checkExit(TestSecurityManager.java:51)
   [junit4]   2> 	at java.lang.Runtime.exit(Runtime.java:107)
   [junit4]   2> 	at java.lang.System.exit(System.java:962)
   [junit4]   2> 	at org.apache.zookeeper.server.SyncRequestProcessor.run(SyncRequestProcessor.java:185)
   [junit4]   2> 
   [junit4]   2> !!!! WARNING: best effort to remove C:\Users\JenkinsSlave\workspace\Lucene-Solr-trunk-Windows\solr\build\solr-core\test\J0\.\org.apache.solr.cloud.RemoteQueryErrorTest-1395835395056\zookeeper\server1\data\version-2\log.1 FAILED !!!!!
   [junit4]   2> !!!! WARNING: best effort to remove C:\Users\JenkinsSlave\workspace\Lucene-Solr-trunk-Windows\solr\build\solr-core\test\J0\.\org.apache.solr.cloud.RemoteQueryErrorTest-1395835395056\zookeeper\server1\data\version-2 FAILED !!!!!
   [junit4]   2> !!!! WARNING: best effort to remove C:\Users\JenkinsSlave\workspace\Lucene-Solr-trunk-Windows\solr\build\solr-core\test\J0\.\org.apache.solr.cloud.RemoteQueryErrorTest-1395835395056\zookeeper\server1\data FAILED !!!!!
   [junit4]   2> !!!! WARNING: best effort to remove C:\Users\JenkinsSlave\workspace\Lucene-Solr-trunk-Windows\solr\build\solr-core\test\J0\.\org.apache.solr.cloud.RemoteQueryErrorTest-1395835395056\zookeeper\server1 FAILED !!!!!
   [junit4]   2> !!!! WARNING: best effort to remove C:\Users\JenkinsSlave\workspace\Lucene-Solr-trunk-Windows\solr\build\solr-core\test\J0\.\org.apache.solr.cloud.RemoteQueryErrorTest-1395835395056\zookeeper FAILED !!!!!
   [junit4]   2> !!!! WARNING: best effort to remove C:\Users\JenkinsSlave\workspace\Lucene-Solr-trunk-Windows\solr\build\solr-core\test\J0\.\org.apache.solr.cloud.RemoteQueryErrorTest-1395835395056 FAILED !!!!!
   [junit4]   2> 3590099 T11643 oas.SolrTestCaseJ4.tearDown ###Ending testDistribSearch
   [junit4]   2> 3590103 T11643 oasc.ZkTestServer.send4LetterWord connecting to 127.0.0.1:51720 51720
   [junit4]   1> client port:0.0.0.0/0.0.0.0:0
   [junit4]   2> NOTE: reproduce with: ant test  -Dtestcase=RemoteQueryErrorTest -Dtests.method=testDistribSearch -Dtests.seed=E46DFB6310126FB0 -Dtests.slow=true -Dtests.locale=es_EC -Dtests.timezone=Pacific/Tahiti -Dtests.file.encoding=Cp1252
   [junit4] ERROR   47.9s | RemoteQueryErrorTest.testDistribSearch <<<
   [junit4]    > Throwable #1: org.apache.solr.common.SolrException: java.util.concurrent.TimeoutException: Could not connect to ZooKeeper 127.0.0.1:51720 within 45000 ms
   [junit4]    > 	at org.apache.solr.common.cloud.SolrZkClient.<init>(SolrZkClient.java:150)
   [junit4]    > 	at org.apache.solr.common.cloud.SolrZkClient.<init>(SolrZkClient.java:101)
   [junit4]    > 	at org.apache.solr.common.cloud.SolrZkClient.<init>(SolrZkClient.java:91)
   [junit4]    > 	at org.apache.solr.cloud.AbstractZkTestCase.buildZooKeeper(AbstractZkTestCase.java:91)
   [junit4]    > 	at org.apache.solr.cloud.AbstractZkTestCase.buildZooKeeper(AbstractZkTestCase.java:85)
   [junit4]    > 	at org.apache.solr.cloud.AbstractDistribZkTestBase.setUp(AbstractDistribZkTestBase.java:77)
   [junit4]    > 	at org.apache.solr.cloud.AbstractFullDistribZkTestBase.setUp(AbstractFullDistribZkTestBase.java:201)
   [junit4]    > 	at java.lang.Thread.run(Thread.java:744)
   [junit4]    > Caused by: java.util.concurrent.TimeoutException: Could not connect to ZooKeeper 127.0.0.1:51720 within 45000 ms
   [junit4]    > 	at org.apache.solr.common.cloud.ConnectionManager.waitForConnected(ConnectionManager.java:223)
   [junit4]    > 	at org.apache.solr.common.cloud.SolrZkClient.<init>(SolrZkClient.java:142)
   [junit4]    > 	... 44 moreThrowable #2: com.carrotsearch.randomizedtesting.UncaughtExceptionError: Captured an uncaught exception in thread: Thread[id=11647, name=SyncThread:0, state=RUNNABLE, group=TGRP-RemoteQueryErrorTest]
   [junit4]    > Caused by: java.lang.SecurityException: java.lang.System#exit(11) calls are not allowed because they terminate the test runner's JVM.
   [junit4]    > 	at __randomizedtesting.SeedInfo.seed([E46DFB6310126FB0]:0)
   [junit4]    > 	at org.apache.lucene.util.TestSecurityManager$1.run(TestSecurityManager.java:82)
   [junit4]    > 	at org.apache.lucene.util.TestSecurityManager$1.run(TestSecurityManager.java:51)
   [junit4]    > 	at java.security.AccessController.doPrivileged(Native Method)
   [junit4]    > 	at org.apache.lucene.util.TestSecurityManager.checkExit(TestSecurityManager.java:51)
   [junit4]    > 	at java.lang.Runtime.exit(Runtime.java:107)
   [junit4]    > 	at java.lang.System.exit(System.java:962)
   [junit4]    > 	at org.apache.zookeeper.server.SyncRequestProcessor.run(SyncRequestProcessor.java:185)
   [junit4]   2> 3592304 T11643 oas.SolrTestCaseJ4.deleteCore ###deleteCore
   [junit4]   2> NOTE: test params are: codec=HighCompressionCompressingStoredFields(storedFieldsFormat=CompressingStoredFieldsFormat(compressionMode=HIGH_COMPRESSION, chunkSize=398), termVectorsFormat=CompressingTermVectorsFormat(compressionMode=HIGH_COMPRESSION, chunkSize=398)), sim=RandomSimilarityProvider(queryNorm=true,coord=no): {}, locale=es_EC, timezone=Pacific/Tahiti
   [junit4]   2> NOTE: Windows 7 6.1 x86/Oracle Corporation 1.7.0_51 (32-bit)/cpus=2,threads=1,free=102523528,total=389775360
   [junit4]   2> NOTE: All tests run in this JVM: [ShardSplitTest, JsonLoaderTest, TestStressReorder, TestCSVLoader, TestStressRecovery, TestSolrCoreProperties, SynonymTokenizerTest, TestSchemaResource, TermVectorComponentTest, PreAnalyzedUpdateProcessorTest, InfoHandlerTest, TestDFRSimilarityFactory, TestManagedSchemaFieldResource, TestFunctionQuery, TestManagedResourceStorage, OverseerTest, TestDynamicFieldCollectionResource, SuggesterTest, DocValuesTest, DistribCursorPagingTest, ZkCLITest, HighlighterConfigTest, DocValuesMultiTest, TestSolr4Spatial, TestDistributedGrouping, MoreLikeThisHandlerTest, StandardRequestHandlerTest, DirectUpdateHandlerOptimizeTest, CoreAdminRequestStatusTest, SearchHandlerTest, PluginInfoTest, BadIndexSchemaTest, SchemaVersionSpecificBehaviorTest, TestRecovery, SolrIndexConfigTest, DistributedQueryComponentOptimizationTest, TestDocBasedVersionConstraints, TestStressUserVersions, PrimUtilsTest, ShardRoutingTest, RegexBoostProcessorTest, PingRequestHandlerTest, TestDynamicFieldResource, LegacyHTMLStripCharFilterTest, BadCopyFieldTest, TestInfoStreamLogging, SSLMigrationTest, TestBM25SimilarityFactory, DefaultValueUpdateProcessorTest, CollectionsAPIAsyncDistributedZkTest, TestManagedResource, FileUtilsTest, TestShardHandlerFactory, TestQuerySenderListener, TestWordDelimiterFilterFactory, DistributedQueryElevationComponentTest, TestRandomFaceting, HdfsSyncSliceTest, AddSchemaFieldsUpdateProcessorFactoryTest, SolrXmlInZkTest, TestFieldSortValues, TestFiltering, EnumFieldTest, ModifyConfFileTest, SolrPluginUtilsTest, TestCollationFieldDocValues, TestReplicationHandler, SliceStateUpdateTest, BlockCacheTest, OverseerRolesTest, TestPartialUpdateDeduplication, TestWriterPerf, SliceStateTest, TestStandardQParsers, DebugComponentTest, CustomCollectionTest, TestLMDirichletSimilarityFactory, EchoParamsTest, ShowFileRequestHandlerTest, CoreContainerCoreInitFailuresTest, TestMiniSolrCloudCluster, TestSimpleQParserPlugin, SuggesterTSTTest, FunctionTest, CoreAdminCreateDiscoverTest, RangeFacetTest, TestExceedMaxTermLength, UnloadDistributedZkTest, ZkNodePropsTest, TestExpandComponent, TestHashPartitioner, MigrateRouteKeyTest, XmlUpdateRequestHandlerTest, UUIDFieldTest, TestTrie, XsltUpdateRequestHandlerTest, AutoCommitTest, TestBadConfig, DistributedDebugComponentTest, TestSearcherReuse, DistributedTermsComponentTest, TestSolrQueryParserDefaultOperatorResource, TestCloudManagedSchemaAddField, SpellCheckCollatorTest, TestSolrDeletionPolicy2, SimpleFacetsTest, ChangedSchemaMergeTest, OpenCloseCoreStressTest, TestSearchPerf, TestReversedWildcardFilterFactory, TestManagedStopFilterFactory, DocValuesMissingTest, SortByFunctionTest, TestComponentsName, TestPostingsSolrHighlighter, FieldFacetExtrasTest, TestQueryTypes, DOMUtilTest, TestXIncludeConfig, TestFoldingMultitermQuery, CursorMarkTest, LeaderElectionIntegrationTest, SolrIndexSplitterTest, CurrencyFieldOpenExchangeTest, TestAnalyzeInfixSuggestions, DistributedSuggestComponentTest, TestHighFrequencyDictionaryFactory, AbstractAnalyticsFacetTest, QueryResultKeyTest, TestFreeTextSuggestions, TestIBSimilarityFactory, UpdateRequestProcessorFactoryTest, SoftAutoCommitTest, ScriptEngineTest, TriLevelCompositeIdRoutingTest, FieldMutatingUpdateProcessorTest, DistributedExpandComponentTest, HdfsBasicDistributedZkTest, TestAnalyzedSuggestions, DeleteShardTest, PrimitiveFieldTypeTest, TestFastOutputStream, ConnectionManagerTest, TestNonNRTOpen, WordBreakSolrSpellCheckerTest, QueryEqualityTest, HdfsDirectoryTest, TestBlendedInfixSuggestions, TestExtendedDismaxParser, TestDocSet, RecoveryZkTest, TestNonDefinedSimilarityFactory, TestLMJelinekMercerSimilarityFactory, ResponseLogComponentTest, TestInitQParser, DateMathParserTest, TestCollationField, TestSolrJ, QueryParsingTest, TestJoin, TermVectorComponentDistributedTest, TestSolrXmlPersistence, HardAutoCommitTest, TestSurroundQueryParser, ParsingFieldUpdateProcessorsTest, TestFieldTypeResource, TestReloadAndDeleteDocs, TestManagedSchema, MultiTermTest, DistanceFunctionTest, QueryElevationComponentTest, TestCloudManagedSchema, SimplePostToolTest, ChaosMonkeyNothingIsSafeTest, CoreAdminHandlerTest, HdfsWriteToMultipleCollectionsTest, ReturnFieldsTest, TestNoOpRegenerator, CopyFieldTest, RAMDirectoryFactoryTest, PeerSyncTest, TestCoreContainer, BasicDistributedZk2Test, PreAnalyzedFieldTest, TestConfigSets, TestSweetSpotSimilarityFactory, TestDistribDocBasedVersion, AssignTest, SolrCmdDistributorTest, TestNRTOpen, TestJmxIntegration, BasicDistributedZkTest, ChaosMonkeySafeLeaderTest, CollectionsAPIDistributedZkTest, SyncSliceTest, BasicZkTest, FullSolrCloudDistribCmdsTest, ClusterStateUpdateTest, LeaderElectionTest, ZkSolrClientTest, TestZkChroot, TestRandomDVFaceting, ShardRoutingCustomTest, TestDistributedSearch, TestFaceting, DistributedSpellCheckComponentTest, ZkControllerTest, TestRealTimeGet, TestMultiCoreConfBootstrap, TestReload, TestStressVersions, TestRangeQuery, SolrCoreTest, StatsComponentTest, SpellCheckComponentTest, TestGroupingSearch, ConvertedLegacyTest, TestSort, BasicFunctionalityTest, TestLazyCores, DirectUpdateHandlerTest, OverseerCollectionProcessorTest, TestIndexSearcher, HighlighterTest, CurrencyFieldXmlFileTest, TestCoreDiscovery, AnalysisAfterCoreReloadTest, SignatureUpdateProcessorFactoryTest, SuggesterFSTTest, SolrRequestParserTest, TestStressLucene, SpatialFilterTest, SuggesterWFSTTest, PolyFieldTest, NoCacheHeaderTest, SolrCoreCheckLockOnStartupTest, TestPseudoReturnFields, TestUpdate, TestAtomicUpdateErrorCases, StatelessScriptUpdateProcessorFactoryTest, TestRemoteStreaming, TestSolrDeletionPolicy1, SolrInfoMBeanTest, CacheHeaderTest, IndexBasedSpellCheckerTest, LukeRequestHandlerTest, DisMaxRequestHandlerTest, TestQueryUtils, DirectSolrSpellCheckerTest, DocumentAnalysisRequestHandlerTest, TestOmitPositions, FileBasedSpellCheckerTest, TermsComponentTest, RequestHandlersTest, DocumentBuilderTest, TestValueSourceCache, PathHierarchyTokenizerFactoryTest, TestIndexingPerformance, RequiredFieldsTest, FieldAnalysisRequestHandlerTest, TestSolrQueryParser, TestArbitraryIndexDir, FastVectorHighlighterTest, IndexSchemaRuntimeFieldTest, LoggingHandlerTest, IndexSchemaTest, JSONWriterTest, TestCSVResponseWriter, MBeansHandlerTest, UniqFieldsUpdateProcessorFactoryTest, BinaryUpdateRequestHandlerTest, TestPHPSerializedResponseWriter, CSVRequestHandlerTest, TestBinaryResponseWriter, TestLFUCache, SOLR749Test, UpdateParamsTest, AlternateDirectoryTest, TestSolrIndexConfig, TestQuerySenderNoQuery, BadComponentTest, TestMergePolicyConfig, SampleTest, TestBinaryField, NumericFieldsTest, MinimalSchemaTest, TestElisionMultitermQuery, TestConfig, OutputWriterTest, TestFuzzyAnalyzedSuggestions, ExternalFileFieldSortTest, DirectSolrConnectionTest, NotRequiredUniqueKeyTest, TestLuceneMatchVersion, TestPhraseSuggestions, SpellPossibilityIteratorTest, TestCharFilters, TestCodecSupport, TestPerFieldSimilarity, TestNumberUtils, TestDefaultSimilarityFactory, TestFastWriter, TestJmxMonitoredMap, TimeZoneUtilsTest, ResourceLoaderTest, OpenExchangeRatesOrgProviderTest, URLClassifyProcessorTest, TestFastLRUCache, TestSolrXMLSerializer, TestSystemIdResolver, TestSuggestSpellingConverter, DateFieldTest, SpellingQueryConverterTest, ClusterStateTest, TestLRUCache, TestUtils, TestDocumentBuilder, SystemInfoHandlerTest, CircularListTest, TestRTGBase, CursorPagingTest, SolrTestCaseJ4Test, TestCursorMarkWithoutUniqueKey, TestDistributedMissingSort, TestHighlightDedupGrouping, AbstractAnalyticsStatsTest, NoFacetTest, ExpressionTest, QueryFacetTest, AliasIntegrationTest, AsyncMigrateRouteKeyTest, DeleteInactiveReplicaTest, DeleteReplicaTest, OverseerStatusTest, RemoteQueryErrorTest]
   [junit4] Completed in 47.96s, 1 test, 1 error <<< FAILURES!

[...truncated 1 lines...]
   [junit4] Suite: org.apache.solr.cloud.TestModifyConfFiles
   [junit4]   2> 3592590 T11652 oas.SolrTestCaseJ4.buildSSLConfig Randomized ssl (true) and clientAuth (true)
   [junit4]   2> 3592590 T11652 oas.BaseDistributedSearchTestCase.initHostContext Setting hostContext system property: /f_yqh/vk
   [junit4]   2> 3592596 T11652 oas.SolrTestCaseJ4.setUp ###Starting testDistribSearch
   [junit4]   2> Creating dataDir: C:\Users\JenkinsSlave\workspace\Lucene-Solr-trunk-Windows\solr\build\solr-core\test\J0\.\solrtest-TestModifyConfFiles-1395835443249
   [junit4]   2> 3592600 T11652 oasc.ZkTestServer.run STARTING ZK TEST SERVER
   [junit4]   2> 3592602 T11653 oasc.ZkTestServer$ZKServerMain.runFromConfig Starting server
   [junit4]   2> 3592699 T11652 oasc.ZkTestServer.run start zk server on port:51729
   [junit4]   2> 3592703 T11652 oascc.ConnectionManager.waitForConnected Waiting for client to connect to ZooKeeper
   [junit4]   2> 3592707 T11656 oazs.SyncRequestProcessor.run ERROR Severe unrecoverable error, exiting java.io.IOException: There is not enough space on the disk
   [junit4]   2> 	at sun.nio.ch.FileDispatcherImpl.pwrite0(Native Method)
   [junit4]   2> 	at sun.nio.ch.FileDispatcherImpl.pwrite(FileDispatcherImpl.java:80)
   [junit4]   2> 	at sun.nio.ch.IOUtil.writeFromNativeBuffer(IOUtil.java:89)
   [junit4]   2> 	at sun.nio.ch.IOUtil.write(IOUtil.java:51)
   [junit4]   2> 	at sun.nio.ch.FileChannelImpl.writeInternal(FileChannelImpl.java:738)
   [junit4]   2> 	at sun.nio.ch.FileChannelImpl.write(FileChannelImpl.java:720)
   [junit4]   2> 	at org.apache.zookeeper.server.persistence.Util.padLogFile(Util.java:219)
   [junit4]   2> 	at org.apache.zookeeper.server.persistence.FileTxnLog.padFile(FileTxnLog.java:237)
   [junit4]   2> 	at org.apache.zookeeper.server.persistence.FileTxnLog.append(FileTxnLog.java:215)
   [junit4]   2> 	at org.apache.zookeeper.server.persistence.FileTxnSnapLog.append(FileTxnSnapLog.java:314)
   [junit4]   2> 	at org.apache.zookeeper.server.ZKDatabase.append(ZKDatabase.java:476)
   [junit4]   2> 	at org.apache.zookeeper.server.SyncRequestProcessor.run(SyncRequestProcessor.java:140)
   [junit4]   2> 
   [junit4]   2> 120 T11656 ccr.RandomizedRunner$QueueUncaughtExceptionsHandler.uncaughtException WARNING Uncaught exception in thread: Thread[SyncThread:0,5,TGRP-TestModifyConfFiles] java.lang.SecurityException: java.lang.System#exit(11) calls are not allowed because they terminate the test runner's JVM.
   [junit4]   2> 	at __randomizedtesting.SeedInfo.seed([E46DFB6310126FB0]:0)
   [junit4]   2> 	at org.apache.lucene.util.TestSecurityManager$1.run(TestSecurityManager.java:82)
   [junit4]   2> 	at org.apache.lucene.util.TestSecurityManager$1.run(TestSecurityManager.java:51)
   [junit4]   2> 	at java.security.AccessController.doPrivileged(Native Method)
   [junit4]   2> 	at org.apache.lucene.util.TestSecurityManager.checkExit(TestSecurityManager.java:51)
   [junit4]   2> 	at java.lang.Runtime.exit(Runtime.java:107)
   [junit4]   2> 	at java.lang.System.exit(System.java:962)
   [junit4]   2> 	at org.apache.zookeeper.server.SyncRequestProcessor.run(SyncRequestProcessor.java:185)
   [junit4]   2> 
   [junit4]   2> !!!! WARNING: best effort to remove C:\Users\JenkinsSlave\workspace\Lucene-Solr-trunk-Windows\solr\build\solr-core\test\J0\.\org.apache.solr.cloud.TestModifyConfFiles-1395835443248\zookeeper\server1\data\version-2\log.1 FAILED !!!!!
   [junit4]   2> !!!! WARNING: best effort to remove C:\Users\JenkinsSlave\workspace\Lucene-Solr-trunk-Windows\solr\build\solr-core\tes

[...truncated too long message...]

sorTest, InfoHandlerTest, TestDFRSimilarityFactory, TestManagedSchemaFieldResource, TestFunctionQuery, TestManagedResourceStorage, OverseerTest, TestDynamicFieldCollectionResource, SuggesterTest, DocValuesTest, DistribCursorPagingTest, ZkCLITest, HighlighterConfigTest, DocValuesMultiTest, TestSolr4Spatial, TestDistributedGrouping, MoreLikeThisHandlerTest, StandardRequestHandlerTest, DirectUpdateHandlerOptimizeTest, CoreAdminRequestStatusTest, SearchHandlerTest, PluginInfoTest, BadIndexSchemaTest, SchemaVersionSpecificBehaviorTest, TestRecovery, SolrIndexConfigTest, DistributedQueryComponentOptimizationTest, TestDocBasedVersionConstraints, TestStressUserVersions, PrimUtilsTest, ShardRoutingTest, RegexBoostProcessorTest, PingRequestHandlerTest, TestDynamicFieldResource, LegacyHTMLStripCharFilterTest, BadCopyFieldTest, TestInfoStreamLogging, SSLMigrationTest, TestBM25SimilarityFactory, DefaultValueUpdateProcessorTest, CollectionsAPIAsyncDistributedZkTest, TestManagedResource, FileUtilsTest, TestShardHandlerFactory, TestQuerySenderListener, TestWordDelimiterFilterFactory, DistributedQueryElevationComponentTest, TestRandomFaceting, HdfsSyncSliceTest, AddSchemaFieldsUpdateProcessorFactoryTest, SolrXmlInZkTest, TestFieldSortValues, TestFiltering, EnumFieldTest, ModifyConfFileTest, SolrPluginUtilsTest, TestCollationFieldDocValues, TestReplicationHandler, SliceStateUpdateTest, BlockCacheTest, OverseerRolesTest, TestPartialUpdateDeduplication, TestWriterPerf, SliceStateTest, TestStandardQParsers, DebugComponentTest, CustomCollectionTest, TestLMDirichletSimilarityFactory, EchoParamsTest, ShowFileRequestHandlerTest, CoreContainerCoreInitFailuresTest, TestMiniSolrCloudCluster, TestSimpleQParserPlugin, SuggesterTSTTest, FunctionTest, CoreAdminCreateDiscoverTest, RangeFacetTest, TestExceedMaxTermLength, UnloadDistributedZkTest, ZkNodePropsTest, TestExpandComponent, TestHashPartitioner, MigrateRouteKeyTest, XmlUpdateRequestHandlerTest, UUIDFieldTest, TestTrie, XsltUpdateRequestHandlerTest, AutoCommitTest, TestBadConfig, DistributedDebugComponentTest, TestSearcherReuse, DistributedTermsComponentTest, TestSolrQueryParserDefaultOperatorResource, TestCloudManagedSchemaAddField, SpellCheckCollatorTest, TestSolrDeletionPolicy2, SimpleFacetsTest, ChangedSchemaMergeTest, OpenCloseCoreStressTest, TestSearchPerf, TestReversedWildcardFilterFactory, TestManagedStopFilterFactory, DocValuesMissingTest, SortByFunctionTest, TestComponentsName, TestPostingsSolrHighlighter, FieldFacetExtrasTest, TestQueryTypes, DOMUtilTest, TestXIncludeConfig, TestFoldingMultitermQuery, CursorMarkTest, LeaderElectionIntegrationTest, SolrIndexSplitterTest, CurrencyFieldOpenExchangeTest, TestAnalyzeInfixSuggestions, DistributedSuggestComponentTest, TestHighFrequencyDictionaryFactory, AbstractAnalyticsFacetTest, QueryResultKeyTest, TestFreeTextSuggestions, TestIBSimilarityFactory, UpdateRequestProcessorFactoryTest, SoftAutoCommitTest, ScriptEngineTest, TriLevelCompositeIdRoutingTest, FieldMutatingUpdateProcessorTest, DistributedExpandComponentTest, HdfsBasicDistributedZkTest, TestAnalyzedSuggestions, DeleteShardTest, PrimitiveFieldTypeTest, TestFastOutputStream, ConnectionManagerTest, TestNonNRTOpen, WordBreakSolrSpellCheckerTest, QueryEqualityTest, HdfsDirectoryTest, TestBlendedInfixSuggestions, TestExtendedDismaxParser, TestDocSet, RecoveryZkTest, TestNonDefinedSimilarityFactory, TestLMJelinekMercerSimilarityFactory, ResponseLogComponentTest, TestInitQParser, DateMathParserTest, TestCollationField, TestSolrJ, QueryParsingTest, TestJoin, TermVectorComponentDistributedTest, TestSolrXmlPersistence, HardAutoCommitTest, TestSurroundQueryParser, ParsingFieldUpdateProcessorsTest, TestFieldTypeResource, TestReloadAndDeleteDocs, TestManagedSchema, MultiTermTest, DistanceFunctionTest, QueryElevationComponentTest, TestCloudManagedSchema, SimplePostToolTest, ChaosMonkeyNothingIsSafeTest, CoreAdminHandlerTest, HdfsWriteToMultipleCollectionsTest, ReturnFieldsTest, TestNoOpRegenerator, CopyFieldTest, RAMDirectoryFactoryTest, PeerSyncTest, TestCoreContainer, BasicDistributedZk2Test, PreAnalyzedFieldTest, TestConfigSets, TestSweetSpotSimilarityFactory, TestDistribDocBasedVersion, AssignTest, SolrCmdDistributorTest, TestNRTOpen, TestJmxIntegration, BasicDistributedZkTest, ChaosMonkeySafeLeaderTest, CollectionsAPIDistributedZkTest, SyncSliceTest, BasicZkTest, FullSolrCloudDistribCmdsTest, ClusterStateUpdateTest, LeaderElectionTest, ZkSolrClientTest, TestZkChroot, TestRandomDVFaceting, ShardRoutingCustomTest, TestDistributedSearch, TestFaceting, DistributedSpellCheckComponentTest, ZkControllerTest, TestRealTimeGet, TestMultiCoreConfBootstrap, TestReload, TestStressVersions, TestRangeQuery, SolrCoreTest, StatsComponentTest, SpellCheckComponentTest, TestGroupingSearch, ConvertedLegacyTest, TestSort, BasicFunctionalityTest, TestLazyCores, DirectUpdateHandlerTest, OverseerCollectionProcessorTest, TestIndexSearcher, HighlighterTest, CurrencyFieldXmlFileTest, TestCoreDiscovery, AnalysisAfterCoreReloadTest, SignatureUpdateProcessorFactoryTest, SuggesterFSTTest, SolrRequestParserTest, TestStressLucene, SpatialFilterTest, SuggesterWFSTTest, PolyFieldTest, NoCacheHeaderTest, SolrCoreCheckLockOnStartupTest, TestPseudoReturnFields, TestUpdate, TestAtomicUpdateErrorCases, StatelessScriptUpdateProcessorFactoryTest, TestRemoteStreaming, TestSolrDeletionPolicy1, SolrInfoMBeanTest, CacheHeaderTest, IndexBasedSpellCheckerTest, LukeRequestHandlerTest, DisMaxRequestHandlerTest, TestQueryUtils, DirectSolrSpellCheckerTest, DocumentAnalysisRequestHandlerTest, TestOmitPositions, FileBasedSpellCheckerTest, TermsComponentTest, RequestHandlersTest, DocumentBuilderTest, TestValueSourceCache, PathHierarchyTokenizerFactoryTest, TestIndexingPerformance, RequiredFieldsTest, FieldAnalysisRequestHandlerTest, TestSolrQueryParser, TestArbitraryIndexDir, FastVectorHighlighterTest, IndexSchemaRuntimeFieldTest, LoggingHandlerTest, IndexSchemaTest, JSONWriterTest, TestCSVResponseWriter, MBeansHandlerTest, UniqFieldsUpdateProcessorFactoryTest, BinaryUpdateRequestHandlerTest, TestPHPSerializedResponseWriter, CSVRequestHandlerTest, TestBinaryResponseWriter, TestLFUCache, SOLR749Test, UpdateParamsTest, AlternateDirectoryTest, TestSolrIndexConfig, TestQuerySenderNoQuery, BadComponentTest, TestMergePolicyConfig, SampleTest, TestBinaryField, NumericFieldsTest, MinimalSchemaTest, TestElisionMultitermQuery, TestConfig, OutputWriterTest, TestFuzzyAnalyzedSuggestions, ExternalFileFieldSortTest, DirectSolrConnectionTest, NotRequiredUniqueKeyTest, TestLuceneMatchVersion, TestPhraseSuggestions, SpellPossibilityIteratorTest, TestCharFilters, TestCodecSupport, TestPerFieldSimilarity, TestNumberUtils, TestDefaultSimilarityFactory, TestFastWriter, TestJmxMonitoredMap, TimeZoneUtilsTest, ResourceLoaderTest, OpenExchangeRatesOrgProviderTest, URLClassifyProcessorTest, TestFastLRUCache, TestSolrXMLSerializer, TestSystemIdResolver, TestSuggestSpellingConverter, DateFieldTest, SpellingQueryConverterTest, ClusterStateTest, TestLRUCache, TestUtils, TestDocumentBuilder, SystemInfoHandlerTest, CircularListTest, TestRTGBase, CursorPagingTest, SolrTestCaseJ4Test, TestCursorMarkWithoutUniqueKey, TestDistributedMissingSort, TestHighlightDedupGrouping, AbstractAnalyticsStatsTest, NoFacetTest, ExpressionTest, QueryFacetTest, AliasIntegrationTest, AsyncMigrateRouteKeyTest, DeleteInactiveReplicaTest, DeleteReplicaTest, OverseerStatusTest, RemoteQueryErrorTest, TestModifyConfFiles, TestRequestStatusCollectionAPI, TestShortCircuitedRequests, HdfsBasicDistributedZk2Test, HdfsChaosMonkeySafeLeaderTest, HdfsCollectionsAPIDistributedZkTest, HdfsRecoveryZkTest, HdfsUnloadDistributedZkTest, StressHdfsTest, CachingDirectoryFactoryTest, TestImplicitCoreProperties, TestSolrXml, TestSolrXmlPersistor, CoreMergeIndexesAdminHandlerTest, DistributedQueryComponentCustomSortTest, SuggestComponentTest, TestRestManager, TestClassNameShortening, TestCopyFieldCollectionResource, TestDefaultSearchFieldResource, TestFieldCollectionResource, TestFieldResource, TestFieldTypeCollectionResource, TestSchemaNameResource, TestSchemaSimilarityResource, TestSchemaVersionResource, TestSerializedLuceneMatchVersion, TestSolrQueryParserResource, TestUniqueKeyFieldResource, TestAddFieldRealTimeGet, TestCollapseQParserPlugin, TestComplexPhraseQParserPlugin, TestCustomSort, TestMaxScoreQueryParser, TestOverriddenPrefixQueryForCustomFieldType, TestRecoveryHdfs, BJQParserTest, TestFileDictionaryLookup, BlockDirectoryTest]
   [junit4] Completed in 5.77s, 4 tests, 2 errors <<< FAILURES!

[...truncated 28 lines...]
BUILD FAILED
C:\Users\JenkinsSlave\workspace\Lucene-Solr-trunk-Windows\build.xml:467: The following error occurred while executing this line:
C:\Users\JenkinsSlave\workspace\Lucene-Solr-trunk-Windows\build.xml:447: The following error occurred while executing this line:
C:\Users\JenkinsSlave\workspace\Lucene-Solr-trunk-Windows\build.xml:45: The following error occurred while executing this line:
C:\Users\JenkinsSlave\workspace\Lucene-Solr-trunk-Windows\extra-targets.xml:37: The following error occurred while executing this line:
C:\Users\JenkinsSlave\workspace\Lucene-Solr-trunk-Windows\solr\build.xml:189: The following error occurred while executing this line:
C:\Users\JenkinsSlave\workspace\Lucene-Solr-trunk-Windows\solr\common-build.xml:490: The following error occurred while executing this line:
C:\Users\JenkinsSlave\workspace\Lucene-Solr-trunk-Windows\lucene\common-build.xml:1275: The following error occurred while executing this line:
C:\Users\JenkinsSlave\workspace\Lucene-Solr-trunk-Windows\lucene\common-build.xml:907: There were test failures: 393 suites, 1651 tests, 8 errors, 54 ignored (33 assumptions)

Total time: 92 minutes 55 seconds
Build step 'Invoke Ant' marked build as failure
Description set: Java: 32bit/jdk1.7.0_51 -server -XX:+UseConcMarkSweepGC
Archiving artifacts
Recording test results
Email was triggered for: Failure
Sending email for trigger: Failure



Mime
View raw message