lucene-dev mailing list archives

Site index · List index
Message view « Date » · « Thread »
Top « Date » · « Thread »
From Apache Jenkins Server <jenk...@builds.apache.org>
Subject [JENKINS-MAVEN] Lucene-Solr-Maven-trunk #1122: POMs out of sync
Date Sat, 08 Mar 2014 06:47:10 GMT
Build: https://builds.apache.org/job/Lucene-Solr-Maven-trunk/1122/

1 tests failed.
FAILED:  org.apache.solr.cloud.ChaosMonkeyNothingIsSafeTest.testDistribSearch

Error Message:
shard2 is not consistent.  Got 1049 from http://127.0.0.1:64635/ck_lez/ua/collection1lastClient
and got 1051 from http://127.0.0.1:49109/ck_lez/ua/collection1

Stack Trace:
java.lang.AssertionError: shard2 is not consistent.  Got 1049 from http://127.0.0.1:64635/ck_lez/ua/collection1lastClient
and got 1051 from http://127.0.0.1:49109/ck_lez/ua/collection1
	at __randomizedtesting.SeedInfo.seed([925F39D71B556AB5:13B9B7CF6C0A0A89]:0)
	at org.junit.Assert.fail(Assert.java:93)
	at org.apache.solr.cloud.AbstractFullDistribZkTestBase.checkShardConsistency(AbstractFullDistribZkTestBase.java:1230)
	at org.apache.solr.cloud.AbstractFullDistribZkTestBase.checkShardConsistency(AbstractFullDistribZkTestBase.java:1209)
	at org.apache.solr.cloud.ChaosMonkeyNothingIsSafeTest.doTest(ChaosMonkeyNothingIsSafeTest.java:218)




Build Log:
[...truncated 53195 lines...]
BUILD FAILED
/usr/home/hudson/hudson-slave/workspace/Lucene-Solr-Maven-trunk/build.xml:488: The following
error occurred while executing this line:
/usr/home/hudson/hudson-slave/workspace/Lucene-Solr-Maven-trunk/build.xml:176: The following
error occurred while executing this line:
/usr/home/hudson/hudson-slave/workspace/Lucene-Solr-Maven-trunk/extra-targets.xml:77: Java
returned: 1

Total time: 152 minutes 56 seconds
Build step 'Invoke Ant' marked build as failure
Recording test results
Email was triggered for: Failure
Sending email for trigger: Failure



Mime
View raw message