lucene-dev mailing list archives

Site index · List index
Message view « Date » · « Thread »
Top « Date » · « Thread »
From Policeman Jenkins Server <jenk...@thetaphi.de>
Subject [JENKINS] Lucene-Solr-trunk-MacOSX (64bit/jdk1.8.0) - Build # 1422 - Failure!
Date Wed, 19 Mar 2014 10:54:20 GMT
Build: http://jenkins.thetaphi.de/job/Lucene-Solr-trunk-MacOSX/1422/
Java: 64bit/jdk1.8.0 -XX:-UseCompressedOops -XX:+UseG1GC

6 tests failed.
REGRESSION:  org.apache.solr.cloud.TestRequestStatusCollectionAPI.testDistribSearch

Error Message:


Stack Trace:
org.apache.solr.common.cloud.ZooKeeperException: 
	at __randomizedtesting.SeedInfo.seed([8B8B23D7E462D52:895E3C2509194D6E]:0)
	at org.apache.solr.client.solrj.impl.CloudSolrServer.connect(CloudSolrServer.java:249)
	at org.apache.solr.cloud.AbstractFullDistribZkTestBase.initCloud(AbstractFullDistribZkTestBase.java:256)
	at org.apache.solr.cloud.AbstractFullDistribZkTestBase.createServers(AbstractFullDistribZkTestBase.java:312)
	at org.apache.solr.BaseDistributedSearchTestCase.testDistribSearch(BaseDistributedSearchTestCase.java:868)
	at sun.reflect.NativeMethodAccessorImpl.invoke0(Native Method)
	at sun.reflect.NativeMethodAccessorImpl.invoke(NativeMethodAccessorImpl.java:62)
	at sun.reflect.DelegatingMethodAccessorImpl.invoke(DelegatingMethodAccessorImpl.java:43)
	at java.lang.reflect.Method.invoke(Method.java:483)
	at com.carrotsearch.randomizedtesting.RandomizedRunner.invoke(RandomizedRunner.java:1617)
	at com.carrotsearch.randomizedtesting.RandomizedRunner$6.evaluate(RandomizedRunner.java:826)
	at com.carrotsearch.randomizedtesting.RandomizedRunner$7.evaluate(RandomizedRunner.java:862)
	at com.carrotsearch.randomizedtesting.RandomizedRunner$8.evaluate(RandomizedRunner.java:876)
	at com.carrotsearch.randomizedtesting.rules.SystemPropertiesRestoreRule$1.evaluate(SystemPropertiesRestoreRule.java:53)
	at org.apache.lucene.util.TestRuleSetupTeardownChained$1.evaluate(TestRuleSetupTeardownChained.java:50)
	at org.apache.lucene.util.TestRuleFieldCacheSanity$1.evaluate(TestRuleFieldCacheSanity.java:51)
	at org.apache.lucene.util.AbstractBeforeAfterRule$1.evaluate(AbstractBeforeAfterRule.java:46)
	at com.carrotsearch.randomizedtesting.rules.SystemPropertiesInvariantRule$1.evaluate(SystemPropertiesInvariantRule.java:55)
	at org.apache.lucene.util.TestRuleThreadAndTestName$1.evaluate(TestRuleThreadAndTestName.java:49)
	at org.apache.lucene.util.TestRuleIgnoreAfterMaxFailures$1.evaluate(TestRuleIgnoreAfterMaxFailures.java:70)
	at org.apache.lucene.util.TestRuleMarkFailure$1.evaluate(TestRuleMarkFailure.java:48)
	at com.carrotsearch.randomizedtesting.rules.StatementAdapter.evaluate(StatementAdapter.java:36)
	at com.carrotsearch.randomizedtesting.ThreadLeakControl$StatementRunner.run(ThreadLeakControl.java:359)
	at com.carrotsearch.randomizedtesting.ThreadLeakControl.forkTimeoutingTask(ThreadLeakControl.java:783)
	at com.carrotsearch.randomizedtesting.ThreadLeakControl$3.evaluate(ThreadLeakControl.java:443)
	at com.carrotsearch.randomizedtesting.RandomizedRunner.runSingleTest(RandomizedRunner.java:835)
	at com.carrotsearch.randomizedtesting.RandomizedRunner$3.evaluate(RandomizedRunner.java:737)
	at com.carrotsearch.randomizedtesting.RandomizedRunner$4.evaluate(RandomizedRunner.java:771)
	at com.carrotsearch.randomizedtesting.RandomizedRunner$5.evaluate(RandomizedRunner.java:782)
	at com.carrotsearch.randomizedtesting.rules.StatementAdapter.evaluate(StatementAdapter.java:36)
	at com.carrotsearch.randomizedtesting.rules.SystemPropertiesRestoreRule$1.evaluate(SystemPropertiesRestoreRule.java:53)
	at org.apache.lucene.util.AbstractBeforeAfterRule$1.evaluate(AbstractBeforeAfterRule.java:46)
	at org.apache.lucene.util.TestRuleStoreClassName$1.evaluate(TestRuleStoreClassName.java:42)
	at com.carrotsearch.randomizedtesting.rules.SystemPropertiesInvariantRule$1.evaluate(SystemPropertiesInvariantRule.java:55)
	at com.carrotsearch.randomizedtesting.rules.NoShadowingOrOverridesOnMethodsRule$1.evaluate(NoShadowingOrOverridesOnMethodsRule.java:39)
	at com.carrotsearch.randomizedtesting.rules.NoShadowingOrOverridesOnMethodsRule$1.evaluate(NoShadowingOrOverridesOnMethodsRule.java:39)
	at com.carrotsearch.randomizedtesting.rules.StatementAdapter.evaluate(StatementAdapter.java:36)
	at org.apache.lucene.util.TestRuleAssertionsRequired$1.evaluate(TestRuleAssertionsRequired.java:43)
	at org.apache.lucene.util.TestRuleMarkFailure$1.evaluate(TestRuleMarkFailure.java:48)
	at org.apache.lucene.util.TestRuleIgnoreAfterMaxFailures$1.evaluate(TestRuleIgnoreAfterMaxFailures.java:70)
	at org.apache.lucene.util.TestRuleIgnoreTestSuites$1.evaluate(TestRuleIgnoreTestSuites.java:55)
	at com.carrotsearch.randomizedtesting.rules.StatementAdapter.evaluate(StatementAdapter.java:36)
	at com.carrotsearch.randomizedtesting.ThreadLeakControl$StatementRunner.run(ThreadLeakControl.java:359)
	at java.lang.Thread.run(Thread.java:744)
Caused by: org.apache.zookeeper.KeeperException$NoNodeException: KeeperErrorCode = NoNode for /live_nodes
	at org.apache.zookeeper.KeeperException.create(KeeperException.java:111)
	at org.apache.zookeeper.KeeperException.create(KeeperException.java:51)
	at org.apache.zookeeper.ZooKeeper.getChildren(ZooKeeper.java:1468)
	at org.apache.solr.common.cloud.SolrZkClient$6.execute(SolrZkClient.java:259)
	at org.apache.solr.common.cloud.SolrZkClient$6.execute(SolrZkClient.java:256)
	at org.apache.solr.common.cloud.ZkCmdExecutor.retryOperation(ZkCmdExecutor.java:73)
	at org.apache.solr.common.cloud.SolrZkClient.getChildren(SolrZkClient.java:256)
	at org.apache.solr.common.cloud.ZkStateReader.createClusterStateWatchersAndUpdate(ZkStateReader.java:299)
	at org.apache.solr.client.solrj.impl.CloudSolrServer.connect(CloudSolrServer.java:242)
	... 42 more


FAILED:  junit.framework.TestSuite.org.apache.solr.cloud.TestRequestStatusCollectionAPI

Error Message:
ERROR: SolrZkClient opens=4 closes=3

Stack Trace:
java.lang.AssertionError: ERROR: SolrZkClient opens=4 closes=3
	at __randomizedtesting.SeedInfo.seed([8B8B23D7E462D52]:0)
	at org.junit.Assert.fail(Assert.java:93)
	at org.apache.solr.SolrTestCaseJ4.endTrackingZkClients(SolrTestCaseJ4.java:435)
	at org.apache.solr.SolrTestCaseJ4.afterClass(SolrTestCaseJ4.java:180)
	at sun.reflect.GeneratedMethodAccessor24.invoke(Unknown Source)
	at sun.reflect.DelegatingMethodAccessorImpl.invoke(DelegatingMethodAccessorImpl.java:43)
	at java.lang.reflect.Method.invoke(Method.java:483)
	at com.carrotsearch.randomizedtesting.RandomizedRunner.invoke(RandomizedRunner.java:1617)
	at com.carrotsearch.randomizedtesting.RandomizedRunner$5.evaluate(RandomizedRunner.java:789)
	at com.carrotsearch.randomizedtesting.rules.StatementAdapter.evaluate(StatementAdapter.java:36)
	at com.carrotsearch.randomizedtesting.rules.SystemPropertiesRestoreRule$1.evaluate(SystemPropertiesRestoreRule.java:53)
	at org.apache.lucene.util.AbstractBeforeAfterRule$1.evaluate(AbstractBeforeAfterRule.java:46)
	at org.apache.lucene.util.TestRuleStoreClassName$1.evaluate(TestRuleStoreClassName.java:42)
	at com.carrotsearch.randomizedtesting.rules.SystemPropertiesInvariantRule$1.evaluate(SystemPropertiesInvariantRule.java:55)
	at com.carrotsearch.randomizedtesting.rules.NoShadowingOrOverridesOnMethodsRule$1.evaluate(NoShadowingOrOverridesOnMethodsRule.java:39)
	at com.carrotsearch.randomizedtesting.rules.NoShadowingOrOverridesOnMethodsRule$1.evaluate(NoShadowingOrOverridesOnMethodsRule.java:39)
	at com.carrotsearch.randomizedtesting.rules.StatementAdapter.evaluate(StatementAdapter.java:36)
	at org.apache.lucene.util.TestRuleAssertionsRequired$1.evaluate(TestRuleAssertionsRequired.java:43)
	at org.apache.lucene.util.TestRuleMarkFailure$1.evaluate(TestRuleMarkFailure.java:48)
	at org.apache.lucene.util.TestRuleIgnoreAfterMaxFailures$1.evaluate(TestRuleIgnoreAfterMaxFailures.java:70)
	at org.apache.lucene.util.TestRuleIgnoreTestSuites$1.evaluate(TestRuleIgnoreTestSuites.java:55)
	at com.carrotsearch.randomizedtesting.rules.StatementAdapter.evaluate(StatementAdapter.java:36)
	at com.carrotsearch.randomizedtesting.ThreadLeakControl$StatementRunner.run(ThreadLeakControl.java:359)
	at java.lang.Thread.run(Thread.java:744)


FAILED:  junit.framework.TestSuite.org.apache.solr.cloud.TestRequestStatusCollectionAPI

Error Message:
2 threads leaked from SUITE scope at org.apache.solr.cloud.TestRequestStatusCollectionAPI:     1) Thread[id=2140, name=TEST-TestRequestStatusCollectionAPI.testDistribSearch-seed#[8B8B23D7E462D52]-SendThread(localhost:49692), state=TIMED_WAITING, group=TGRP-TestRequestStatusCollectionAPI]         at java.lang.Thread.sleep(Native Method)         at org.apache.zookeeper.ClientCnxn$SendThread.run(ClientCnxn.java:984)    2) Thread[id=2141, name=TEST-TestRequestStatusCollectionAPI.testDistribSearch-seed#[8B8B23D7E462D52]-EventThread, state=WAITING, group=TGRP-TestRequestStatusCollectionAPI]         at sun.misc.Unsafe.park(Native Method)         at java.util.concurrent.locks.LockSupport.park(LockSupport.java:175)         at java.util.concurrent.locks.AbstractQueuedSynchronizer$ConditionObject.await(AbstractQueuedSynchronizer.java:2039)         at java.util.concurrent.LinkedBlockingQueue.take(LinkedBlockingQueue.java:442)         at org.apache.zookeeper.ClientCnxn$EventThread.run(ClientCnxn.java:491)

Stack Trace:
com.carrotsearch.randomizedtesting.ThreadLeakError: 2 threads leaked from SUITE scope at org.apache.solr.cloud.TestRequestStatusCollectionAPI: 
   1) Thread[id=2140, name=TEST-TestRequestStatusCollectionAPI.testDistribSearch-seed#[8B8B23D7E462D52]-SendThread(localhost:49692), state=TIMED_WAITING, group=TGRP-TestRequestStatusCollectionAPI]
        at java.lang.Thread.sleep(Native Method)
        at org.apache.zookeeper.ClientCnxn$SendThread.run(ClientCnxn.java:984)
   2) Thread[id=2141, name=TEST-TestRequestStatusCollectionAPI.testDistribSearch-seed#[8B8B23D7E462D52]-EventThread, state=WAITING, group=TGRP-TestRequestStatusCollectionAPI]
        at sun.misc.Unsafe.park(Native Method)
        at java.util.concurrent.locks.LockSupport.park(LockSupport.java:175)
        at java.util.concurrent.locks.AbstractQueuedSynchronizer$ConditionObject.await(AbstractQueuedSynchronizer.java:2039)
        at java.util.concurrent.LinkedBlockingQueue.take(LinkedBlockingQueue.java:442)
        at org.apache.zookeeper.ClientCnxn$EventThread.run(ClientCnxn.java:491)
	at __randomizedtesting.SeedInfo.seed([8B8B23D7E462D52]:0)


FAILED:  junit.framework.TestSuite.org.apache.solr.cloud.TestRequestStatusCollectionAPI

Error Message:
There are still zombie threads that couldn't be terminated:    1) Thread[id=2140, name=TEST-TestRequestStatusCollectionAPI.testDistribSearch-seed#[8B8B23D7E462D52]-SendThread(localhost:49692), state=TIMED_WAITING, group=TGRP-TestRequestStatusCollectionAPI]         at java.lang.Thread.sleep(Native Method)         at org.apache.zookeeper.client.StaticHostProvider.next(StaticHostProvider.java:86)         at org.apache.zookeeper.ClientCnxn$SendThread.startConnect(ClientCnxn.java:937)         at org.apache.zookeeper.ClientCnxn$SendThread.run(ClientCnxn.java:993)

Stack Trace:
com.carrotsearch.randomizedtesting.ThreadLeakError: There are still zombie threads that couldn't be terminated:
   1) Thread[id=2140, name=TEST-TestRequestStatusCollectionAPI.testDistribSearch-seed#[8B8B23D7E462D52]-SendThread(localhost:49692), state=TIMED_WAITING, group=TGRP-TestRequestStatusCollectionAPI]
        at java.lang.Thread.sleep(Native Method)
        at org.apache.zookeeper.client.StaticHostProvider.next(StaticHostProvider.java:86)
        at org.apache.zookeeper.ClientCnxn$SendThread.startConnect(ClientCnxn.java:937)
        at org.apache.zookeeper.ClientCnxn$SendThread.run(ClientCnxn.java:993)
	at __randomizedtesting.SeedInfo.seed([8B8B23D7E462D52]:0)


REGRESSION:  org.apache.solr.rest.schema.analysis.TestManagedStopFilterFactory.testManagedStopwords

Error Message:
JSON Parse Error: char=<,position=0 BEFORE='<' AFTER='html> <head> <meta http-equiv="Content-'

Stack Trace:
org.noggit.JSONParser$ParseException: JSON Parse Error: char=<,position=0 BEFORE='<' AFTER='html> <head> <meta http-equiv="Content-'
	at __randomizedtesting.SeedInfo.seed([8B8B23D7E462D52:A00B458C1593C155]:0)
	at org.noggit.JSONParser.err(JSONParser.java:223)
	at org.noggit.JSONParser.next(JSONParser.java:622)
	at org.noggit.JSONParser.nextEvent(JSONParser.java:663)
	at org.noggit.ObjectBuilder.<init>(ObjectBuilder.java:44)
	at org.noggit.ObjectBuilder.getVal(ObjectBuilder.java:37)
	at org.noggit.ObjectBuilder.fromJSON(ObjectBuilder.java:33)
	at org.apache.solr.JSONTestUtil.match(JSONTestUtil.java:81)
	at org.apache.solr.JSONTestUtil.match(JSONTestUtil.java:71)
	at org.apache.solr.util.RestTestBase.assertJQ(RestTestBase.java:244)
	at org.apache.solr.util.RestTestBase.assertJQ(RestTestBase.java:196)
	at org.apache.solr.rest.schema.analysis.TestManagedStopFilterFactory.testManagedStopwords(TestManagedStopFilterFactory.java:95)
	at sun.reflect.NativeMethodAccessorImpl.invoke0(Native Method)
	at sun.reflect.NativeMethodAccessorImpl.invoke(NativeMethodAccessorImpl.java:62)
	at sun.reflect.DelegatingMethodAccessorImpl.invoke(DelegatingMethodAccessorImpl.java:43)
	at java.lang.reflect.Method.invoke(Method.java:483)
	at com.carrotsearch.randomizedtesting.RandomizedRunner.invoke(RandomizedRunner.java:1617)
	at com.carrotsearch.randomizedtesting.RandomizedRunner$6.evaluate(RandomizedRunner.java:826)
	at com.carrotsearch.randomizedtesting.RandomizedRunner$7.evaluate(RandomizedRunner.java:862)
	at com.carrotsearch.randomizedtesting.RandomizedRunner$8.evaluate(RandomizedRunner.java:876)
	at com.carrotsearch.randomizedtesting.rules.SystemPropertiesRestoreRule$1.evaluate(SystemPropertiesRestoreRule.java:53)
	at org.apache.lucene.util.TestRuleSetupTeardownChained$1.evaluate(TestRuleSetupTeardownChained.java:50)
	at org.apache.lucene.util.TestRuleFieldCacheSanity$1.evaluate(TestRuleFieldCacheSanity.java:51)
	at org.apache.lucene.util.AbstractBeforeAfterRule$1.evaluate(AbstractBeforeAfterRule.java:46)
	at com.carrotsearch.randomizedtesting.rules.SystemPropertiesInvariantRule$1.evaluate(SystemPropertiesInvariantRule.java:55)
	at org.apache.lucene.util.TestRuleThreadAndTestName$1.evaluate(TestRuleThreadAndTestName.java:49)
	at org.apache.lucene.util.TestRuleIgnoreAfterMaxFailures$1.evaluate(TestRuleIgnoreAfterMaxFailures.java:70)
	at org.apache.lucene.util.TestRuleMarkFailure$1.evaluate(TestRuleMarkFailure.java:48)
	at com.carrotsearch.randomizedtesting.rules.StatementAdapter.evaluate(StatementAdapter.java:36)
	at com.carrotsearch.randomizedtesting.ThreadLeakControl$StatementRunner.run(ThreadLeakControl.java:359)
	at com.carrotsearch.randomizedtesting.ThreadLeakControl.forkTimeoutingTask(ThreadLeakControl.java:783)
	at com.carrotsearch.randomizedtesting.ThreadLeakControl$3.evaluate(ThreadLeakControl.java:443)
	at com.carrotsearch.randomizedtesting.RandomizedRunner.runSingleTest(RandomizedRunner.java:835)
	at com.carrotsearch.randomizedtesting.RandomizedRunner$3.evaluate(RandomizedRunner.java:737)
	at com.carrotsearch.randomizedtesting.RandomizedRunner$4.evaluate(RandomizedRunner.java:771)
	at com.carrotsearch.randomizedtesting.RandomizedRunner$5.evaluate(RandomizedRunner.java:782)
	at com.carrotsearch.randomizedtesting.rules.StatementAdapter.evaluate(StatementAdapter.java:36)
	at com.carrotsearch.randomizedtesting.rules.SystemPropertiesRestoreRule$1.evaluate(SystemPropertiesRestoreRule.java:53)
	at org.apache.lucene.util.AbstractBeforeAfterRule$1.evaluate(AbstractBeforeAfterRule.java:46)
	at org.apache.lucene.util.TestRuleStoreClassName$1.evaluate(TestRuleStoreClassName.java:42)
	at com.carrotsearch.randomizedtesting.rules.SystemPropertiesInvariantRule$1.evaluate(SystemPropertiesInvariantRule.java:55)
	at com.carrotsearch.randomizedtesting.rules.NoShadowingOrOverridesOnMethodsRule$1.evaluate(NoShadowingOrOverridesOnMethodsRule.java:39)
	at com.carrotsearch.randomizedtesting.rules.NoShadowingOrOverridesOnMethodsRule$1.evaluate(NoShadowingOrOverridesOnMethodsRule.java:39)
	at com.carrotsearch.randomizedtesting.rules.StatementAdapter.evaluate(StatementAdapter.java:36)
	at org.apache.lucene.util.TestRuleAssertionsRequired$1.evaluate(TestRuleAssertionsRequired.java:43)
	at org.apache.lucene.util.TestRuleMarkFailure$1.evaluate(TestRuleMarkFailure.java:48)
	at org.apache.lucene.util.TestRuleIgnoreAfterMaxFailures$1.evaluate(TestRuleIgnoreAfterMaxFailures.java:70)
	at org.apache.lucene.util.TestRuleIgnoreTestSuites$1.evaluate(TestRuleIgnoreTestSuites.java:55)
	at com.carrotsearch.randomizedtesting.rules.StatementAdapter.evaluate(StatementAdapter.java:36)
	at com.carrotsearch.randomizedtesting.ThreadLeakControl$StatementRunner.run(ThreadLeakControl.java:359)
	at java.lang.Thread.run(Thread.java:744)


REGRESSION:  org.apache.solr.schema.ChangedSchemaMergeTest.testOptimizeDiffSchemas

Error Message:
'hostPort' must be configured to run SolrCloud

Stack Trace:
org.apache.solr.common.cloud.ZooKeeperException: 'hostPort' must be configured to run SolrCloud
	at __randomizedtesting.SeedInfo.seed([8B8B23D7E462D52:332334D92BEB255D]:0)
	at org.apache.solr.core.ZkContainer.initZooKeeper(ZkContainer.java:91)
	at org.apache.solr.core.ZkContainer.initZooKeeper(ZkContainer.java:67)
	at org.apache.solr.core.CoreContainer.load(CoreContainer.java:230)
	at org.apache.solr.schema.ChangedSchemaMergeTest.init(ChangedSchemaMergeTest.java:70)
	at org.apache.solr.schema.ChangedSchemaMergeTest.testOptimizeDiffSchemas(ChangedSchemaMergeTest.java:77)
	at sun.reflect.NativeMethodAccessorImpl.invoke0(Native Method)
	at sun.reflect.NativeMethodAccessorImpl.invoke(NativeMethodAccessorImpl.java:62)
	at sun.reflect.DelegatingMethodAccessorImpl.invoke(DelegatingMethodAccessorImpl.java:43)
	at java.lang.reflect.Method.invoke(Method.java:483)
	at com.carrotsearch.randomizedtesting.RandomizedRunner.invoke(RandomizedRunner.java:1617)
	at com.carrotsearch.randomizedtesting.RandomizedRunner$6.evaluate(RandomizedRunner.java:826)
	at com.carrotsearch.randomizedtesting.RandomizedRunner$7.evaluate(RandomizedRunner.java:862)
	at com.carrotsearch.randomizedtesting.RandomizedRunner$8.evaluate(RandomizedRunner.java:876)
	at com.carrotsearch.randomizedtesting.rules.SystemPropertiesRestoreRule$1.evaluate(SystemPropertiesRestoreRule.java:53)
	at org.apache.lucene.util.TestRuleSetupTeardownChained$1.evaluate(TestRuleSetupTeardownChained.java:50)
	at org.apache.lucene.util.TestRuleFieldCacheSanity$1.evaluate(TestRuleFieldCacheSanity.java:51)
	at org.apache.lucene.util.AbstractBeforeAfterRule$1.evaluate(AbstractBeforeAfterRule.java:46)
	at com.carrotsearch.randomizedtesting.rules.SystemPropertiesInvariantRule$1.evaluate(SystemPropertiesInvariantRule.java:55)
	at org.apache.lucene.util.TestRuleThreadAndTestName$1.evaluate(TestRuleThreadAndTestName.java:49)
	at org.apache.lucene.util.TestRuleIgnoreAfterMaxFailures$1.evaluate(TestRuleIgnoreAfterMaxFailures.java:70)
	at org.apache.lucene.util.TestRuleMarkFailure$1.evaluate(TestRuleMarkFailure.java:48)
	at com.carrotsearch.randomizedtesting.rules.StatementAdapter.evaluate(StatementAdapter.java:36)
	at com.carrotsearch.randomizedtesting.ThreadLeakControl$StatementRunner.run(ThreadLeakControl.java:359)
	at com.carrotsearch.randomizedtesting.ThreadLeakControl.forkTimeoutingTask(ThreadLeakControl.java:783)
	at com.carrotsearch.randomizedtesting.ThreadLeakControl$3.evaluate(ThreadLeakControl.java:443)
	at com.carrotsearch.randomizedtesting.RandomizedRunner.runSingleTest(RandomizedRunner.java:835)
	at com.carrotsearch.randomizedtesting.RandomizedRunner$3.evaluate(RandomizedRunner.java:737)
	at com.carrotsearch.randomizedtesting.RandomizedRunner$4.evaluate(RandomizedRunner.java:771)
	at com.carrotsearch.randomizedtesting.RandomizedRunner$5.evaluate(RandomizedRunner.java:782)
	at com.carrotsearch.randomizedtesting.rules.StatementAdapter.evaluate(StatementAdapter.java:36)
	at com.carrotsearch.randomizedtesting.rules.SystemPropertiesRestoreRule$1.evaluate(SystemPropertiesRestoreRule.java:53)
	at org.apache.lucene.util.AbstractBeforeAfterRule$1.evaluate(AbstractBeforeAfterRule.java:46)
	at org.apache.lucene.util.TestRuleStoreClassName$1.evaluate(TestRuleStoreClassName.java:42)
	at com.carrotsearch.randomizedtesting.rules.SystemPropertiesInvariantRule$1.evaluate(SystemPropertiesInvariantRule.java:55)
	at com.carrotsearch.randomizedtesting.rules.NoShadowingOrOverridesOnMethodsRule$1.evaluate(NoShadowingOrOverridesOnMethodsRule.java:39)
	at com.carrotsearch.randomizedtesting.rules.NoShadowingOrOverridesOnMethodsRule$1.evaluate(NoShadowingOrOverridesOnMethodsRule.java:39)
	at com.carrotsearch.randomizedtesting.rules.StatementAdapter.evaluate(StatementAdapter.java:36)
	at org.apache.lucene.util.TestRuleAssertionsRequired$1.evaluate(TestRuleAssertionsRequired.java:43)
	at org.apache.lucene.util.TestRuleMarkFailure$1.evaluate(TestRuleMarkFailure.java:48)
	at org.apache.lucene.util.TestRuleIgnoreAfterMaxFailures$1.evaluate(TestRuleIgnoreAfterMaxFailures.java:70)
	at org.apache.lucene.util.TestRuleIgnoreTestSuites$1.evaluate(TestRuleIgnoreTestSuites.java:55)
	at com.carrotsearch.randomizedtesting.rules.StatementAdapter.evaluate(StatementAdapter.java:36)
	at com.carrotsearch.randomizedtesting.ThreadLeakControl$StatementRunner.run(ThreadLeakControl.java:359)
	at java.lang.Thread.run(Thread.java:744)




Build Log:
[...truncated 10324 lines...]
   [junit4] Suite: org.apache.solr.schema.ChangedSchemaMergeTest
   [junit4]   2> 563086 T2102 oas.SolrTestCaseJ4.startTrackingSearchers WARN startTrackingSearchers: numOpens=6 numCloses=6
   [junit4]   2> 563086 T2102 oas.SolrTestCaseJ4.buildSSLConfig Randomized ssl (true) and clientAuth (false)
   [junit4]   2> 563086 T2102 oas.SolrTestCaseJ4.initCore ####initCore
   [junit4]   2> Creating dataDir: /Users/jenkins/workspace/Lucene-Solr-trunk-MacOSX/solr/build/solr-core/test/J0/./solrtest-ChangedSchemaMergeTest-1395225566908
   [junit4]   2> 563087 T2102 oas.SolrTestCaseJ4.initCore ####initCore end
   [junit4]   2> 563089 T2102 oas.SolrTestCaseJ4.setUp ###Starting testOptimizeDiffSchemas
   [junit4]   2> 563096 T2102 oasc.SolrResourceLoader.<init> new SolrResourceLoader for directory: '/Users/jenkins/workspace/Lucene-Solr-trunk-MacOSX/solr/build/solr-core/test/J0/./ChangedSchemaMergeTest/'
   [junit4]   2> 563134 T2102 oasc.ConfigSolr.fromFile Loading container configuration from /Users/jenkins/workspace/Lucene-Solr-trunk-MacOSX/solr/build/solr-core/test/J0/./ChangedSchemaMergeTest/solr.xml
   [junit4]   2> 563146 T2102 oasc.CorePropertiesLocator.<init> Config-defined core root directory: /Users/jenkins/workspace/Lucene-Solr-trunk-MacOSX/solr/build/solr-core/test/J0/./ChangedSchemaMergeTest
   [junit4]   2> 563147 T2102 oasc.CoreContainer.<init> New CoreContainer 622548923
   [junit4]   2> 563147 T2102 oasc.CoreContainer.load Loading cores into CoreContainer [instanceDir=/Users/jenkins/workspace/Lucene-Solr-trunk-MacOSX/solr/build/solr-core/test/J0/./ChangedSchemaMergeTest/]
   [junit4]   2> 563147 T2102 oashc.HttpShardHandlerFactory.getParameter Setting socketTimeout to: 0
   [junit4]   2> 563147 T2102 oashc.HttpShardHandlerFactory.getParameter Setting urlScheme to: null
   [junit4]   2> 563148 T2102 oashc.HttpShardHandlerFactory.getParameter Setting connTimeout to: 0
   [junit4]   2> 563148 T2102 oashc.HttpShardHandlerFactory.getParameter Setting maxConnectionsPerHost to: 20
   [junit4]   2> 563148 T2102 oashc.HttpShardHandlerFactory.getParameter Setting corePoolSize to: 0
   [junit4]   2> 563149 T2102 oashc.HttpShardHandlerFactory.getParameter Setting maximumPoolSize to: 2147483647
   [junit4]   2> 563149 T2102 oashc.HttpShardHandlerFactory.getParameter Setting maxThreadIdleTime to: 5
   [junit4]   2> 563149 T2102 oashc.HttpShardHandlerFactory.getParameter Setting sizeOfQueue to: -1
   [junit4]   2> 563149 T2102 oashc.HttpShardHandlerFactory.getParameter Setting fairnessPolicy to: false
   [junit4]   2> 563154 T2102 oasl.LogWatcher.createWatcher SLF4J impl is org.slf4j.impl.Log4jLoggerFactory
   [junit4]   2> 563155 T2102 oasl.LogWatcher.newRegisteredLogWatcher Registering Log Listener [Log4j (org.slf4j.impl.Log4jLoggerFactory)]
   [junit4]   2> 563155 T2102 oasc.CoreContainer.load Host Name: null
   [junit4]   2> 563155 T2102 oas.SolrTestCaseJ4.tearDown ###Ending testOptimizeDiffSchemas
   [junit4]   2> NOTE: reproduce with: ant test  -Dtestcase=ChangedSchemaMergeTest -Dtests.method=testOptimizeDiffSchemas -Dtests.seed=8B8B23D7E462D52 -Dtests.slow=true -Dtests.locale=es_BO -Dtests.timezone=Etc/GMT+4 -Dtests.file.encoding=ISO-8859-1
   [junit4] ERROR   0.08s | ChangedSchemaMergeTest.testOptimizeDiffSchemas <<<
   [junit4]    > Throwable #1: org.apache.solr.common.cloud.ZooKeeperException: 'hostPort' must be configured to run SolrCloud
   [junit4]    > 	at __randomizedtesting.SeedInfo.seed([8B8B23D7E462D52:332334D92BEB255D]:0)
   [junit4]    > 	at org.apache.solr.core.ZkContainer.initZooKeeper(ZkContainer.java:91)
   [junit4]    > 	at org.apache.solr.core.ZkContainer.initZooKeeper(ZkContainer.java:67)
   [junit4]    > 	at org.apache.solr.core.CoreContainer.load(CoreContainer.java:230)
   [junit4]    > 	at org.apache.solr.schema.ChangedSchemaMergeTest.init(ChangedSchemaMergeTest.java:70)
   [junit4]    > 	at org.apache.solr.schema.ChangedSchemaMergeTest.testOptimizeDiffSchemas(ChangedSchemaMergeTest.java:77)
   [junit4]    > 	at java.lang.Thread.run(Thread.java:744)
   [junit4]   2> 563163 T2102 oas.SolrTestCaseJ4.deleteCore ###deleteCore
   [junit4]   2> NOTE: test params are: codec=Lucene40, sim=RandomSimilarityProvider(queryNorm=false,coord=yes): {}, locale=es_BO, timezone=Etc/GMT+4
   [junit4]   2> NOTE: Mac OS X 10.8.5 x86_64/Oracle Corporation 1.8.0 (64-bit)/cpus=2,threads=1,free=215419216,total=501219328
   [junit4]   2> NOTE: All tests run in this JVM: [TestCSVLoader, TestRandomFaceting, TestNRTOpen, TestCursorMarkWithoutUniqueKey, NoFacetTest, TestSort, TestCoreContainer, ConvertedLegacyTest, CurrencyFieldOpenExchangeTest, ReturnFieldsTest, SolrIndexConfigTest, DeleteShardTest, TestSolr4Spatial, SSLMigrationTest, TestMultiCoreConfBootstrap, RAMDirectoryFactoryTest, TestStressVersions, SOLR749Test, TestHashPartitioner, OverseerRolesTest, TestFastWriter, SolrCmdDistributorTest, SampleTest, TestIBSimilarityFactory, HdfsDirectoryTest, RemoteQueryErrorTest, JSONWriterTest, SynonymTokenizerTest, CoreAdminRequestStatusTest, TestAnalyzeInfixSuggestions, DisMaxRequestHandlerTest, IndexSchemaTest, TestRecovery, TestStressLucene, TestCollationField, MoreLikeThisHandlerTest, TestFieldSortValues, TestRandomDVFaceting, BadCopyFieldTest, CursorMarkTest, TestBinaryField, OpenCloseCoreStressTest, HardAutoCommitTest, TestBinaryResponseWriter, LegacyHTMLStripCharFilterTest, SimpleFacetsTest, SuggesterWFSTTest, InfoHandlerTest, DistributedSuggestComponentTest, TestSolrXml, SuggesterFSTTest, TestSuggestSpellingConverter, TestManagedSchemaFieldResource, NoCacheHeaderTest, QueryElevationComponentTest, TestCSVResponseWriter, HdfsRecoveryZkTest, AliasIntegrationTest, TestSurroundQueryParser, SoftAutoCommitTest, SolrIndexSplitterTest, CoreAdminHandlerTest, URLClassifyProcessorTest, TestSystemIdResolver, TestElisionMultitermQuery, TestCloudManagedSchemaAddField, AddSchemaFieldsUpdateProcessorFactoryTest, TestPerFieldSimilarity, TestPartialUpdateDeduplication, TestFoldingMultitermQuery, ChangedSchemaMergeTest]
   [junit4] Completed in 0.12s, 1 test, 1 error <<< FAILURES!

[...truncated 4 lines...]
   [junit4] Suite: org.apache.solr.rest.schema.analysis.TestManagedStopFilterFactory
   [junit4]   2> 563255 T2106 oas.SolrTestCaseJ4.buildSSLConfig Randomized ssl (true) and clientAuth (false)
   [junit4]   2> 563258 T2106 oas.SolrTestCaseJ4.setUp ###Starting testManagedStopwords
   [junit4]   2> Creating dataDir: /Users/jenkins/workspace/Lucene-Solr-trunk-MacOSX/solr/build/solr-core/test/J0/./solrtest-TestManagedStopFilterFactory-1395225567080
   [junit4]   2> 564426 T2106 oas.SolrTestCaseJ4.initCore ####initCore
   [junit4]   2> 564427 T2106 oas.SolrTestCaseJ4.initCore ####initCore end
   [junit4]   2> 564427 T2106 oejs.Server.doStart jetty-8.1.10.v20130312
   [junit4]   2> 564433 T2106 oejus.SslContextFactory.doStart Enabled Protocols [SSLv2Hello, SSLv3, TLSv1, TLSv1.1, TLSv1.2] of [SSLv2Hello, SSLv3, TLSv1, TLSv1.1, TLSv1.2]
   [junit4]   2> 564441 T2106 oejs.AbstractConnector.doStart Started SslSelectChannelConnector@127.0.0.1:49661
   [junit4]   2> 564442 T2106 oass.SolrDispatchFilter.init SolrDispatchFilter.init()
   [junit4]   2> 564442 T2106 oasc.SolrResourceLoader.locateSolrHome JNDI not configured for solr (NoInitialContextEx)
   [junit4]   2> 564443 T2106 oasc.SolrResourceLoader.locateSolrHome using system property solr.solr.home: /Users/jenkins/workspace/Lucene-Solr-trunk-MacOSX/solr/build/solr-core/test/J0/./TestManagedStopFilterFactory1395225567081
   [junit4]   2> 564443 T2106 oasc.SolrResourceLoader.<init> new SolrResourceLoader for directory: '/Users/jenkins/workspace/Lucene-Solr-trunk-MacOSX/solr/build/solr-core/test/J0/./TestManagedStopFilterFactory1395225567081/'
   [junit4]   2> 564470 T2106 oass.SolrDispatchFilter.loadConfigSolr Trying to read solr.xml from 127.0.0.1:49609/solr
   [junit4]   2> 564472 T2106 oascc.ConnectionManager.waitForConnected Waiting for client to connect to ZooKeeper
   [junit4]   2> 564473 T2116 oaz.ClientCnxn$SendThread.run WARN Session 0x0 for server null, unexpected error, closing socket connection and attempting reconnect java.net.ConnectException: Connection refused
   [junit4]   2> 	at sun.nio.ch.SocketChannelImpl.checkConnect(Native Method)
   [junit4]   2> 	at sun.nio.ch.SocketChannelImpl.finishConnect(SocketChannelImpl.java:712)
   [junit4]   2> 	at org.apache.zookeeper.ClientCnxnSocketNIO.doTransport(ClientCnxnSocketNIO.java:350)
   [junit4]   2> 	at org.apache.zookeeper.ClientCnxn$SendThread.run(ClientCnxn.java:1068)
   [junit4]   2> 
   [junit4]   2> 565577 T2116 oaz.ClientCnxn$SendThread.run WARN Session 0x0 for server null, unexpected error, closing socket connection and attempting reconnect java.net.ConnectException: Connection refused
   [junit4]   2> 	at sun.nio.ch.SocketChannelImpl.checkConnect(Native Method)
   [junit4]   2> 	at sun.nio.ch.SocketChannelImpl.finishConnect(SocketChannelImpl.java:712)
   [junit4]   2> 	at org.apache.zookeeper.ClientCnxnSocketNIO.doTransport(ClientCnxnSocketNIO.java:350)
   [junit4]   2> 	at org.apache.zookeeper.ClientCnxn$SendThread.run(ClientCnxn.java:1068)
   [junit4]   2> 
   [junit4]   2> 566681 T2116 oaz.ClientCnxn$SendThread.run WARN Session 0x0 for server null, unexpected error, closing socket connection and attempting reconnect java.net.ConnectException: Connection refused
   [junit4]   2> 	at sun.nio.ch.SocketChannelImpl.checkConnect(Native Method)
   [junit4]   2> 	at sun.nio.ch.SocketChannelImpl.finishConnect(SocketChannelImpl.java:712)
   [junit4]   2> 	at org.apache.zookeeper.ClientCnxnSocketNIO.doTransport(ClientCnxnSocketNIO.java:350)
   [junit4]   2> 	at org.apache.zookeeper.ClientCnxn$SendThread.run(ClientCnxn.java:1068)
   [junit4]   2> 
   [junit4]   2> 567785 T2116 oaz.ClientCnxn$SendThread.run WARN Session 0x0 for server null, unexpected error, closing socket connection and attempting reconnect java.net.ConnectException: Connection refused
   [junit4]   2> 	at sun.nio.ch.SocketChannelImpl.checkConnect(Native Method)
   [junit4]   2> 	at sun.nio.ch.SocketChannelImpl.finishConnect(SocketChannelImpl.java:712)
   [junit4]   2> 	at org.apache.zookeeper.ClientCnxnSocketNIO.doTransport(ClientCnxnSocketNIO.java:350)
   [junit4]   2> 	at org.apache.zookeeper.ClientCnxn$SendThread.run(ClientCnxn.java:1068)
   [junit4]   2> 
   [junit4]   2> 568890 T2116 oaz.ClientCnxn$SendThread.run WARN Session 0x0 for server null, unexpected error, closing socket connection and attempting reconnect java.net.ConnectException: Connection refused
   [junit4]   2> 	at sun.nio.ch.SocketChannelImpl.checkConnect(Native Method)
   [junit4]   2> 	at sun.nio.ch.SocketChannelImpl.finishConnect(SocketChannelImpl.java:712)
   [junit4]   2> 	at org.apache.zookeeper.ClientCnxnSocketNIO.doTransport(ClientCnxnSocketNIO.java:350)
   [junit4]   2> 	at org.apache.zookeeper.ClientCnxn$SendThread.run(ClientCnxn.java:1068)
   [junit4]   2> 
   [junit4]   2> 569995 T2116 oaz.ClientCnxn$SendThread.run WARN Session 0x0 for server null, unexpected error, closing socket connection and attempting reconnect java.net.ConnectException: Connection refused
   [junit4]   2> 	at sun.nio.ch.SocketChannelImpl.checkConnect(Native Method)
   [junit4]   2> 	at sun.nio.ch.SocketChannelImpl.finishConnect(SocketChannelImpl.java:712)
   [junit4]   2> 	at org.apache.zookeeper.ClientCnxnSocketNIO.doTransport(ClientCnxnSocketNIO.java:350)
   [junit4]   2> 	at org.apache.zookeeper.ClientCnxn$SendThread.run(ClientCnxn.java:1068)
   [junit4]   2> 
   [junit4]   2> 571098 T2116 oaz.ClientCnxn$SendThread.run WARN Session 0x0 for server null, unexpected error, closing socket connection and attempting reconnect java.net.ConnectException: Connection refused
   [junit4]   2> 	at sun.nio.ch.SocketChannelImpl.checkConnect(Native Method)
   [junit4]   2> 	at sun.nio.ch.SocketChannelImpl.finishConnect(SocketChannelImpl.java:712)
   [junit4]   2> 	at org.apache.zookeeper.ClientCnxnSocketNIO.doTransport(ClientCnxnSocketNIO.java:350)
   [junit4]   2> 	at org.apache.zookeeper.ClientCnxn$SendThread.run(ClientCnxn.java:1068)
   [junit4]   2> 
   [junit4]   2> 572202 T2116 oaz.ClientCnxn$SendThread.run WARN Session 0x0 for server null, unexpected error, closing socket connection and attempting reconnect java.net.ConnectException: Connection refused
   [junit4]   2> 	at sun.nio.ch.SocketChannelImpl.checkConnect(Native Method)
   [junit4]   2> 	at sun.nio.ch.SocketChannelImpl.finishConnect(SocketChannelImpl.java:712)
   [junit4]   2> 	at org.apache.zookeeper.ClientCnxnSocketNIO.doTransport(ClientCnxnSocketNIO.java:350)
   [junit4]   2> 	at org.apache.zookeeper.ClientCnxn$SendThread.run(ClientCnxn.java:1068)
   [junit4]   2> 
   [junit4]   2> 573307 T2116 oaz.ClientCnxn$SendThread.run WARN Session 0x0 for server null, unexpected error, closing socket connection and attempting reconnect java.net.ConnectException: Connection refused
   [junit4]   2> 	at sun.nio.ch.SocketChannelImpl.checkConnect(Native Method)
   [junit4]   2> 	at sun.nio.ch.SocketChannelImpl.finishConnect(SocketChannelImpl.java:712)
   [junit4]   2> 	at org.apache.zookeeper.ClientCnxnSocketNIO.doTransport(ClientCnxnSocketNIO.java:350)
   [junit4]   2> 	at org.apache.zookeeper.ClientCnxn$SendThread.run(ClientCnxn.java:1068)
   [junit4]   2> 
   [junit4]   2> 574412 T2116 oaz.ClientCnxn$SendThread.run WARN Session 0x0 for server null, unexpected error, closing socket connection and attempting reconnect java.net.ConnectException: Connection refused
   [junit4]   2> 	at sun.nio.ch.SocketChannelImpl.checkConnect(Native Method)
   [junit4]   2> 	at sun.nio.ch.SocketChannelImpl.finishConnect(SocketChannelImpl.java:712)
   [junit4]   2> 	at org.apache.zookeeper.ClientCnxnSocketNIO.doTransport(ClientCnxnSocketNIO.java:350)
   [junit4]   2> 	at org.apache.zookeeper.ClientCnxn$SendThread.run(ClientCnxn.java:1068)
   [junit4]   2> 
   [junit4]   2> 575516 T2116 oaz.ClientCnxn$SendThread.run WARN Session 0x0 for server null, unexpected error, closing socket connection and attempting reconnect java.net.ConnectException: Connection refused
   [junit4]   2> 	at sun.nio.ch.SocketChannelImpl.checkConnect(Native Method)
   [junit4]   2> 	at sun.nio.ch.SocketChannelImpl.finishConnect(SocketChannelImpl.java:712)
   [junit4]   2> 	at org.apache.zookeeper.ClientCnxnSocketNIO.doTransport(ClientCnxnSocketNIO.java:350)
   [junit4]   2> 	at org.apache.zookeeper.ClientCnxn$SendThread.run(ClientCnxn.java:1068)
   [junit4]   2> 
   [junit4]   2> 576620 T2116 oaz.ClientCnxn$SendThread.run WARN Session 0x0 for server null, unexpected error, closing socket connection and attempting reconnect java.net.ConnectException: Connection refused
   [junit4]   2> 	at sun.nio.ch.SocketChannelImpl.checkConnect(Native Method)
   [junit4]   2> 	at sun.nio.ch.SocketChannelImpl.finishConnect(SocketChannelImpl.java:712)
   [junit4]   2> 	at org.apache.zookeeper.ClientCnxnSocketNIO.doTransport(ClientCnxnSocketNIO.java:350)
   [junit4]   2> 	at org.apache.zookeeper.ClientCnxn$SendThread.run(ClientCnxn.java:1068)
   [junit4]   2> 
   [junit4]   2> 577724 T2116 oaz.ClientCnxn$SendThread.run WARN Session 0x0 for server null, unexpected error, closing socket connection and attempting reconnect java.net.ConnectException: Connection refused
   [junit4]   2> 	at sun.nio.ch.SocketChannelImpl.checkConnect(Native Method)
   [junit4]   2> 	at sun.nio.ch.SocketChannelImpl.finishConnect(SocketChannelImpl.java:712)
   [junit4]   2> 	at org.apache.zookeeper.ClientCnxnSocketNIO.doTransport(ClientCnxnSocketNIO.java:350)
   [junit4]   2> 	at org.apache.zookeeper.ClientCnxn$SendThread.run(ClientCnxn.java:1068)
   [junit4]   2> 
   [junit4]   2> 578829 T2116 oaz.ClientCnxn$SendThread.run WARN Session 0x0 for server null, unexpected error, closing socket connection and attempting reconnect java.net.ConnectException: Connection refused
   [junit4]   2> 	at sun.nio.ch.SocketChannelImpl.checkConnect(Native Method)
   [junit4]   2> 	at sun.nio.ch.SocketChannelImpl.finishConnect(SocketChannelImpl.java:712)
   [junit4]   2> 	at org.apache.zookeeper.ClientCnxnSocketNIO.doTransport(ClientCnxnSocketNIO.java:350)
   [junit4]   2> 	at org.apache.zookeeper.ClientCnxn$SendThread.run(ClientCnxn.java:1068)
   [junit4]   2> 
   [junit4]   2> 579935 T2116 oaz.ClientCnxn$SendThread.run WARN Session 0x0 for server null, unexpected error, closing socket connection and attempting reconnect java.net.ConnectException: Connection refused
   [junit4]   2> 	at sun.nio.ch.SocketChannelImpl.checkConnect(Native Method)
   [junit4]   2> 	at sun.nio.ch.SocketChannelImpl.finishConnect(SocketChannelImpl.java:712)
   [junit4]   2> 	at org.apache.zookeeper.ClientCnxnSocketNIO.doTransport(ClientCnxnSocketNIO.java:350)
   [junit4]   2> 	at org.apache.zookeeper.ClientCnxn$SendThread.run(ClientCnxn.java:1068)
   [junit4]   2> 
   [junit4]   2> 581040 T2116 oaz.ClientCnxn$SendThread.run WARN Session 0x0 for server null, unexpected error, closing socket connection and attempting reconnect java.net.ConnectException: Connection refused
   [junit4]   2> 	at sun.nio.ch.SocketChannelImpl.checkConnect(Native Method)
   [junit4]   2> 	at sun.nio.ch.SocketChannelImpl.finishConnect(SocketChannelImpl.java:712)
   [junit4]   2> 	at org.apache.zookeeper.ClientCnxnSocketNIO.doTransport(ClientCnxnSocketNIO.java:350)
   [junit4]   2> 	at org.apache.zookeeper.ClientCnxn$SendThread.run(ClientCnxn.java:1068)
   [junit4]   2> 
   [junit4]   2> 582143 T2116 oaz.ClientCnxn$SendThread.run WARN Session 0x0 for server null, unexpected error, closing socket connection and attempting reconnect java.net.ConnectException: Connection refused
   [junit4]   2> 	at sun.nio.ch.SocketChannelImpl.checkConnect(Native Method)
   [junit4]   2> 	at sun.nio.ch.SocketChannelImpl.finishConnect(SocketChannelImpl.java:712)
   [junit4]   2> 	at org.apache.zookeeper.ClientCnxnSocketNIO.doTransport(ClientCnxnSocketNIO.java:350)
   [junit4]   2> 	at org.apache.zookeeper.ClientCnxn$SendThread.run(ClientCnxn.java:1068)
   [junit4]   2> 
   [junit4]   2> 583247 T2116 oaz.ClientCnxn$SendThread.run WARN Session 0x0 for server null, unexpected error, closing socket connection and attempting reconnect java.net.ConnectException: Connection refused
   [junit4]   2> 	at sun.nio.ch.SocketChannelImpl.checkConnect(Native Method)
   [junit4]   2> 	at sun.nio.ch.SocketChannelImpl.finishConnect(SocketChannelImpl.java:712)
   [junit4]   2> 	at org.apache.zookeeper.ClientCnxnSocketNIO.doTransport(ClientCnxnSocketNIO.java:350)
   [junit4]   2> 	at org.apache.zookeeper.ClientCnxn$SendThread.run(ClientCnxn.java:1068)
   [junit4]   2> 
   [junit4]   2> 584359 T2116 oaz.ClientCnxn$SendThread.run WARN Session 0x0 for server null, unexpected error, closing socket connection and attempting reconnect java.net.ConnectException: Connection refused
   [junit4]   2> 	at sun.nio.ch.SocketChannelImpl.checkConnect(Native Method)
   [junit4]   2> 	at sun.nio.ch.SocketChannelImpl.finishConnect(SocketChannelImpl.java:712)
   [junit4]   2> 	at org.apache.zookeeper.ClientCnxnSocketNIO.doTransport(ClientCnxnSocketNIO.java:350)
   [junit4]   2> 	at org.apache.zookeeper.ClientCnxn$SendThread.run(ClientCnxn.java:1068)
   [junit4]   2> 
   [junit4]   2> 585465 T2116 oaz.ClientCnxn$SendThread.run WARN Session 0x0 for server null, unexpected error, closing socket connection and attempting reconnect java.net.ConnectException: Connection refused
   [junit4]   2> 	at sun.nio.ch.SocketChannelImpl.checkConnect(Native Method)
   [junit4]   2> 	at sun.nio.ch.SocketChannelImpl.finishConnect(SocketChannelImpl.java:712)
   [junit4]   2> 	at org.apache.zookeeper.ClientCnxnSocketNIO.doTransport(ClientCnxnSocketNIO.java:350)
   [junit4]   2> 	at org.apache.zookeeper.ClientCnxn$SendThread.run(ClientCnxn.java:1068)
   [junit4]   2> 
   [junit4]   2> 586571 T2116 oaz.ClientCnxn$SendThread.run WARN Session 0x0 for server null, unexpected error, closing socket connection and attempting reconnect java.net.ConnectException: Connection refused
   [junit4]   2> 	at sun.nio.ch.SocketChannelImpl.checkConnect(Native Method)
   [junit4]   2> 	at sun.nio.ch.SocketChannelImpl.finishConnect(SocketChannelImpl.java:712)
   [junit4]   2> 	at org.apache.zookeeper.ClientCnxnSocketNIO.doTransport(ClientCnxnSocketNIO.java:350)
   [junit4]   2> 	at org.apache.zookeeper.ClientCnxn$SendThread.run(ClientCnxn.java:1068)
   [junit4]   2> 
   [junit4]   2> 587676 T2116 oaz.ClientCnxn$SendThread.run WARN Session 0x0 for server null, unexpected error, closing socket connection and attempting reconnect java.net.ConnectException: Connection refused
   [junit4]   2> 	at sun.nio.ch.SocketChannelImpl.checkConnect(Native Method)
   [junit4]   2> 	at sun.nio.ch.SocketChannelImpl.finishConnect(SocketChannelImpl.java:712)
   [junit4]   2> 	at org.apache.zookeeper.ClientCnxnSocketNIO.doTransport(ClientCnxnSocketNIO.java:350)
   [junit4]   2> 	at org.apache.zookeeper.ClientCnxn$SendThread.run(ClientCnxn.java:1068)
   [junit4]   2> 
   [junit4]   2> 588781 T2116 oaz.ClientCnxn$SendThread.run WARN Session 0x0 for server null, unexpected error, closing socket connection and attempting reconnect java.net.ConnectException: Connection refused
   [junit4]   2> 	at sun.nio.ch.SocketChannelImpl.checkConnect(Native Method)
   [junit4]   2> 	at sun.nio.ch.SocketChannelImpl.finishConnect(SocketChannelImpl.java:712)
   [junit4]   2> 	at org.apache.zookeeper.ClientCnxnSocketNIO.doTransport(ClientCnxnSocketNIO.java:350)
   [junit4]   2> 	at org.apache.zookeeper.ClientCnxn$SendThread.run(ClientCnxn.java:1068)
   [junit4]   2> 
   [junit4]   2> 589885 T2116 oaz.ClientCnxn$SendThread.run WARN Session 0x0 for server null, unexpected error, closing socket connection and attempting reconnect java.net.ConnectException: Connection refused
   [junit4]   2> 	at sun.nio.ch.SocketChannelImpl.checkConnect(Native Method)
   [junit4]   2> 	at sun.nio.ch.SocketChannelImpl.finishConnect(SocketChannelImpl.java:712)
   [junit4]   2> 	at org.apache.zookeeper.ClientCnxnSocketNIO.doTransport(ClientCnxnSocketNIO.java:350)
   [junit4]   2> 	at org.apache.zookeeper.ClientCnxn$SendThread.run(ClientCnxn.java:1068)
   [junit4]   2> 
   [junit4]   2> 590990 T2116 oaz.ClientCnxn$SendThread.run WARN Session 0x0 for server null, unexpected error, closing socket connection and attempting reconnect java.net.ConnectException: Connection refused
   [junit4]   2> 	at sun.nio.ch.SocketChannelImpl.checkConnect(Native Method)
   [junit4]   2> 	at sun.nio.ch.SocketChannelImpl.finishConnect(SocketChannelImpl.java:712)
   [junit4]   2> 	at org.apache.zookeeper.ClientCnxnSocketNIO.doTransport(ClientCnxnSocketNIO.java:350)
   [junit4]   2> 	at org.apache.zookeeper.ClientCnxn$SendThread.run(ClientCnxn.java:1068)
   [junit4]   2> 
   [junit4]   2> 592097 T2116 oaz.ClientCnxn$SendThread.run WARN Session 0x0 for server null, unexpected error, closing socket connection and attempting reconnect java.net.ConnectException: Connection refused
   [junit4]   2> 	at sun.nio.ch.SocketChannelImpl.checkConnect(Native Method)
   [junit4]   2> 	at sun.nio.ch.SocketChannelImpl.finishConnect(SocketChannelImpl.java:712)
   [junit4]   2> 	at org.apache.zookeeper.ClientCnxnSocketNIO.doTransport(ClientCnxnSocketNIO.java:350)
   [junit4]   2> 	at org.apache.zookeeper.ClientCnxn$SendThread.run(ClientCnxn.java:1068)
   [junit4]   2> 
   [junit4]   2> 593202 T2116 oaz.ClientCnxn$SendThread.run WARN Session 0x0 for server null, unexpected error, closing socket connection and attempting reconnect java.net.ConnectException: Connection refused
   [junit4]   2> 	at sun.nio.ch.SocketChannelImpl.checkConnect(Native Method)
   [junit4]   2> 	at sun.nio.ch.SocketChannelImpl.finishConnect(SocketChannelImpl.java:712)
   [junit4]   2> 	at org.apache.zookeeper.ClientCnxnSocketNIO.doTransport(ClientCnxnSocketNIO.java:350)
   [junit4]   2> 	at org.apache.zookeeper.ClientCnxn$SendThread.run(ClientCnxn.java:1068)
   [junit4]   2> 
   [junit4]   2> 594306 T2116 oaz.ClientCnxn$SendThread.run WARN Session 0x0 for server null, unexpected error, closing socket connection and attempting reconnect java.net.ConnectException: Connection refused
   [junit4]   2> 	at sun.nio.ch.SocketChannelImpl.checkConnect(Native Method)
   [junit4]   2> 	at sun.nio.ch.SocketChannelImpl.finishConnect(SocketChannelImpl.java:712)
   [junit4]   2> 	at org.apache.zookeeper.ClientCnxnSocketNIO.doTransport(ClientCnxnSocketNIO.java:350)
   [junit4]   2> 	at org.apache.zookeeper.ClientCnxn$SendThread.run(ClientCnxn.java:1068)
   [junit4]   2> 
   [junit4]   2> 595512 T2106 oass.SolrDispatchFilter.init ERROR Could not start Solr. Check solr/home property and the logs
   [junit4]   2> 595515 T2106 oasc.SolrException.log ERROR null:org.apache.solr.common.SolrException: java.util.concurrent.TimeoutException: Could not connect to ZooKeeper 127.0.0.1:49609/solr within 30000 ms
   [junit4]   2> 		at org.apache.solr.common.cloud.SolrZkClient.<init>(SolrZkClient.java:150)
   [junit4]   2> 		at org.apache.solr.common.cloud.SolrZkClient.<init>(SolrZkClient.java:101)
   [junit4]   2> 		at org.apache.solr.common.cloud.SolrZkClient.<init>(SolrZkClient.java:96)
   [junit4]   2> 		at org.apache.solr.common.cloud.SolrZkClient.<init>(SolrZkClient.java:83)
   [junit4]   2> 		at org.apache.solr.servlet.SolrDispatchFilter.loadConfigSolr(SolrDispatchFilter.java:175)
   [junit4]   2> 		at org.apache.solr.servlet.SolrDispatchFilter.createCoreContainer(SolrDispatchFilter.java:198)
   [junit4]   2> 		at org.apache.solr.servlet.SolrDispatchFilter.init(SolrDispatchFilter.java:147)
   [junit4]   2> 		at org.eclipse.jetty.servlet.FilterHolder.doStart(FilterHolder.java:119)
   [junit4]   2> 		at org.eclipse.jetty.util.component.AbstractLifeCycle.start(AbstractLifeCycle.java:64)
   [junit4]   2> 		at org.eclipse.jetty.servlet.ServletHandler.initialize(ServletHandler.java:719)
   [junit4]   2> 		at org.eclipse.jetty.servlet.ServletHandler.updateMappings(ServletHandler.java:1309)
   [junit4]   2> 		at org.eclipse.jetty.servlet.ServletHandler.setFilterMappings(ServletHandler.java:1345)
   [junit4]   2> 		at org.eclipse.jetty.servlet.ServletHandler.addFilterMapping(ServletHandler.java:1085)
   [junit4]   2> 		at org.eclipse.jetty.servlet.ServletHandler.addFilterWithMapping(ServletHandler.java:931)
   [junit4]   2> 		at org.eclipse.jetty.servlet.ServletHandler.addFilterWithMapping(ServletHandler.java:888)
   [junit4]   2> 		at org.eclipse.jetty.servlet.ServletContextHandler.addFilter(ServletContextHandler.java:340)
   [junit4]   2> 		at org.apache.solr.client.solrj.embedded.JettySolrRunner$1.lifeCycleStarted(JettySolrRunner.java:325)
   [junit4]   2> 		at org.eclipse.jetty.util.component.AbstractLifeCycle.setStarted(AbstractLifeCycle.java:174)
   [junit4]   2> 		at org.eclipse.jetty.util.component.AbstractLifeCycle.start(AbstractLifeCycle.java:65)
   [junit4]   2> 		at org.apache.solr.client.solrj.embedded.JettySolrRunner.start(JettySolrRunner.java:430)
   [junit4]   2> 		at org.apache.solr.client.solrj.embedded.JettySolrRunner.start(JettySolrRunner.java:403)
   [junit4]   2> 		at org.apache.solr.SolrJettyTestBase.createJetty(SolrJettyTestBase.java:65)
   [junit4]   2> 		at org.apache.solr.util.RestTestBase.createJettyAndHarness(RestTestBase.java:51)
   [junit4]   2> 		at org.apache.solr.rest.schema.analysis.TestManagedStopFilterFactory.before(TestManagedStopFilterFactory.java:61)
   [junit4]   2> 		at sun.reflect.NativeMethodAccessorImpl.invoke0(Native Method)
   [junit4]   2> 		at sun.reflect.NativeMethodAccessorImpl.invoke(NativeMethodAccessorImpl.java:62)
   [junit4]   2> 		at sun.reflect.DelegatingMethodAccessorImpl.invoke(DelegatingMethodAccessorImpl.java:43)
   [junit4]   2> 		at java.lang.reflect.Method.invoke(Method.java:483)
   [junit4]   2> 		at com.carrotsearch.randomizedtesting.RandomizedRunner.invoke(RandomizedRunner.java:1617)
   [junit4]   2> 		at com.carrotsearch.randomizedtesting.RandomizedRunner$7.evaluate(RandomizedRunner.java:860)
   [junit4]   2> 		at com.carrotsearch.randomizedtesting.RandomizedRunner$8.evaluate(RandomizedRunner.java:876)
   [junit4]   2> 		at com.carrotsearch.randomizedtesting.rules.SystemPropertiesRestoreRule$1.evaluate(SystemPropertiesRestoreRule.java:53)
   [junit4]   2> 		at org.apache.lucene.util.TestRuleSetupTeardownChained$1.evaluate(TestRuleSetupTeardownChained.java:50)
   [junit4]   2> 		at org.apache.lucene.util.TestRuleFieldCacheSanity$1.evaluate(TestRuleFieldCacheSanity.java:51)
   [junit4]   2> 		at org.apache.lucene.util.AbstractBeforeAfterRule$1.evaluate(AbstractBeforeAfterRule.java:46)
   [junit4]   2> 		at com.carrotsearch.randomizedtesting.rules.SystemPropertiesInvariantRule$1.evaluate(SystemPropertiesInvariantRule.java:55)
   [junit4]   2> 		at org.apache.lucene.util.TestRuleThreadAndTestName$1.evaluate(TestRuleThreadAndTestName.java:49)
   [junit4]   2> 		at org.apache.lucene.util.TestRuleIgnoreAfterMaxFailures$1.evaluate(TestRuleIgnoreAfterMaxFailures.java:70)
   [junit4]   2> 		at org.apache.lucene.util.TestRuleMarkFailure$1.evaluate(TestRuleMarkFailure.java:48)
   [junit4]   2> 		at com.carrotsearch.randomizedtesting.rules.StatementAdapter.evaluate(StatementAdapter.java:36)
   [junit4]   2> 		at com.carrotsearch.randomizedtesting.ThreadLeakControl$StatementRunner.run(ThreadLeakControl.java:359)
   [junit4]   2> 		at com.carrotsearch.randomizedtesting.ThreadLeakControl.forkTimeoutingTask(ThreadLeakControl.java:783)
   [junit4]   2> 		at com.carrotsearch.randomizedtesting.ThreadLeakControl$3.evaluate(ThreadLeakControl.java:443)
   [junit4]   2> 		at com.carrotsearch.randomizedtesting.RandomizedRunner.runSingleTest(RandomizedRunner.java:835)
   [junit4]   2> 		at com.carrotsearch.randomizedtesting.RandomizedRunner$3.evaluate(RandomizedRunner.java:737)
   [junit4]   2> 		at com.carrotsearch.randomizedtesting.RandomizedRunner$4.evaluate(RandomizedRunner.java:771)
   [junit4]   2> 		at com.carrotsearch.randomizedtesting.RandomizedRunner$5.evaluate(RandomizedRunner.java:782)
   [junit4]   2> 		at com.carrotsearch.randomizedtesting.rules.StatementAdapter.evaluate(StatementAdapter.java:36)
   [junit4]   2> 		at com.carrotsearch.randomizedtesting.rules.SystemPropertiesRestoreRule$1.evaluate(SystemPropertiesRestoreRule.java:53)
   [junit4]   2> 		at org.apache.lucene.util.AbstractBeforeAfterRule$1.evaluate(AbstractBeforeAfterRule.java:46)
   [junit4]   2> 		at org.apache.lucene.util.TestRuleStoreClassName$1.evaluate(TestRuleStoreClassName.java:42)
   [junit4]   2> 		at com.carrotsearch.randomizedtesting.rules.SystemPropertiesInvariantRule$1.evaluate(SystemPropertiesInvariantRule.java:55)
   [junit4]   2> 		at com.carrotsearch.randomizedtesting.rules.NoShadowingOrOverridesOnMethodsRule$1.evaluate(NoShadowingOrOverridesOnMethodsRule.java:39)
   [junit4]   2> 		at com.carrotsearch.randomizedtesting.rules.NoShadowingOrOverridesOnMethodsRule$1.evaluate(NoShadowingOrOverridesOnMethodsRule.java:39)
   [junit4]   2> 		at com.carrotsearch.randomizedtesting.rules.StatementAdapter.evaluate(StatementAdapter.java:36)
   [junit4]   2> 		at org.apache.lucene.util.TestRuleAssertionsRequired$1.evaluate(TestRuleAssertionsRequired.java:43)
   [junit4]   2> 		at org.apache.lucene.util.TestRuleMarkFailure$1.evaluate(TestRuleMarkFailure.java:48)
   [junit4]   2> 		at org.apache.lucene.util.TestRuleIgnoreAfterMaxFailures$1.evaluate(TestRuleIgnoreAfterMaxFailures.java:70)
   [junit4]   2> 		at org.apache.lucene.util.TestRuleIgnoreTestSuites$1.evaluate(TestRuleIgnoreTestSuites.java:55)
   [junit4]   2> 		at com.carrotsearch.randomizedtesting.rules.StatementAdapter.evaluate(StatementAdapter.java:36)
   [junit4]   2> 		at com.carrotsearch.randomizedtesting.ThreadLeakControl$StatementRunner.run(ThreadLeakControl.java:359)
   [junit4]   2> 		at java.lang.Thread.run(Thread.java:744)
   [junit4]   2> 	Caused by: java.util.concurrent.TimeoutException: Could not connect to ZooKeeper 127.0.0.1:49609/solr within 30000 ms
   [junit4]   2> 		at org.apache.solr.common.cloud.ConnectionManager.waitForConnected(ConnectionManager.java:223)
   [junit4]   2> 		at org.apache.solr.common.cloud.SolrZkClient.<init>(SolrZkClient.java:142)
   [junit4]   2> 		... 61 more
   [junit4]   2> 	
   [junit4]   2> 595516 T2106 oass.SolrDispatchFilter.init SolrDispatchFilter.init() done
   [junit4]   2> 595516 T2106 oas.SolrJettyTestBase.createJetty Jetty Assigned Port#49661
   [junit4]   2> 595540 T2106 oasu.RestTestBase.assertJQ ERROR JSON query validation threw an exception.
   [junit4]   2> 	 expected =/wordSet/initArgs/ignoreCase==false
   [junit4]   2> 	 response = <html>
   [junit4]   2> 	<head>
   [junit4]   2> 	<meta http-equiv="Content-Type" content="text/html;charset=ISO-8859-1"/>
   [junit4]   2> 	<title>Error 503 Server is shutting down or failed to initialize</title>
   [junit4]   2> 	</head>
   [junit4]   2> 	<body>
   [junit4]   2> 	<h2>HTTP ERROR: 503</h2>
   [junit4]   2> 	<p>Problem accessing /solr/schema/analysis/stopwords/english. Reason:
   [junit4]   2> 	<pre>    Server is shutting down or failed to initialize</pre></p>
   [junit4]   2> 	<hr /><i><small>Powered by Jetty://</small></i>
   [junit4]   2> 	                                                
   [junit4]   2> 	                                                
   [junit4]   2> 	                                                
   [junit4]   2> 	                                                
   [junit4]   2> 	                                                
   [junit4]   2> 	                                                
   [junit4]   2> 	                                                
   [junit4]   2> 	                                                
   [junit4]   2> 	                                                
   [junit4]   2> 	                                                
   [junit4]   2> 	                                                
   [junit4]   2> 	                                                
   [junit4]   2> 	                                                
   [junit4]   2> 	                                                
   [junit4]   2> 	                                                
   [junit4]   2> 	                                                
   [junit4]   2> 	                                                
   [junit4]   2> 	                                                
   [junit4]   2> 	                                                
   [junit4]   2> 	                                                
   [junit4]   2> 	</body>
   [junit4]   2> 	</html>
   [junit4]   2> 	
   [junit4]   2> 	 request = /schema/analysis/stopwords/english?wt=json&indent=on
   [junit4]   2> 	
   [junit4]   2> 595555 T2106 oejsh.ContextHandler.doStop stopped o.e.j.s.ServletContextHandler{/solr,null}
   [junit4]   2> 595951 T2106 oas.SolrTestCaseJ4.tearDown ###Ending testManagedStopwords
   [junit4]   2> NOTE: reproduce with: ant test  -Dtestcase=TestManagedStopFilterFactory -Dtests.method=testManagedStopwords -Dtests.seed=8B8B23D7E462D52 -Dtests.slow=true -Dtests.locale=hi -Dtests.timezone=Africa/Harare -Dtests.file.encoding=ISO-8859-1
   [junit4] ERROR   32.7s | TestManagedStopFilterFactory.testManagedStopwords <<<
   [junit4]    > Throwable #1: org.noggit.JSONParser$ParseException: JSON Parse Error: char=<,position=0 BEFORE='<' AFTER='html> <head> <meta http-equiv="Content-'
   [junit4]    > 	at __randomizedtesting.SeedInfo.seed([8B8B23D7E462D52:A00B458C1593C155]:0)
   [junit4]    > 	at org.noggit.JSONParser.err(JSONParser.java:223)
   [junit4]    > 	at org.noggit.JSONParser.next(JSONParser.java:622)
   [junit4]    > 	at org.noggit.JSONParser.nextEvent(JSONParser.java:663)
   [junit4]    > 	at org.noggit.ObjectBuilder.<init>(ObjectBuilder.java:44)
   [junit4]    > 	at org.noggit.ObjectBuilder.getVal(ObjectBuilder.java:37)
   [junit4]    > 	at org.noggit.ObjectBuilder.fromJSON(ObjectBuilder.java:33)
   [junit4]    > 	at org.apache.solr.JSONTestUtil.match(JSONTestUtil.java:81)
   [junit4]    > 	at org.apache.solr.JSONTestUtil.match(JSONTestUtil.java:71)
   [junit4]    > 	at org.apache.solr.util.RestTestBase.assertJQ(RestTestBase.java:244)
   [junit4]    > 	at org.apache.solr.util.RestTestBase.assertJQ(RestTestBase.java:196)
   [junit4]    > 	at org.apache.solr.rest.schema.analysis.TestManagedStopFilterFactory.testManagedStopwords(TestManagedStopFilterFactory.java:95)
   [junit4]    > 	at java.lang.Thread.run(Thread.java:744)
   [junit4]   2> 595955 T2106 oas.SolrTestCaseJ4.deleteCore ###deleteCore
   [junit4]   2> NOTE: test params are: codec=Asserting, sim=DefaultSimilarity, locale=hi, timezone=Africa/Harare
   [junit4]   2> NOTE: Mac OS X 10.8.5 x86_64/Oracle Corporation 1.8.0 (64-bit)/cpus=2,threads=1,free=148920096,total=501219328
   [junit4]   2> NOTE: All tests run in this JVM: [TestCSVLoader, TestRandomFaceting, TestNRTOpen, TestCursorMarkWithoutUniqueKey, NoFacetTest, TestSort, TestCoreContainer, ConvertedLegacyTest, CurrencyFieldOpenExchangeTest, ReturnFieldsTest, SolrIndexConfigTest, DeleteShardTest, TestSolr4Spatial, SSLMigrationTest, TestMultiCoreConfBootstrap, RAMDirectoryFactoryTest, TestStressVersions, SOLR749Test, TestHashPartitioner, OverseerRolesTest, TestFastWriter, SolrCmdDistributorTest, SampleTest, TestIBSimilarityFactory, HdfsDirectoryTest, RemoteQueryErrorTest, JSONWriterTest, SynonymTokenizerTest, CoreAdminRequestStatusTest, TestAnalyzeInfixSuggestions, DisMaxRequestHandlerTest, IndexSchemaTest, TestRecovery, TestStressLucene, TestCollationField, MoreLikeThisHandlerTest, TestFieldSortValues, TestRandomDVFaceting, BadCopyFieldTest, CursorMarkTest, TestBinaryField, OpenCloseCoreStressTest, HardAutoCommitTest, TestBinaryResponseWriter, LegacyHTMLStripCharFilterTest, SimpleFacetsTest, SuggesterWFSTTest, InfoHandlerTest, DistributedSuggestComponentTest, TestSolrXml, SuggesterFSTTest, TestSuggestSpellingConverter, TestManagedSchemaFieldResource, NoCacheHeaderTest, QueryElevationComponentTest, TestCSVResponseWriter, HdfsRecoveryZkTest, AliasIntegrationTest, TestSurroundQueryParser, SoftAutoCommitTest, SolrIndexSplitterTest, CoreAdminHandlerTest, URLClassifyProcessorTest, TestSystemIdResolver, TestElisionMultitermQuery, TestCloudManagedSchemaAddField, AddSchemaFieldsUpdateProcessorFactoryTest, TestPerFieldSimilarity, TestPartialUpdateDeduplication, TestFoldingMultitermQuery, ChangedSchemaMergeTest, TestRecoveryHdfs, TestManagedStopFilterFactory]
   [junit4] Completed in 32.72s, 1 test, 1 error <<< FAILURES!

[...truncated 1 lines...]
   [junit4] Suite: org.apache.solr.cloud.TestRequestStatusCollectionAPI
   [junit4]   2> 596037 T2119 oas.BaseDistributedSearchTestCase.initHostContext Setting hostContext system property: /bdff/qh
   [junit4]   2> 596043 T2119 oas.SolrTestCaseJ4.setUp ###Starting testDistribSearch
   [junit4]   2> Creating dataDir: /Users/jenkins/workspace/Lucene-Solr-trunk-MacOSX/solr/build/solr-core/test/J0/./solrtest-TestRequestStatusCollectionAPI-1395225599866
   [junit4]   2> 596045 T2119 oasc.ZkTestServer.run STARTING ZK TEST SERVER
   [junit4]   2> 596045 T2120 oasc.ZkTestServer$ZKServerMain.runFromConfig Starting server
   [junit4]   2> 596155 T2119 oasc.ZkTestServer.run start zk server on port:49692
   [junit4]   2> 596161 T2119 oascc.ConnectionManager.waitForConnected Waiting for client to connect to ZooKeeper
   [junit4]   2> 596168 T2126 oascc.ConnectionManager.process Watcher org.apache.solr.common.cloud.ConnectionManager@70bd674a name:ZooKeeperConnection Watcher:127.0.0.1:49692 got event WatchedEvent state:SyncConnected type:None path:null path:null type:None
   [junit4]   2> 596173 T2119 oascc.ConnectionManager.waitForConnected Client is connected to ZooKeeper
   [junit4]   2> 596174 T2119 oascc.SolrZkClient.makePath makePath: /solr
   [junit4]   2> 596212 T2119 oascc.ConnectionManager.waitForConnected Waiting for client to connect to ZooKeeper
   [junit4]   2> 596216 T2128 oascc.ConnectionManager.process Watcher org.apache.solr.common.cloud.ConnectionManager@5e4a6bb8 name:ZooKeeperConnection Watcher:127.0.0.1:49692/solr got event WatchedEvent state:SyncConnected type:None path:null path:null type:None
   [junit4]   2> 596216 T2119 oascc.ConnectionManager.waitForConnected Client is connected to ZooKeeper
   [junit4]   2> 596216 T2119 oascc.SolrZkClient.makePath makePath: /collections/collection1
   [junit4]   2> 596223 T2119 oascc.SolrZkClient.makePath makePath: /collections/collection1/shards
   [junit4]   2> 596228 T2119 oascc.SolrZkClient.makePath makePath: /collections/control_collection
   [junit4]   2> 596233 T2119 oascc.SolrZkClient.makePath makePath: /collections/control_collection/shards
   [junit4]   2> 596239 T2119 oasc.AbstractZkTestCase.putConfig put /Users/jenkins/workspace/Lucene-Solr-trunk-MacOSX/solr/core/src/test-files/solr/collection1/conf/solrconfig-tlog.xml to /configs/conf1/solrconfig.xml
   [junit4]   2> 596240 T2119 oascc.SolrZkClient.makePath makePath: /configs/conf1/solrconfig.xml
   [junit4]   2> 596249 T2119 oasc.AbstractZkTestCase.putConfig put /Users/jenkins/workspace/Lucene-Solr-trunk-MacOSX/solr/core/src/test-files/solr/collection1/conf/schema15.xml to /configs/conf1/schema.xml
   [junit4]   2> 596249 T2119 oascc.SolrZkClient.makePath makePath: /configs/conf1/schema.xml
   [junit4]   2> 596258 T2119 oasc.AbstractZkTestCase.putConfig put /Users/jenkins/workspace/Lucene-Solr-trunk-MacOSX/solr/core/src/test-files/solr/collection1/conf/solrconfig.snippet.randomindexconfig.xml to /configs/conf1/solrconfig.snippet.randomindexconfig.xml
   [junit4]   2> 596259 T2119 oascc.SolrZkClient.makePath makePath: /configs/conf1/solrconfig.snippet.randomindexconfig.xml
   [junit4]   2> 596265 T2119 oasc.AbstractZkTestCase.putConfig put /Users/jenkins/workspace/Lucene-Solr-trunk-MacOSX/solr/core/src/test-files/solr/collection1/conf/stopwords.txt to /configs/conf1/stopwords.txt
   [junit4]   2> 596266 T2119 oascc.SolrZkClient.makePath makePath: /configs/conf1/stopwords.txt
   [junit4]   2> 596275 T2119 oasc.AbstractZkTestCase.putConfig put /Users/jenkins/workspace/Lucene-Solr-trunk-MacOSX/solr/core/src/test-files/solr/collection1/conf/protwords.txt to /configs/conf1/protwords.txt
   [junit4]   2> 596275 T2119 oascc.SolrZkClient.makePath makePath: /configs/conf1/protwords.txt
   [junit4]   2> 596285 T2119 oasc.AbstractZkTestCase.putConfig put /Users/jenkins/workspace/Lucene-Solr-trunk-MacOSX/solr/core/src/test-files/solr/collection1/conf/currency.xml to /configs/conf1/currency.xml
   [junit4]   2> 596286 T2119 oascc.SolrZkClient.makePath makePath: /configs/conf1/currency.xml
   [junit4]   2> 596295 T2119 oasc.AbstractZkTestCase.putConfig put /Users/jenkins/workspace/Lucene-Solr-trunk-MacOSX/solr/core/src/test-files/solr/collection1/conf/enumsConfig.xml to /configs/conf1/enumsConfig.xml
   [junit4]   2> 596296 T2119 oascc.SolrZkClient.makePath makePath: /configs/conf1/enumsConfig.xml
   [junit4]   2> 596306 T2119 oasc.AbstractZkTestCase.putConfig put /Users/jenkins/workspace/Lucene-Solr-trunk-MacOSX/solr/core/src/test-files/solr/collection1/conf/open-exchange-rates.json to /configs/conf1/open-exchange-rates.json
   [junit4]   2> 596308 T2119 oascc.SolrZkClient.makePath makePath: /configs/conf1/open-exchange-rates.json
   [junit4]   2> 596317 T2119 oasc.AbstractZkTestCase.putConfig put /Users/jenkins/workspace/Lucene-Solr-trunk-MacOSX/solr/core/src/test-files/solr/collection1/conf/mapping-ISOLatin1Accent.txt to /configs/conf1/mapping-ISOLatin1Accent.txt
   [junit4]   2> 596319 T2119 oascc.SolrZkClient.makePath makePath: /configs/conf1/mapping-ISOLatin1Accent.txt
   [junit4]   2> 596330 T2119 oasc.AbstractZkTestCase.putConfig put /Users/jenkins/workspace/Lucene-Solr-trunk-MacOSX/solr/core/src/test-files/solr/collection1/conf/old_synonyms.txt to /configs/conf1/old_synonyms.txt
   [junit4]   2> 596331 T2119 oascc.SolrZkClient.makePath makePath: /configs/conf1/old_synonyms.txt
   [junit4]   2> 596344 T2119 oasc.AbstractZkTestCase.putConfig put /Users/jenkins/workspace/Lucene-Solr-trunk-MacOSX/solr/core/src/test-files/solr/collection1/conf/synonyms.txt to /configs/conf1/synonyms.txt
   [junit4]   2> 596345 T2119 oascc.SolrZkClient.makePath makePath: /configs/conf1/synonyms.txt
   [junit4]   2> 597393 T2119 oejs.Server.doStart jetty-8.1.10.v20130312
   [junit4]   2> 597404 T2119 oejs.AbstractConnector.doStart Started SelectChannelConnector@127.0.0.1:49695
   [junit4]   2> 597405 T2119 oass.SolrDispatchFilter.init SolrDispatchFilter.init()
   [junit4]   2> 597405 T2119 oasc.SolrResourceLoader.locateSolrHome JNDI not configured for solr (NoInitialContextEx)
   [junit4]   2> 597405 T2119 oasc.SolrResourceLoader.locateSolrHome using system property solr.solr.home: ./org.apache.solr.cloud.TestRequestStatusCollectionAPI-controljetty-1395225600184
   [junit4]   2> 597405 T2119 oasc.SolrResourceLoader.<init> new SolrResourceLoader for directory: './org.apache.solr.cloud.TestRequestStatusCollectionAPI-controljetty-1395225600184/'
   [junit4]   2> 597433 T2119 oass.SolrDispatchFilter.loadConfigSolr Trying to read solr.xml from 127.0.0.1:49692/solr
   [junit4]   2> 597434 T2119 oascc.ConnectionManager.waitForConnected Waiting for client to connect to ZooKeeper
   [junit4]   2> 597437 T2139 oascc.ConnectionManager.process Watcher org.apache.solr.common.cloud.ConnectionManager@57cd5e3d name:ZooKeeperConnection Watcher:127.0.0.1:49692/solr got event WatchedEvent state:SyncConnected type:None path:null path:null type:None
   [junit4]   2> 597437 T2119 oascc.ConnectionManager.waitForConnected Client is connected to ZooKeeper
   [junit4]   2> 597440 T2119 oass.SolrDispatchFilter.init ERROR Could not start Solr. Check solr/home property and the logs
   [junit4]   2> 597441 T2119 oasc.SolrException.log ERROR null:org.apache.solr.common.SolrException: Could not load solr.xml from zookeeper
   [junit4]   2> 		at org.apache.solr.servlet.SolrDispatchFilter.loadConfigSolr(SolrDispatchFilter.java:182)
   [junit4]   2> 		at org.apache.solr.servlet.SolrDispatchFilter.createCoreContainer(SolrDispatchFilter.java:198)
   [junit4]   2> 		at org.apache.solr.servlet.SolrDispatchFilter.init(SolrDispatchFilter.java:147)
   [junit4]   2> 		at org.eclipse.jetty.servlet.FilterHolder.doStart(FilterHolder.java:119)
   [junit4]   2> 		at org.eclipse.jetty.util.component.AbstractLifeCycle.start(AbstractLifeCycle.java:64)
   [junit4]   2> 		at org.eclipse.jetty.servlet.ServletHandler.initialize(ServletHandler.java:719)
   [junit4]   2> 		at org.eclipse.jetty.servlet.ServletHandler.updateMappings(ServletHandler.java:1309)
   [junit4]   2> 		at org.eclipse.jetty.servlet.ServletHandler.setFilterMappings(ServletHandler.java:1345)
   [junit4]   2> 		at org.eclipse.jetty.servlet.ServletHandler.addFilterMapping(ServletHandler.java:1085)
   [junit4]   2> 		at org.eclipse.jetty.servlet.ServletHandler.addFilterWithMapping(ServletHandler.java:931)
   [junit4]   2> 		at org.eclipse.jetty.servlet.ServletHandler.addFilterWithMapping(ServletHandler.java:888)
   [junit4]   2> 		at org.eclipse.jetty.servlet.ServletContextHandler.addFilter(ServletContextHandler.java:340)
   [junit4]   2> 		at org.apache.solr.client.solrj.embedded.JettySolrRunner$1.lifeCycleStarted(JettySolrRunner.java:325)
   [junit4]   2> 		at org.eclipse.jetty.util.component.AbstractLifeCycle.setStarted(AbstractLifeCycle.java:174)
   [junit4]   2> 		at org.eclipse.jetty.util.component.AbstractLifeCycle.start(AbstractLifeCycle.java:65)
   [junit4]   2> 		at org.apache.solr.client.solrj.embedded.JettySolrRunner.start(JettySolrRunner.java:430)
   [junit4]   2> 		at org.apache.solr.client.solrj.embedded.JettySolrRunner.start(JettySolrRunner.java:403)
   [junit4]   2> 		at org.apache.solr.cloud.AbstractFullDistribZkTestBase.createJetty(AbstractFullDistribZkTestBase.java:490)
   [junit4]   2> 		at org.apache.solr.BaseDistributedSearchTestCase.createJetty(BaseDistributedSearchTestCase.java:356)
   [junit4]   2> 		at org.apache.solr.cloud.AbstractFullDistribZkTestBase.createServers(AbstractFullDistribZkTestBase.java:291)
   [junit4]   2> 		at org.apache.solr.BaseDistributedSearchTestCase.testDistribSearch(BaseDistributedSearchTestCase.java:868)
   [junit4]   2> 		at sun.reflect.NativeMethodAccessorImpl.invoke0(Native Method)
   [junit4]   2> 		at sun.reflect.NativeMethodAccessorImpl.invoke(NativeMethodAccessorImpl.java:62)
   [junit4]   2> 		at sun.reflect.DelegatingMethodAccessorImpl.invoke(DelegatingMethodAccessorImpl.java:43)
   [junit4]   2> 		at java.lang.reflect.Method.invoke(Method.java:483)
   [junit4]   2> 		at com.carrotsearch.randomizedtesting.RandomizedRunner.invoke(RandomizedRunner.java:1617)
   [junit4]   2> 		at com.carrotsearch.randomizedtesting.RandomizedRunner$6.evaluate(RandomizedRunner.java:826)
   [junit4]   2> 		at com.carrotsearch.randomizedtesting.RandomizedRunner$7.evaluate(RandomizedRunner.java:862)
   [junit4]   2> 		at com.carrotsearch.randomizedtesting.RandomizedRunner$8.evaluate(RandomizedRunner.java:876)
   [junit4]   2> 		at com.carrotsearch.randomizedtesting.rules.SystemPropertiesRestoreRule$1.evaluate(SystemPropertiesRestoreRule.java:53)
   [junit4]   2> 		at org.apache.lucene.util.TestRuleSetupTeardownChained$1.evaluate(TestRuleSetupTeardownChained.java:50)
   [junit4]   2> 		at org.apache.lucene.util.TestRuleFieldCacheSanity$1.evaluate(TestRuleFieldCacheSanity.java:51)
   [junit4]   2> 		at org.apache.lucene.util.AbstractBeforeAfterRule$1.evaluate(AbstractBeforeAfterRule.java:46)
   [junit4]   2> 		at com.carrotsearch.randomizedtesting.rules.SystemPropertiesInvariantRule$1.evaluate(SystemPropertiesInvariantRule.java:55)
   [junit4]   2> 		at org.apache.lucene.util.TestRuleThreadAndTestName$1.evaluate(TestRuleThreadAndTestName.java:49)
   [junit4]   2> 		at org.apache.lucene.util.TestRuleIgnoreAfterMaxFailures$1.evaluate(TestRuleIgnoreAfterMaxFailures.java:70)
   [junit4]   2> 		at org.apache.lucene.util.TestRuleMarkFailure$1.evaluate(TestRuleMarkFailure.java:48)
   [junit4]   2> 		at com.carrotsearch.randomizedtesting.rules.StatementAdapter.evaluate(StatementAdapter.java:36)
   [junit4]   2> 		at com.carrotsearch.randomizedtesting.ThreadLeakControl$StatementRunner.run(ThreadLeakControl.java:359)
   [junit4]   2> 		at com.carrotsearch.randomizedtesting.ThreadLeakControl.forkTimeoutingTask(ThreadLeakControl.java:783)
   [junit4]   2> 		at com.carrotsearch.randomizedtesting.ThreadLeakControl$3.evaluate(ThreadLeakControl.java:443)
   [junit4]   2> 		at com.carrotsearch.randomizedtesting.RandomizedRunner.runSingleTest(RandomizedRunner.java:835)
   [junit4]   2> 		at com.carrotsearch.randomizedtesting.RandomizedRunner$3.evaluate(RandomizedRunner.java:737)
   [junit4]   2> 		at com.carrotsearch.randomizedtesting.RandomizedRunner$4.evaluate(RandomizedRunner.java:771)
   [junit4]   2> 		at com.carrotsearch.randomizedtesting.RandomizedRunner$5.evaluate(RandomizedRunner.java:782)
   [junit4]   2> 		at com.carrotsearch.randomizedtesting.rules.StatementAdapter.evaluate(StatementAdapter.java:36)
   [junit4]   2> 		at com.carrotsearch.randomizedtesting.rules.SystemPropertiesRestoreRule$1.evaluate(SystemPropertiesRestoreRule.java:53)
   [junit4]   2> 		at org.apache.lucene.util.AbstractBeforeAfterRule$1.evaluate(AbstractBeforeAfterRule.java:46)
   [junit4]   2> 		at org.apache.lucene.util.TestRuleStoreClassName$1.evaluate(TestRuleStoreClassName.java:42)
   [junit4]   2> 		at com.carrotsearch.randomizedtesting.rules.SystemPropertiesInvariantRule$1.evaluate(SystemPropertiesInvariantRule.java:55)
   [junit4]   2> 		at com.carrotsearch.randomizedtesting.rules.NoShadowingOrOverridesOnMethodsRule$1.evaluate(NoShadowingOrOverridesOnMethodsRule.java:39)
   [junit4]   2> 		at com.carrotsearch.randomizedtesting.rules.NoShadowingOrOverridesOnMethodsRule$1.evaluate(NoShadowingOrOverridesOnMethodsRule.java:39)
   [junit4]   2> 		at com.carrotsearch.randomizedtesting.rules.StatementAdapter.evaluate(StatementAdapter.java:36)
   [junit4]   2> 		at org.apache.lucene.util.TestRuleAssertionsRequired$1.evaluate(TestRuleAssertionsRequired.java:43)
   [junit4]   2> 		at org.apache.lucene.util.TestRuleMarkFailure$1.evaluate(TestRuleMarkFailure.java:48)
   [junit4]   2> 		at org.apache.lucene.util.TestRuleIgnoreAfterMaxFailures$1.evaluate(TestRuleIgnoreAfterMaxFailures.java:70)
   [junit4]   2> 		at org.apache.lucene.util.TestRuleIgnoreTestSuites$1.evaluate(TestRuleIgnoreTestSuites.java:55)
   [junit4]   2> 		at com.carrotsearch.randomizedtesting.rules.StatementAdapter.evaluate(StatementAdapter.java:36)
   [junit4]   2> 		at com.carrotsearch.randomizedtesting.ThreadLeakControl$StatementRunner.run(ThreadLeakControl.java:359)
   [junit4]   2> 		at java.lang.Thread.run(Thread.java:744)
   [junit4]   2> 	Caused by: org.apache.solr.common.SolrException: Could not load solr.xml from zookeeper: node not found
   [junit4]   2> 		at org.apache.solr.servlet.SolrDispatchFilter.loadConfigSolr(SolrDispatchFilter.java:178)
   [junit4]   2> 		... 59 more
   [junit4]   2> 	
   [junit4]   2> 597441 T2119 oass.SolrDispatchFilter.init SolrDispatchFilter.init() done
   [junit4]   2> 597442 T2119 oascc.ConnectionManager.waitForConnected Waiting for client to connect to ZooKeeper
   [junit4]   2> 597445 T2141 oascc.ConnectionManager.process Watcher org.apache.solr.common.cloud.ConnectionManager@618991f name:ZooKeeperConnection Watcher:127.0.0.1:49692/solr got event WatchedEvent state:SyncConnected type:None path:null path:null type:None
   [junit4]   2> 597445 T2119 oascc.ConnectionManager.waitForConnected Client is connected to ZooKeeper
   [junit4]   2> 597446 T2119 oascc.SolrZkClient.makePath makePath: /clusterstate.json
   [junit4]   2> 597450 T2119 oascc.SolrZkClient.makePath makePath: /aliases.json
   [junit4]   2> 597453 T2119 oascc.ZkStateReader.createClusterStateWatchersAndUpdate Updating cluster state from ZooKeeper... 
   [junit4]   2> 597456 T2119 oasc.ChaosMonkey.monkeyLog monkey: stop shard! 49695
   [junit4]   2> 597470 T2119 oejsh.ContextHandler.doStop stopped o.e.j.s.ServletContextHandler{/bdff/qh,null}
   [junit4]   2> 597533 T2119 oas.SolrTestCaseJ4.tearDown ###Ending testDistribSearch
   [junit4]   2> 597536 T2119 oasc.ZkTestServer.send4LetterWord connecting to 127.0.0.1:49692 49692
   [junit4]   1> client port:0.0.0.0/0.0.0.0:0
   [junit4]   2> NOTE: reproduce with: ant test  -Dtestcase=TestRequestStatusCollectionAPI -Dtests.method=testDistribSearch -Dtests.seed=8B8B23D7E462D52 -Dtests.slow=true -Dtests.locale=es_VE -Dtests.timezone=America/St_Johns -Dtests.file.encoding=ISO-8859-1
   [junit4] ERROR   2.53s | TestRequestStatusCollectionAPI.testDistribSearch <<<
   [junit4]    > Throwable #1: org.apache.solr.common.cloud.ZooKeeperException: 
   [junit4]    > 	at __randomizedtesting.SeedInfo.seed([8B8B23D7E462D52:895E3C2509194D6E]:0)
   [junit4]    > 	at org.apache.solr.client.solrj.impl.CloudSolrServer.connect(CloudSolrServer.java:249)
   [junit4]    > 	at org.apache.solr.cloud.AbstractFullDistribZkTestBase.initCloud(AbstractFullDistribZkTestBase.java:256)
   [junit4]    > 	at org.apache.solr.cloud.AbstractFullDistribZkTestBase.createServers(AbstractFullDistribZkTestBase.java:312)
   [junit4]    > 	at org.apache.solr.BaseDistributedSearchTestCase.testDistribSearch(BaseDistributedSearchTestCase.java:868)
   [junit4]    > 	at java.lang.Thread.run(Thread.java:744)
   [junit4]    > Caused by: org.apache.zookeeper.KeeperException$NoNodeException: KeeperErrorCode = NoNode for /live_nodes
   [junit4]    > 	at org.apache.zookeeper.KeeperException.create(KeeperException.java:111)
   [junit4]    > 	at org.apache.zookeeper.KeeperException.create(KeeperException.java:51)
   [junit4]    > 	at org.apache.zookeeper.ZooKeeper.getChildren(ZooKeeper.java:1468)
   [junit4]    > 	at org.apache.solr.common.cloud.SolrZkClient$6.execute(SolrZkClient.java:259)
   [junit4]    > 	at org.apache.solr.common.cloud.SolrZkClient$6.execute(SolrZkClient.java:256)
   [junit4]    > 	at org.apache.solr.common.cloud.ZkCmdExecutor.retryOperation(ZkCmdExecutor.java:73)
   [junit4]    > 	at org.apache.solr.common.cloud.SolrZkClient.getChildren(SolrZkClient.java:256)
   [junit4]    > 	at org.apache.solr.common.cloud.ZkStateReader.createClusterStateWatchersAndUpdate(ZkStateReader.java:299)
   [junit4]    > 	at org.apache.solr.client.solrj.impl.CloudSolrServer.connect(CloudSolrServer.java:242)
   [junit4]    > 	... 42 more
   [junit4]   2> 598567 T2119 oas.SolrTestCaseJ4.deleteCore ###deleteCore
   [junit4]   2> 598567 T2119 oas.SolrTestCaseJ4.endTrackingZkClients ERROR ERROR: SolrZkClient opens=4 closes=3
   [junit4]   2> 2535 T2118 ccr.ThreadLeakControl.checkThreadLeaks WARNING Will linger awaiting termination of 2 leaked thread(s).
   [junit4]   2> 598653 T2141 oascc.ConnectionManager.process Watcher org.apache.solr.common.cloud.ConnectionManager@618991f name:ZooKeeperConnection Watcher:127.0.0.1:49692/solr got event WatchedEvent state:Disconnected type:None path:null path:null type:None
   [junit4]   2> 598653 T2141 oascc.ConnectionManager.process zkClient has disconnected
   [junit4]   2> 600566 T2140 oaz.ClientCnxn$SendThread.run WARN Session 0x144d9ed1f800003 for server null, unexpected error, closing socket connection and attempting reconnect java.net.ConnectException: Connection refused
   [junit4]   2> 	at sun.nio.ch.SocketChannelImpl.checkConnect(Native Method)
   [junit4]   2> 	at sun.nio.ch.SocketChannelImpl.finishConnect(SocketChannelImpl.java:712)
   [junit4]   2> 	at org.apache.zookeeper.ClientCnxnSocketNIO.doTransport(ClientCnxnSocketNIO.java:350)
   [junit4]   2> 	at org.apache.zookeeper.ClientCnxn$SendThread.run(ClientCnxn.java:1068)
   [junit4]   2> 
   [junit4]   2> 601745 T2140 oaz.ClientCnxn$SendThread.run WARN Session 0x144d9ed1f800003 for server null, unexpected error, closing socket connection and attempting reconnect java.net.ConnectException: Connection refused
   [junit4]   2> 	at sun.nio.ch.SocketChannelImpl.checkConnect(Native Method)
   [junit4]   2> 	at sun.nio.ch.SocketChannelImpl.finishConnect(SocketChannelImpl.java:712)
   [junit4]   2> 	at org.apache.zookeeper.ClientCnxnSocketNIO.doTransport(ClientCnxnSocketNIO.java:350)
   [junit4]   2> 	at org.apache.zookeeper.ClientCnxn$SendThread.run(ClientCnxn.java:1068)
   [junit4]   2> 
   [junit4]   2> 603330 T2140 oaz.ClientCnxn$SendThread.run WARN Session 0x144d9ed1f800003 for server null, unexpected error, closing socket connection and attempting reconnect java.net.ConnectException: Connection refused
   [junit4]   2> 	at sun.nio.ch.SocketChannelImpl.checkConnect(Native Method)
   [junit4]   2> 	at sun.nio.ch.SocketChannelImpl.finishConnect(SocketChannelImpl.java:712)
   [junit4]   2> 	at org.apache.zookeeper.ClientCnxnSocketNIO.doTransport(ClientCnxnSocketNIO.java:350)
   [junit4]   2> 	at org.apache.zookeeper.ClientCnxn$SendThread.run(ClientCnxn.java:1068)
   [junit4]   2> 
   [junit4]   2> 605017 T2140 oaz.ClientCnxn$SendThread.run WARN Session 0x144d9ed1f800003 for server null, unexpected error, closing socket connection and attempting reconnect java.net.ConnectException: Connection refused
   [junit4]   2> 	at sun.nio.ch.SocketChannelImpl.checkConnect(Native Method)
   [junit4]   2> 	at sun.nio.ch.SocketChannelImpl.finishConnect(SocketChannelImpl.java:712)
   [junit4]   2> 	at org.apache.zookeeper.ClientCnxnSocketNIO.doTransport(ClientCnxnSocketNIO.java:350)
   [junit4]   2> 	at org.apache.zookeeper.ClientCnxn$SendThread.run(ClientCnxn.java:1068)
   [junit4]   2> 
   [junit4]   2> 606816 T2140 oaz.ClientCnxn$SendThread.run WARN Session 0x144d9ed1f800003 for server null, unexpected error, closing socket connection and attempting reconnect java.net.ConnectException: Connection refused
   [junit4]   2> 	at sun.nio.ch.SocketChannelImpl.checkConnect(Native Method)
   [junit4]   2> 	at sun.nio.ch.SocketChannelImpl.finishConnect(SocketChannelImpl.java:712)
   [junit4]   2> 	at org.apache.zookeeper.ClientCnxnSocketNIO.doTransport(ClientCnxnSocketNIO.java:350)
   [junit4]   2> 	at org.apache.zookeeper.ClientCnxn$SendThread.run(ClientCnxn.java:1068)
   [junit4]   2> 
   [junit4]   2> 608093 T2140 oaz.ClientCnxn$SendThread.run WARN Session 0x144d9ed1f800003 for server null, unexpected error, closing socket connection and attempting reconnect java.net.ConnectException: Connection refused
   [junit4]   2> 	at sun.nio.ch.SocketChannelImpl.checkConnect(Native Method)
   [junit4]   2> 	at sun.nio.ch.SocketChannelImpl.finishConnect(SocketChannelImpl.java:712)
   [junit4]   2> 	at org.apache.zookeeper.ClientCnxnSocketNIO.doTransport(ClientCnxnSocketNIO.java:350)
   [junit4]   2> 	at org.apache.zookeeper.ClientCnxn$SendThread.run(ClientCnxn.java:1068)
   [junit4]   2> 
   [junit4]   2> 609859 T2140 oaz.ClientCnxn$SendThread.run WARN Session 0x144d9ed1f800003 for server null, unexpected error, closing socket connection and attempting reconnect java.net.ConnectException: Connection refused
   [junit4]   2> 	at sun.nio.ch.SocketChannelImpl.checkConnect(Native Method)
   [junit4]   2> 	at sun.nio.ch.SocketChannelImpl.finishConnect(SocketChannelImpl.java:712)
   [junit4]   2> 	at org.apache.zookeeper.ClientCnxnSocketNIO.doTransport(ClientCnxnSocketNIO.java:350)
   [junit4]   2> 	at org.apache.zookeeper.ClientCnxn$SendThread.run(ClientCnxn.java:1068)
   [junit4]   2> 
   [junit4]   2> 611914 T2140 oaz.ClientCnxn$SendThread.run WARN Session 0x144d9ed1f800003 for server null, unexpected error, closing socket connection and attempting reconnect java.net.ConnectException: Connection refused
   [junit4]   2> 	at sun.nio.ch.SocketChannelImpl.checkConnect(Native Method)
   [junit4]   2> 	at sun.nio.ch.SocketChannelImpl.finishConnect(SocketChannelImpl.java:712)
   [junit4]   2> 	at org.apache.zookeeper.ClientCnxnSocketNIO.doTransport(ClientCnxnSocketNIO.java:350)
   [junit4]   2> 	at org.apache.zookeeper.ClientCnxn$SendThread.run(ClientCnxn.java:1068)
   [junit4]   2> 
   [junit4]   2> 613469 T2140 oaz.ClientCnxn$SendThread.run WARN Session 0x144d9ed1f800003 for server null, unexpected error, closing socket connection and attempting reconnect java.net.ConnectException: Connection refused
   [junit4]   2> 	at sun.nio.ch.SocketChannelImpl.checkConnect(Native Method)
   [junit4]   2> 	at sun.nio.ch.SocketChannelImpl.finishConnect(SocketChannelImpl.java:712)
   [junit4]   2> 	at org.apache.zookeeper.ClientCnxnSocketNIO.doTransport(ClientCnxnSocketNIO.java:350)
   [junit4]   2> 	at org.apache.zookeeper.ClientCnxn$SendThread.run(ClientCnxn.java:1068)
   [junit4]   2> 
   [junit4]   2> 614605 T2140 oaz.ClientCnxn$SendThread.run WARN Session 0x144d9ed1f800003 for server null, unexpected error, closing socket connection and attempting reconnect java.net.ConnectException: Connection refused
   [junit4]   2> 	at sun.nio.ch.SocketChannelImpl.checkConnect(Native Method)
   [junit4]   2> 	at sun.nio.ch.SocketChannelImpl.finishConnect(SocketChannelImpl.java:712)
   [junit4]   2> 	at org.apache.zookeeper.ClientCnxnSocketNIO.doTransport(ClientCnxnSocketNIO.java:350)
   [junit4]   2> 	at org.apache.zookeeper.ClientCnxn$SendThread.run(ClientCnxn.java:1068)
   [junit4]   2> 
   [junit4]   2> 616137 T2140 oaz.ClientCnxn$SendThread.run WARN Session 0x144d9ed1f800003 for server null, unexpected error, closing socket connection and attempting reconnect java.net.ConnectException: Connection refused
   [junit4]   2> 	at sun.nio.ch.SocketChannelImpl.checkConnect(Native Method)
   [junit4]   2> 	at sun.nio.ch.SocketChannelImpl.finishConnect(SocketChannelImpl.java:712)
   [junit4]   2> 	at org.apache.zookeeper.ClientCnxnSocketNIO.doTransport(ClientCnxnSocketNIO.java:350)
   [junit4]   2> 	at org.apache.zookeeper.ClientCnxn$SendThread.run(ClientCnxn.java:1068)
   [junit4]   2> 
   [junit4]   2> 618125 T2140 oaz.ClientCnxn$SendThread.run WARN Session 0x144d9ed1f800003 for server null, unexpected error, closing socket connection and attempting reconnect java.net.ConnectException: Connection refused
   [junit4]   2> 	at sun.nio.ch.SocketChannelImpl.checkConnect(Native Method)
   [junit4]   2> 	at sun.nio.ch.SocketChannelImpl.finishConnect(SocketChannelImpl.java:712)
   [junit4]   2> 	at org.apache.zookeeper.ClientCnxnSocketNIO.doTransport(ClientCnxnSocketNIO.java:350)
   [junit4]   2> 	at org.apache.zookeeper.ClientCnxn$SendThread.run(ClientCnxn.java:1068)
   [junit4]   2> 
   [junit4]   2> 22596 T2118 ccr.ThreadLeakControl.checkThreadLeaks SEVERE 2 threads leaked from SUITE scope at org.apache.solr.cloud.TestRequestStatusCollectionAPI: 
   [junit4]   2> 	   1) Thread[id=2140, name=TEST-TestRequestStatusCollectionAPI.testDistribSearch-seed#[8B8B23D7E462D52]-SendThread(localhost:49692), state=TIMED_WAITING, group=TGRP-TestRequestStatusCollectionAPI]
   [junit4]   2> 	        at java.lang.Thread.sleep(Native Method)
   [junit4]   2> 	        at org.apache.zookeeper.ClientCnxn$SendThread.run(ClientCnxn.java:984)
   [junit4]   2> 	   2) Thread[id=2141, name=TEST-TestRequestStatusCollectionAPI.testDistribSearch-seed#[8B8B23D7E462D52]-EventThread, state=WAITING, group=TGRP-TestRequestStatusCollectionAPI]
   [junit4]   2> 	        at sun.misc.Unsafe.park(Native Method)
   [junit4]   2> 	        at java.util.concurrent.locks.LockSupport.park(LockSupport.java:175)
   [junit4]   2> 	        at java.util.concurrent.locks.AbstractQueuedSynchronizer$ConditionObject.await(AbstractQueuedSynchronizer.java:2039)
   [junit4]   2> 	        at java.util.concurrent.LinkedBlockingQueue.take(LinkedBlockingQueue.java:442)
   [junit4]   2> 	        at org.apache.zookeeper.ClientCnxn$EventThread.run(ClientCnxn.java:491)
   [junit4]   2> 22597 T2118 ccr.ThreadLeakControl.tryToInterruptAll Starting to interrupt leaked threads:
   [junit4]   2> 	   1) Thread[id=2140, name=TEST-TestRequestStatusCollectionAPI.testDistribSearch-seed#[8B8B23D7E462D52]-SendThread(localhost:49692), state=TIMED_WAITING, group=TGRP-TestRequestStatusCollectionAPI]
   [junit4]   2> 	   2) Thread[id=2141, name=TEST-TestRequestStatusCollectionAPI.testDistribSearch-seed#[8B8B23D7E462D52]-EventThread, state=WAITING, group=TGRP-TestRequestStatusCollectionAPI]
   [junit4]   2> 618635 T2141 oaz.ClientCnxn$EventThread.run ERROR Event thread exiting due to interruption java.lang.InterruptedException
   [junit4]   2> 	at java.util.concurrent.locks.AbstractQueuedSynchronizer$ConditionObject.reportInterruptAfterWait(AbstractQueuedSynchronizer.java:2014)
   [junit4]   2> 	at java.util.concurrent.locks.AbstractQueuedSynchronizer$ConditionObject.await(AbstractQueuedSynchronizer.java:2048)
   [junit4]   2> 	at java.util.concurrent.LinkedBlockingQueue.take(LinkedBlockingQueue.java:442)
   [junit4]   2> 	at org.apache.zookeeper.ClientCnxn$EventThread.run(ClientCnxn.java:491)
   [junit4]   2> 
   [junit4]   2> 618636 T2140 oaz.ClientCnxn$SendThread.run WARN Unexpected exception java.lang.InterruptedException: sleep interrupted
   [junit4]   2> 	at java.lang.Thread.sleep(Native Method)
   [junit4]   2> 	at org.apache.zookeeper.ClientCnxn$SendThread.run(ClientCnxn.java:984)
   [junit4]   2> 
   [junit4]   2> 619138 T2140 oazc.StaticHostProvider.next WARN Unexpected exception java.lang.InterruptedException: sleep interrupted
   [junit4]   2> 	at java.lang.Thread.sleep(Native Method)
   [junit4]   2> 	at org.apache.zookeeper.client.StaticHostProvider.next(StaticHostProvider.java:86)
   [junit4]   2> 	at org.apache.zookeeper.ClientCnxn$SendThread.startConnect(ClientCnxn.java:937)
   [junit4]   2> 	at org.apache.zookeeper.ClientCnxn$SendThread.run(ClientCnxn.java:993)
   [junit4]   2> 
   [junit4]   2> 619139 T2140 oaz.ClientCnxn$SendThread.run WARN Session 0x144d9ed1f800003 for server null, unexpected error, closing socket connection and attempting reconnect java.net.ConnectException: Connection refused
   [junit4]   2> 	at sun.nio.ch.SocketChannelImpl.checkConnect(Native Method)
   [junit4]   2> 	at sun.nio.ch.SocketChannelImpl.finishConnect(SocketChannelImpl.java:712)
   [junit4]   2> 	at org.apache.zookeeper.ClientCnxnSocketNIO.doTransport(ClientCnxnSocketNIO.java:350)
   [junit4]   2> 	at org.apache.zookeeper.ClientCnxn$SendThread.run(ClientCnxn.java:1068)
   [junit4]   2> 
   [junit4]   2> 619637 T2140 oaz.ClientCnxn$SendThread.run WARN Unexpected exception java.lang.InterruptedException: sleep interrupted
   [junit4]   2> 	at java.lang.Thread.sleep(Native Method)
   [junit4]   2> 	at org.apache.zookeeper.ClientCnxn$SendThread.run(ClientCnxn.java:984)
   [junit4]   2> 
   [junit4]   2> 620138 T2140 oazc.StaticHostProvider.next WARN Unexpected exception java.lang.InterruptedException: sleep interrupted
   [junit4]   2> 	at java.lang.Thread.sleep(Native Method)
   [junit4]   2> 	at org.apache.zookeeper.client.StaticHostProvider.next(StaticHostProvider.java:86)
   [junit4]   2> 	at org.apache.zookeeper.ClientCnxn$SendThread.startConnect(ClientCnxn.java:937)
   [junit4]   2> 	at org.apache.zookeeper.ClientCnxn$SendThread.run(ClientCnxn.java:993)
   [junit4]   2> 
   [junit4]   2> 620139 T2140 oaz.ClientCnxn$SendThread.run WARN Session 0x144d9ed1f800003 for server null, unexpected error, closing socket connection and attempting reconnect java.net.ConnectException: Connection refused
   [junit4]   2> 	at sun.nio.ch.SocketChannelImpl.checkConnect(Native Method)
   [junit4]   2> 	at sun.nio.ch.SocketChannelImpl.finishConnect(SocketChannelImpl.java:712)
   [junit4]   2> 	at org.apache.zookeeper.ClientCnxnSocketNIO.doTransport(ClientCnxnSocketNIO.java:350)
   [junit4]   2> 	at org.apache.zookeeper.ClientCnxn$SendThread.run(ClientCnxn.java:1068)
   [junit4]   2> 
   [junit4]   2> 620640 T2140 oazc.StaticHostProvider.next WARN Unexpected exception java.lang.InterruptedException: sleep interrupted
   [junit4]   2> 	at java.lang.Thread.sleep(Native Method)
   [junit4]   2> 	at org.apache.zookeeper.client.StaticHostProvider.next(StaticHostProvider.java:86)
   [junit4]   2> 	at org.apache.zookeeper.ClientCnxn$SendThread.startConnect(ClientCnxn.java:937)
   [junit4]   2> 	at org.apache.zookeeper.ClientCnxn$SendThread.run(ClientCnxn.java:993)
   [junit4]   2> 
   [junit4]   2> 620641 T2140 oaz.ClientCnxn$SendThread.run WARN Session 0x144d9ed1f800003 for server null, unexpected error, closing socket connection and attempting reconnect java.net.ConnectException: Connection refused
   [junit4]   2> 	at sun.nio.ch.SocketChannelImpl.checkConnect(Native Method)
   [junit4]   2> 	at sun.nio.ch.SocketChannelImpl.finishConnect(SocketChannelImpl.java:712)
   [junit4]   2> 	at org.apache.zookeeper.ClientCnxnSocketNIO.doTransport(ClientCnxnSocketNIO.java:350)
   [junit4]   2> 	at org.apache.zookeeper.ClientCnxn$SendThread.run(ClientCnxn.java:1068)
   [junit4]   2> 
   [junit4]   2> 621141 T2140 oazc.StaticHostProvider.next WARN Unexpected exception java.lang.InterruptedException: sleep interrupted
   [junit4]   2> 	at java.lang.Thread.sleep(Native Method)
   [junit4]   2> 	at org.apache.zookeeper.client.StaticHostProvider.next(StaticHostProvider.java:86)
   [junit4]   2> 	at org.apache.zookeeper.ClientCnxn$SendThread.startConnect(ClientCnxn.java:937)
   [junit4]   2> 	at org.apache.zookeeper.ClientCnxn$SendThread.run(ClientCnxn.java:993)
   [junit4]   2> 
   [junit4]   2> 621142 T2140 oaz.ClientCnxn$SendThread.run WARN Session 0x144d9ed1f800003 for server null, unexpected error, closing socket connection and attempting reconnect java.net.ConnectException: Connection refused
   [junit4]   2> 	at sun.nio.ch.SocketChannelImpl.checkConnect(Native Method)
   [junit4]   2> 	at sun.nio.ch.SocketChannelImpl.finishConnect(SocketChannelImpl.java:712)
   [junit4]   2> 	at org.apache.zookeeper.ClientCnxnSocketNIO.doTransport(ClientCnxnSocketNIO.java:350)
   [junit4]   2> 	at org.apache.zookeeper.ClientCnxn$SendThread.run(ClientCnxn.java:1068)
   [junit4]   2> 
   [junit4]   2> 25606 T2118 ccr.ThreadLeakControl.tryToInterruptAll SEVERE There are still zombie threads that couldn't be terminated:
   [junit4]   2> 	   1) Thread[id=2140, name=TEST-TestRequestStatusCollectionAPI.testDistribSearch-seed#[8B8B23D7E462D52]-SendThread(localhost:49692), state=TIMED_WAITING, group=TGRP-TestRequestStatusCollectionAPI]
   [junit4]   2> 	        at java.lang.Thread.sleep(Native Method)
   [junit4]   2> 	        at org.apache.zookeeper.client.StaticHostProvider.next(StaticHostProvider.java:86)
   [junit4]   2> 	        at org.apache.zookeeper.ClientCnxn$SendThread.startConnect(ClientCnxn.java:937)
   [junit4]   2> 	        at org.apache.zookeeper.ClientCnxn$SendThread.run(ClientCnxn.java:993)
   [junit4]   2> NOTE: test params are: codec=Lucene46: {}, docValues:{}, sim=RandomSimilarityProvider(queryNorm=true,coord=yes): {}, locale=es_VE, timezone=America/St_Johns
   [junit4]   2> NOTE: Mac OS X 10.8.5 x86_64/Oracle Corporation 1.8.0 (64-bit)/cpus=2,threads=2,free=88568456,total=501219328
   [junit4]   2> NOTE: All tests run in this JVM: [TestCSVLoader, TestRandomFaceting, TestNRTOpen, TestCursorMarkWithoutUniqueKey, NoFacetTest, TestSort, TestCoreContainer, ConvertedLegacyTest, CurrencyFieldOpenExchangeTest, ReturnFieldsTest, SolrIndexConfigTest, DeleteShardTest, TestSolr4Spatial, SSLMigrationTest, TestMultiCoreConfBootstrap, RAMDirectoryFactoryTest, TestStressVersions, SOLR749Test, TestHashPartitioner, OverseerRolesTest, TestFastWriter, SolrCmdDistributorTest, SampleTest, TestIBSimilarityFactory, HdfsDirectoryTest, RemoteQueryErrorTest, JSONWriterTest, SynonymTokenizerTest, CoreAdminRequestStatusTest, TestAnalyzeInfixSuggestions, DisMaxRequestHandlerTest, IndexSchemaTest, TestRecovery, TestStressLucene, TestCollationField, MoreLikeThisHandlerTest, TestFieldSortValues, TestRandomDVFaceting, BadCopyFieldTest, CursorMarkTest, TestBinaryField, OpenCloseCoreStressTest, HardAutoCommitTest, TestBinaryResponseWriter, LegacyHTMLStripCharFilterTest, SimpleFacetsTest, SuggesterWFSTTest, InfoHandlerTest, DistributedSuggestComponentTest, TestSolrXml, SuggesterFSTTest, TestSuggestSpellingConverter, TestManagedSchemaFieldResource, NoCacheHeaderTest, QueryElevationComponentTest, TestCSVResponseWriter, HdfsRecoveryZkTest, AliasIntegrationTest, TestSurroundQueryParser, SoftAutoCommitTest, SolrIndexSplitterTest, CoreAdminHandlerTest, URLClassifyProcessorTest, TestSystemIdResolver, TestElisionMultitermQuery, TestCloudManagedSchemaAddField, AddSchemaFieldsUpdateProcessorFactoryTest, TestPerFieldSimilarity, TestPartialUpdateDeduplication, TestFoldingMultitermQuery, ChangedSchemaMergeTest, TestRecoveryHdfs, TestManagedStopFilterFactory, TestRequestStatusCollectionAPI]
   [junit4]   2> NOTE: reproduce with: ant test  -Dtestcase=TestRequestStatusCollectionAPI -Dtests.seed=8B8B23D7E462D52 -Dtests.slow=true -Dtests.locale=es_VE -Dtests.timezone=America/St_Johns -Dtests.file.encoding=ISO-8859-1
   [junit4] ERROR   0.00s | TestRequestStatusCollectionAPI (suite) <<<
   [junit4]    > Throwable #1: java.lang.AssertionError: ERROR: SolrZkClient opens=4 closes=3
   [junit4]    > 	at __randomizedtesting.SeedInfo.seed([8B8B23D7E462D52]:0)
   [junit4]    > 	at org.apache.solr.SolrTestCaseJ4.endTrackingZkClients(SolrTestCaseJ4.java:435)
   [junit4]    > 	at org.apache.solr.SolrTestCaseJ4.afterClass(SolrTestCaseJ4.java:180)
   [junit4]    > 	at java.lang.Thread.run(Thread.java:744)Throwable #2: com.carrotsearch.randomizedtesting.ThreadLeakError: 2 threads leaked from SUITE scope at org.apache.solr.cloud.TestRequestStatusCollectionAPI: 
   [junit4]    >    1) Thread[id=2140, name=TEST-TestRequestStatusCollectionAPI.testDistribSearch-seed#[8B8B23D7E462D52]-SendThread(localhost:49692), state=TIMED_WAITING, group=TGRP-TestRequestStatusCollectionAPI]
   [junit4]    >         at java.lang.Thread.sleep(Native Method)
   [junit4]    >         at org.apache.zookeeper.ClientCnxn$SendThread.run(ClientCnxn.java:984)
   [junit4]    >    2) Thread[id=2141, name=TEST-TestRequestStatusCollectionAPI.testDistribSearch-seed#[8B8B23D7E462D52]-EventThread, state=WAITING, group=TGRP-TestRequestStatusCollectionAPI]
   [junit4]    >         at sun.misc.Unsafe.park(Native Method)
   [junit4]    >         at java.util.concurrent.locks.LockSupport.park(LockSupport.java:175)
   [junit4]    >         at java.util.concurrent.locks.AbstractQueuedSynchronizer$ConditionObject.await(AbstractQueuedSynchronizer.java:2039)
   [junit4]    >         at java.util.concurrent.LinkedBlockingQueue.take(LinkedBlockingQueue.java:442)
   [junit4]    >         at org.apache.zookeeper.ClientCnxn$EventThread.run(ClientCnxn.java:491)
   [junit4]    > 	at __randomizedtesting.SeedInfo.seed([8B8B23D7E462D52]:0)Throwable #3: com.carrotsearch.randomizedtesting.ThreadLeakError: There are still zombie threads that couldn't be terminated:
   [junit4]    >    1) Thread[id=2140, name=TEST-TestRequestStatusCollectionAPI.testDistribSearch-seed#[8B8B23D7E462D52]-SendThread(localhost:49692), state=TIMED_WAITING, group=TGRP-TestRequestStatusCollectionAPI]
   [junit4]    >         at java.lang.Thread.sleep(Native Method)
   [junit4]    >         at org.apache.zookeeper.client.StaticHostProvider.next(StaticHostProvider.java:86)
   [junit4]    >         at org.apache.zookeeper.ClientCnxn$SendThread.startConnect(ClientCnxn.java:937)
   [junit4]    >         at org.apache.zookeeper.ClientCnxn$SendThread.run(ClientCnxn.java:993)
   [junit4]    > 	at __randomizedtesting.SeedInfo.seed([8B8B23D7E462D52]:0)
   [junit4] Completed in 25.65s, 1 test, 1 failure, 3 errors <<< FAILURES!

[...truncated 976 lines...]
BUILD FAILED
/Users/jenkins/workspace/Lucene-Solr-trunk-MacOSX/build.xml:467: The following error occurred while executing this line:
/Users/jenkins/workspace/Lucene-Solr-trunk-MacOSX/build.xml:447: The following error occurred while executing this line:
/Users/jenkins/workspace/Lucene-Solr-trunk-MacOSX/build.xml:45: The following error occurred while executing this line:
/Users/jenkins/workspace/Lucene-Solr-trunk-MacOSX/extra-targets.xml:37: The following error occurred while executing this line:
/Users/jenkins/workspace/Lucene-Solr-trunk-MacOSX/solr/build.xml:189: The following error occurred while executing this line:
/Users/jenkins/workspace/Lucene-Solr-trunk-MacOSX/solr/common-build.xml:490: The following error occurred while executing this line:
/Users/jenkins/workspace/Lucene-Solr-trunk-MacOSX/lucene/common-build.xml:1275: The following error occurred while executing this line:
/Users/jenkins/workspace/Lucene-Solr-trunk-MacOSX/lucene/common-build.xml:907: There were test failures: 391 suites, 1645 tests, 3 suite-level errors, 3 errors, 1263 ignored (27 assumptions)

Total time: 37 minutes 12 seconds
Build step 'Invoke Ant' marked build as failure
Description set: Java: 64bit/jdk1.8.0 -XX:-UseCompressedOops -XX:+UseG1GC
Archiving artifacts
Recording test results
Email was triggered for: Failure
Sending email for trigger: Failure



Mime
View raw message