lucene-dev mailing list archives

Site index · List index
Message view « Date » · « Thread »
Top « Date » · « Thread »
From Policeman Jenkins Server <jenk...@thetaphi.de>
Subject [JENKINS] Lucene-Solr-4.x-Linux (32bit/jdk1.7.0_51) - Build # 9725 - Still Failing!
Date Tue, 18 Mar 2014 06:26:20 GMT
Build: http://jenkins.thetaphi.de/job/Lucene-Solr-4.x-Linux/9725/
Java: 32bit/jdk1.7.0_51 -server -XX:+UseSerialGC

2 tests failed.
FAILED:  org.apache.lucene.spatial.prefix.SpatialOpRecursivePrefixTreeTest.testContains {#7
seed=[175A10038A619363:146B27D88CDE16A]}

Error Message:
Shouldn't match I#0:Rect(minX=-180.0,maxX=180.0,minY=-90.0,maxY=90.0) Q:ShapePair(Rect(minX=-180.0,maxX=180.0,minY=-90.0,maxY=90.0)
, Rect(minX=-21.0,maxX=-14.0,minY=-26.0,maxY=-21.0))

Stack Trace:
java.lang.AssertionError: Shouldn't match I#0:Rect(minX=-180.0,maxX=180.0,minY=-90.0,maxY=90.0)
Q:ShapePair(Rect(minX=-180.0,maxX=180.0,minY=-90.0,maxY=90.0) , Rect(minX=-21.0,maxX=-14.0,minY=-26.0,maxY=-21.0))
	at __randomizedtesting.SeedInfo.seed([175A10038A619363:146B27D88CDE16A]:0)
	at org.junit.Assert.fail(Assert.java:93)
	at org.apache.lucene.spatial.prefix.SpatialOpRecursivePrefixTreeTest.fail(SpatialOpRecursivePrefixTreeTest.java:355)
	at org.apache.lucene.spatial.prefix.SpatialOpRecursivePrefixTreeTest.doTest(SpatialOpRecursivePrefixTreeTest.java:335)
	at org.apache.lucene.spatial.prefix.SpatialOpRecursivePrefixTreeTest.testContains(SpatialOpRecursivePrefixTreeTest.java:126)
	at sun.reflect.NativeMethodAccessorImpl.invoke0(Native Method)
	at sun.reflect.NativeMethodAccessorImpl.invoke(NativeMethodAccessorImpl.java:57)
	at sun.reflect.DelegatingMethodAccessorImpl.invoke(DelegatingMethodAccessorImpl.java:43)
	at java.lang.reflect.Method.invoke(Method.java:606)
	at com.carrotsearch.randomizedtesting.RandomizedRunner.invoke(RandomizedRunner.java:1617)
	at com.carrotsearch.randomizedtesting.RandomizedRunner$6.evaluate(RandomizedRunner.java:826)
	at com.carrotsearch.randomizedtesting.RandomizedRunner$7.evaluate(RandomizedRunner.java:862)
	at com.carrotsearch.randomizedtesting.RandomizedRunner$8.evaluate(RandomizedRunner.java:876)
	at org.apache.lucene.util.TestRuleSetupTeardownChained$1.evaluate(TestRuleSetupTeardownChained.java:50)
	at org.apache.lucene.util.TestRuleFieldCacheSanity$1.evaluate(TestRuleFieldCacheSanity.java:51)
	at org.apache.lucene.util.AbstractBeforeAfterRule$1.evaluate(AbstractBeforeAfterRule.java:46)
	at com.carrotsearch.randomizedtesting.rules.SystemPropertiesInvariantRule$1.evaluate(SystemPropertiesInvariantRule.java:55)
	at org.apache.lucene.util.TestRuleThreadAndTestName$1.evaluate(TestRuleThreadAndTestName.java:49)
	at org.apache.lucene.util.TestRuleIgnoreAfterMaxFailures$1.evaluate(TestRuleIgnoreAfterMaxFailures.java:70)
	at org.apache.lucene.util.TestRuleMarkFailure$1.evaluate(TestRuleMarkFailure.java:48)
	at com.carrotsearch.randomizedtesting.rules.StatementAdapter.evaluate(StatementAdapter.java:36)
	at com.carrotsearch.randomizedtesting.ThreadLeakControl$StatementRunner.run(ThreadLeakControl.java:359)
	at com.carrotsearch.randomizedtesting.ThreadLeakControl.forkTimeoutingTask(ThreadLeakControl.java:783)
	at com.carrotsearch.randomizedtesting.ThreadLeakControl$3.evaluate(ThreadLeakControl.java:443)
	at com.carrotsearch.randomizedtesting.RandomizedRunner.runSingleTest(RandomizedRunner.java:835)
	at com.carrotsearch.randomizedtesting.RandomizedRunner$3.evaluate(RandomizedRunner.java:737)
	at com.carrotsearch.randomizedtesting.RandomizedRunner$4.evaluate(RandomizedRunner.java:771)
	at com.carrotsearch.randomizedtesting.RandomizedRunner$5.evaluate(RandomizedRunner.java:782)
	at org.apache.lucene.util.AbstractBeforeAfterRule$1.evaluate(AbstractBeforeAfterRule.java:46)
	at org.apache.lucene.util.TestRuleStoreClassName$1.evaluate(TestRuleStoreClassName.java:42)
	at com.carrotsearch.randomizedtesting.rules.SystemPropertiesInvariantRule$1.evaluate(SystemPropertiesInvariantRule.java:55)
	at com.carrotsearch.randomizedtesting.rules.NoShadowingOrOverridesOnMethodsRule$1.evaluate(NoShadowingOrOverridesOnMethodsRule.java:39)
	at com.carrotsearch.randomizedtesting.rules.NoShadowingOrOverridesOnMethodsRule$1.evaluate(NoShadowingOrOverridesOnMethodsRule.java:39)
	at com.carrotsearch.randomizedtesting.rules.StatementAdapter.evaluate(StatementAdapter.java:36)
	at org.apache.lucene.util.TestRuleAssertionsRequired$1.evaluate(TestRuleAssertionsRequired.java:43)
	at org.apache.lucene.util.TestRuleMarkFailure$1.evaluate(TestRuleMarkFailure.java:48)
	at org.apache.lucene.util.TestRuleIgnoreAfterMaxFailures$1.evaluate(TestRuleIgnoreAfterMaxFailures.java:70)
	at org.apache.lucene.util.TestRuleIgnoreTestSuites$1.evaluate(TestRuleIgnoreTestSuites.java:55)
	at com.carrotsearch.randomizedtesting.rules.StatementAdapter.evaluate(StatementAdapter.java:36)
	at com.carrotsearch.randomizedtesting.ThreadLeakControl$StatementRunner.run(ThreadLeakControl.java:359)
	at java.lang.Thread.run(Thread.java:744)


FAILED:  org.apache.lucene.spatial.prefix.SpatialOpRecursivePrefixTreeTest.testWithin {#9
seed=[175A10038A619363:F5955167D20E961C]}

Error Message:
Shouldn't match I#1:Rect(minX=0.0,maxX=256.0,minY=-128.0,maxY=128.0) Q:ShapePair(Rect(minX=0.0,maxX=255.0,minY=-127.0,maxY=127.0)
, Rect(minX=242.0,maxX=249.0,minY=-98.0,maxY=-98.0))

Stack Trace:
java.lang.AssertionError: Shouldn't match I#1:Rect(minX=0.0,maxX=256.0,minY=-128.0,maxY=128.0)
Q:ShapePair(Rect(minX=0.0,maxX=255.0,minY=-127.0,maxY=127.0) , Rect(minX=242.0,maxX=249.0,minY=-98.0,maxY=-98.0))
	at __randomizedtesting.SeedInfo.seed([175A10038A619363:F5955167D20E961C]:0)
	at org.junit.Assert.fail(Assert.java:93)
	at org.apache.lucene.spatial.prefix.SpatialOpRecursivePrefixTreeTest.fail(SpatialOpRecursivePrefixTreeTest.java:355)
	at org.apache.lucene.spatial.prefix.SpatialOpRecursivePrefixTreeTest.doTest(SpatialOpRecursivePrefixTreeTest.java:335)
	at org.apache.lucene.spatial.prefix.SpatialOpRecursivePrefixTreeTest.testWithin(SpatialOpRecursivePrefixTreeTest.java:119)
	at sun.reflect.NativeMethodAccessorImpl.invoke0(Native Method)
	at sun.reflect.NativeMethodAccessorImpl.invoke(NativeMethodAccessorImpl.java:57)
	at sun.reflect.DelegatingMethodAccessorImpl.invoke(DelegatingMethodAccessorImpl.java:43)
	at java.lang.reflect.Method.invoke(Method.java:606)
	at com.carrotsearch.randomizedtesting.RandomizedRunner.invoke(RandomizedRunner.java:1617)
	at com.carrotsearch.randomizedtesting.RandomizedRunner$6.evaluate(RandomizedRunner.java:826)
	at com.carrotsearch.randomizedtesting.RandomizedRunner$7.evaluate(RandomizedRunner.java:862)
	at com.carrotsearch.randomizedtesting.RandomizedRunner$8.evaluate(RandomizedRunner.java:876)
	at org.apache.lucene.util.TestRuleSetupTeardownChained$1.evaluate(TestRuleSetupTeardownChained.java:50)
	at org.apache.lucene.util.TestRuleFieldCacheSanity$1.evaluate(TestRuleFieldCacheSanity.java:51)
	at org.apache.lucene.util.AbstractBeforeAfterRule$1.evaluate(AbstractBeforeAfterRule.java:46)
	at com.carrotsearch.randomizedtesting.rules.SystemPropertiesInvariantRule$1.evaluate(SystemPropertiesInvariantRule.java:55)
	at org.apache.lucene.util.TestRuleThreadAndTestName$1.evaluate(TestRuleThreadAndTestName.java:49)
	at org.apache.lucene.util.TestRuleIgnoreAfterMaxFailures$1.evaluate(TestRuleIgnoreAfterMaxFailures.java:70)
	at org.apache.lucene.util.TestRuleMarkFailure$1.evaluate(TestRuleMarkFailure.java:48)
	at com.carrotsearch.randomizedtesting.rules.StatementAdapter.evaluate(StatementAdapter.java:36)
	at com.carrotsearch.randomizedtesting.ThreadLeakControl$StatementRunner.run(ThreadLeakControl.java:359)
	at com.carrotsearch.randomizedtesting.ThreadLeakControl.forkTimeoutingTask(ThreadLeakControl.java:783)
	at com.carrotsearch.randomizedtesting.ThreadLeakControl$3.evaluate(ThreadLeakControl.java:443)
	at com.carrotsearch.randomizedtesting.RandomizedRunner.runSingleTest(RandomizedRunner.java:835)
	at com.carrotsearch.randomizedtesting.RandomizedRunner$3.evaluate(RandomizedRunner.java:737)
	at com.carrotsearch.randomizedtesting.RandomizedRunner$4.evaluate(RandomizedRunner.java:771)
	at com.carrotsearch.randomizedtesting.RandomizedRunner$5.evaluate(RandomizedRunner.java:782)
	at org.apache.lucene.util.AbstractBeforeAfterRule$1.evaluate(AbstractBeforeAfterRule.java:46)
	at org.apache.lucene.util.TestRuleStoreClassName$1.evaluate(TestRuleStoreClassName.java:42)
	at com.carrotsearch.randomizedtesting.rules.SystemPropertiesInvariantRule$1.evaluate(SystemPropertiesInvariantRule.java:55)
	at com.carrotsearch.randomizedtesting.rules.NoShadowingOrOverridesOnMethodsRule$1.evaluate(NoShadowingOrOverridesOnMethodsRule.java:39)
	at com.carrotsearch.randomizedtesting.rules.NoShadowingOrOverridesOnMethodsRule$1.evaluate(NoShadowingOrOverridesOnMethodsRule.java:39)
	at com.carrotsearch.randomizedtesting.rules.StatementAdapter.evaluate(StatementAdapter.java:36)
	at org.apache.lucene.util.TestRuleAssertionsRequired$1.evaluate(TestRuleAssertionsRequired.java:43)
	at org.apache.lucene.util.TestRuleMarkFailure$1.evaluate(TestRuleMarkFailure.java:48)
	at org.apache.lucene.util.TestRuleIgnoreAfterMaxFailures$1.evaluate(TestRuleIgnoreAfterMaxFailures.java:70)
	at org.apache.lucene.util.TestRuleIgnoreTestSuites$1.evaluate(TestRuleIgnoreTestSuites.java:55)
	at com.carrotsearch.randomizedtesting.rules.StatementAdapter.evaluate(StatementAdapter.java:36)
	at com.carrotsearch.randomizedtesting.ThreadLeakControl$StatementRunner.run(ThreadLeakControl.java:359)
	at java.lang.Thread.run(Thread.java:744)




Build Log:
[...truncated 9234 lines...]
   [junit4] Suite: org.apache.lucene.spatial.prefix.SpatialOpRecursivePrefixTreeTest
   [junit4]   1> Strategy: RecursivePrefixTreeStrategy(prefixGridScanLevel:-1,SPG:(QuadPrefixTree(maxLevels:3,ctx:SpatialContext{geo=false,
calculator=CartesianDistCalc, worldBounds=Rect(minX=0.0,maxX=256.0,minY=-128.0,maxY=128.0)})))
   [junit4]   1> Strategy: RecursivePrefixTreeStrategy(prefixGridScanLevel:-1,SPG:(GeohashPrefixTree(maxLevels:3,ctx:SpatialContext.GEO)))
   [junit4]   1> Strategy: RecursivePrefixTreeStrategy(prefixGridScanLevel:1,SPG:(QuadPrefixTree(maxLevels:5,ctx:SpatialContext{geo=false,
calculator=CartesianDistCalc, worldBounds=Rect(minX=0.0,maxX=256.0,minY=-128.0,maxY=128.0)})))
   [junit4]   1> Strategy: RecursivePrefixTreeStrategy(prefixGridScanLevel:-2,SPG:(GeohashPrefixTree(maxLevels:2,ctx:SpatialContext.GEO)))
   [junit4]   1> Strategy: RecursivePrefixTreeStrategy(prefixGridScanLevel:-2,SPG:(GeohashPrefixTree(maxLevels:2,ctx:SpatialContext.GEO)))
   [junit4]   1> Strategy: RecursivePrefixTreeStrategy(prefixGridScanLevel:-2,SPG:(GeohashPrefixTree(maxLevels:2,ctx:SpatialContext.GEO)))
   [junit4]   1> Strategy: RecursivePrefixTreeStrategy(prefixGridScanLevel:-3,SPG:(GeohashPrefixTree(maxLevels:1,ctx:SpatialContext.GEO)))
   [junit4]   1> Strategy: RecursivePrefixTreeStrategy(prefixGridScanLevel:-1,SPG:(GeohashPrefixTree(maxLevels:3,ctx:SpatialContext.GEO)))
   [junit4]   1> Strategy: RecursivePrefixTreeStrategy(prefixGridScanLevel:2,SPG:(QuadPrefixTree(maxLevels:6,ctx:SpatialContext{geo=false,
calculator=CartesianDistCalc, worldBounds=Rect(minX=0.0,maxX=256.0,minY=-128.0,maxY=128.0)})))
   [junit4]   1> Strategy: RecursivePrefixTreeStrategy(prefixGridScanLevel:-2,SPG:(GeohashPrefixTree(maxLevels:2,ctx:SpatialContext.GEO)))
   [junit4]   1> Strategy: RecursivePrefixTreeStrategy(prefixGridScanLevel:-1,SPG:(QuadPrefixTree(maxLevels:3,ctx:SpatialContext{geo=false,
calculator=CartesianDistCalc, worldBounds=Rect(minX=0.0,maxX=256.0,minY=-128.0,maxY=128.0)})))
   [junit4]   1> Strategy: RecursivePrefixTreeStrategy(prefixGridScanLevel:-2,SPG:(GeohashPrefixTree(maxLevels:2,ctx:SpatialContext.GEO)))
   [junit4]   1> Strategy: RecursivePrefixTreeStrategy(prefixGridScanLevel:-2,SPG:(GeohashPrefixTree(maxLevels:2,ctx:SpatialContext.GEO)))
   [junit4]   1> Strategy: RecursivePrefixTreeStrategy(prefixGridScanLevel:-1,SPG:(GeohashPrefixTree(maxLevels:3,ctx:SpatialContext.GEO)))
   [junit4]   1> Strategy: RecursivePrefixTreeStrategy(prefixGridScanLevel:-2,SPG:(QuadPrefixTree(maxLevels:2,ctx:SpatialContext{geo=false,
calculator=CartesianDistCalc, worldBounds=Rect(minX=0.0,maxX=256.0,minY=-128.0,maxY=128.0)})))
   [junit4]   1> Strategy: RecursivePrefixTreeStrategy(prefixGridScanLevel:-2,SPG:(GeohashPrefixTree(maxLevels:2,ctx:SpatialContext.GEO)))
   [junit4]   1> Strategy: RecursivePrefixTreeStrategy(prefixGridScanLevel:-2,SPG:(QuadPrefixTree(maxLevels:2,ctx:SpatialContext{geo=false,
calculator=CartesianDistCalc, worldBounds=Rect(minX=0.0,maxX=256.0,minY=-128.0,maxY=128.0)})))
   [junit4]   1> Strategy: RecursivePrefixTreeStrategy(prefixGridScanLevel:-1,SPG:(GeohashPrefixTree(maxLevels:3,ctx:SpatialContext.GEO)))
   [junit4]   2> Ig:Rect(minX=-180.0,maxX=180.0,minY=-90.0,maxY=90.0) Qg:ShapePair(Rect(minX=-180.0,maxX=180.0,minY=-90.0,maxY=90.0)
, Rect(minX=-21.09375,maxX=-12.65625,minY=-26.71875,maxY=-19.6875))
   [junit4]   2> NOTE: reproduce with: ant test  -Dtestcase=SpatialOpRecursivePrefixTreeTest
-Dtests.method=testContains -Dtests.seed=175A10038A619363 -Dtests.multiplier=3 -Dtests.slow=true
-Dtests.locale=bg_BG -Dtests.timezone=US/Central -Dtests.file.encoding=UTF-8
   [junit4] FAILURE 0.11s J0 | SpatialOpRecursivePrefixTreeTest.testContains {#7 seed=[175A10038A619363:146B27D88CDE16A]}
<<<
   [junit4]    > Throwable #1: java.lang.AssertionError: Shouldn't match I#0:Rect(minX=-180.0,maxX=180.0,minY=-90.0,maxY=90.0)
Q:ShapePair(Rect(minX=-180.0,maxX=180.0,minY=-90.0,maxY=90.0) , Rect(minX=-21.0,maxX=-14.0,minY=-26.0,maxY=-21.0))
   [junit4]    > 	at __randomizedtesting.SeedInfo.seed([175A10038A619363:146B27D88CDE16A]:0)
   [junit4]    > 	at org.apache.lucene.spatial.prefix.SpatialOpRecursivePrefixTreeTest.fail(SpatialOpRecursivePrefixTreeTest.java:355)
   [junit4]    > 	at org.apache.lucene.spatial.prefix.SpatialOpRecursivePrefixTreeTest.doTest(SpatialOpRecursivePrefixTreeTest.java:335)
   [junit4]    > 	at org.apache.lucene.spatial.prefix.SpatialOpRecursivePrefixTreeTest.testContains(SpatialOpRecursivePrefixTreeTest.java:126)
   [junit4]    > 	at java.lang.Thread.run(Thread.java:744)
   [junit4]   1> Strategy: RecursivePrefixTreeStrategy(prefixGridScanLevel:3,SPG:(QuadPrefixTree(maxLevels:7,ctx:SpatialContext{geo=false,
calculator=CartesianDistCalc, worldBounds=Rect(minX=0.0,maxX=256.0,minY=-128.0,maxY=128.0)})))
   [junit4]   1> Strategy: RecursivePrefixTreeStrategy(prefixGridScanLevel:-2,SPG:(GeohashPrefixTree(maxLevels:2,ctx:SpatialContext.GEO)))
   [junit4]   1> Strategy: RecursivePrefixTreeStrategy(prefixGridScanLevel:-3,SPG:(GeohashPrefixTree(maxLevels:1,ctx:SpatialContext.GEO)))
   [junit4]   1> Strategy: RecursivePrefixTreeStrategy(prefixGridScanLevel:-1,SPG:(GeohashPrefixTree(maxLevels:3,ctx:SpatialContext.GEO)))
   [junit4]   1> Strategy: RecursivePrefixTreeStrategy(prefixGridScanLevel:-2,SPG:(GeohashPrefixTree(maxLevels:2,ctx:SpatialContext.GEO)))
   [junit4]   1> Strategy: RecursivePrefixTreeStrategy(prefixGridScanLevel:-3,SPG:(QuadPrefixTree(maxLevels:1,ctx:SpatialContext{geo=false,
calculator=CartesianDistCalc, worldBounds=Rect(minX=0.0,maxX=256.0,minY=-128.0,maxY=128.0)})))
   [junit4]   1> Strategy: RecursivePrefixTreeStrategy(prefixGridScanLevel:3,SPG:(QuadPrefixTree(maxLevels:7,ctx:SpatialContext{geo=false,
calculator=CartesianDistCalc, worldBounds=Rect(minX=0.0,maxX=256.0,minY=-128.0,maxY=128.0)})))
   [junit4]   1> Strategy: RecursivePrefixTreeStrategy(prefixGridScanLevel:-3,SPG:(GeohashPrefixTree(maxLevels:1,ctx:SpatialContext.GEO)))
   [junit4]   1> Strategy: RecursivePrefixTreeStrategy(prefixGridScanLevel:-3,SPG:(GeohashPrefixTree(maxLevels:1,ctx:SpatialContext.GEO)))
   [junit4]   1> Strategy: RecursivePrefixTreeStrategy(prefixGridScanLevel:4,SPG:(QuadPrefixTree(maxLevels:8,ctx:SpatialContext{geo=false,
calculator=CartesianDistCalc, worldBounds=Rect(minX=0.0,maxX=256.0,minY=-128.0,maxY=128.0)})))
   [junit4]   1> Strategy: RecursivePrefixTreeStrategy(prefixGridScanLevel:-1,SPG:(GeohashPrefixTree(maxLevels:3,ctx:SpatialContext.GEO)))
   [junit4]   1> Strategy: RecursivePrefixTreeStrategy(prefixGridScanLevel:-2,SPG:(GeohashPrefixTree(maxLevels:2,ctx:SpatialContext.GEO)))
   [junit4]   1> Strategy: RecursivePrefixTreeStrategy(prefixGridScanLevel:0,SPG:(QuadPrefixTree(maxLevels:4,ctx:SpatialContext{geo=false,
calculator=CartesianDistCalc, worldBounds=Rect(minX=0.0,maxX=256.0,minY=-128.0,maxY=128.0)})))
   [junit4]   1> Strategy: RecursivePrefixTreeStrategy(prefixGridScanLevel:-2,SPG:(GeohashPrefixTree(maxLevels:2,ctx:SpatialContext.GEO)))
   [junit4]   1> Strategy: RecursivePrefixTreeStrategy(prefixGridScanLevel:-2,SPG:(GeohashPrefixTree(maxLevels:2,ctx:SpatialContext.GEO)))
   [junit4]   1> Strategy: RecursivePrefixTreeStrategy(prefixGridScanLevel:-3,SPG:(GeohashPrefixTree(maxLevels:1,ctx:SpatialContext.GEO)))
   [junit4]   1> Strategy: RecursivePrefixTreeStrategy(prefixGridScanLevel:-1,SPG:(GeohashPrefixTree(maxLevels:3,ctx:SpatialContext.GEO)))
   [junit4]   1> Strategy: RecursivePrefixTreeStrategy(prefixGridScanLevel:2,SPG:(QuadPrefixTree(maxLevels:6,ctx:SpatialContext{geo=false,
calculator=CartesianDistCalc, worldBounds=Rect(minX=0.0,maxX=256.0,minY=-128.0,maxY=128.0)})))
   [junit4]   1> Strategy: RecursivePrefixTreeStrategy(prefixGridScanLevel:-3,SPG:(GeohashPrefixTree(maxLevels:1,ctx:SpatialContext.GEO)))
   [junit4]   1> Strategy: RecursivePrefixTreeStrategy(prefixGridScanLevel:-1,SPG:(QuadPrefixTree(maxLevels:3,ctx:SpatialContext{geo=false,
calculator=CartesianDistCalc, worldBounds=Rect(minX=0.0,maxX=256.0,minY=-128.0,maxY=128.0)})))
   [junit4]   1> Strategy: RecursivePrefixTreeStrategy(prefixGridScanLevel:3,SPG:(QuadPrefixTree(maxLevels:7,ctx:SpatialContext{geo=false,
calculator=CartesianDistCalc, worldBounds=Rect(minX=0.0,maxX=256.0,minY=-128.0,maxY=128.0)})))
   [junit4]   1> Strategy: RecursivePrefixTreeStrategy(prefixGridScanLevel:-1,SPG:(QuadPrefixTree(maxLevels:3,ctx:SpatialContext{geo=false,
calculator=CartesianDistCalc, worldBounds=Rect(minX=0.0,maxX=256.0,minY=-128.0,maxY=128.0)})))
   [junit4]   2> Ig:Rect(minX=0.0,maxX=256.0,minY=-128.0,maxY=128.0) Qg:ShapePair(Rect(minX=0.0,maxX=256.0,minY=-128.0,maxY=128.0)
, Rect(minX=224.0,maxX=256.0,minY=-128.0,maxY=-96.0))
   [junit4]   2> NOTE: reproduce with: ant test  -Dtestcase=SpatialOpRecursivePrefixTreeTest
-Dtests.method=testWithin -Dtests.seed=175A10038A619363 -Dtests.multiplier=3 -Dtests.slow=true
-Dtests.locale=bg_BG -Dtests.timezone=US/Central -Dtests.file.encoding=UTF-8
   [junit4] FAILURE 0.03s J0 | SpatialOpRecursivePrefixTreeTest.testWithin {#9 seed=[175A10038A619363:F5955167D20E961C]}
<<<
   [junit4]    > Throwable #1: java.lang.AssertionError: Shouldn't match I#1:Rect(minX=0.0,maxX=256.0,minY=-128.0,maxY=128.0)
Q:ShapePair(Rect(minX=0.0,maxX=255.0,minY=-127.0,maxY=127.0) , Rect(minX=242.0,maxX=249.0,minY=-98.0,maxY=-98.0))
   [junit4]    > 	at __randomizedtesting.SeedInfo.seed([175A10038A619363:F5955167D20E961C]:0)
   [junit4]    > 	at org.apache.lucene.spatial.prefix.SpatialOpRecursivePrefixTreeTest.fail(SpatialOpRecursivePrefixTreeTest.java:355)
   [junit4]    > 	at org.apache.lucene.spatial.prefix.SpatialOpRecursivePrefixTreeTest.doTest(SpatialOpRecursivePrefixTreeTest.java:335)
   [junit4]    > 	at org.apache.lucene.spatial.prefix.SpatialOpRecursivePrefixTreeTest.testWithin(SpatialOpRecursivePrefixTreeTest.java:119)
   [junit4]    > 	at java.lang.Thread.run(Thread.java:744)
   [junit4]   2> NOTE: test params are: codec=Lucene3x, sim=RandomSimilarityProvider(queryNorm=true,coord=no):
{}, locale=bg_BG, timezone=US/Central
   [junit4]   2> NOTE: Linux 3.8.0-36-generic i386/Oracle Corporation 1.7.0_51 (32-bit)/cpus=8,threads=1,free=38923056,total=64880640
   [junit4]   2> NOTE: All tests run in this JVM: [TestTestFramework, SerializedStrategyTest,
SpatialOpRecursivePrefixTreeTest]
   [junit4] Completed on J0 in 5.11s, 43 tests, 2 failures <<< FAILURES!

[...truncated 39 lines...]
BUILD FAILED
/mnt/ssd/jenkins/workspace/Lucene-Solr-4.x-Linux/build.xml:467: The following error occurred
while executing this line:
/mnt/ssd/jenkins/workspace/Lucene-Solr-4.x-Linux/build.xml:447: The following error occurred
while executing this line:
/mnt/ssd/jenkins/workspace/Lucene-Solr-4.x-Linux/build.xml:45: The following error occurred
while executing this line:
/mnt/ssd/jenkins/workspace/Lucene-Solr-4.x-Linux/extra-targets.xml:37: The following error
occurred while executing this line:
/mnt/ssd/jenkins/workspace/Lucene-Solr-4.x-Linux/lucene/build.xml:539: The following error
occurred while executing this line:
/mnt/ssd/jenkins/workspace/Lucene-Solr-4.x-Linux/lucene/common-build.xml:1996: The following
error occurred while executing this line:
/mnt/ssd/jenkins/workspace/Lucene-Solr-4.x-Linux/lucene/module-build.xml:60: The following
error occurred while executing this line:
/mnt/ssd/jenkins/workspace/Lucene-Solr-4.x-Linux/lucene/common-build.xml:1276: The following
error occurred while executing this line:
/mnt/ssd/jenkins/workspace/Lucene-Solr-4.x-Linux/lucene/common-build.xml:908: There were test
failures: 13 suites, 74 tests, 2 failures, 2 ignored (2 assumptions)

Total time: 21 minutes 17 seconds
Build step 'Invoke Ant' marked build as failure
Description set: Java: 32bit/jdk1.7.0_51 -server -XX:+UseSerialGC
Archiving artifacts
Recording test results
Email was triggered for: Failure
Sending email for trigger: Failure



Mime
View raw message