lucene-dev mailing list archives

Site index · List index
Message view « Date » · « Thread »
Top « Date » · « Thread »
From Mark Miller <markrmil...@gmail.com>
Subject Re: [JENKINS] Lucene-Solr-SmokeRelease-4.x - Build # 157 - Still Failing
Date Sat, 08 Mar 2014 15:21:24 GMT
The failed tests has a bunch of the following in it:

  [exec]    [junit4]   2> 89295 T12 oasc.SolrException.log ERROR java.lang.ArrayIndexOutOfBoundsException: 0
     [exec]    [junit4]   2> 		at org.apache.solr.search.SolrIndexSearcher.warm(SolrIndexSearcher.java:2161)
     [exec]    [junit4]   2> 		at org.apache.solr.core.SolrCore$4.call(SolrCore.java:1693)
     [exec]    [junit4]   2> 		at java.util.concurrent.FutureTask$Sync.innerRun(FutureTask.java:334)
     [exec]    [junit4]   2> 		at java.util.concurrent.FutureTask.run(FutureTask.java:166)
     [exec]    [junit4]   2> 		at java.util.concurrent.ThreadPoolExecutor.runWorker(ThreadPoolExecutor.java:1146)
     [exec]    [junit4]   2> 		at java.util.concurrent.ThreadPoolExecutor$Worker.run(ThreadPoolExecutor.java:615)
     [exec]    [junit4]   2> 		at java.lang.Thread.run(Thread.java:679)

There is also another new test fail I’ve been seeing that seem to point to perhaps an issue with the optimization hossman recently made about not opening a new searcher if you don’t have to. Just a guess though.

- Mark

http://about.me/markrmiller

On Mar 8, 2014, at 10:05 AM, Apache Jenkins Server <jenkins@builds.apache.org> wrote:

> Build: https://builds.apache.org/job/Lucene-Solr-SmokeRelease-4.x/157/
> 
> No tests ran.
> 
> Build Log:
> [...truncated 51260 lines...]
> prepare-release-no-sign:
>    [mkdir] Created dir: /usr/home/hudson/hudson-slave/workspace/Lucene-Solr-SmokeRelease-4.x/lucene/build/fakeRelease
>     [copy] Copying 431 files to /usr/home/hudson/hudson-slave/workspace/Lucene-Solr-SmokeRelease-4.x/lucene/build/fakeRelease/lucene
>     [copy] Copying 239 files to /usr/home/hudson/hudson-slave/workspace/Lucene-Solr-SmokeRelease-4.x/lucene/build/fakeRelease/solr
>     [exec] JAVA6_HOME is /home/hudson/tools/java/latest1.6
>     [exec] JAVA7_HOME is /home/hudson/tools/java/latest1.7
>     [exec] NOTE: output encoding is US-ASCII
>     [exec] 
>     [exec] Load release URL "file:/usr/home/hudson/hudson-slave/workspace/Lucene-Solr-SmokeRelease-4.x/lucene/build/fakeRelease/"...
>     [exec] 
>     [exec] Test Lucene...
>     [exec]   test basics...
>     [exec]   get KEYS
>     [exec]     0.1 MB in 0.01 sec (14.5 MB/sec)
>     [exec]   check changes HTML...
>     [exec]   download lucene-4.8.0-src.tgz...
>     [exec]     27.4 MB in 0.09 sec (301.7 MB/sec)
>     [exec]     verify md5/sha1 digests
>     [exec]   download lucene-4.8.0.tgz...
>     [exec]     61.7 MB in 0.48 sec (128.8 MB/sec)
>     [exec]     verify md5/sha1 digests
>     [exec]   download lucene-4.8.0.zip...
>     [exec]     71.3 MB in 0.17 sec (409.7 MB/sec)
>     [exec]     verify md5/sha1 digests
>     [exec]   unpack lucene-4.8.0.tgz...
>     [exec]     verify JAR metadata/identity/no javax.* or java.* classes...
>     [exec]     test demo with 1.6...
>     [exec]       got 5649 hits for query "lucene"
>     [exec]     test demo with 1.7...
>     [exec]       got 5649 hits for query "lucene"
>     [exec]     check Lucene's javadoc JAR
>     [exec]   unpack lucene-4.8.0.zip...
>     [exec]     verify JAR metadata/identity/no javax.* or java.* classes...
>     [exec]     test demo with 1.6...
>     [exec]       got 5649 hits for query "lucene"
>     [exec]     test demo with 1.7...
>     [exec]       got 5649 hits for query "lucene"
>     [exec]     check Lucene's javadoc JAR
>     [exec]   unpack lucene-4.8.0-src.tgz...
>     [exec]     make sure no JARs/WARs in src dist...
>     [exec]     run "ant validate"
>     [exec]     run tests w/ Java 6 and testArgs='-Dtests.jettyConnector=Socket  -Dtests.disableHdfs=true'...
>     [exec]     test demo with 1.6...
>     [exec]       got 243 hits for query "lucene"
>     [exec]     generate javadocs w/ Java 6...
>     [exec]     run tests w/ Java 7 and testArgs='-Dtests.jettyConnector=Socket  -Dtests.disableHdfs=true'...
>     [exec]     test demo with 1.7...
>     [exec]       got 243 hits for query "lucene"
>     [exec]     generate javadocs w/ Java 7...
>     [exec] 
>     [exec] Crawl/parse...
>     [exec] 
>     [exec] Verify...
>     [exec] 
>     [exec] Test Solr...
>     [exec]   test basics...
>     [exec]   get KEYS
>     [exec]     0.1 MB in 0.00 sec (81.7 MB/sec)
>     [exec]   check changes HTML...
>     [exec]   download solr-4.8.0-src.tgz...
>     [exec]     32.6 MB in 0.43 sec (75.6 MB/sec)
>     [exec]     verify md5/sha1 digests
>     [exec]   download solr-4.8.0.tgz...
>     [exec]     145.0 MB in 1.37 sec (105.7 MB/sec)
>     [exec]     verify md5/sha1 digests
>     [exec]   download solr-4.8.0.zip...
>     [exec]     150.3 MB in 0.69 sec (216.5 MB/sec)
>     [exec]     verify md5/sha1 digests
>     [exec]   unpack solr-4.8.0.tgz...
>     [exec]     verify JAR metadata/identity/no javax.* or java.* classes...
>     [exec]     unpack lucene-4.8.0.tgz...
>     [exec]       **WARNING**: skipping check of /usr/home/hudson/hudson-slave/workspace/Lucene-Solr-SmokeRelease-4.x/lucene/build/fakeReleaseTmp/unpack/solr-4.8.0/contrib/dataimporthandler/lib/activation-1.1.jar: it has javax.* classes
>     [exec]       **WARNING**: skipping check of /usr/home/hudson/hudson-slave/workspace/Lucene-Solr-SmokeRelease-4.x/lucene/build/fakeReleaseTmp/unpack/solr-4.8.0/contrib/dataimporthandler/lib/mail-1.4.1.jar: it has javax.* classes
>     [exec]     verify WAR metadata/contained JAR identity/no javax.* or java.* classes...
>     [exec]     unpack lucene-4.8.0.tgz...
>     [exec]     copying unpacked distribution for Java 6 ...
>     [exec]     test solr example w/ Java 6...
>     [exec]       start Solr instance (log=/usr/home/hudson/hudson-slave/workspace/Lucene-Solr-SmokeRelease-4.x/lucene/build/fakeReleaseTmp/unpack/solr-4.8.0-java6/solr-example.log)...
>     [exec]       startup done
>     [exec]       test utf8...
>     [exec]       index example docs...
>     [exec]       run query...
>     [exec]       stop server (SIGINT)...
>     [exec]     copying unpacked distribution for Java 7 ...
>     [exec]     test solr example w/ Java 7...
>     [exec]       start Solr instance (log=/usr/home/hudson/hudson-slave/workspace/Lucene-Solr-SmokeRelease-4.x/lucene/build/fakeReleaseTmp/unpack/solr-4.8.0-java7/solr-example.log)...
>     [exec]       startup done
>     [exec]       test utf8...
>     [exec]       index example docs...
>     [exec]       run query...
>     [exec]       stop server (SIGINT)...
>     [exec]   unpack solr-4.8.0.zip...
>     [exec]     verify JAR metadata/identity/no javax.* or java.* classes...
>     [exec]     unpack lucene-4.8.0.tgz...
>     [exec]       **WARNING**: skipping check of /usr/home/hudson/hudson-slave/workspace/Lucene-Solr-SmokeRelease-4.x/lucene/build/fakeReleaseTmp/unpack/solr-4.8.0/contrib/dataimporthandler/lib/mail-1.4.1.jar: it has javax.* classes
>     [exec]       **WARNING**: skipping check of /usr/home/hudson/hudson-slave/workspace/Lucene-Solr-SmokeRelease-4.x/lucene/build/fakeReleaseTmp/unpack/solr-4.8.0/contrib/dataimporthandler/lib/activation-1.1.jar: it has javax.* classes
>     [exec]     verify WAR metadata/contained JAR identity/no javax.* or java.* classes...
>     [exec]     unpack lucene-4.8.0.tgz...
>     [exec]     copying unpacked distribution for Java 6 ...
>     [exec]     test solr example w/ Java 6...
>     [exec]       start Solr instance (log=/usr/home/hudson/hudson-slave/workspace/Lucene-Solr-SmokeRelease-4.x/lucene/build/fakeReleaseTmp/unpack/solr-4.8.0-java6/solr-example.log)...
>     [exec]       startup done
>     [exec]       test utf8...
>     [exec]       index example docs...
>     [exec]       run query...
>     [exec]       stop server (SIGINT)...
>     [exec]     copying unpacked distribution for Java 7 ...
>     [exec]     test solr example w/ Java 7...
>     [exec]       start Solr instance (log=/usr/home/hudson/hudson-slave/workspace/Lucene-Solr-SmokeRelease-4.x/lucene/build/fakeReleaseTmp/unpack/solr-4.8.0-java7/solr-example.log)...
>     [exec]       startup done
>     [exec]       test utf8...
>     [exec]       index example docs...
>     [exec]       run query...
>     [exec]       stop server (SIGINT)...
>     [exec]   unpack solr-4.8.0-src.tgz...
>     [exec]     make sure no JARs/WARs in src dist...
>     [exec]     run "ant validate"
>     [exec]     run tests w/ Java 6 and testArgs='-Dtests.jettyConnector=Socket  -Dtests.disableHdfs=true'...
>     [exec] 
>     [exec] command "export JAVA_HOME="/home/hudson/tools/java/latest1.6" PATH="/home/hudson/tools/java/latest1.6/bin:$PATH" JAVACMD="/home/hudson/tools/java/latest1.6/bin/java"; ant test -Dtests.slow=false -Dtests.jettyConnector=Socket  -Dtests.disableHdfs=true" failed:
>     [exec] Buildfile: /usr/home/hudson/hudson-slave/workspace/Lucene-Solr-SmokeRelease-4.x/lucene/build/fakeReleaseTmp/unpack/solr-4.8.0/solr/build.xml
>     [exec]      [echo] Building solr...
>     [exec] 
>     [exec] ivy-availability-check:
>     [exec]      [echo] Building solr...
>     [exec] 
>     [exec] ivy-fail:
>     [exec] 
>     [exec] ivy-configure:
>     [exec] [ivy:configure] :: Apache Ivy 2.3.0 - 20130110142753 :: http://ant.apache.org/ivy/ ::
>     [exec] [ivy:configure] :: loading settings :: file = /usr/home/hudson/hudson-slave/workspace/Lucene-Solr-SmokeRelease-4.x/lucene/build/fakeReleaseTmp/unpack/solr-4.8.0/lucene/ivy-settings.xml
>     [exec] 
>     [exec] resolve-groovy:
>     [exec] [ivy:cachepath] :: resolving dependencies :: org.codehaus.groovy#groovy-all-caller;working
>     [exec] [ivy:cachepath] 	confs: [default]
>     [exec] [ivy:cachepath] 	found org.codehaus.groovy#groovy-all;2.2.1 in public
>     [exec] [ivy:cachepath] :: resolution report :: resolve 124ms :: artifacts dl 3ms
>     [exec] 	---------------------------------------------------------------------
>     [exec] 	|                  |            modules            ||   artifacts   |
>     [exec] 	|       conf       | number| search|dwnlded|evicted|| number|dwnlded|
>     [exec] 	---------------------------------------------------------------------
>     [exec] 	|      default     |   1   |   0   |   0   |   0   ||   1   |   0   |
>     [exec] 	---------------------------------------------------------------------
>     [exec] 
>     [exec] -init-totals:
>     [exec]     [mkdir] Created dir: /usr/home/hudson/hudson-slave/workspace/Lucene-Solr-SmokeRelease-4.x/lucene/build/fakeReleaseTmp/unpack/solr-4.8.0/solr/build/solr
>     [exec] 
>     [exec] -clover.load:
>     [exec] 
>     [exec] test-solr-core:
>     [exec]      [echo] Building solr-core...
>     [exec] 
>     [exec] test:
>     [exec]      [echo] Building solr-core...
>     [exec] 
>     [exec] -clover.disable:
>     [exec] 
>     [exec] ivy-availability-check:
>     [exec]      [echo] Building solr-core...
>     [exec] 
>     [exec] ivy-fail:
>     [exec] 
>     [exec] ivy-configure:
>     [exec] [ivy:configure] :: loading settings :: file = /usr/home/hudson/hudson-slave/workspace/Lucene-Solr-SmokeRelease-4.x/lucene/build/fakeReleaseTmp/unpack/solr-4.8.0/lucene/ivy-settings.xml
>     [exec] 
>     [exec] -clover.load:
>     [exec] 
>     [exec] -clover.classpath:
>     [exec] 
>     [exec] -clover.setup:
>     [exec] 
>     [exec] clover:
>     [exec] 
>     [exec] compile-solr-test-framework:
>     [exec]      [echo] Building solr-test-framework...
>     [exec] 
>     [exec] ivy-availability-check:
>     [exec]      [echo] Building solr-test-framework...
>     [exec] 
>     [exec] ivy-fail:
>     [exec] 
>     [exec] ivy-configure:
>     [exec] [ivy:configure] :: loading settings :: file = /usr/home/hudson/hudson-slave/workspace/Lucene-Solr-SmokeRelease-4.x/lucene/build/fakeReleaseTmp/unpack/solr-4.8.0/lucene/ivy-settings.xml
>     [exec] 
>     [exec] resolve:
>     [exec] 
>     [exec] compile-solr-core:
>     [exec]      [echo] Building solr-core...
>     [exec] 
>     [exec] compile-solrj:
>     [exec]      [echo] Building solr-solrj...
>     [exec] 
>     [exec] check-lucene-core-uptodate:
>     [exec] 
>     [exec] jar-lucene-core:
>     [exec] 
>     [exec] check-analyzers-phonetic-uptodate:
>     [exec] 
>     [exec] jar-analyzers-phonetic:
>     [exec] 
>     [exec] check-analyzers-kuromoji-uptodate:
>     [exec] 
>     [exec] jar-analyzers-kuromoji:
>     [exec] 
>     [exec] check-codecs-uptodate:
>     [exec] 
>     [exec] jar-codecs:
>     [exec] 
>     [exec] check-expressions-uptodate:
>     [exec] 
>     [exec] jar-expressions:
>     [exec] 
>     [exec] check-suggest-uptodate:
>     [exec] 
>     [exec] jar-suggest:
>     [exec] 
>     [exec] check-highlighter-uptodate:
>     [exec] 
>     [exec] jar-highlighter:
>     [exec] 
>     [exec] check-memory-uptodate:
>     [exec] 
>     [exec] jar-memory:
>     [exec] 
>     [exec] check-misc-uptodate:
>     [exec] 
>     [exec] jar-misc:
>     [exec] 
>     [exec] check-spatial-uptodate:
>     [exec] 
>     [exec] jar-spatial:
>     [exec] 
>     [exec] check-grouping-uptodate:
>     [exec] 
>     [exec] jar-grouping:
>     [exec] 
>     [exec] check-queries-uptodate:
>     [exec] 
>     [exec] jar-queries:
>     [exec] 
>     [exec] check-queryparser-uptodate:
>     [exec] 
>     [exec] jar-queryparser:
>     [exec] 
>     [exec] check-join-uptodate:
>     [exec] 
>     [exec] jar-join:
>     [exec] 
>     [exec] prep-lucene-jars:
>     [exec] 
>     [exec] resolve-example:
>     [exec]      [echo] Building solr-example...
>     [exec] 
>     [exec] ivy-availability-check:
>     [exec]      [echo] Building solr-example...
>     [exec] 
>     [exec] ivy-fail:
>     [exec] 
>     [exec] ivy-fail:
>     [exec] 
>     [exec] ivy-configure:
>     [exec] [ivy:configure] :: loading settings :: file = /usr/home/hudson/hudson-slave/workspace/Lucene-Solr-SmokeRelease-4.x/lucene/build/fakeReleaseTmp/unpack/solr-4.8.0/lucene/ivy-settings.xml
>     [exec] 
>     [exec] sync-hack:
>     [exec] 
>     [exec] resolve:
>     [exec]      [echo] Building solr-example-DIH...
>     [exec] 
>     [exec] ivy-availability-check:
>     [exec]      [echo] Building solr-example-DIH...
>     [exec] 
>     [exec] ivy-fail:
>     [exec] 
>     [exec] ivy-configure:
>     [exec] [ivy:configure] :: loading settings :: file = /usr/home/hudson/hudson-slave/workspace/Lucene-Solr-SmokeRelease-4.x/lucene/build/fakeReleaseTmp/unpack/solr-4.8.0/lucene/ivy-settings.xml
>     [exec] 
>     [exec] resolve:
>     [exec] 
>     [exec] ivy-availability-check:
>     [exec]      [echo] Building solr-solrj...
>     [exec] 
>     [exec] ivy-fail:
>     [exec] 
>     [exec] ivy-configure:
>     [exec] [ivy:configure] :: loading settings :: file = /usr/home/hudson/hudson-slave/workspace/Lucene-Solr-SmokeRelease-4.x/lucene/build/fakeReleaseTmp/unpack/solr-4.8.0/lucene/ivy-settings.xml
>     [exec] 
>     [exec] resolve:
>     [exec] 
>     [exec] common.init:
>     [exec] 
>     [exec] compile-lucene-core:
>     [exec] 
>     [exec] ivy-availability-check:
>     [exec] 
>     [exec] ivy-fail:
>     [exec] 
>     [exec] ivy-configure:
>     [exec] [ivy:configure] :: loading settings :: file = /usr/home/hudson/hudson-slave/workspace/Lucene-Solr-SmokeRelease-4.x/lucene/build/fakeReleaseTmp/unpack/solr-4.8.0/lucene/ivy-settings.xml
>     [exec] 
>     [exec] resolve:
>     [exec] 
>     [exec] init:
>     [exec] 
>     [exec] -clover.disable:
>     [exec] 
>     [exec] -clover.load:
>     [exec] 
>     [exec] -clover.classpath:
>     [exec] 
>     [exec] -clover.setup:
>     [exec] 
>     [exec] clover:
>     [exec] 
>     [exec] compile-core:
>     [exec] 
>     [exec] init:
>     [exec] 
>     [exec] -clover.disable:
>     [exec] 
>     [exec] -clover.load:
>     [exec] 
>     [exec] -clover.classpath:
>     [exec] 
>     [exec] -clover.setup:
>     [exec] 
>     [exec] clover:
>     [exec] 
>     [exec] common.compile-core:
>     [exec] 
>     [exec] compile-core:
>     [exec] 
>     [exec] check-lucene-core-uptodate:
>     [exec] 
>     [exec] jar-lucene-core:
>     [exec] 
>     [exec] check-analyzers-phonetic-uptodate:
>     [exec] 
>     [exec] jar-analyzers-phonetic:
>     [exec] 
>     [exec] check-analyzers-kuromoji-uptodate:
>     [exec] 
>     [exec] jar-analyzers-kuromoji:
>     [exec] 
>     [exec] check-codecs-uptodate:
>     [exec] 
>     [exec] jar-codecs:
>     [exec] 
>     [exec] check-expressions-uptodate:
>     [exec] 
>     [exec] jar-expressions:
>     [exec] 
>     [exec] check-suggest-uptodate:
>     [exec] 
>     [exec] jar-suggest:
>     [exec] 
>     [exec] check-highlighter-uptodate:
>     [exec] 
>     [exec] jar-highlighter:
>     [exec] 
>     [exec] check-memory-uptodate:
>     [exec] 
>     [exec] jar-memory:
>     [exec] 
>     [exec] check-misc-uptodate:
>     [exec] 
>     [exec] jar-misc:
>     [exec] 
>     [exec] check-spatial-uptodate:
>     [exec] 
>     [exec] jar-spatial:
>     [exec] 
>     [exec] check-grouping-uptodate:
>     [exec] 
>     [exec] jar-grouping:
>     [exec] 
>     [exec] check-queries-uptodate:
>     [exec] 
>     [exec] jar-queries:
>     [exec] 
>     [exec] check-queryparser-uptodate:
>     [exec] 
>     [exec] jar-queryparser:
>     [exec] 
>     [exec] check-join-uptodate:
>     [exec] 
>     [exec] jar-join:
>     [exec] 
>     [exec] prep-lucene-jars:
>     [exec] 
>     [exec] resolve-example:
>     [exec]      [echo] Building solr-example...
>     [exec] 
>     [exec] ivy-availability-check:
>     [exec]      [echo] Building solr-example...
>     [exec] 
>     [exec] ivy-fail:
>     [exec] 
>     [exec] ivy-fail:
>     [exec] 
>     [exec] ivy-configure:
>     [exec] [ivy:configure] :: loading settings :: file = /usr/home/hudson/hudson-slave/workspace/Lucene-Solr-SmokeRelease-4.x/lucene/build/fakeReleaseTmp/unpack/solr-4.8.0/lucene/ivy-settings.xml
>     [exec] 
>     [exec] sync-hack:
>     [exec] 
>     [exec] resolve:
>     [exec]      [echo] Building solr-example-DIH...
>     [exec] 
>     [exec] ivy-availability-check:
>     [exec]      [echo] Building solr-example-DIH...
>     [exec] 
>     [exec] ivy-fail:
>     [exec] 
>     [exec] ivy-configure:
>     [exec] [ivy:configure] :: loading settings :: file = /usr/home/hudson/hudson-slave/workspace/Lucene-Solr-SmokeRelease-4.x/lucene/build/fakeReleaseTmp/unpack/solr-4.8.0/lucene/ivy-settings.xml
>     [exec] 
>     [exec] resolve:
>     [exec] 
>     [exec] ivy-availability-check:
>     [exec]      [echo] Building solr-core...
>     [exec] 
>     [exec] ivy-fail:
>     [exec] 
>     [exec] ivy-fail:
>     [exec] 
>     [exec] ivy-configure:
>     [exec] [ivy:configure] :: loading settings :: file = /usr/home/hudson/hudson-slave/workspace/Lucene-Solr-SmokeRelease-4.x/lucene/build/fakeReleaseTmp/unpack/solr-4.8.0/lucene/ivy-settings.xml
>     [exec] 
>     [exec] resolve:
>     [exec] 
>     [exec] common.init:
>     [exec] 
>     [exec] compile-lucene-core:
>     [exec] 
>     [exec] ivy-availability-check:
>     [exec] 
>     [exec] ivy-fail:
>     [exec] 
>     [exec] ivy-configure:
>     [exec] [ivy:configure] :: loading settings :: file = /usr/home/hudson/hudson-slave/workspace/Lucene-Solr-SmokeRelease-4.x/lucene/build/fakeReleaseTmp/unpack/solr-4.8.0/lucene/ivy-settings.xml
>     [exec] 
>     [exec] resolve:
>     [exec] 
>     [exec] init:
>     [exec] 
>     [exec] -clover.disable:
>     [exec] 
>     [exec] -clover.load:
>     [exec] 
>     [exec] -clover.classpath:
>     [exec] 
>     [exec] -clover.setup:
>     [exec] 
>     [exec] clover:
>     [exec] 
>     [exec] compile-core:
>     [exec] 
>     [exec] init:
>     [exec] 
>     [exec] -clover.disable:
>     [exec] 
>     [exec] -clover.load:
>     [exec] 
>     [exec] -clover.classpath:
>     [exec] 
>     [exec] -clover.setup:
>     [exec] 
>     [exec] clover:
>     [exec] 
>     [exec] common.compile-core:
>     [exec] 
>     [exec] common-solr.compile-core:
>     [exec] 
>     [exec] compile-core:
>     [exec] 
>     [exec] compile-test-framework:
>     [exec] 
>     [exec] compile-test-framework:
>     [exec] 
>     [exec] ivy-availability-check:
>     [exec] 
>     [exec] ivy-fail:
>     [exec] 
>     [exec] ivy-configure:
>     [exec] [ivy:configure] :: loading settings :: file = /usr/home/hudson/hudson-slave/workspace/Lucene-Solr-SmokeRelease-4.x/lucene/build/fakeReleaseTmp/unpack/solr-4.8.0/lucene/ivy-settings.xml
>     [exec] 
>     [exec] resolve:
>     [exec] 
>     [exec] init:
>     [exec] 
>     [exec] compile-lucene-core:
>     [exec] 
>     [exec] ivy-availability-check:
>     [exec] 
>     [exec] ivy-fail:
>     [exec] 
>     [exec] ivy-configure:
>     [exec] [ivy:configure] :: loading settings :: file = /usr/home/hudson/hudson-slave/workspace/Lucene-Solr-SmokeRelease-4.x/lucene/build/fakeReleaseTmp/unpack/solr-4.8.0/lucene/ivy-settings.xml
>     [exec] 
>     [exec] resolve:
>     [exec] 
>     [exec] init:
>     [exec] 
>     [exec] -clover.disable:
>     [exec] 
>     [exec] -clover.load:
>     [exec] 
>     [exec] -clover.classpath:
>     [exec] 
>     [exec] -clover.setup:
>     [exec] 
>     [exec] clover:
>     [exec] 
>     [exec] compile-core:
>     [exec] 
>     [exec] compile-codecs:
>     [exec]      [echo] Building codecs...
>     [exec] 
>     [exec] ivy-availability-check:
>     [exec]      [echo] Building codecs...
>     [exec] 
>     [exec] ivy-fail:
>     [exec] 
>     [exec] ivy-configure:
>     [exec] [ivy:configure] :: loading settings :: file = /usr/home/hudson/hudson-slave/workspace/Lucene-Solr-SmokeRelease-4.x/lucene/build/fakeReleaseTmp/unpack/solr-4.8.0/lucene/ivy-settings.xml
>     [exec] 
>     [exec] resolve:
>     [exec] 
>     [exec] common.init:
>     [exec] 
>     [exec] compile-lucene-core:
>     [exec] 
>     [exec] init:
>     [exec] 
>     [exec] -clover.disable:
>     [exec] 
>     [exec] -clover.load:
>     [exec] 
>     [exec] -clover.classpath:
>     [exec] 
>     [exec] -clover.setup:
>     [exec] 
>     [exec] clover:
>     [exec] 
>     [exec] compile-core:
>     [exec] 
>     [exec] -clover.disable:
>     [exec] 
>     [exec] -clover.load:
>     [exec] 
>     [exec] -clover.classpath:
>     [exec] 
>     [exec] -clover.setup:
>     [exec] 
>     [exec] clover:
>     [exec] 
>     [exec] common.compile-core:
>     [exec] 
>     [exec] compile-core:
>     [exec] 
>     [exec] compile-core:
>     [exec] 
>     [exec] compile-solrj:
>     [exec]      [echo] Building solr-solrj...
>     [exec] 
>     [exec] check-lucene-core-uptodate:
>     [exec] 
>     [exec] jar-lucene-core:
>     [exec] 
>     [exec] check-analyzers-phonetic-uptodate:
>     [exec] 
>     [exec] jar-analyzers-phonetic:
>     [exec] 
>     [exec] check-analyzers-kuromoji-uptodate:
>     [exec] 
>     [exec] jar-analyzers-kuromoji:
>     [exec] 
>     [exec] check-codecs-uptodate:
>     [exec] 
>     [exec] jar-codecs:
>     [exec] 
>     [exec] check-expressions-uptodate:
>     [exec] 
>     [exec] jar-expressions:
>     [exec] 
>     [exec] check-suggest-uptodate:
>     [exec] 
>     [exec] jar-suggest:
>     [exec] 
>     [exec] check-highlighter-uptodate:
>     [exec] 
>     [exec] jar-highlighter:
>     [exec] 
>     [exec] check-memory-uptodate:
>     [exec] 
>     [exec] jar-memory:
>     [exec] 
>     [exec] check-misc-uptodate:
>     [exec] 
>     [exec] jar-misc:
>     [exec] 
>     [exec] check-spatial-uptodate:
>     [exec] 
>     [exec] jar-spatial:
>     [exec] 
>     [exec] check-grouping-uptodate:
>     [exec] 
>     [exec] jar-grouping:
>     [exec] 
>     [exec] check-queries-uptodate:
>     [exec] 
>     [exec] jar-queries:
>     [exec] 
>     [exec] check-queryparser-uptodate:
>     [exec] 
>     [exec] jar-queryparser:
>     [exec] 
>     [exec] check-join-uptodate:
>     [exec] 
>     [exec] jar-join:
>     [exec] 
>     [exec] prep-lucene-jars:
>     [exec] 
>     [exec] resolve-example:
>     [exec]      [echo] Building solr-example...
>     [exec] 
>     [exec] ivy-availability-check:
>     [exec]      [echo] Building solr-example...
>     [exec] 
>     [exec] ivy-fail:
>     [exec] 
>     [exec] ivy-fail:
>     [exec] 
>     [exec] ivy-configure:
>     [exec] [ivy:configure] :: loading settings :: file = /usr/home/hudson/hudson-slave/workspace/Lucene-Solr-SmokeRelease-4.x/lucene/build/fakeReleaseTmp/unpack/solr-4.8.0/lucene/ivy-settings.xml
>     [exec] 
>     [exec] sync-hack:
>     [exec] 
>     [exec] resolve:
>     [exec]      [echo] Building solr-example-DIH...
>     [exec] 
>     [exec] ivy-availability-check:
>     [exec]      [echo] Building solr-example-DIH...
>     [exec] 
>     [exec] ivy-fail:
>     [exec] 
>     [exec] ivy-configure:
>     [exec] [ivy:configure] :: loading settings :: file = /usr/home/hudson/hudson-slave/workspace/Lucene-Solr-SmokeRelease-4.x/lucene/build/fakeReleaseTmp/unpack/solr-4.8.0/lucene/ivy-settings.xml
>     [exec] 
>     [exec] resolve:
>     [exec] 
>     [exec] ivy-availability-check:
>     [exec]      [echo] Building solr-solrj...
>     [exec] 
>     [exec] ivy-fail:
>     [exec] 
>     [exec] ivy-configure:
>     [exec] [ivy:configure] :: loading settings :: file = /usr/home/hudson/hudson-slave/workspace/Lucene-Solr-SmokeRelease-4.x/lucene/build/fakeReleaseTmp/unpack/solr-4.8.0/lucene/ivy-settings.xml
>     [exec] 
>     [exec] resolve:
>     [exec] 
>     [exec] common.init:
>     [exec] 
>     [exec] compile-lucene-core:
>     [exec] 
>     [exec] ivy-availability-check:
>     [exec] 
>     [exec] ivy-fail:
>     [exec] 
>     [exec] ivy-configure:
>     [exec] [ivy:configure] :: loading settings :: file = /usr/home/hudson/hudson-slave/workspace/Lucene-Solr-SmokeRelease-4.x/lucene/build/fakeReleaseTmp/unpack/solr-4.8.0/lucene/ivy-settings.xml
>     [exec] 
>     [exec] resolve:
>     [exec] 
>     [exec] init:
>     [exec] 
>     [exec] -clover.disable:
>     [exec] 
>     [exec] -clover.load:
>     [exec] 
>     [exec] -clover.classpath:
>     [exec] 
>     [exec] -clover.setup:
>     [exec] 
>     [exec] clover:
>     [exec] 
>     [exec] compile-core:
>     [exec] 
>     [exec] init:
>     [exec] 
>     [exec] -clover.disable:
>     [exec] 
>     [exec] -clover.load:
>     [exec] 
>     [exec] -clover.classpath:
>     [exec] 
>     [exec] -clover.setup:
>     [exec] 
>     [exec] clover:
>     [exec] 
>     [exec] common.compile-core:
>     [exec] 
>     [exec] compile-core:
>     [exec] 
>     [exec] check-lucene-core-uptodate:
>     [exec] 
>     [exec] jar-lucene-core:
>     [exec] 
>     [exec] check-analyzers-phonetic-uptodate:
>     [exec] 
>     [exec] jar-analyzers-phonetic:
>     [exec] 
>     [exec] check-analyzers-kuromoji-uptodate:
>     [exec] 
>     [exec] jar-analyzers-kuromoji:
>     [exec] 
>     [exec] check-codecs-uptodate:
>     [exec] 
>     [exec] jar-codecs:
>     [exec] 
>     [exec] check-expressions-uptodate:
>     [exec] 
>     [exec] jar-expressions:
>     [exec] 
>     [exec] check-suggest-uptodate:
>     [exec] 
>     [exec] jar-suggest:
>     [exec] 
>     [exec] check-highlighter-uptodate:
>     [exec] 
>     [exec] jar-highlighter:
>     [exec] 
>     [exec] check-memory-uptodate:
>     [exec] 
>     [exec] jar-memory:
>     [exec] 
>     [exec] check-misc-uptodate:
>     [exec] 
>     [exec] jar-misc:
>     [exec] 
>     [exec] check-spatial-uptodate:
>     [exec] 
>     [exec] jar-spatial:
>     [exec] 
>     [exec] check-grouping-uptodate:
>     [exec] 
>     [exec] jar-grouping:
>     [exec] 
>     [exec] check-queries-uptodate:
>     [exec] 
>     [exec] jar-queries:
>     [exec] 
>     [exec] check-queryparser-uptodate:
>     [exec] 
>     [exec] jar-queryparser:
>     [exec] 
>     [exec] check-join-uptodate:
>     [exec] 
>     [exec] jar-join:
>     [exec] 
>     [exec] prep-lucene-jars:
>     [exec] 
>     [exec] resolve-example:
>     [exec]      [echo] Building solr-example...
>     [exec] 
>     [exec] ivy-availability-check:
>     [exec]      [echo] Building solr-example...
>     [exec] 
>     [exec] ivy-fail:
>     [exec] 
>     [exec] ivy-fail:
>     [exec] 
>     [exec] ivy-configure:
>     [exec] [ivy:configure] :: loading settings :: file = /usr/home/hudson/hudson-slave/workspace/Lucene-Solr-SmokeRelease-4.x/lucene/build/fakeReleaseTmp/unpack/solr-4.8.0/lucene/ivy-settings.xml
>     [exec] 
>     [exec] sync-hack:
>     [exec] 
>     [exec] resolve:
>     [exec]      [echo] Building solr-example-DIH...
>     [exec] 
>     [exec] ivy-availability-check:
>     [exec]      [echo] Building solr-example-DIH...
>     [exec] 
>     [exec] ivy-fail:
>     [exec] 
>     [exec] ivy-configure:
>     [exec] [ivy:configure] :: loading settings :: file = /usr/home/hudson/hudson-slave/workspace/Lucene-Solr-SmokeRelease-4.x/lucene/build/fakeReleaseTmp/unpack/solr-4.8.0/lucene/ivy-settings.xml
>     [exec] 
>     [exec] resolve:
>     [exec] 
>     [exec] ivy-fail:
>     [exec] 
>     [exec] resolve:
>     [exec] 
>     [exec] common.init:
>     [exec] 
>     [exec] compile-lucene-core:
>     [exec] 
>     [exec] ivy-availability-check:
>     [exec] 
>     [exec] ivy-fail:
>     [exec] 
>     [exec] ivy-configure:
>     [exec] [ivy:configure] :: loading settings :: file = /usr/home/hudson/hudson-slave/workspace/Lucene-Solr-SmokeRelease-4.x/lucene/build/fakeReleaseTmp/unpack/solr-4.8.0/lucene/ivy-settings.xml
>     [exec] 
>     [exec] resolve:
>     [exec] 
>     [exec] init:
>     [exec] 
>     [exec] -clover.disable:
>     [exec] 
>     [exec] -clover.load:
>     [exec] 
>     [exec] -clover.classpath:
>     [exec] 
>     [exec] -clover.setup:
>     [exec] 
>     [exec] clover:
>     [exec] 
>     [exec] compile-core:
>     [exec] 
>     [exec] init:
>     [exec] 
>     [exec] common.compile-core:
>     [exec] 
>     [exec] common-solr.compile-core:
>     [exec] 
>     [exec] compile-core:
>     [exec] 
>     [exec] compile-test-framework:
>     [exec] 
>     [exec] ivy-availability-check:
>     [exec] 
>     [exec] ivy-fail:
>     [exec] 
>     [exec] ivy-configure:
>     [exec] [ivy:configure] :: loading settings :: file = /usr/home/hudson/hudson-slave/workspace/Lucene-Solr-SmokeRelease-4.x/lucene/build/fakeReleaseTmp/unpack/solr-4.8.0/lucene/ivy-settings.xml
>     [exec] 
>     [exec] resolve:
>     [exec] 
>     [exec] init:
>     [exec] 
>     [exec] compile-lucene-core:
>     [exec] 
>     [exec] compile-codecs:
>     [exec]      [echo] Building codecs...
>     [exec] 
>     [exec] ivy-availability-check:
>     [exec]      [echo] Building codecs...
>     [exec] 
>     [exec] ivy-fail:
>     [exec] 
>     [exec] ivy-configure:
>     [exec] [ivy:configure] :: loading settings :: file = /usr/home/hudson/hudson-slave/workspace/Lucene-Solr-SmokeRelease-4.x/lucene/build/fakeReleaseTmp/unpack/solr-4.8.0/lucene/ivy-settings.xml
>     [exec] 
>     [exec] resolve:
>     [exec] 
>     [exec] common.init:
>     [exec] 
>     [exec] compile-lucene-core:
>     [exec] 
>     [exec] init:
>     [exec] 
>     [exec] -clover.disable:
>     [exec] 
>     [exec] -clover.load:
>     [exec] 
>     [exec] -clover.classpath:
>     [exec] 
>     [exec] -clover.setup:
>     [exec] 
>     [exec] clover:
>     [exec] 
>     [exec] compile-core:
>     [exec] 
>     [exec] -clover.disable:
>     [exec] 
>     [exec] -clover.load:
>     [exec] 
>     [exec] -clover.classpath:
>     [exec] 
>     [exec] -clover.setup:
>     [exec] 
>     [exec] clover:
>     [exec] 
>     [exec] common.compile-core:
>     [exec] 
>     [exec] compile-core:
>     [exec] 
>     [exec] common.compile-test:
>     [exec] 
>     [exec] compile-test:
>     [exec] 
>     [exec] install-junit4-taskdef:
>     [exec] 
>     [exec] compile-tools:
>     [exec] 
>     [exec] ivy-availability-check:
>     [exec] 
>     [exec] ivy-fail:
>     [exec] 
>     [exec] ivy-configure:
>     [exec] [ivy:configure] :: loading settings :: file = /usr/home/hudson/hudson-slave/workspace/Lucene-Solr-SmokeRelease-4.x/lucene/build/fakeReleaseTmp/unpack/solr-4.8.0/lucene/ivy-settings.xml
>     [exec] 
>     [exec] resolve:
>     [exec] 
>     [exec] init:
>     [exec] 
>     [exec] compile-core:
>     [exec] 
>     [exec] validate:
>     [exec] 
>     [exec] resolve-groovy:
>     [exec] 
>     [exec] -init-totals:
>     [exec] 
>     [exec] -test:
>     [exec]     [mkdir] Created dir: /usr/home/hudson/hudson-slave/workspace/Lucene-Solr-SmokeRelease-4.x/lucene/build/fakeReleaseTmp/unpack/solr-4.8.0/solr/build/solr-core/test
>     [exec]     [mkdir] Created dir: /usr/home/hudson/hudson-slave/workspace/Lucene-Solr-SmokeRelease-4.x/lucene/build/fakeReleaseTmp/unpack/solr-4.8.0/solr/build/solr-core/test/temp
>     [exec]     [mkdir] Created dir: /usr/home/hudson/hudson-slave/workspace/Lucene-Solr-SmokeRelease-4.x/lucene/build/fakeReleaseTmp/unpack/solr-4.8.0/.caches/test-stats/solr-core
>     [exec]    [junit4] <JUnit4> says ??! Master seed: 1B1C31FD8B248A8B
>     [exec]    [junit4] Your default console's encoding may not display certain unicode glyphs: ISO-8859-1
>     [exec]    [junit4] Executing 369 suites with 4 JVMs.
>     [exec]    [junit4] 
>     [exec]    [junit4] Started J2 PID(3620@lucene.zones.apache.org).
>     [exec]    [junit4] Started J1 PID(3623@lucene.zones.apache.org).
>     [exec]    [junit4] Started J3 PID(3621@lucene.zones.apache.org).
>     [exec]    [junit4] Started J0 PID(3622@lucene.zones.apache.org).
>     [exec]    [junit4] Suite: org.apache.solr.handler.TestReplicationHandler
>     [exec]    [junit4] IGNOR/A 0.16s J2 | TestReplicationHandler.doTestBackup
>     [exec]    [junit4]    > Assumption #1: 'slow' test group is disabled (@Slow)
>     [exec]    [junit4] IGNOR/A 0.00s J2 | TestReplicationHandler.doTestReplicateAfterStartupWithNoActivity
>     [exec]    [junit4]    > Assumption #1: 'slow' test group is disabled (@Slow)
>     [exec]    [junit4] IGNOR/A 0.00s J2 | TestReplicationHandler.testEmptyCommits
>     [exec]    [junit4]    > Assumption #1: 'slow' test group is disabled (@Slow)
>     [exec]    [junit4] IGNOR/A 0.01s J2 | TestReplicationHandler.doTestStressReplication
>     [exec]    [junit4]    > Assumption #1: 'slow' test group is disabled (@Slow)
>     [exec]    [junit4] IGNOR/A 0.00s J2 | TestReplicationHandler.doTestSnapPullWithMasterUrl
>     [exec]    [junit4]    > Assumption #1: 'slow' test group is disabled (@Slow)
>     [exec]    [junit4] IGNOR/A 0.01s J2 | TestReplicationHandler.testNoWriter
>     [exec]    [junit4]    > Assumption #1: 'slow' test group is disabled (@Slow)
>     [exec]    [junit4] IGNOR/A 0.01s J2 | TestReplicationHandler.doTestDetails
>     [exec]    [junit4]    > Assumption #1: 'slow' test group is disabled (@Slow)
>     [exec]    [junit4] IGNOR/A 0.00s J2 | TestReplicationHandler.doTestReplicateAfterCoreReload
>     [exec]    [junit4]    > Assumption #1: 'slow' test group is disabled (@Slow)
>     [exec]    [junit4] IGNOR/A 0.00s J2 | TestReplicationHandler.doTestRepeater
>     [exec]    [junit4]    > Assumption #1: 'slow' test group is disabled (@Slow)
>     [exec]    [junit4] IGNOR/A 0.00s J2 | TestReplicationHandler.doTestStopPoll
>     [exec]    [junit4]    > Assumption #1: 'slow' test group is disabled (@Slow)
>     [exec]    [junit4] IGNOR/A 0.00s J2 | TestReplicationHandler.doTestIndexAndConfigAliasReplication
>     [exec]    [junit4]    > Assumption #1: 'slow' test group is disabled (@Slow)
>     [exec]    [junit4] IGNOR/A 0.00s J2 | TestReplicationHandler.doTestIndexAndConfigReplication
>     [exec]    [junit4]    > Assumption #1: 'slow' test group is disabled (@Slow)
>     [exec]    [junit4] IGNOR/A 0.00s J2 | TestReplicationHandler.doTestReplicateAfterWrite2Slave
>     [exec]    [junit4]    > Assumption #1: 'slow' test group is disabled (@Slow)
>     [exec]    [junit4] IGNOR/A 0.00s J2 | TestReplicationHandler.doTestReplicateAfterStartup
>     [exec]    [junit4]    > Assumption #1: 'slow' test group is disabled (@Slow)
>     [exec]    [junit4] Completed on J2 in 10.43s, 14 tests, 14 skipped
>     [exec]    [junit4] 
>     [exec]    [junit4] Suite: org.apache.solr.core.ResourceLoaderTest
>     [exec]    [junit4] Completed on J0 in 14.46s, 7 tests
>     [exec]    [junit4] 
>     [exec]    [junit4] Suite: org.apache.solr.handler.admin.LoggingHandlerTest
>     [exec]    [junit4] Completed on J3 in 39.81s, 1 test
>     [exec]    [junit4] 
>     [exec]    [junit4] Suite: org.apache.solr.TestRandomFaceting
>     [exec]    [junit4] IGNOR/A 0.19s J0 | TestRandomFaceting.testRandomFaceting
>     [exec]    [junit4]    > Assumption #1: 'slow' test group is disabled (@Slow)
>     [exec]    [junit4] Completed on J0 in 27.06s, 1 test, 1 skipped
>     [exec]    [junit4] 
>     [exec]    [junit4] Suite: org.apache.solr.cloud.AssignTest
>     [exec]    [junit4] Completed on J3 in 3.40s, 1 test
>     [exec]    [junit4] 
>     [exec]    [junit4] Suite: org.apache.solr.core.TestReloadAndDeleteDocs
>     [exec]    [junit4] Completed on J1 in 47.50s, 2 tests
>     [exec]    [junit4] 
>     [exec]    [junit4] Suite: org.apache.solr.analysis.LegacyHTMLStripCharFilterTest
>     [exec]    [junit4] Completed on J1 in 0.58s, 13 tests, 1 skipped
>     [exec]    [junit4] 
>     [exec]    [junit4] Suite: org.apache.solr.handler.component.TestExpandComponent
>     [exec]    [junit4] Completed on J0 in 9.75s, 1 test
>     [exec]    [junit4] 
>     [exec]    [junit4] Suite: org.apache.solr.handler.component.SpellCheckComponentTest
>     [exec]    [junit4] IGNOR/A 0.14s J1 | SpellCheckComponentTest.testExtendedResultsCount
>     [exec]    [junit4]    > Assumption #1: 'slow' test group is disabled (@Slow)
>     [exec]    [junit4] IGNOR/A 0.00s J1 | SpellCheckComponentTest.testCollate
>     [exec]    [junit4]    > Assumption #1: 'slow' test group is disabled (@Slow)
>     [exec]    [junit4] IGNOR/A 0.00s J1 | SpellCheckComponentTest.testRelativeIndexDirLocation
>     [exec]    [junit4]    > Assumption #1: 'slow' test group is disabled (@Slow)
>     [exec]    [junit4] IGNOR/A 0.00s J1 | SpellCheckComponentTest.testPerDictionary
>     [exec]    [junit4]    > Assumption #1: 'slow' test group is disabled (@Slow)
>     [exec]    [junit4] IGNOR/A 0.00s J1 | SpellCheckComponentTest.testRebuildOnCommit
>     [exec]    [junit4]    > Assumption #1: 'slow' test group is disabled (@Slow)
>     [exec]    [junit4] IGNOR/A 0.00s J1 | SpellCheckComponentTest.testCorrectSpelling
>     [exec]    [junit4]    > Assumption #1: 'slow' test group is disabled (@Slow)
>     [exec]    [junit4] IGNOR/A 0.00s J1 | SpellCheckComponentTest.test
>     [exec]    [junit4]    > Assumption #1: 'slow' test group is disabled (@Slow)
>     [exec]    [junit4] IGNOR/A 0.00s J1 | SpellCheckComponentTest.testThresholdTokenFrequency
>     [exec]    [junit4]    > Assumption #1: 'slow' test group is disabled (@Slow)
>     [exec]    [junit4] IGNOR/A 0.00s J1 | SpellCheckComponentTest.testReloadOnStart
>     [exec]    [junit4]    > Assumption #1: 'slow' test group is disabled (@Slow)
>     [exec]    [junit4] Completed on J1 in 3.75s, 9 tests, 9 skipped
>     [exec]    [junit4] 
>     [exec]    [junit4] Suite: org.apache.solr.core.TestXIncludeConfig
>     [exec]    [junit4] Completed on J1 in 0.84s, 1 test
>     [exec]    [junit4] 
>     [exec]    [junit4] Suite: org.apache.solr.core.OpenCloseCoreStressTest
>     [exec]    [junit4] IGNOR/A 0.00s J1 | OpenCloseCoreStressTest.test10MinutesOld
>     [exec]    [junit4]    > Assumption #1: 'nightly' test group is disabled (@Nightly)
>     [exec]    [junit4] IGNOR/A 0.00s J1 | OpenCloseCoreStressTest.test1HourOld
>     [exec]    [junit4]    > Assumption #1: 'weekly' test group is disabled (@Weekly)
>     [exec]    [junit4] IGNOR/A 0.00s J1 | OpenCloseCoreStressTest.test15SecondsNew
>     [exec]    [junit4]    > Assumption #1: 'slow' test group is disabled (@Slow)
>     [exec]    [junit4] IGNOR/A 0.00s J1 | OpenCloseCoreStressTest.test15SecondsOld
>     [exec]    [junit4]    > Assumption #1: 'slow' test group is disabled (@Slow)
>     [exec]    [junit4] IGNOR/A 0.00s J1 | OpenCloseCoreStressTest.test10MinutesNew
>     [exec]    [junit4]    > Assumption #1: 'nightly' test group is disabled (@Nightly)
>     [exec]    [junit4] IGNOR/A 0.00s J1 | OpenCloseCoreStressTest.test1HourNew
>     [exec]    [junit4]    > Assumption #1: 'weekly' test group is disabled (@Weekly)
>     [exec]    [junit4] Completed on J1 in 0.05s, 6 tests, 6 skipped
>     [exec]    [junit4] 
>     [exec]    [junit4] Suite: org.apache.solr.TestJoin
>     [exec]    [junit4] Completed on J2 in 44.04s, 2 tests
>     [exec]    [junit4] 
>     [exec]    [junit4] Suite: org.apache.solr.schema.DocValuesMultiTest
>     [exec]    [junit4] Completed on J0 in 2.96s, 4 tests
>     [exec]    [junit4] 
>     [exec]    [junit4] Suite: org.apache.solr.rest.schema.TestFieldCollectionResource
>     [exec]    [junit4] Completed on J3 in 13.28s, 7 tests
>     [exec]    [junit4] 
>     [exec]    [junit4] Suite: org.apache.solr.handler.component.DistributedMLTComponentTest
>     [exec]    [junit4] Completed on J3 in 0.01s, 0 tests
>     [exec]    [junit4] 
>     [exec]    [junit4] Suite: org.apache.solr.handler.component.TermVectorComponentTest
>     [exec]    [junit4] Completed on J1 in 6.42s, 3 tests
>     [exec]    [junit4] 
>     [exec]    [junit4] Suite: org.apache.solr.spelling.FileBasedSpellCheckerTest
>     [exec]    [junit4] Completed on J0 in 4.84s, 3 tests
>     [exec]    [junit4] 
>     [exec]    [junit4] Suite: org.apache.solr.servlet.DirectSolrConnectionTest
>     [exec]    [junit4] Completed on J0 in 1.39s, 2 tests
>     [exec]    [junit4] 
>     [exec]    [junit4] Suite: org.apache.solr.core.TestSolrIndexConfig
>     [exec]    [junit4] Completed on J0 in 2.39s, 2 tests
>     [exec]    [junit4] 
>     [exec]    [junit4] Suite: org.apache.solr.cloud.hdfs.HdfsChaosMonkeySafeLeaderTest
>     [exec]    [junit4] Completed on J0 in 0.16s, 1 test, 1 skipped
>     [exec]    [junit4] 
>     [exec]    [junit4] Suite: org.apache.solr.search.TestRTGBase
>     [exec]    [junit4] Completed on J0 in 0.00s, 0 tests
>     [exec]    [junit4] 
>     [exec]    [junit4] Suite: org.apache.solr.handler.component.SuggestComponentTest
>     [exec]    [junit4] Completed on J2 in 10.28s, 6 tests
>     [exec]    [junit4] 
>     [exec]    [junit4] Suite: org.apache.solr.handler.MoreLikeThisHandlerTest
>     [exec]    [junit4] Completed on J3 in 8.09s, 1 test
>     [exec]    [junit4] 
>     [exec]    [junit4] Suite: org.apache.solr.rest.schema.TestFieldResource
>     [exec]    [junit4] Completed on J3 in 2.57s, 7 tests
>     [exec]    [junit4] 
>     [exec]    [junit4] Suite: org.apache.solr.schema.UUIDFieldTest
>     [exec]    [junit4] Completed on J3 in 0.02s, 1 test
>     [exec]    [junit4] 
>     [exec]    [junit4] Suite: org.apache.solr.cloud.UnloadDistributedZkTest
>     [exec]    [junit4] IGNOR/A 0.17s J3 | UnloadDistributedZkTest.testDistribSearch
>     [exec]    [junit4]    > Assumption #1: 'slow' test group is disabled (@Slow)
>     [exec]    [junit4] Completed on J3 in 0.24s, 1 test, 1 skipped
>     [exec]    [junit4] 
>     [exec]    [junit4] Suite: org.apache.solr.handler.XmlUpdateRequestHandlerTest
>     [exec]    [junit4] Completed on J2 in 3.93s, 5 tests
>     [exec]    [junit4] 
>     [exec]    [junit4] Suite: org.apache.solr.schema.BadIndexSchemaTest
>     [exec]    [junit4] Completed on J1 in 9.05s, 17 tests
>     [exec]    [junit4] 
>     [exec]    [junit4] Suite: org.apache.solr.cloud.FullSolrCloudDistribCmdsTest
>     [exec]    [junit4] IGNOR/A 0.01s J1 | FullSolrCloudDistribCmdsTest.testDistribSearch
>     [exec]    [junit4]    > Assumption #1: 'slow' test group is disabled (@Slow)
>     [exec]    [junit4] Completed on J1 in 0.05s, 1 test, 1 skipped
>     [exec]    [junit4] 
>     [exec]    [junit4] Suite: org.apache.solr.core.TestSolrXMLSerializer
>     [exec]    [junit4] Completed on J2 in 0.19s, 1 test
>     [exec]    [junit4] 
>     [exec]    [junit4] Suite: org.apache.solr.search.TestSearchPerf
>     [exec]    [junit4] Completed on J3 in 1.56s, 1 test
>     [exec]    [junit4] 
>     [exec]    [junit4] Suite: org.apache.solr.TestGroupingSearch
>     [exec]    [junit4] Completed on J0 in 9.11s, 13 tests
>     [exec]    [junit4] 
>     [exec]    [junit4] Suite: org.apache.solr.schema.TestBinaryField
>     [exec]    [junit4] Completed on J1 in 8.63s, 1 test
>     [exec]    [junit4] 
>     [exec]    [junit4] Suite: org.apache.solr.servlet.NoCacheHeaderTest
>     [exec]    [junit4] Completed on J1 in 3.08s, 3 tests
>     [exec]    [junit4] 
>     [exec]    [junit4] Suite: org.apache.solr.cloud.DistribCursorPagingTest
>     [exec]    [junit4] IGNOR/A 0.01s J1 | DistribCursorPagingTest.testDistribSearch
>     [exec]    [junit4]    > Assumption #1: 'slow' test group is disabled (@Slow)
>     [exec]    [junit4] Completed on J1 in 0.12s, 1 test, 1 skipped
>     [exec]    [junit4] 
>     [exec]    [junit4] Suite: org.apache.solr.store.blockcache.BlockDirectoryTest
>     [exec]    [junit4] Completed on J3 in 13.92s, 4 tests
>     [exec]    [junit4] 
>     [exec]    [junit4] Suite: org.apache.solr.core.CachingDirectoryFactoryTest
>     [exec]    [junit4] Completed on J1 in 8.26s, 1 test
>     [exec]    [junit4] 
>     [exec]    [junit4] Suite: org.apache.solr.search.TestStressVersions
>     [exec]    [junit4] Completed on J0 in 19.07s, 1 test
>     [exec]    [junit4] 
>     [exec]    [junit4] Suite: org.apache.solr.schema.SynonymTokenizerTest
>     [exec]    [junit4] Completed on J0 in 0.75s, 1 test
>     [exec]    [junit4] 
>     [exec]    [junit4] Suite: org.apache.solr.schema.IndexSchemaRuntimeFieldTest
>     [exec]    [junit4] Completed on J1 in 4.93s, 1 test
>     [exec]    [junit4] 
>     [exec]    [junit4] Suite: org.apache.solr.update.processor.ParsingFieldUpdateProcessorsTest
>     [exec]    [junit4] Completed on J0 in 4.55s, 33 tests
>     [exec]    [junit4] 
>     [exec]    [junit4] Suite: org.apache.solr.update.processor.StatelessScriptUpdateProcessorFactoryTest
>     [exec]    [junit4] Completed on J1 in 5.08s, 7 tests
>     [exec]    [junit4] 
>     [exec]    [junit4] Suite: org.apache.solr.cloud.DeleteInactiveReplicaTest
>     [exec]    [junit4] IGNOR/A 0.00s J1 | DeleteInactiveReplicaTest.testDistribSearch
>     [exec]    [junit4]    > Assumption #1: 'slow' test group is disabled (@Slow)
>     [exec]    [junit4] Completed on J1 in 0.03s, 1 test, 1 skipped
>     [exec]    [junit4] 
>     [exec]    [junit4] Suite: org.apache.solr.handler.component.SearchHandlerTest
>     [exec]    [junit4] Completed on J0 in 2.13s, 1 test
>     [exec]    [junit4] 
>     [exec]    [junit4] Suite: org.apache.solr.search.similarities.TestBM25SimilarityFactory
>     [exec]    [junit4] Completed on J1 in 0.73s, 2 tests
>     [exec]    [junit4] 
>     [exec]    [junit4] Suite: org.apache.solr.search.TestSolrJ
>     [exec]    [junit4] Completed on J1 in 0.02s, 1 test
>     [exec]    [junit4] 
>     [exec]    [junit4] Suite: org.apache.solr.handler.component.TermVectorComponentDistributedTest
>     [exec]    [junit4] Completed on J2 in 31.45s, 1 test
>     [exec]    [junit4] 
>     [exec]    [junit4] Suite: org.apache.solr.schema.NotRequiredUniqueKeyTest
>     [exec]    [junit4] Completed on J2 in 0.99s, 1 test
>     [exec]    [junit4] 
>     [exec]    [junit4] Suite: org.apache.solr.cloud.RemoteQueryErrorTest
>     [exec]    [junit4] IGNOR/A 0.00s J2 | RemoteQueryErrorTest.testDistribSearch
>     [exec]    [junit4]    > Assumption #1: 'slow' test group is disabled (@Slow)
>     [exec]    [junit4] Completed on J2 in 0.04s, 1 test, 1 skipped
>     [exec]    [junit4] 
>     [exec]    [junit4] Suite: org.apache.solr.core.TestConfig
>     [exec]    [junit4] Completed on J0 in 2.33s, 7 tests
>     [exec]    [junit4] 
>     [exec]    [junit4] Suite: org.apache.solr.cloud.hdfs.HdfsRecoveryZkTest
>     [exec]    [junit4] Completed on J0 in 0.04s, 1 test, 1 skipped
>     [exec]    [junit4] 
>     [exec]    [junit4] Suite: org.apache.solr.util.PrimUtilsTest
>     [exec]    [junit4] Completed on J0 in 0.05s, 2 tests
>     [exec]    [junit4] 
>     [exec]    [junit4] Suite: org.apache.solr.cloud.TestHashPartitioner
>     [exec]    [junit4] Completed on J3 in 20.29s, 3 tests
>     [exec]    [junit4] 
>     [exec]    [junit4] Suite: org.apache.solr.core.TestNonNRTOpen
>     [exec]    [junit4] Completed on J0 in 3.24s, 2 tests
>     [exec]    [junit4] 
>     [exec]    [junit4] Suite: org.apache.solr.cloud.RecoveryZkTest
>     [exec]    [junit4] IGNOR/A 0.00s J0 | RecoveryZkTest.testDistribSearch
>     [exec]    [junit4]    > Assumption #1: 'slow' test group is disabled (@Slow)
>     [exec]    [junit4] Completed on J0 in 0.03s, 1 test, 1 skipped
>     [exec]    [junit4] 
>     [exec]    [junit4] Suite: org.apache.solr.search.TestFoldingMultitermQuery
>     [exec]    [junit4] Completed on J2 in 3.84s, 19 tests
>     [exec]    [junit4] 
>     [exec]    [junit4] Suite: org.apache.solr.rest.schema.TestSolrQueryParserResource
>     [exec]    [junit4] Completed on J1 in 5.86s, 1 test
>     [exec]    [junit4] 
>     [exec]    [junit4] Suite: org.apache.solr.search.similarities.TestDefaultSimilarityFactory
>     [exec]    [junit4] Completed on J2 in 0.66s, 2 tests
>     [exec]    [junit4] 
>     [exec]    [junit4] Suite: org.apache.solr.cloud.OverseerRolesTest
>     [exec]    [junit4] IGNOR/A 0.00s J2 | OverseerRolesTest.testDistribSearch
>     [exec]    [junit4]    > Assumption #1: 'slow' test group is disabled (@Slow)
>     [exec]    [junit4] Completed on J2 in 0.03s, 1 test, 1 skipped
>     [exec]    [junit4] 
>     [exec]    [junit4] Suite: org.apache.solr.handler.BinaryUpdateRequestHandlerTest
>     [exec]    [junit4] Completed on J3 in 2.85s, 1 test
>     [exec]    [junit4] 
>     [exec]    [junit4] Suite: org.apache.solr.update.processor.UniqFieldsUpdateProcessorFactoryTest
>     [exec]    [junit4] Completed on J1 in 2.85s, 1 test
>     [exec]    [junit4] 
>     [exec]    [junit4] Suite: org.apache.solr.cloud.hdfs.HdfsCollectionsAPIDistributedZkTest
>     [exec]    [junit4] Completed on J1 in 0.07s, 1 test, 1 skipped
>     [exec]    [junit4] 
>     [exec]    [junit4] Suite: org.apache.solr.core.RequestHandlersTest
>     [exec]    [junit4] Completed on J0 in 3.16s, 4 tests
>     [exec]    [junit4] 
>     [exec]    [junit4] Suite: org.apache.solr.handler.FieldAnalysisRequestHandlerTest
>     [exec]    [junit4] Completed on J0 in 2.98s, 4 tests
>     [exec]    [junit4] 
>     [exec]    [junit4] Suite: org.apache.solr.search.TestIndexSearcher
>     [exec]    [junit4] Completed on J3 in 5.41s, 2 tests
>     [exec]    [junit4] 
>     [exec]    [junit4] Suite: org.apache.solr.cloud.OverseerTest
>     [exec]    [junit4] IGNOR/A 0.00s J0 | OverseerTest.testPlaceholders
>     [exec]    [junit4]    > Assumption #1: 'slow' test group is disabled (@Slow)
>     [exec]    [junit4] IGNOR/A 0.00s J0 | OverseerTest.testDoubleAssignment
>     [exec]    [junit4]    > Assumption #1: 'slow' test group is disabled (@Slow)
>     [exec]    [junit4] IGNOR/A 0.00s J0 | OverseerTest.testShardAssignmentBigger
>     [exec]    [junit4]    > Assumption #1: 'slow' test group is disabled (@Slow)
>     [exec]    [junit4] IGNOR/A 0.00s J0 | OverseerTest.testReplay
>     [exec]    [junit4]    > Assumption #1: 'slow' test group is disabled (@Slow)
>     [exec]    [junit4] IGNOR/A 0.00s J0 | OverseerTest.testShardAssignment
>     [exec]    [junit4]    > Assumption #1: 'slow' test group is disabled (@Slow)
>     [exec]    [junit4] IGNOR/A 0.00s J0 | OverseerTest.testOverseerFailure
>     [exec]    [junit4]    > Assumption #1: 'slow' test group is disabled (@Slow)
>     [exec]    [junit4] IGNOR/A 0.00s J0 | OverseerTest.testBadQueueItem
>     [exec]    [junit4]    > Assumption #1: 'slow' test group is disabled (@Slow)
>     [exec]    [junit4] IGNOR/A 0.00s J0 | OverseerTest.testStateChange
>     [exec]    [junit4]    > Assumption #1: 'slow' test group is disabled (@Slow)
>     [exec]    [junit4] IGNOR/A 0.00s J0 | OverseerTest.testShardLeaderChange
>     [exec]    [junit4]    > Assumption #1: 'slow' test group is disabled (@Slow)
>     [exec]    [junit4] Completed on J0 in 3.04s, 9 tests, 9 skipped
>     [exec]    [junit4] 
>     [exec]    [junit4] Suite: org.apache.solr.update.processor.UpdateRequestProcessorFactoryTest
>     [exec]    [junit4] Completed on J3 in 2.58s, 2 tests
>     [exec]    [junit4] 
>     [exec]    [junit4] Suite: org.apache.solr.ConvertedLegacyTest
>     [exec]    [junit4] Completed on J1 in 6.29s, 1 test
>     [exec]    [junit4] 
>     [exec]    [junit4] Suite: org.apache.solr.cloud.SliceStateTest
>     [exec]    [junit4] Completed on J3 in 0.05s, 1 test
>     [exec]    [junit4] 
>     [exec]    [junit4] Suite: org.apache.solr.schema.ChangedSchemaMergeTest
>     [exec]    [junit4] Completed on J1 in 1.08s, 1 test
>     [exec]    [junit4] 
>     [exec]    [junit4] Suite: org.apache.solr.handler.admin.InfoHandlerTest
>     [exec]    [junit4] Completed on J1 in 2.45s, 2 tests
>     [exec]    [junit4] 
>     [exec]    [junit4] Suite: org.apache.solr.spelling.suggest.TestAnalyzedSuggestions
>     [exec]    [junit4] Completed on J3 in 3.98s, 2 tests
>     [exec]    [junit4] 
>     [exec]    [junit4] Suite: org.apache.solr.core.TestLazyCores
>     [exec]    [junit4] Completed on J2 in 12.74s, 8 tests
>     [exec]    [junit4] 
>     [exec]    [junit4] Suite: org.apache.solr.servlet.CacheHeaderTest
>     [exec]    [junit4] Completed on J3 in 1.85s, 5 tests
>     [exec]    [junit4] 
>     [exec]    [junit4] Suite: org.apache.solr.schema.TestCloudManagedSchema
>     [exec]    [junit4] IGNOR/A 0.00s J3 | TestCloudManagedSchema.testDistribSearch
>     [exec]    [junit4]    > Assumption #1: 'slow' test group is disabled (@Slow)
>     [exec]    [junit4] Completed on J3 in 0.03s, 1 test, 1 skipped
>     [exec]    [junit4] 
>     [exec]    [junit4] Suite: org.apache.solr.util.DOMUtilTest
>     [exec]    [junit4] Completed on J3 in 0.05s, 1 test
>     [exec]    [junit4] 
>     [exec]    [junit4] Suite: org.apache.solr.search.ReturnFieldsTest
>     [exec]    [junit4] Completed on J2 in 1.88s, 12 tests
>     [exec]    [junit4] 
>     [exec]    [junit4] Suite: org.apache.solr.update.TestAtomicUpdateErrorCases
>     [exec]    [junit4] Completed on J1 in 3.71s, 2 tests
>     [exec]    [junit4] 
>     [exec]    [junit4] Suite: org.apache.solr.core.TestQuerySenderNoQuery
>     [exec]    [junit4] Completed on J3 in 1.98s, 3 tests
>     [exec]    [junit4] 
>     [exec]    [junit4] Suite: org.apache.solr.EchoParamsTest
>     [exec]    [junit4] Completed on J3 in 0.85s, 1 test
>     [exec]    [junit4] 
>     [exec]    [junit4] Suite: org.apache.solr.search.TestRangeQuery
>     [exec]    [junit4] Completed on J0 in 8.97s, 2 tests
>     [exec]    [junit4] 
>     [exec]    [junit4] Suite: org.apache.solr.update.SolrIndexSplitterTest
>     [exec]    [junit4] Completed on J2 in 4.22s, 5 tests
>     [exec]    [junit4] 
>     [exec]    [junit4] Suite: org.apache.solr.cloud.MigrateRouteKeyTest
>     [exec]    [junit4] IGNOR/A 0.00s J2 | MigrateRouteKeyTest.testDistribSearch
>     [exec]    [junit4]    > Assumption #1: 'slow' test group is disabled (@Slow)
>     [exec]    [junit4] Completed on J2 in 0.04s, 1 test, 1 skipped
>     [exec]    [junit4] 
>     [exec]    [junit4] Suite: org.apache.solr.core.TestMergePolicyConfig
>     [exec]    [junit4] Completed on J0 in 2.18s, 4 tests
>     [exec]    [junit4] 
>     [exec]    [junit4] Suite: org.apache.solr.search.TestSolrQueryParser
>     [exec]    [junit4] Completed on J2 in 2.23s, 5 tests
>     [exec]    [junit4] 
>     [exec]    [junit4] Suite: org.apache.solr.handler.admin.LukeRequestHandlerTest
>     [exec]    [junit4] Completed on J1 in 5.62s, 6 tests
>     [exec]    [junit4] 
>     [exec]    [junit4] Suite: org.apache.solr.cloud.hdfs.HdfsBasicDistributedZk2Test
>     [exec]    [junit4] Completed on J1 in 0.04s, 1 test, 1 skipped
>     [exec]    [junit4] 
>     [exec]    [junit4] Suite: org.apache.solr.search.QueryEqualityTest
>     [exec]    [junit4] Completed on J3 in 4.61s, 68 tests
>     [exec]    [junit4] 
>     [exec]    [junit4] Suite: org.apache.solr.search.TestPseudoReturnFields
>     [exec]    [junit4] Completed on J2 in 3.01s, 14 tests
>     [exec]    [junit4] 
>     [exec]    [junit4] Suite: org.apache.solr.highlight.TestPostingsSolrHighlighter
>     [exec]    [junit4] Completed on J3 in 2.19s, 13 tests
>     [exec]    [junit4] 
>     [exec]    [junit4] Suite: org.apache.solr.search.TestExtendedDismaxParser
>     [exec]    [junit4] Completed on J1 in 4.48s, 18 tests
>     [exec]    [junit4] 
>     [exec]    [junit4] Suite: org.apache.solr.update.processor.RegexBoostProcessorTest
>     [exec]    [junit4] Completed on J3 in 3.74s, 4 tests
>     [exec]    [junit4] 
>     [exec]    [junit4] Suite: org.apache.solr.internal.csv.CSVUtilsTest
>     [exec]    [junit4] Completed on J3 in 0.07s, 14 tests
>     [exec]    [junit4] 
>     [exec]    [junit4] Suite: org.apache.solr.update.HardAutoCommitTest
>     [exec]    [junit4] IGNOR/A 0.00s J1 | HardAutoCommitTest.testCommitWithin
>     [exec]    [junit4]    > Assumption #1: 'slow' test group is disabled (@Slow)
>     [exec]    [junit4] Completed on J1 in 2.33s, 1 test, 1 skipped
>     [exec]    [junit4] 
>     [exec]    [junit4] Suite: org.apache.solr.core.TestJmxMonitoredMap
>     [exec]    [junit4] Completed on J3 in 0.48s, 2 tests
>     [exec]    [junit4] 
>     [exec]    [junit4] Suite: org.apache.solr.util.TestFastOutputStream
>     [exec]    [junit4] Completed on J1 in 0.14s, 1 test
>     [exec]    [junit4] 
>     [exec]    [junit4] Suite: org.apache.solr.rest.schema.TestSerializedLuceneMatchVersion
>     [exec]    [junit4] Completed on J2 in 4.81s, 2 tests
>     [exec]    [junit4] 
>     [exec]    [junit4] Suite: org.apache.solr.search.similarities.TestPerFieldSimilarity
>     [exec]    [junit4] Completed on J1 in 0.65s, 7 tests
>     [exec]    [junit4] 
>     [exec]    [junit4] Suite: org.apache.solr.search.similarities.TestIBSimilarityFactory
>     [exec]    [junit4] Completed on J3 in 0.97s, 2 tests
>     [exec]    [junit4] 
>     [exec]    [junit4] Suite: org.apache.solr.core.TestBadConfig
>     [exec]    [junit4] Completed on J0 in 10.79s, 13 tests
>     [exec]    [junit4] 
>     [exec]    [junit4] Suite: org.apache.solr.update.SolrIndexConfigTest
>     [exec]    [junit4] Completed on J1 in 2.28s, 3 tests
>     [exec]    [junit4] 
>     [exec]    [junit4] Suite: org.apache.solr.analysis.TestLuceneMatchVersion
>     [exec]    [junit4] Completed on J1 in 1.09s, 1 test
>     [exec]    [junit4] 
>     [exec]    [junit4] Suite: org.apache.solr.handler.component.DebugComponentTest
>     [exec]    [junit4] Completed on J0 in 3.18s, 4 tests
>     [exec]    [junit4] 
>     [exec]    [junit4] Suite: org.apache.solr.search.TestComponentsName
>     [exec]    [junit4] Completed on J1 in 2.92s, 1 test
>     [exec]    [junit4] 
>     [exec]    [junit4] Suite: org.apache.solr.util.CircularListTest
>     [exec]    [junit4] Completed on J1 in 0.02s, 1 test
>     [exec]    [junit4] 
>     [exec]    [junit4] Suite: org.apache.solr.cloud.TestDistribDocBasedVersion
>     [exec]    [junit4] IGNOR/A 0.00s J1 | TestDistribDocBasedVersion.testDistribSearch
>     [exec]    [junit4]    > Assumption #1: 'slow' test group is disabled (@Slow)
>     [exec]    [junit4] Completed on J1 in 0.05s, 1 test, 1 skipped
>     [exec]    [junit4] 
>     [exec]    [junit4] Suite: org.apache.solr.update.processor.TestPartialUpdateDeduplication
>     [exec]    [junit4] Completed on J0 in 2.48s, 1 test
>     [exec]    [junit4] 
>     [exec]    [junit4] Suite: org.apache.solr.update.TestDocBasedVersionConstraints
>     [exec]    [junit4] Completed on J2 in 7.86s, 6 tests
>     [exec]    [junit4] 
>     [exec]    [junit4] Suite: org.apache.solr.core.QueryResultKeyTest
>     [exec]    [junit4] Completed on J2 in 0.57s, 4 tests
>     [exec]    [junit4] 
>     [exec]    [junit4] Suite: org.apache.solr.search.similarities.TestNonDefinedSimilarityFactory
>     [exec]    [junit4] Completed on J1 in 2.21s, 3 tests
>     [exec]    [junit4] 
>     [exec]    [junit4] Suite: org.apache.solr.schema.BadCopyFieldTest
>     [exec]    [junit4] Completed on J1 in 1.52s, 5 tests
>     [exec]    [junit4] 
>     [exec]    [junit4] Suite: org.apache.solr.update.SolrCmdDistributorTest
>     [exec]    [junit4] Completed on J3 in 9.72s, 1 test
>     [exec]    [junit4] 
>     [exec]    [junit4] Suite: org.apache.solr.TestDistributedSearch
>     [exec]    [junit4] IGNOR/A 0.00s J1 | TestDistributedSearch.testDistribSearch
>     [exec]    [junit4]    > Assumption #1: 'slow' test group is disabled (@Slow)
>     [exec]    [junit4] Completed on J1 in 0.02s, 1 test, 1 skipped
>     [exec]    [junit4] 
>     [exec]    [junit4] Suite: org.apache.solr.util.TestSystemIdResolver
>     [exec]    [junit4] Completed on J3 in 0.13s, 1 test
>     [exec]    [junit4] 
>     [exec]    [junit4] Suite: org.apache.solr.MinimalSchemaTest
>     [exec]    [junit4] Completed on J2 in 2.16s, 3 tests
>     [exec]    [junit4] 
>     [exec]    [junit4] Suite: org.apache.solr.schema.OpenExchangeRatesOrgProviderTest
>     [exec]    [junit4] Completed on J2 in 0.20s, 5 tests
>     [exec]    [junit4] 
>     [exec]    [junit4] Suite: org.apache.solr.handler.component.DistributedSuggestComponentTest
>     [exec]    [junit4] IGNOR/A 0.01s J2 | DistributedSuggestComponentTest.testDistribSearch
>     [exec]    [junit4]    > Assumption #1: 'slow' test group is disabled (@Slow)
>     [exec]    [junit4] Completed on J2 in 0.04s, 1 test, 1 skipped
>     [exec]    [junit4] 
>     [exec]    [junit4] Suite: org.apache.solr.spelling.SpellPossibilityIteratorTest
>     [exec]    [junit4] Completed on J1 in 0.30s, 3 tests
>     [exec]    [junit4] 
>     [exec]    [junit4] Suite: org.apache.solr.spelling.suggest.TestFileDictionaryLookup
>     [exec]    [junit4] Completed on J3 in 0.78s, 1 test
>     [exec]    [junit4] 
>     [exec]    [junit4] Suite: org.apache.solr.schema.PrimitiveFieldTypeTest
>     [exec]    [junit4] Completed on J1 in 2.01s, 1 test
>     [exec]    [junit4] 
>     [exec]    [junit4] Suite: org.apache.solr.spelling.suggest.TestPhraseSuggestions
>     [exec]    [junit4] Completed on J2 in 2.36s, 1 test
>     [exec]    [junit4] 
>     [exec]    [junit4] Suite: org.apache.solr.update.TestUpdate
>     [exec]    [junit4] Completed on J3 in 2.82s, 1 test
>     [exec]    [junit4] 
>     [exec]    [junit4] Suite: org.apache.solr.cloud.CollectionsAPIDistributedZkTest
>     [exec]    [junit4] IGNOR/A 0.00s J3 | CollectionsAPIDistributedZkTest.testDistribSearch
>     [exec]    [junit4]    > Assumption #1: 'slow' test group is disabled (@Slow)
>     [exec]    [junit4] Completed on J3 in 0.03s, 1 test, 1 skipped
>     [exec]    [junit4] 
>     [exec]    [junit4] Suite: org.apache.solr.handler.component.DistributedExpandComponentTest
>     [exec]    [junit4] Completed on J1 in 6.40s, 1 test
>     [exec]    [junit4] 
>     [exec]    [junit4] Suite: org.apache.solr.search.function.TestFunctionQuery
>     [exec]    [junit4] Completed on J3 in 5.15s, 15 tests
>     [exec]    [junit4] 
>     [exec]    [junit4] Suite: org.apache.solr.internal.csv.writer.CSVWriterTest
>     [exec]    [junit4] Completed on J1 in 0.11s, 2 tests
>     [exec]    [junit4] 
>     [exec]    [junit4] Suite: org.apache.solr.util.SimplePostToolTest
>     [exec]    [junit4] Completed on J3 in 0.19s, 11 tests
>     [exec]    [junit4] 
>     [exec]    [junit4] Suite: org.apache.solr.update.PeerSyncTest
>     [exec]    [junit4] Completed on J0 in 14.29s, 1 test
>     [exec]    [junit4] 
>     [exec]    [junit4] Suite: org.apache.solr.cloud.DeleteReplicaTest
>     [exec]    [junit4] IGNOR/A 0.00s J0 | DeleteReplicaTest.testDistribSearch
>     [exec]    [junit4]    > Assumption #1: 'slow' test group is disabled (@Slow)
>     [exec]    [junit4] Completed on J0 in 0.04s, 1 test, 1 skipped
>     [exec]    [junit4] 
>     [exec]    [junit4] Suite: org.apache.solr.update.processor.DefaultValueUpdateProcessorTest
>     [exec]    [junit4] Completed on J1 in 5.12s, 1 test
>     [exec]    [junit4] 
>     [exec]    [junit4] Suite: org.apache.solr.search.TestStressLucene
>     [exec]    [junit4] Completed on J1 in 0.29s, 1 test
>     [exec]    [junit4] 
>     [exec]    [junit4] Suite: org.apache.solr.handler.component.DistributedTermsComponentTest
>     [exec]    [junit4] Completed on J2 in 12.36s, 1 test
>     [exec]    [junit4] 
>     [exec]    [junit4] Suite: org.apache.solr.core.PluginInfoTest
>     [exec]    [junit4] Completed on J2 in 0.09s, 9 tests
>     [exec]    [junit4] 
>     [exec]    [junit4] Suite: org.apache.solr.analysis.TestCollationKeyRangeQueries
>     [exec]    [junit4] Completed on J1 in 0.82s, 3 tests
>     [exec]    [junit4] 
>     [exec]    [junit4] Suite: org.apache.solr.rest.schema.TestClassNameShortening
>     [exec]    [junit4] Completed on J0 in 4.44s, 3 tests
>     [exec]    [junit4] 
>     [exec]    [junit4] Suite: org.apache.solr.search.TestOverriddenPrefixQueryForCustomFieldType
>     [exec]    [junit4] Completed on J2 in 1.22s, 2 tests
>     [exec]    [junit4] 
>     [exec]    [junit4] Suite: org.apache.solr.search.TestElisionMultitermQuery
>     [exec]    [junit4] Completed on J1 in 1.89s, 1 test
>     [exec]    [junit4] 
>     [exec]    [junit4] Suite: org.apache.solr.cloud.BasicDistributedZkTest
>     [exec]    [junit4] IGNOR/A 0.00s J1 | BasicDistributedZkTest.testDistribSearch
>     [exec]    [junit4]    > Assumption #1: 'slow' test group is disabled (@Slow)
>     [exec]    [junit4] Completed on J1 in 0.04s, 1 test, 1 skipped
>     [exec]    [junit4] 
>     [exec]    [junit4] Suite: org.apache.solr.search.TestCustomSort
>     [exec]    [junit4] Completed on J0 in 1.99s, 1 test
>     [exec]    [junit4] 
>     [exec]    [junit4] Suite: org.apache.solr.cloud.ChaosMonkeySafeLeaderTest
>     [exec]    [junit4] IGNOR/A 0.00s J1 | ChaosMonkeySafeLeaderTest.testDistribSearch
>     [exec]    [junit4]    > Assumption #1: 'slow' test group is disabled (@Slow)
>     [exec]    [junit4] Completed on J1 in 0.05s, 1 test, 1 skipped
>     [exec]    [junit4] 
>     [exec]    [junit4] Suite: org.apache.solr.cloud.BasicDistributedZk2Test
>     [exec]    [junit4] IGNOR/A 0.00s J1 | BasicDistributedZk2Test.testDistribSearch
>     [exec]    [junit4]    > Assumption #1: 'slow' test group is disabled (@Slow)
>     [exec]    [junit4] Completed on J1 in 0.04s, 1 test, 1 skipped
>     [exec]    [junit4] 
>     [exec]    [junit4] Suite: org.apache.solr.cloud.SyncSliceTest
>     [exec]    [junit4] IGNOR/A 0.00s J1 | SyncSliceTest.testDistribSearch
>     [exec]    [junit4]    > Assumption #1: 'slow' test group is disabled (@Slow)
>     [exec]    [junit4] Completed on J1 in 0.04s, 1 test, 1 skipped
>     [exec]    [junit4] 
>     [exec]    [junit4] Suite: org.apache.solr.spelling.suggest.SuggesterFSTTest
>     [exec]    [junit4] Completed on J2 in 3.87s, 4 tests
>     [exec]    [junit4] 
>     [exec]    [junit4] Suite: org.apache.solr.util.TestUtils
>     [exec]    [junit4] Completed on J2 in 0.02s, 3 tests
>     [exec]    [junit4] 
>     [exec]    [junit4] Suite: org.apache.solr.cloud.LeaderElectionIntegrationTest
>     [exec]    [junit4] IGNOR/A 0.00s J1 | LeaderElectionIntegrationTest.testSimpleSliceLeaderElection
>     [exec]    [junit4]    > Assumption #1: 'slow' test group is disabled (@Slow)
>     [exec]    [junit4] IGNOR/A 0.00s J1 | LeaderElectionIntegrationTest.testLeaderElectionAfterClientTimeout
>     [exec]    [junit4]    > Assumption #1: 'slow' test group is disabled (@Slow)
>     [exec]    [junit4] Completed on J1 in 2.03s, 2 tests, 2 skipped
>     [exec]    [junit4] 
>     [exec]    [junit4] Suite: org.apache.solr.cloud.ShardRoutingTest
>     [exec]    [junit4] IGNOR/A 0.00s J1 | ShardRoutingTest.testDistribSearch
>     [exec]    [junit4]    > Assumption #1: 'slow' test group is disabled (@Slow)
>     [exec]    [junit4] Completed on J1 in 0.05s, 1 test, 1 skipped
>     [exec]    [junit4] 
>     [exec]    [junit4] Suite: org.apache.solr.search.function.SortByFunctionTest
>     [exec]    [junit4] Completed on J2 in 3.11s, 2 tests
>     [exec]    [junit4] 
>     [exec]    [junit4] Suite: org.apache.solr.spelling.suggest.TestFreeTextSuggestions
>     [exec]    [junit4] Completed on J2 in 0.99s, 1 test
>     [exec]    [junit4] 
>     [exec]    [junit4] Suite: org.apache.solr.cloud.AliasIntegrationTest
>     [exec]    [junit4] IGNOR/A 0.00s J2 | AliasIntegrationTest.testDistribSearch
>     [exec]    [junit4]    > Assumption #1: 'slow' test group is disabled (@Slow)
>     [exec]    [junit4] Completed on J2 in 0.04s, 1 test, 1 skipped
>     [exec]    [junit4] 
>     [exec]    [junit4] Suite: org.apache.solr.cloud.ZkCLITest
>     [exec]    [junit4] Completed on J3 in 15.94s, 12 tests
>     [exec]    [junit4] 
>     [exec]    [junit4] Suite: org.apache.solr.handler.admin.ShowFileRequestHandlerTest
>     [exec]    [junit4] Completed on J0 in 8.39s, 4 tests
>     [exec]    [junit4] 
>     [exec]    [junit4] Suite: org.apache.solr.spelling.suggest.TestBlendedInfixSuggestions
>     [exec]    [junit4] Completed on J3 in 2.06s, 3 tests
>     [exec]    [junit4] 
>     [exec]    [junit4] Suite: org.apache.solr.search.TestMaxScoreQueryParser
>     [exec]    [junit4] Completed on J2 in 2.81s, 6 tests
>     [exec]    [junit4] 
>     [exec]    [junit4] Suite: org.apache.solr.util.TestFastWriter
>     [exec]    [junit4] Completed on J2 in 0.28s, 1 test
>     [exec]    [junit4] 
>     [exec]    [junit4] Suite: org.apache.solr.cloud.SliceStateUpdateTest
>     [exec]    [junit4] IGNOR/A 0.00s J2 | SliceStateUpdateTest.testSliceStateUpdate
>     [exec]    [junit4]    > Assumption #1: 'slow' test group is disabled (@Slow)
>     [exec]    [junit4] Completed on J2 in 0.03s, 1 test, 1 skipped
>     [exec]    [junit4] 
>     [exec]    [junit4] Suite: org.apache.solr.analysis.TestWordDelimiterFilterFactory
>     [exec]    [junit4] Completed on J0 in 3.51s, 7 tests
>     [exec]    [junit4] 
>     [exec]    [junit4] Suite: org.apache.solr.schema.TestOmitPositions
>     [exec]    [junit4] Completed on J3 in 2.87s, 2 tests
>     [exec]    [junit4] 
>     [exec]    [junit4] Suite: org.apache.solr.search.TestValueSourceCache
>     [exec]    [junit4] Completed on J2 in 2.74s, 2 tests
>     [exec]    [junit4] 
>     [exec]    [junit4] Suite: org.apache.solr.SolrTestCaseJ4Test
>     [exec]    [junit4] Completed on J3 in 0.68s, 1 test
>     [exec]    [junit4] 
>     [exec]    [junit4] Suite: org.apache.solr.rest.schema.TestUniqueKeyFieldResource
>     [exec]    [junit4] Completed on J2 in 1.71s, 1 test
>     [exec]    [junit4] 
>     [exec]    [junit4] Suite: org.apache.solr.handler.admin.CoreMergeIndexesAdminHandlerTest
>     [exec]    [junit4] Completed on J0 in 2.69s, 1 test
>     [exec]    [junit4] 
>     [exec]    [junit4] Suite: org.apache.solr.update.AutoCommitTest
>     [exec]    [junit4] IGNOR/A 0.00s J3 | AutoCommitTest.testCommitWithin
>     [exec]    [junit4]    > Assumption #1: 'slow' test group is disabled (@Slow)
>     [exec]    [junit4] IGNOR/A 0.00s J3 | AutoCommitTest.testMaxTime
>     [exec]    [junit4]    > Assumption #1: 'slow' test group is disabled (@Slow)
>     [exec]    [junit4] IGNOR/A 0.00s J3 | AutoCommitTest.testMaxDocs
>     [exec]    [junit4]    > Assumption #1: 'slow' test group is disabled (@Slow)
>     [exec]    [junit4] Completed on J3 in 2.48s, 3 tests, 3 skipped
>     [exec]    [junit4] 
>     [exec]    [junit4] Suite: org.apache.solr.search.TestRecoveryHdfs
>     [exec]    [junit4] Completed on J3 in 0.04s, 10 tests, 10 skipped
>     [exec]    [junit4] 
>     [exec]    [junit4] Suite: org.apache.solr.request.TestRemoteStreaming
>     [exec]    [junit4] Completed on J3 in 1.74s, 4 tests
>     [exec]    [junit4] 
>     [exec]    [junit4] Suite: org.apache.solr.SolrInfoMBeanTest
>     [exec]    [junit4] Completed on J2 in 4.13s, 1 test
>     [exec]    [junit4] 
>     [exec]    [junit4] Suite: org.apache.solr.rest.schema.TestSchemaSimilarityResource
>     [exec]    [junit4] Completed on J3 in 1.87s, 1 test
>     [exec]    [junit4] 
>     [exec]    [junit4] Suite: org.apache.solr.cloud.OverseerCollectionProcessorTest
>     [exec]    [junit4] Completed on J0 in 5.30s, 14 tests
>     [exec]    [junit4] 
>     [exec]    [junit4] Suite: org.apache.solr.spelling.DirectSolrSpellCheckerTest
>     [exec]    [junit4] Completed on J2 in 2.55s, 2 tests
>     [exec]    [junit4] 
>     [exec]    [junit4] Suite: org.apache.solr.schema.PreAnalyzedFieldTest
>     [exec]    [junit4] Completed on J0 in 2.04s, 3 tests
>     [exec]    [junit4] 
>     [exec]    [junit4] Suite: org.apache.solr.search.TestFieldSortValues
>     [exec]    [junit4] Completed on J2 in 0.73s, 1 test
>     [exec]    [junit4] 
>     [exec]    [junit4] Suite: org.apache.solr.update.processor.SignatureUpdateProcessorFactoryTest
>     [exec]    [junit4] Completed on J3 in 2.90s, 6 tests
>     [exec]    [junit4] 
>     [exec]    [junit4] Suite: org.apache.solr.handler.component.ResponseLogComponentTest
>     [exec]    [junit4] Completed on J2 in 1.91s, 3 tests
>     [exec]    [junit4] 
>     [exec]    [junit4] Suite: org.apache.solr.internal.csv.CSVPrinterTest
>     [exec]    [junit4] Completed on J2 in 0.69s, 6 tests
>     [exec]    [junit4] 
>     [exec]    [junit4] Suite: org.apache.solr.update.AnalysisErrorHandlingTest
>     [exec]    [junit4] Completed on J2 in 0.61s, 1 test
>     [exec]    [junit4] 
>     [exec]    [junit4] Suite: org.apache.solr.spelling.suggest.SuggesterTSTTest
>     [exec]    [junit4] Completed on J3 in 4.02s, 4 tests
>     [exec]    [junit4] 
>     [exec]    [junit4] Suite: org.apache.solr.cloud.ClusterStateUpdateTest
>     [exec]    [junit4] IGNOR/A 0.00s J3 | ClusterStateUpdateTest.testCoreRegistration
>     [exec]    [junit4]    > Assumption #1: 'slow' test group is disabled (@Slow)
>     [exec]    [junit4] Completed on J3 in 0.04s, 1 test, 1 skipped
>     [exec]    [junit4] 
>     [exec]    [junit4] Suite: org.apache.solr.update.processor.FieldMutatingUpdateProcessorTest
>     [exec]    [junit4] Completed on J0 in 5.09s, 27 tests
>     [exec]    [junit4] 
>     [exec]    [junit4] Suite: org.apache.solr.search.similarities.TestDFRSimilarityFactory
>     [exec]    [junit4] Completed on J3 in 0.70s, 3 tests
>     [exec]    [junit4] 
>     [exec]    [junit4] Suite: org.apache.solr.store.hdfs.HdfsDirectoryTest
>     [exec]    [junit4] Completed on J0 in 0.03s, 3 tests, 3 skipped
>     [exec]    [junit4] 
>     [exec]    [junit4] Suite: org.apache.solr.cloud.DeleteShardTest
>     [exec]    [junit4] IGNOR/A 0.00s J0 | DeleteShardTest.testDistribSearch
>     [exec]    [junit4]    > Assumption #1: 'slow' test group is disabled (@Slow)
>     [exec]    [junit4] Completed on J0 in 0.04s, 1 test, 1 skipped
>     [exec]    [junit4] 
>     [exec]    [junit4] Suite: org.apache.solr.search.TestFastLRUCache
>     [exec]    [junit4] Completed on J0 in 0.11s, 7 tests
>     [exec]    [junit4] 
>     [exec]    [junit4] Suite: org.apache.solr.cloud.LeaderElectionTest
>     [exec]    [junit4] IGNOR/A 0.00s J3 | LeaderElectionTest.testElection
>     [exec]    [junit4]    > Assumption #1: 'slow' test group is disabled (@Slow)
>     [exec]    [junit4] IGNOR/A 0.00s J3 | LeaderElectionTest.testStressElection
>     [exec]    [junit4]    > Assumption #1: 'slow' test group is disabled (@Slow)
>     [exec]    [junit4] IGNOR/A 0.00s J3 | LeaderElectionTest.testBasic
>     [exec]    [junit4]    > Assumption #1: 'slow' test group is disabled (@Slow)
>     [exec]    [junit4] IGNOR/A 0.00s J3 | LeaderElectionTest.testCancelElection
>     [exec]    [junit4]    > Assumption #1: 'slow' test group is disabled (@Slow)
>     [exec]    [junit4] Completed on J3 in 0.04s, 4 tests, 4 skipped
>     [exec]    [junit4] 
>     [exec]    [junit4] Suite: org.apache.solr.update.TestIndexingPerformance
>     [exec]    [junit4] Completed on J0 in 2.57s, 1 test
>     [exec]    [junit4] 
>     [exec]    [junit4] Suite: org.apache.solr.util.FileUtilsTest
>     [exec]    [junit4] Completed on J0 in 0.02s, 1 test
>     [exec]    [junit4] 
>     [exec]    [junit4] Suite: org.apache.solr.rest.schema.TestSchemaVersionResource
>     [exec]    [junit4] Completed on J0 in 1.36s, 1 test
>     [exec]    [junit4] 
>     [exec]    [junit4] Suite: org.apache.solr.cloud.ChaosMonkeyShardSplitTest
>     [exec]    [junit4] Completed on J0 in 0.00s, 0 tests
>     [exec]    [junit4] 
>     [exec]    [junit4] Suite: org.apache.solr.search.TestQueryUtils
>     [exec]    [junit4] Completed on J0 in 2.18s, 1 test
>     [exec]    [junit4] 
>     [exec]    [junit4] Suite: org.apache.solr.cloud.ZkSolrClientTest
>     [exec]    [junit4] Completed on J3 in 11.10s, 5 tests
>     [exec]    [junit4] 
>     [exec]    [junit4] Suite: org.apache.solr.cloud.SolrXmlInZkTest
>     [exec]    [junit4] Completed on J0 in 8.14s, 8 tests
>     [exec]    [junit4] 
>     [exec]    [junit4] Suite: org.apache.solr.search.similarities.TestLMJelinekMercerSimilarityFactory
>     [exec]    [junit4] Completed on J0 in 0.85s, 2 tests
>     [exec]    [junit4] 
>     [exec]    [junit4] Suite: org.apache.solr.cloud.ShardRoutingCustomTest
>     [exec]    [junit4] IGNOR/A 0.00s J0 | ShardRoutingCustomTest.testDistribSearch
>     [exec]    [junit4]    > Assumption #1: 'slow' test group is disabled (@Slow)
>     [exec]    [junit4] Completed on J0 in 0.04s, 1 test, 1 skipped
>     [exec]    [junit4] 
>     [exec]    [junit4] Suite: org.apache.solr.TestDistributedGrouping
>     [exec]    [junit4] IGNOR/A 0.00s J0 | TestDistributedGrouping.testDistribSearch
>     [exec]    [junit4]    > Assumption #1: 'slow' test group is disabled (@Slow)
>     [exec]    [junit4] Completed on J0 in 0.03s, 1 test, 1 skipped
>     [exec]    [junit4] 
>     [exec]    [junit4] Suite: org.apache.solr.cloud.TestZkChroot
>     [exec]    [junit4] Completed on J3 in 12.81s, 4 tests
>     [exec]    [junit4] 
>     [exec]    [junit4] Suite: org.apache.solr.handler.component.DistributedSpellCheckComponentTest
>     [exec]    [junit4] IGNOR/A 0.00s J3 | DistributedSpellCheckComponentTest.testDistribSearch
>     [exec]    [junit4]    > Assumption #1: 'slow' test group is disabled (@Slow)
>     [exec]    [junit4] Completed on J3 in 0.02s, 1 test, 1 skipped
>     [exec]    [junit4] 
>     [exec]    [junit4] Suite: org.apache.solr.cloud.ZkControllerTest
>     [exec]    [junit4] IGNOR/A 0.00s J3 | ZkControllerTest.testReadConfigName
>     [exec]    [junit4]    > Assumption #1: 'slow' test group is disabled (@Slow)
>     [exec]    [junit4] IGNOR/A 0.00s J3 | ZkControllerTest.testUploadToCloud
>     [exec]    [junit4]    > Assumption #1: 'slow' test group is disabled (@Slow)
>     [exec]    [junit4] IGNOR/A 0.00s J3 | ZkControllerTest.testGetHostName
>     [exec]    [junit4]    > Assumption #1: 'slow' test group is disabled (@Slow)
>     [exec]    [junit4] IGNOR/A 0.00s J3 | ZkControllerTest.testNodeNameUrlConversion
>     [exec]    [junit4]    > Assumption #1: 'slow' test group is disabled (@Slow)
>     [exec]    [junit4] Completed on J3 in 0.04s, 4 tests, 4 skipped
>     [exec]    [junit4] 
>     [exec]    [junit4] Suite: org.apache.solr.request.TestFaceting
>     [exec]    [junit4] Completed on J0 in 9.92s, 9 tests
>     [exec]    [junit4] 
>     [exec]    [junit4] Suite: org.apache.solr.search.TestRecovery
>     [exec]    [junit4] Completed on J2 in 47.36s, 11 tests
>     [exec]    [junit4] 
>     [exec]    [junit4] Suite: org.apache.solr.search.TestRealTimeGet
>     [exec]    [junit4] Completed on J3 in 21.41s, 4 tests
>     [exec]    [junit4] 
>     [exec]    [junit4] Suite: org.apache.solr.TestRandomDVFaceting
>     [exec]    [junit4] IGNOR/A 0.01s J2 | TestRandomDVFaceting.testRandomFaceting
>     [exec]    [junit4]    > Assumption #1: 'slow' test group is disabled (@Slow)
>     [exec]    [junit4] Completed on J2 in 0.99s, 1 test, 1 skipped
>     [exec]    [junit4] 
>     [exec]    [junit4] Suite: org.apache.solr.search.TestNoOpRegenerator
>     [exec]    [junit4] Completed on J2 in 1.21s, 1 test
>     [exec]    [junit4] 
>     [exec]    [junit4] Suite: org.apache.solr.search.TestStressReorder
>     [exec]    [junit4] Completed on J0 in 23.32s, 1 test
>     [exec]    [junit4] 
>     [exec]    [junit4] Suite: org.apache.solr.cloud.TestMultiCoreConfBootstrap
>     [exec]    [junit4] Completed on J3 in 3.68s, 1 test
>     [exec]    [junit4] 
>     [exec]    [junit4] HEARTBEAT J1 PID(3623@lucene.zones.apache.org): 2014-03-08T14:34:39, stalled for 70.7s at: BasicZkTest.testBasic
>     [exec]    [junit4] Suite: org.apache.solr.request.SimpleFacetsTest
>     [exec]    [junit4] Completed on J3 in 9.13s, 32 tests
>     [exec]    [junit4] 
>     [exec]    [junit4] Suite: org.apache.solr.search.TestReload
>     [exec]    [junit4] Completed on J2 in 13.66s, 1 test
>     [exec]    [junit4] 
>     [exec]    [junit4] Suite: org.apache.solr.core.TestCoreContainer
>     [exec]    [junit4] Completed on J0 in 20.32s, 8 tests
>     [exec]    [junit4] 
>     [exec]    [junit4] Suite: org.apache.solr.search.TestSolr4Spatial
>     [exec]    [junit4] IGNOR/A 0.02s J3 | TestSolr4Spatial.solr4OldShapeSyntax {p0=pointvector}
>     [exec]    [junit4]    > Assumption #1: Mostly just valid for prefix-tree
>     [exec]    [junit4] IGNOR/A 0.02s J3 | TestSolr4Spatial.testSortMultiVal {p0=pointvector}
>     [exec]    [junit4]    > Assumption #1: Multivalue not supported for this field
>     [exec]    [junit4] Completed on J3 in 10.47s, 32 tests, 2 skipped
>     [exec]    [junit4] 
>     [exec]    [junit4] Suite: org.apache.solr.handler.component.StatsComponentTest
>     [exec]    [junit4] Completed on J0 in 5.26s, 7 tests
>     [exec]    [junit4] 
>     [exec]    [junit4] Suite: org.apache.solr.core.SolrCoreTest
>     [exec]    [junit4] Completed on J2 in 14.02s, 6 tests
>     [exec]    [junit4] 
>     [exec]    [junit4] Suite: org.apache.solr.search.TestSort
>     [exec]    [junit4] Completed on J0 in 4.18s, 2 tests
>     [exec]    [junit4] 
>     [exec]    [junit4] Suite: org.apache.solr.search.TestFiltering
>     [exec]    [junit4] Completed on J2 in 4.87s, 3 tests
>     [exec]    [junit4] 
>     [exec]    [junit4] Suite: org.apache.solr.BasicFunctionalityTest
>     [exec]    [junit4] Completed on J0 in 5.03s, 23 tests
>     [exec]    [junit4] 
>     [exec]    [junit4] Suite: org.apache.solr.handler.component.QueryElevationComponentTest
>     [exec]    [junit4] Completed on J3 in 14.62s, 8 tests
>     [exec]    [junit4] 
>     [exec]    [junit4] Suite: org.apache.solr.update.SoftAutoCommitTest
>     [exec]    [junit4] IGNOR/A 0.00s J3 | SoftAutoCommitTest.testSoftAndHardCommitMaxTimeDelete
>     [exec]    [junit4]    > Assumption #1: 'slow' test group is disabled (@Slow)
>     [exec]    [junit4] IGNOR/A 0.00s J3 | SoftAutoCommitTest.testSoftAndHardCommitMaxTimeRapidAdds
>     [exec]    [junit4]    > Assumption #1: 'slow' test group is disabled (@Slow)
>     [exec]    [junit4] IGNOR/A 0.00s J3 | SoftAutoCommitTest.testSoftAndHardCommitMaxTimeMixedAdds
>     [exec]    [junit4]    > Assumption #1: 'slow' test group is disabled (@Slow)
>     [exec]    [junit4] Completed on J3 in 2.53s, 3 tests, 3 skipped
>     [exec]    [junit4] 
>     [exec]    [junit4] Suite: org.apache.solr.update.DirectUpdateHandlerTest
>     [exec]    [junit4] Completed on J2 in 7.67s, 6 tests
>     [exec]    [junit4] 
>     [exec]    [junit4] Suite: org.apache.solr.highlight.HighlighterTest
>     [exec]    [junit4] Completed on J0 in 4.64s, 30 tests
>     [exec]    [junit4] 
>     [exec]    [junit4] Suite: org.apache.solr.schema.CurrencyFieldOpenExchangeTest
>     [exec]    [junit4] Completed on J3 in 3.63s, 10 tests, 1 skipped
>     [exec]    [junit4] 
>     [exec]    [junit4] Suite: org.apache.solr.handler.component.DistributedQueryElevationComponentTest
>     [exec]    [junit4] Completed on J2 in 4.07s, 1 test
>     [exec]    [junit4] 
>     [exec]    [junit4] Suite: org.apache.solr.schema.CurrencyFieldXmlFileTest
>     [exec]    [junit4] Completed on J0 in 3.42s, 11 tests, 1 skipped
>     [exec]    [junit4] 
>     [exec]    [junit4] Suite: org.apache.solr.core.TestCoreDiscovery
>     [exec]    [junit4] Completed on J3 in 2.60s, 4 tests
>     [exec]    [junit4] 
>     [exec]    [junit4] Suite: org.apache.solr.spelling.SpellCheckCollatorTest
>     [exec]    [junit4] IGNOR/A 0.00s J0 | SpellCheckCollatorTest.testContextSensitiveCollate
>     [exec]    [junit4]    > Assumption #1: 'slow' test group is disabled (@Slow)
>     [exec]    [junit4] IGNOR/A 0.00s J0 | SpellCheckCollatorTest.testEstimatedHitCounts
>     [exec]    [junit4]    > Assumption #1: 'slow' test group is disabled (@Slow)
>     [exec]    [junit4] IGNOR/A 0.00s J0 | SpellCheckCollatorTest.testCollateWithGrouping
>     [exec]    [junit4]    > Assumption #1: 'slow' test group is disabled (@Slow)
>     [exec]    [junit4] IGNOR/A 0.00s J0 | SpellCheckCollatorTest.testCollateWithFilter
>     [exec]    [junit4]    > Assumption #1: 'slow' test group is disabled (@Slow)
>     [exec]    [junit4] IGNOR/A 0.00s J0 | SpellCheckCollatorTest.testCollateWithMultipleRequestHandlers
>     [exec]    [junit4]    > Assumption #1: 'slow' test group is disabled (@Slow)
>     [exec]    [junit4] IGNOR/A 0.00s J0 | SpellCheckCollatorTest.testExtendedCollate
>     [exec]    [junit4]    > Assumption #1: 'slow' test group is disabled (@Slow)
>     [exec]    [junit4] IGNOR/A 0.00s J0 | SpellCheckCollatorTest.testCollationWithHypens
>     [exec]    [junit4]    > Assumption #1: 'slow' test group is disabled (@Slow)
>     [exec]    [junit4] IGNOR/A 0.00s J0 | SpellCheckCollatorTest.testCollateWithOverride
>     [exec]    [junit4]    > Assumption #1: 'slow' test group is disabled (@Slow)
>     [exec]    [junit4] Completed on J0 in 2.69s, 8 tests, 8 skipped
>     [exec]    [junit4] 
>     [exec]    [junit4] Suite: org.apache.solr.AnalysisAfterCoreReloadTest
>     [exec]    [junit4] Completed on J2 in 4.28s, 1 test
>     [exec]    [junit4] 
>     [exec]    [junit4] Suite: org.apache.solr.servlet.SolrRequestParserTest
>     [exec]    [junit4] Completed on J0 in 2.50s, 10 tests
>     [exec]    [junit4] 
>     [exec]    [junit4] Suite: org.apache.solr.schema.DocValuesTest
>     [exec]    [junit4] Completed on J2 in 3.06s, 6 tests
>     [exec]    [junit4] 
>     [exec]    [junit4] Suite: org.apache.solr.handler.admin.CoreAdminHandlerTest
>     [exec]    [junit4] Completed on J3 in 6.81s, 4 tests
>     [exec]    [junit4] 
>     [exec]    [junit4] Suite: org.apache.solr.spelling.suggest.SuggesterTest
>     [exec]    [junit4] Completed on J0 in 4.25s, 4 tests
>     [exec]    [junit4] 
>     [exec]    [junit4] Suite: org.apache.solr.TestTrie
>     [exec]    [junit4] Completed on J2 in 2.34s, 8 tests
>     [exec]    [junit4] 
>     [exec]    [junit4] Suite: org.apache.solr.search.SpatialFilterTest
>     [exec]    [junit4] Completed on J3 in 2.74s, 3 tests
>     [exec]    [junit4] 
>     [exec]    [junit4] Suite: org.apache.solr.handler.TestCSVLoader
>     [exec]    [junit4] Completed on J2 in 2.56s, 6 tests
>     [exec]    [junit4] 
>     [exec]    [junit4] Suite: org.apache.solr.spelling.suggest.SuggesterWFSTTest
>     [exec]    [junit4] Completed on J0 in 3.10s, 4 tests
>     [exec]    [junit4] 
>     [exec]    [junit4] Suite: org.apache.solr.schema.PolyFieldTest
>     [exec]    [junit4] Completed on J3 in 2.09s, 4 tests
>     [exec]    [junit4] 
>     [exec]    [junit4] Suite: org.apache.solr.spelling.WordBreakSolrSpellCheckerTest
>     [exec]    [junit4] Completed on J2 in 3.24s, 3 tests
>     [exec]    [junit4] 
>     [exec]    [junit4] Suite: org.apache.solr.schema.SchemaVersionSpecificBehaviorTest
>     [exec]    [junit4] Completed on J0 in 4.52s, 1 test
>     [exec]    [junit4] 
>     [exec]    [junit4] Suite: org.apache.solr.core.SolrCoreCheckLockOnStartupTest
>     [exec]    [junit4] Completed on J3 in 4.44s, 2 tests
>     [exec]    [junit4] 
>     [exec]    [junit4] Suite: org.apache.solr.update.DirectUpdateHandlerOptimizeTest
>     [exec]    [junit4] Completed on J2 in 2.53s, 1 test
>     [exec]    [junit4] 
>     [exec]    [junit4] Suite: org.apache.solr.search.function.distance.DistanceFunctionTest
>     [exec]    [junit4] Completed on J0 in 2.67s, 3 tests
>     [exec]    [junit4] 
>     [exec]    [junit4] Suite: org.apache.solr.core.TestSolrDeletionPolicy1
>     [exec]    [junit4] Completed on J3 in 2.82s, 3 tests
>     [exec]    [junit4] 
>     [exec]    [junit4] Suite: org.apache.solr.handler.XsltUpdateRequestHandlerTest
>     [exec]    [junit4] Completed on J2 in 2.89s, 2 tests
>     [exec]    [junit4] 
>     [exec]    [junit4] HEARTBEAT J1 PID(3623@lucene.zones.apache.org): 2014-03-08T14:35:39, stalled for  131s at: BasicZkTest.testBasic
>     [exec]    [junit4] Suite: org.apache.solr.spelling.IndexBasedSpellCheckerTest
>     [exec]    [junit4] Completed on J0 in 2.80s, 5 tests
>     [exec]    [junit4] 
>     [exec]    [junit4] Suite: org.apache.solr.DisMaxRequestHandlerTest
>     [exec]    [junit4] Completed on J2 in 2.67s, 2 tests
>     [exec]    [junit4] 
>     [exec]    [junit4] Suite: org.apache.solr.search.TestSurroundQueryParser
>     [exec]    [junit4] Completed on J3 in 3.83s, 1 test
>     [exec]    [junit4] 
>     [exec]    [junit4] Suite: org.apache.solr.handler.StandardRequestHandlerTest
>     [exec]    [junit4] Completed on J0 in 2.28s, 1 test
>     [exec]    [junit4] 
>     [exec]    [junit4] Suite: org.apache.solr.analysis.TestReversedWildcardFilterFactory
>     [exec]    [junit4] Completed on J3 in 1.44s, 4 tests
>     [exec]    [junit4] 
>     [exec]    [junit4] Suite: org.apache.solr.request.TestWriterPerf
>     [exec]    [junit4] Completed on J2 in 2.51s, 1 test
>     [exec]    [junit4] 
>     [exec]    [junit4] Suite: org.apache.solr.handler.DocumentAnalysisRequestHandlerTest
>     [exec]    [junit4] Completed on J0 in 2.32s, 4 tests
>     [exec]    [junit4] 
>     [exec]    [junit4] Suite: org.apache.solr.search.TestQueryTypes
>     [exec]    [junit4] Completed on J3 in 2.05s, 1 test
>     [exec]    [junit4] 
>     [exec]    [junit4] Suite: org.apache.solr.handler.component.TermsComponentTest
>     [exec]    [junit4] Completed on J2 in 2.24s, 13 tests
>     [exec]    [junit4] 
>     [exec]    [junit4] Suite: org.apache.solr.update.DocumentBuilderTest
>     [exec]    [junit4] Completed on J0 in 2.25s, 13 tests
>     [exec]    [junit4] 
>     [exec]    [junit4] Suite: org.apache.solr.analysis.PathHierarchyTokenizerFactoryTest
>     [exec]    [junit4] Completed on J3 in 2.44s, 2 tests
>     [exec]    [junit4] 
>     [exec]    [junit4] Suite: org.apache.solr.schema.RequiredFieldsTest
>     [exec]    [junit4] Completed on J2 in 1.91s, 3 tests
>     [exec]    [junit4] 
>     [exec]    [junit4] Suite: org.apache.solr.core.TestArbitraryIndexDir
>     [exec]    [junit4] Completed on J0 in 2.21s, 1 test
>     [exec]    [junit4] 
>     [exec]    [junit4] Suite: org.apache.solr.highlight.FastVectorHighlighterTest
>     [exec]    [junit4] Completed on J3 in 2.25s, 2 tests
>     [exec]    [junit4] 
>     [exec]    [junit4] Suite: org.apache.solr.util.SolrPluginUtilsTest
>     [exec]    [junit4] Completed on J2 in 2.32s, 7 tests
>     [exec]    [junit4] 
>     [exec]    [junit4] Suite: org.apache.solr.schema.IndexSchemaTest
>     [exec]    [junit4] Completed on J0 in 2.20s, 3 tests
>     [exec]    [junit4] 
>     [exec]    [junit4] Suite: org.apache.solr.schema.TestCollationField
>     [exec]    [junit4] Completed on J2 in 1.04s, 8 tests
>     [exec]    [junit4] 
>     [exec]    [junit4] Suite: org.apache.solr.core.TestJmxIntegration
>     [exec]    [junit4] Completed on J3 in 2.37s, 3 tests, 1 skipped
>     [exec]    [junit4] 
>     [exec]    [junit4] Suite: org.apache.solr.request.JSONWriterTest
>     [exec]    [junit4] Completed on J0 in 2.36s, 3 tests
>     [exec]    [junit4] 
>     [exec]    [junit4] Suite: org.apache.solr.response.TestCSVResponseWriter
>     [exec]    [junit4] Completed on J2 in 2.61s, 2 tests
>     [exec]    [junit4] 
>     [exec]    [junit4] Suite: org.apache.solr.handler.admin.MBeansHandlerTest
>     [exec]    [junit4] Completed on J3 in 2.39s, 1 test
>     [exec]    [junit4] 
>     [exec]    [junit4] Suite: org.apache.solr.search.QueryParsingTest
>     [exec]    [junit4] Completed on J0 in 2.29s, 4 tests
>     [exec]    [junit4] 
>     [exec]    [junit4] Suite: org.apache.solr.handler.JsonLoaderTest
>     [exec]    [junit4] Completed on J2 in 2.10s, 19 tests
>     [exec]    [junit4] 
>     [exec]    [junit4] Suite: org.apache.solr.response.TestPHPSerializedResponseWriter
>     [exec]    [junit4] Completed on J3 in 2.07s, 2 tests
>     [exec]    [junit4] 
>     [exec]    [junit4] Suite: org.apache.solr.handler.PingRequestHandlerTest
>     [exec]    [junit4] Completed on J0 in 1.91s, 5 tests
>     [exec]    [junit4] 
>     [exec]    [junit4] Suite: org.apache.solr.core.CoreContainerCoreInitFailuresTest
>     [exec]    [junit4] Completed on J3 in 1.19s, 2 tests
>     [exec]    [junit4] 
>     [exec]    [junit4] Suite: org.apache.solr.handler.CSVRequestHandlerTest
>     [exec]    [junit4] Completed on J2 in 1.99s, 1 test
>     [exec]    [junit4] 
>     [exec]    [junit4] Suite: org.apache.solr.request.TestBinaryResponseWriter
>     [exec]    [junit4] Completed on J0 in 1.89s, 2 tests
>     [exec]    [junit4] 
>     [e
> 
> [...truncated too long message...]
> 
> ##Starting testTransformValue
>     [exec]    [junit4]   2> 105277 T10 C8 oass.SolrIndexSearcher.<init> Opening Searcher@6220ba4d[collection1] realtime
>     [exec]    [junit4]   2> 105278 T10 C8 oasup.LogUpdateProcessor.finish [collection1] webapp=null path=/update params={} {deleteByQuery=*:* (-1462020195385081856)} 0 2
>     [exec]    [junit4]   2> 105279 T10 C8 oasu.DirectUpdateHandler2.commit start commit{,optimize=false,openSearcher=true,waitSearcher=true,expungeDeletes=false,softCommit=false,prepareCommit=false}
>     [exec]    [junit4]   2> 105280 T10 C8 oasc.SolrDeletionPolicy.onCommit SolrDeletionPolicy.onCommit: commits: num=2
>     [exec]    [junit4]   2> 		commit{dir=MockDirectoryWrapper(RAMDirectory@5454570a lockFactory=NativeFSLockFactory@/usr/home/hudson/hudson-slave/workspace/Lucene-Solr-SmokeRelease-4.x/lucene/build/fakeReleaseTmp/unpack/solr-4.8.0/solr/build/contrib/solr-morphlines-cell/test/J0/./solrtest-SolrCellMorphlineTest-1394291009099/index),segFN=segments_4,generation=4}
>     [exec]    [junit4]   2> 		commit{dir=MockDirectoryWrapper(RAMDirectory@5454570a lockFactory=NativeFSLockFactory@/usr/home/hudson/hudson-slave/workspace/Lucene-Solr-SmokeRelease-4.x/lucene/build/fakeReleaseTmp/unpack/solr-4.8.0/solr/build/contrib/solr-morphlines-cell/test/J0/./solrtest-SolrCellMorphlineTest-1394291009099/index),segFN=segments_5,generation=5}
>     [exec]    [junit4]   2> 105281 T10 C8 oasc.SolrDeletionPolicy.updateCommits newest commit generation = 5
>     [exec]    [junit4]   2> 105282 T10 C8 oasc.SolrCore.openNewSearcher SolrIndexSearcher has not changed - not re-opening: org.apache.solr.search.SolrIndexSearcher
>     [exec]    [junit4]   2> 105282 T12 oasc.QuerySenderListener.newSearcher QuerySenderListener sending requests to Searcher@6220ba4d[collection1] realtime{StandardDirectoryReader(segments_4:59:nrt)}
>     [exec]    [junit4]   2> 105282 T10 C8 oasu.DirectUpdateHandler2.commit end_commit_flush
>     [exec]    [junit4]   2> 105283 T12 oasc.QuerySenderListener.newSearcher QuerySenderListener done.
>     [exec]    [junit4]   2> 105284 T12 oasc.SolrCore.registerSearcher [collection1] Registered new searcher Searcher@6220ba4d[collection1] realtime{StandardDirectoryReader(segments_4:59:nrt)}
>     [exec]    [junit4]   2> 105285 T10 C8 oasup.LogUpdateProcessor.finish [collection1] webapp=null path=/update params={commit=true&softCommit=false&waitSearcher=true} {commit=} 0 6
>     [exec]    [junit4]   2> 105306 T10 oas.SolrTestCaseJ4.tearDown ###Ending testTransformValue
>     [exec]    [junit4]   2> 105310 T10 oas.SolrTestCaseJ4.deleteCore ###deleteCore
>     [exec]    [junit4]   2> 105311 T10 oasc.CoreContainer.shutdown Shutting down CoreContainer instance=268060942
>     [exec]    [junit4]   2> 105312 T10 oasc.SolrCore.close [collection1]  CLOSING SolrCore org.apache.solr.core.SolrCore@2b071e12
>     [exec]    [junit4]   2> 105316 T10 oasu.DirectUpdateHandler2.close closing DirectUpdateHandler2{commits=36,autocommit maxTime=60000ms,autocommits=0,soft autocommit maxTime=1000ms,soft autocommits=0,optimizes=0,rollbacks=0,expungeDeletes=0,docsPending=0,adds=0,deletesById=0,deletesByQuery=0,errors=0,cumulative_adds=41,cumulative_deletesById=0,cumulative_deletesByQuery=9,cumulative_errors=0,transaction_logs_total_size=59750,transaction_logs_total_number=9}
>     [exec]    [junit4]   2> 105317 T10 oasu.SolrCoreState.decrefSolrCoreState Closing SolrCoreState
>     [exec]    [junit4]   2> 105317 T10 oasu.DefaultSolrCoreState.closeIndexWriter SolrCoreState ref count has reached 0 - closing IndexWriter
>     [exec]    [junit4]   2> 105318 T10 oasu.DefaultSolrCoreState.closeIndexWriter closing IndexWriter with IndexWriterCloser
>     [exec]    [junit4]   2> 105321 T10 oasc.SolrCore.closeSearcher [collection1] Closing main searcher on request.
>     [exec]    [junit4]   2> 105322 T10 oasc.CachingDirectoryFactory.close Closing MockDirectoryFactory - 2 directories currently being tracked
>     [exec]    [junit4]   2> 105323 T10 oasc.CachingDirectoryFactory.closeCacheValue looking to close /usr/home/hudson/hudson-slave/workspace/Lucene-Solr-SmokeRelease-4.x/lucene/build/fakeReleaseTmp/unpack/solr-4.8.0/solr/build/contrib/solr-morphlines-cell/test/J0/./solrtest-SolrCellMorphlineTest-1394291009099/index [CachedDir<<refCount=0;path=/usr/home/hudson/hudson-slave/workspace/Lucene-Solr-SmokeRelease-4.x/lucene/build/fakeReleaseTmp/unpack/solr-4.8.0/solr/build/contrib/solr-morphlines-cell/test/J0/./solrtest-SolrCellMorphlineTest-1394291009099/index;done=false>>]
>     [exec]    [junit4]   2> 105324 T10 oasc.CachingDirectoryFactory.close Closing directory: /usr/home/hudson/hudson-slave/workspace/Lucene-Solr-SmokeRelease-4.x/lucene/build/fakeReleaseTmp/unpack/solr-4.8.0/solr/build/contrib/solr-morphlines-cell/test/J0/./solrtest-SolrCellMorphlineTest-1394291009099/index
>     [exec]    [junit4]   2> 105325 T10 oasc.CachingDirectoryFactory.closeCacheValue looking to close /usr/home/hudson/hudson-slave/workspace/Lucene-Solr-SmokeRelease-4.x/lucene/build/fakeReleaseTmp/unpack/solr-4.8.0/solr/build/contrib/solr-morphlines-cell/test/J0/./solrtest-SolrCellMorphlineTest-1394291009099 [CachedDir<<refCount=0;path=/usr/home/hudson/hudson-slave/workspace/Lucene-Solr-SmokeRelease-4.x/lucene/build/fakeReleaseTmp/unpack/solr-4.8.0/solr/build/contrib/solr-morphlines-cell/test/J0/./solrtest-SolrCellMorphlineTest-1394291009099;done=false>>]
>     [exec]    [junit4]   2> 105325 T10 oasc.CachingDirectoryFactory.close Closing directory: /usr/home/hudson/hudson-slave/workspace/Lucene-Solr-SmokeRelease-4.x/lucene/build/fakeReleaseTmp/unpack/solr-4.8.0/solr/build/contrib/solr-morphlines-cell/test/J0/./solrtest-SolrCellMorphlineTest-1394291009099
>     [exec]    [junit4]   2> NOTE: test params are: codec=Appending, sim=RandomSimilarityProvider(queryNorm=true,coord=no): {}, locale=ar_SY, timezone=Pacific/Truk
>     [exec]    [junit4]   2> NOTE: FreeBSD 9.1-RELEASE-p3 amd64/Sun Microsystems Inc. 1.6.0_32 (64-bit)/cpus=16,threads=1,free=257039776,total=419758080
>     [exec]    [junit4]   2> NOTE: All tests run in this JVM: [SolrCellMorphlineTest]
>     [exec]    [junit4] Completed in 106.47s, 5 tests, 1 failure <<< FAILURES!
>     [exec]    [junit4] 
>     [exec]    [junit4] 
>     [exec]    [junit4] Tests with failures:
>     [exec]    [junit4]   - org.apache.solr.morphlines.cell.SolrCellMorphlineTest.testSolrCellDocumentTypes2
>     [exec]    [junit4] 
>     [exec]    [junit4] 
>     [exec]    [junit4] JVM J0:     1.80 ..   110.83 =   109.03s
>     [exec]    [junit4] Execution time total: 1 minute 50 seconds
>     [exec]    [junit4] Tests summary: 1 suite, 5 tests, 1 failure
>     [exec] 
>     [exec] BUILD FAILED
>     [exec] /usr/home/hudson/hudson-slave/workspace/Lucene-Solr-SmokeRelease-4.x/lucene/build/fakeReleaseTmp/unpack/solr-4.8.0/solr/build.xml:209: The following error occurred while executing this line:
>     [exec] /usr/home/hudson/hudson-slave/workspace/Lucene-Solr-SmokeRelease-4.x/lucene/build/fakeReleaseTmp/unpack/solr-4.8.0/solr/common-build.xml:440: The following error occurred while executing this line:
>     [exec] /usr/home/hudson/hudson-slave/workspace/Lucene-Solr-SmokeRelease-4.x/lucene/build/fakeReleaseTmp/unpack/solr-4.8.0/solr/common-build.xml:490: The following error occurred while executing this line:
>     [exec] /usr/home/hudson/hudson-slave/workspace/Lucene-Solr-SmokeRelease-4.x/lucene/build/fakeReleaseTmp/unpack/solr-4.8.0/lucene/common-build.xml:1278: The following error occurred while executing this line:
>     [exec] /usr/home/hudson/hudson-slave/workspace/Lucene-Solr-SmokeRelease-4.x/lucene/build/fakeReleaseTmp/unpack/solr-4.8.0/lucene/common-build.xml:911: There were test failures: 1 suite, 5 tests, 1 failure
>     [exec] 
>     [exec] Total time: 34 minutes 54 seconds
>     [exec] 
>     [exec] 
>     [exec] Traceback (most recent call last):
>     [exec]   File "/usr/home/hudson/hudson-slave/workspace/Lucene-Solr-SmokeRelease-4.x/dev-tools/scripts/smokeTestRelease.py", line 1376, in <module>
>     [exec]     main()
>     [exec]   File "/usr/home/hudson/hudson-slave/workspace/Lucene-Solr-SmokeRelease-4.x/dev-tools/scripts/smokeTestRelease.py", line 1320, in main
>     [exec]     smokeTest(baseURL, svnRevision, version, tmpDir, isSigned, testArgs)
>     [exec]   File "/usr/home/hudson/hudson-slave/workspace/Lucene-Solr-SmokeRelease-4.x/dev-tools/scripts/smokeTestRelease.py", line 1365, in smokeTest
>     [exec]     unpackAndVerify('solr', tmpDir, 'solr-%s-src.tgz' % version, svnRevision, version, testArgs, baseURL)
>     [exec]   File "/usr/home/hudson/hudson-slave/workspace/Lucene-Solr-SmokeRelease-4.x/dev-tools/scripts/smokeTestRelease.py", line 635, in unpackAndVerify
>     [exec]     verifyUnpacked(project, artifact, unpackPath, svnRevision, version, testArgs, tmpDir, baseURL)
>     [exec]   File "/usr/home/hudson/hudson-slave/workspace/Lucene-Solr-SmokeRelease-4.x/dev-tools/scripts/smokeTestRelease.py", line 751, in verifyUnpacked
>     [exec]     run('%s; ant test -Dtests.slow=false %s' % (javaExe('1.6'), testArgs), '%s/test.log' % unpackPath)
>     [exec]   File "/usr/home/hudson/hudson-slave/workspace/Lucene-Solr-SmokeRelease-4.x/dev-tools/scripts/smokeTestRelease.py", line 560, in run
>     [exec]     raise RuntimeError('command "%s" failed; see log file %s' % (command, logPath))
>     [exec] RuntimeError: command "export JAVA_HOME="/home/hudson/tools/java/latest1.6" PATH="/home/hudson/tools/java/latest1.6/bin:$PATH" JAVACMD="/home/hudson/tools/java/latest1.6/bin/java"; ant test -Dtests.slow=false -Dtests.jettyConnector=Socket  -Dtests.disableHdfs=true" failed; see log file /usr/home/hudson/hudson-slave/workspace/Lucene-Solr-SmokeRelease-4.x/lucene/build/fakeReleaseTmp/unpack/solr-4.8.0/test.log
> 
> BUILD FAILED
> /usr/home/hudson/hudson-slave/workspace/Lucene-Solr-SmokeRelease-4.x/build.xml:390: exec returned: 1
> 
> Total time: 109 minutes 23 seconds
> Build step 'Invoke Ant' marked build as failure
> Email was triggered for: Failure
> Sending email for trigger: Failure
> 
> 
> 
> ---------------------------------------------------------------------
> To unsubscribe, e-mail: dev-unsubscribe@lucene.apache.org
> For additional commands, e-mail: dev-help@lucene.apache.org


---------------------------------------------------------------------
To unsubscribe, e-mail: dev-unsubscribe@lucene.apache.org
For additional commands, e-mail: dev-help@lucene.apache.org


Mime
View raw message