lucene-dev mailing list archives

Site index · List index
Message view « Date » · « Thread »
Top « Date » · « Thread »
From Policeman Jenkins Server <jenk...@thetaphi.de>
Subject [JENKINS] Lucene-Solr-4.x-Linux (64bit/jdk1.7.0_51) - Build # 9523 - Still Failing!
Date Sat, 01 Mar 2014 01:54:11 GMT
Build: http://jenkins.thetaphi.de/job/Lucene-Solr-4.x-Linux/9523/
Java: 64bit/jdk1.7.0_51 -XX:+UseCompressedOops -XX:+UseG1GC -XX:-UseSuperWord

1 tests failed.
FAILED:  org.apache.solr.client.solrj.impl.CloudSolrServerTest.testShutdown

Error Message:
java.util.concurrent.TimeoutException: Could not connect to ZooKeeper 127.0.0.1:45697 within 30000 ms

Stack Trace:
org.apache.solr.common.SolrException: java.util.concurrent.TimeoutException: Could not connect to ZooKeeper 127.0.0.1:45697 within 30000 ms
	at __randomizedtesting.SeedInfo.seed([84DD5B3869675E3A:67AB52AD8E1DCB48]:0)
	at org.apache.solr.common.cloud.SolrZkClient.<init>(SolrZkClient.java:148)
	at org.apache.solr.common.cloud.SolrZkClient.<init>(SolrZkClient.java:99)
	at org.apache.solr.common.cloud.SolrZkClient.<init>(SolrZkClient.java:94)
	at org.apache.solr.common.cloud.SolrZkClient.<init>(SolrZkClient.java:85)
	at org.apache.solr.cloud.AbstractZkTestCase.buildZooKeeper(AbstractZkTestCase.java:89)
	at org.apache.solr.cloud.AbstractZkTestCase.buildZooKeeper(AbstractZkTestCase.java:83)
	at org.apache.solr.cloud.AbstractDistribZkTestBase.setUp(AbstractDistribZkTestBase.java:70)
	at org.apache.solr.cloud.AbstractFullDistribZkTestBase.setUp(AbstractFullDistribZkTestBase.java:200)
	at org.apache.solr.client.solrj.impl.CloudSolrServerTest.setUp(CloudSolrServerTest.java:78)
	at sun.reflect.NativeMethodAccessorImpl.invoke0(Native Method)
	at sun.reflect.NativeMethodAccessorImpl.invoke(NativeMethodAccessorImpl.java:57)
	at sun.reflect.DelegatingMethodAccessorImpl.invoke(DelegatingMethodAccessorImpl.java:43)
	at java.lang.reflect.Method.invoke(Method.java:606)
	at com.carrotsearch.randomizedtesting.RandomizedRunner.invoke(RandomizedRunner.java:1559)
	at com.carrotsearch.randomizedtesting.RandomizedRunner.access$600(RandomizedRunner.java:79)
	at com.carrotsearch.randomizedtesting.RandomizedRunner$7.evaluate(RandomizedRunner.java:771)
	at com.carrotsearch.randomizedtesting.RandomizedRunner$8.evaluate(RandomizedRunner.java:787)
	at com.carrotsearch.randomizedtesting.rules.SystemPropertiesRestoreRule$1.evaluate(SystemPropertiesRestoreRule.java:53)
	at org.apache.lucene.util.TestRuleSetupTeardownChained$1.evaluate(TestRuleSetupTeardownChained.java:50)
	at org.apache.lucene.util.TestRuleFieldCacheSanity$1.evaluate(TestRuleFieldCacheSanity.java:51)
	at org.apache.lucene.util.AbstractBeforeAfterRule$1.evaluate(AbstractBeforeAfterRule.java:46)
	at com.carrotsearch.randomizedtesting.rules.SystemPropertiesInvariantRule$1.evaluate(SystemPropertiesInvariantRule.java:55)
	at org.apache.lucene.util.TestRuleThreadAndTestName$1.evaluate(TestRuleThreadAndTestName.java:49)
	at org.apache.lucene.util.TestRuleIgnoreAfterMaxFailures$1.evaluate(TestRuleIgnoreAfterMaxFailures.java:70)
	at org.apache.lucene.util.TestRuleMarkFailure$1.evaluate(TestRuleMarkFailure.java:48)
	at com.carrotsearch.randomizedtesting.rules.StatementAdapter.evaluate(StatementAdapter.java:36)
	at com.carrotsearch.randomizedtesting.ThreadLeakControl$StatementRunner.run(ThreadLeakControl.java:358)
	at com.carrotsearch.randomizedtesting.ThreadLeakControl.forkTimeoutingTask(ThreadLeakControl.java:782)
	at com.carrotsearch.randomizedtesting.ThreadLeakControl$3.evaluate(ThreadLeakControl.java:442)
	at com.carrotsearch.randomizedtesting.RandomizedRunner.runSingleTest(RandomizedRunner.java:746)
	at com.carrotsearch.randomizedtesting.RandomizedRunner$3.evaluate(RandomizedRunner.java:648)
	at com.carrotsearch.randomizedtesting.RandomizedRunner$4.evaluate(RandomizedRunner.java:682)
	at com.carrotsearch.randomizedtesting.RandomizedRunner$5.evaluate(RandomizedRunner.java:693)
	at com.carrotsearch.randomizedtesting.rules.StatementAdapter.evaluate(StatementAdapter.java:36)
	at com.carrotsearch.randomizedtesting.rules.SystemPropertiesRestoreRule$1.evaluate(SystemPropertiesRestoreRule.java:53)
	at org.apache.lucene.util.AbstractBeforeAfterRule$1.evaluate(AbstractBeforeAfterRule.java:46)
	at org.apache.lucene.util.TestRuleStoreClassName$1.evaluate(TestRuleStoreClassName.java:42)
	at com.carrotsearch.randomizedtesting.rules.SystemPropertiesInvariantRule$1.evaluate(SystemPropertiesInvariantRule.java:55)
	at com.carrotsearch.randomizedtesting.rules.NoShadowingOrOverridesOnMethodsRule$1.evaluate(NoShadowingOrOverridesOnMethodsRule.java:39)
	at com.carrotsearch.randomizedtesting.rules.NoShadowingOrOverridesOnMethodsRule$1.evaluate(NoShadowingOrOverridesOnMethodsRule.java:39)
	at com.carrotsearch.randomizedtesting.rules.StatementAdapter.evaluate(StatementAdapter.java:36)
	at org.apache.lucene.util.TestRuleAssertionsRequired$1.evaluate(TestRuleAssertionsRequired.java:43)
	at org.apache.lucene.util.TestRuleMarkFailure$1.evaluate(TestRuleMarkFailure.java:48)
	at org.apache.lucene.util.TestRuleIgnoreAfterMaxFailures$1.evaluate(TestRuleIgnoreAfterMaxFailures.java:70)
	at org.apache.lucene.util.TestRuleIgnoreTestSuites$1.evaluate(TestRuleIgnoreTestSuites.java:55)
	at com.carrotsearch.randomizedtesting.rules.StatementAdapter.evaluate(StatementAdapter.java:36)
	at com.carrotsearch.randomizedtesting.ThreadLeakControl$StatementRunner.run(ThreadLeakControl.java:358)
	at java.lang.Thread.run(Thread.java:744)
Caused by: java.util.concurrent.TimeoutException: Could not connect to ZooKeeper 127.0.0.1:45697 within 30000 ms
	at org.apache.solr.common.cloud.ConnectionManager.waitForConnected(ConnectionManager.java:222)
	at org.apache.solr.common.cloud.SolrZkClient.<init>(SolrZkClient.java:140)
	... 47 more




Build Log:
[...truncated 122 lines...]
ERROR: Failed to update http://svn.apache.org/repos/asf/lucene/dev/branches/branch_4x
org.tmatesoft.svn.core.SVNException: svn: E175002: OPTIONS /repos/asf/lucene/dev/branches/branch_4x failed
	at org.tmatesoft.svn.core.internal.io.dav.http.HTTPConnection.request(HTTPConnection.java:388)
	at org.tmatesoft.svn.core.internal.io.dav.http.HTTPConnection.request(HTTPConnection.java:373)
	at org.tmatesoft.svn.core.internal.io.dav.http.HTTPConnection.request(HTTPConnection.java:361)
	at org.tmatesoft.svn.core.internal.io.dav.DAVConnection.performHttpRequest(DAVConnection.java:707)
	at org.tmatesoft.svn.core.internal.io.dav.DAVConnection.exchangeCapabilities(DAVConnection.java:627)
	at org.tmatesoft.svn.core.internal.io.dav.DAVConnection.open(DAVConnection.java:102)
	at org.tmatesoft.svn.core.internal.io.dav.DAVRepository.openConnection(DAVRepository.java:1020)
	at org.tmatesoft.svn.core.internal.io.dav.DAVRepository.getRepositoryUUID(DAVRepository.java:148)
	at org.tmatesoft.svn.core.internal.wc16.SVNBasicDelegate.createRepository(SVNBasicDelegate.java:339)
	at org.tmatesoft.svn.core.internal.wc16.SVNBasicDelegate.createRepository(SVNBasicDelegate.java:328)
	at org.tmatesoft.svn.core.internal.wc16.SVNUpdateClient16.update(SVNUpdateClient16.java:482)
	at org.tmatesoft.svn.core.internal.wc16.SVNUpdateClient16.doUpdate(SVNUpdateClient16.java:364)
	at org.tmatesoft.svn.core.internal.wc16.SVNUpdateClient16.doUpdate(SVNUpdateClient16.java:274)
	at org.tmatesoft.svn.core.internal.wc2.old.SvnOldUpdate.run(SvnOldUpdate.java:27)
	at org.tmatesoft.svn.core.internal.wc2.old.SvnOldUpdate.run(SvnOldUpdate.java:11)
	at org.tmatesoft.svn.core.internal.wc2.SvnOperationRunner.run(SvnOperationRunner.java:20)
	at org.tmatesoft.svn.core.wc2.SvnOperationFactory.run(SvnOperationFactory.java:1238)
	at org.tmatesoft.svn.core.wc2.SvnOperation.run(SvnOperation.java:294)
	at org.tmatesoft.svn.core.wc.SVNUpdateClient.doUpdate(SVNUpdateClient.java:311)
	at org.tmatesoft.svn.core.wc.SVNUpdateClient.doUpdate(SVNUpdateClient.java:291)
	at org.tmatesoft.svn.core.wc.SVNUpdateClient.doUpdate(SVNUpdateClient.java:387)
	at hudson.scm.subversion.UpdateUpdater$TaskImpl.perform(UpdateUpdater.java:157)
	at hudson.scm.subversion.WorkspaceUpdater$UpdateTask.delegateTo(WorkspaceUpdater.java:161)
	at hudson.scm.SubversionSCM$CheckOutTask.perform(SubversionSCM.java:1029)
	at hudson.scm.SubversionSCM$CheckOutTask.invoke(SubversionSCM.java:1010)
	at hudson.scm.SubversionSCM$CheckOutTask.invoke(SubversionSCM.java:986)
	at hudson.FilePath.act(FilePath.java:914)
	at hudson.FilePath.act(FilePath.java:887)
	at hudson.scm.SubversionSCM.checkout(SubversionSCM.java:935)
	at hudson.scm.SubversionSCM.checkout(SubversionSCM.java:870)
	at hudson.model.AbstractProject.checkout(AbstractProject.java:1411)
	at hudson.model.AbstractBuild$AbstractBuildExecution.defaultCheckout(AbstractBuild.java:671)
	at jenkins.scm.SCMCheckoutStrategy.checkout(SCMCheckoutStrategy.java:88)
	at hudson.model.AbstractBuild$AbstractBuildExecution.run(AbstractBuild.java:580)
	at hudson.model.Run.execute(Run.java:1670)
	at hudson.model.FreeStyleBuild.run(FreeStyleBuild.java:46)
	at hudson.model.ResourceController.execute(ResourceController.java:88)
	at hudson.model.Executor.run(Executor.java:231)
Caused by: svn: E175002: OPTIONS /repos/asf/lucene/dev/branches/branch_4x failed
	at org.tmatesoft.svn.core.SVNErrorMessage.create(SVNErrorMessage.java:208)
	at org.tmatesoft.svn.core.SVNErrorMessage.create(SVNErrorMessage.java:154)
	at org.tmatesoft.svn.core.SVNErrorMessage.create(SVNErrorMessage.java:97)
	... 38 more
Caused by: org.tmatesoft.svn.core.SVNException: svn: E175002: OPTIONS request failed on '/repos/asf/lucene/dev/branches/branch_4x'
svn: E175002: unknown host
	at org.tmatesoft.svn.core.internal.wc.SVNErrorManager.error(SVNErrorManager.java:64)
	at org.tmatesoft.svn.core.internal.wc.SVNErrorManager.error(SVNErrorManager.java:51)
	at org.tmatesoft.svn.core.internal.io.dav.http.HTTPConnection._request(HTTPConnection.java:777)
	at org.tmatesoft.svn.core.internal.io.dav.http.HTTPConnection.request(HTTPConnection.java:382)
	... 37 more
Caused by: svn: E175002: OPTIONS request failed on '/repos/asf/lucene/dev/branches/branch_4x'
	at org.tmatesoft.svn.core.SVNErrorMessage.create(SVNErrorMessage.java:208)
	at org.tmatesoft.svn.core.internal.io.dav.http.HTTPConnection._request(HTTPConnection.java:775)
	... 38 more
Caused by: svn: E175002: unknown host
	at org.tmatesoft.svn.core.SVNErrorMessage.create(SVNErrorMessage.java:208)
	at org.tmatesoft.svn.core.internal.io.dav.http.HTTPConnection._request(HTTPConnection.java:517)
	... 38 more
Caused by: java.net.UnknownHostException: svn.apache.org: Name or service not known
	at java.net.Inet6AddressImpl.lookupAllHostAddr(Native Method)
	at java.net.InetAddress$1.lookupAllHostAddr(InetAddress.java:901)
	at java.net.InetAddress.getAddressesFromNameService(InetAddress.java:1293)
	at java.net.InetAddress.getAllByName0(InetAddress.java:1246)
	at java.net.InetAddress.getAllByName(InetAddress.java:1162)
	at java.net.InetAddress.getAllByName(InetAddress.java:1098)
	at java.net.InetAddress.getByName(InetAddress.java:1048)
	at org.tmatesoft.svn.core.internal.util.SVNSocketFactory.createAddres(SVNSocketFactory.java:189)
	at org.tmatesoft.svn.core.internal.util.SVNSocketFactory.createPlainSocket(SVNSocketFactory.java:66)
	at org.tmatesoft.svn.core.internal.io.dav.http.HTTPConnection.connect(HTTPConnection.java:280)
	at org.tmatesoft.svn.core.internal.io.dav.http.HTTPConnection._request(HTTPConnection.java:451)
	... 38 more
ERROR: Subversion update failed
java.io.IOException
	at hudson.scm.subversion.UpdateUpdater$TaskImpl.perform(UpdateUpdater.java:207)
	at hudson.scm.subversion.WorkspaceUpdater$UpdateTask.delegateTo(WorkspaceUpdater.java:161)
	at hudson.scm.SubversionSCM$CheckOutTask.perform(SubversionSCM.java:1029)
	at hudson.scm.SubversionSCM$CheckOutTask.invoke(SubversionSCM.java:1010)
	at hudson.scm.SubversionSCM$CheckOutTask.invoke(SubversionSCM.java:986)
	at hudson.FilePath.act(FilePath.java:914)
	at hudson.FilePath.act(FilePath.java:887)
	at hudson.scm.SubversionSCM.checkout(SubversionSCM.java:935)
	at hudson.scm.SubversionSCM.checkout(SubversionSCM.java:870)
	at hudson.model.AbstractProject.checkout(AbstractProject.java:1411)
	at hudson.model.AbstractBuild$AbstractBuildExecution.defaultCheckout(AbstractBuild.java:671)
	at jenkins.scm.SCMCheckoutStrategy.checkout(SCMCheckoutStrategy.java:88)
	at hudson.model.AbstractBuild$AbstractBuildExecution.run(AbstractBuild.java:580)
	at hudson.model.Run.execute(Run.java:1670)
	at hudson.model.FreeStyleBuild.run(FreeStyleBuild.java:46)
	at hudson.model.ResourceController.execute(ResourceController.java:88)
	at hudson.model.Executor.run(Executor.java:231)
Caused by: hudson.scm.subversion.UpdaterException: failed to perform svn update
	... 17 more
Caused by: org.tmatesoft.svn.core.SVNException: svn: E175002: OPTIONS /repos/asf/lucene/dev/branches/branch_4x failed
	at org.tmatesoft.svn.core.internal.io.dav.http.HTTPConnection.request(HTTPConnection.java:388)
	at org.tmatesoft.svn.core.internal.io.dav.http.HTTPConnection.request(HTTPConnection.java:373)
	at org.tmatesoft.svn.core.internal.io.dav.http.HTTPConnection.request(HTTPConnection.java:361)
	at org.tmatesoft.svn.core.internal.io.dav.DAVConnection.performHttpRequest(DAVConnection.java:707)
	at org.tmatesoft.svn.core.internal.io.dav.DAVConnection.exchangeCapabilities(DAVConnection.java:627)
	at org.tmatesoft.svn.core.internal.io.dav.DAVConnection.open(DAVConnection.java:102)
	at org.tmatesoft.svn.core.internal.io.dav.DAVRepository.openConnection(DAVRepository.java:1020)
	at org.tmatesoft.svn.core.internal.io.dav.DAVRepository.getRepositoryUUID(DAVRepository.java:148)
	at org.tmatesoft.svn.core.internal.wc16.SVNBasicDelegate.createRepository(SVNBasicDelegate.java:339)
	at org.tmatesoft.svn.core.internal.wc16.SVNBasicDelegate.createRepository(SVNBasicDelegate.java:328)
	at org.tmatesoft.svn.core.internal.wc16.SVNUpdateClient16.update(SVNUpdateClient16.java:482)
	at org.tmatesoft.svn.core.internal.wc16.SVNUpdateClient16.doUpdate(SVNUpdateClient16.java:364)
	at org.tmatesoft.svn.core.internal.wc16.SVNUpdateClient16.doUpdate(SVNUpdateClient16.java:274)
	at org.tmatesoft.svn.core.internal.wc2.old.SvnOldUpdate.run(SvnOldUpdate.java:27)
	at org.tmatesoft.svn.core.internal.wc2.old.SvnOldUpdate.run(SvnOldUpdate.java:11)
	at org.tmatesoft.svn.core.internal.wc2.SvnOperationRunner.run(SvnOperationRunner.java:20)
	at org.tmatesoft.svn.core.wc2.SvnOperationFactory.run(SvnOperationFactory.java:1238)
	at org.tmatesoft.svn.core.wc2.SvnOperation.run(SvnOperation.java:294)
	at org.tmatesoft.svn.core.wc.SVNUpdateClient.doUpdate(SVNUpdateClient.java:311)
	at org.tmatesoft.svn.core.wc.SVNUpdateClient.doUpdate(SVNUpdateClient.java:291)
	at org.tmatesoft.svn.core.wc.SVNUpdateClient.doUpdate(SVNUpdateClient.java:387)
	at hudson.scm.subversion.UpdateUpdater$TaskImpl.perform(UpdateUpdater.java:157)
	... 16 more
Caused by: svn: E175002: OPTIONS /repos/asf/lucene/dev/branches/branch_4x failed
	at org.tmatesoft.svn.core.SVNErrorMessage.create(SVNErrorMessage.java:208)
	at org.tmatesoft.svn.core.SVNErrorMessage.create(SVNErrorMessage.java:154)
	at org.tmatesoft.svn.core.SVNErrorMessage.create(SVNErrorMessage.java:97)
	... 38 more
Caused by: org.tmatesoft.svn.core.SVNException: svn: E175002: OPTIONS request failed on '/repos/asf/lucene/dev/branches/branch_4x'
svn: E175002: unknown host
	at org.tmatesoft.svn.core.internal.wc.SVNErrorManager.error(SVNErrorManager.java:64)
	at org.tmatesoft.svn.core.internal.wc.SVNErrorManager.error(SVNErrorManager.java:51)
	at org.tmatesoft.svn.core.internal.io.dav.http.HTTPConnection._request(HTTPConnection.java:777)
	at org.tmatesoft.svn.core.internal.io.dav.http.HTTPConnection.request(HTTPConnection.java:382)
	... 37 more
Caused by: svn: E175002: OPTIONS request failed on '/repos/asf/lucene/dev/branches/branch_4x'
	at org.tmatesoft.svn.core.SVNErrorMessage.create(SVNErrorMessage.java:208)
	at org.tmatesoft.svn.core.internal.io.dav.http.HTTPConnection._request(HTTPConnection.java:775)
	... 38 more
Caused by: svn: E175002: unknown host
	at org.tmatesoft.svn.core.SVNErrorMessage.create(SVNErrorMessage.java:208)
	at org.tmatesoft.svn.core.internal.io.dav.http.HTTPConnection._request(HTTPConnection.java:517)
	... 38 more
Caused by: java.net.UnknownHostException: svn.apache.org: Name or service not known
	at java.net.Inet6AddressImpl.lookupAllHostAddr(Native Method)
	at java.net.InetAddress$1.lookupAllHostAddr(InetAddress.java:901)
	at java.net.InetAddress.getAddressesFromNameService(InetAddress.java:1293)
	at java.net.InetAddress.getAllByName0(InetAddress.java:1246)
	at java.net.InetAddress.getAllByName(InetAddress.java:1162)
	at java.net.InetAddress.getAllByName(InetAddress.java:1098)
	at java.net.InetAddress.getByName(InetAddress.java:1048)
	at org.tmatesoft.svn.core.internal.util.SVNSocketFactory.createAddres(SVNSocketFactory.java:189)
	at org.tmatesoft.svn.core.internal.util.SVNSocketFactory.createPlainSocket(SVNSocketFactory.java:66)
	at org.tmatesoft.svn.core.internal.io.dav.http.HTTPConnection.connect(HTTPConnection.java:280)
	at org.tmatesoft.svn.core.internal.io.dav.http.HTTPConnection._request(HTTPConnection.java:451)
	... 38 more
Retrying after 10 seconds
Cleaning up /var/lib/jenkins/workspace/Lucene-Solr-4.x-Linux/.
Updating http://svn.apache.org/repos/asf/lucene/dev/branches/branch_4x at revision '2014-03-01T01:01:35.493 +0000'
At revision 1573118
no change for http://svn.apache.org/repos/asf/lucene/dev/branches/branch_4x since the previous build
No emails were triggered.
[Lucene-Solr-4.x-Linux] $ /bin/sh -xe /tmp/hudson7189631583051661152.sh
+ echo Using JDK: 64bit/jdk1.7.0_51 -XX:+UseCompressedOops -XX:+UseG1GC -XX:-UseSuperWord
Using JDK: 64bit/jdk1.7.0_51 -XX:+UseCompressedOops -XX:+UseG1GC -XX:-UseSuperWord
+ /var/lib/jenkins/tools/java/64bit/jdk1.7.0_51/bin/java -XX:+UseCompressedOops -XX:+UseG1GC -XX:-UseSuperWord -version
java version "1.7.0_51"
Java(TM) SE Runtime Environment (build 1.7.0_51-b13)
Java HotSpot(TM) 64-Bit Server VM (build 24.51-b03, mixed mode)
[Lucene-Solr-4.x-Linux] $ /var/lib/jenkins/tools/hudson.tasks.Ant_AntInstallation/ANT_1.8.2/bin/ant "-Dargs=-XX:+UseCompressedOops -XX:+UseG1GC -XX:-UseSuperWord" -Dtests.disableHdfs=true -Dtests.multiplier=3 -Dtests.jvms=2 jenkins-hourly
Buildfile: /mnt/ssd/jenkins/workspace/Lucene-Solr-4.x-Linux/build.xml

jenkins-hourly:

clean:

clean:
     [echo] Building solr...

clean:

-test-with-heapdumps-enabled:
     [echo] Java HotSpot(TM) 64-Bit Server VM: Enabling heap dumps on OutOfMemoryError to dir '/mnt/ssd/jenkins/workspace/Lucene-Solr-4.x-Linux/heapdumps'.
    [mkdir] Created dir: /mnt/ssd/jenkins/workspace/Lucene-Solr-4.x-Linux/heapdumps

test:

-run-test:
    [mkdir] Created dir: /mnt/ssd/jenkins/workspace/Lucene-Solr-4.x-Linux/lucene/build

ivy-availability-check:

ivy-fail:

ivy-configure:
[ivy:configure] :: Apache Ivy 2.3.0 - 20130110142753 :: http://ant.apache.org/ivy/ ::
[ivy:configure] :: loading settings :: file = /mnt/ssd/jenkins/workspace/Lucene-Solr-4.x-Linux/lucene/ivy-settings.xml

-clover.load:

resolve-groovy:
[ivy:cachepath] :: resolving dependencies :: org.codehaus.groovy#groovy-all-caller;working
[ivy:cachepath] 	confs: [default]
[ivy:cachepath] 	found org.codehaus.groovy#groovy-all;2.2.1 in public
[ivy:cachepath] :: resolution report :: resolve 170ms :: artifacts dl 3ms
	---------------------------------------------------------------------
	|                  |            modules            ||   artifacts   |
	|       conf       | number| search|dwnlded|evicted|| number|dwnlded|
	---------------------------------------------------------------------
	|      default     |   1   |   0   |   0   |   0   ||   1   |   0   |
	---------------------------------------------------------------------

-init-totals:

test-core:

-clover.disable:

ivy-availability-check:

ivy-fail:

ivy-configure:
[ivy:configure] :: loading settings :: file = /mnt/ssd/jenkins/workspace/Lucene-Solr-4.x-Linux/lucene/ivy-settings.xml

-clover.load:

-clover.classpath:

-clover.setup:

clover:

resolve:

init:

compile-core:
    [mkdir] Created dir: /mnt/ssd/jenkins/workspace/Lucene-Solr-4.x-Linux/lucene/build/core/classes/java
    [javac] Compiling 710 source files to /mnt/ssd/jenkins/workspace/Lucene-Solr-4.x-Linux/lucene/build/core/classes/java
    [javac] /mnt/ssd/jenkins/workspace/Lucene-Solr-4.x-Linux/lucene/core/src/java/org/apache/lucene/util/PriorityQueue.java:65: warning: [unchecked] unchecked cast
    [javac]     heap = (T[]) new Object[heapSize]; // T is unbounded type, so this unchecked cast works always
    [javac]                  ^
    [javac]   required: T[]
    [javac]   found:    Object[]
    [javac]   where T is a type-variable:
    [javac]     T extends Object declared in class PriorityQueue
    [javac] Note: Some input files use or override a deprecated API.
    [javac] Note: Recompile with -Xlint:deprecation for details.
    [javac] 1 warning
     [copy] Copying 3 files to /mnt/ssd/jenkins/workspace/Lucene-Solr-4.x-Linux/lucene/build/core/classes/java

compile-test-framework:

ivy-availability-check:

ivy-fail:

ivy-configure:
[ivy:configure] :: loading settings :: file = /mnt/ssd/jenkins/workspace/Lucene-Solr-4.x-Linux/lucene/ivy-settings.xml

resolve:

init:

compile-lucene-core:

ivy-availability-check:

ivy-fail:

ivy-configure:
[ivy:configure] :: loading settings :: file = /mnt/ssd/jenkins/workspace/Lucene-Solr-4.x-Linux/lucene/ivy-settings.xml

resolve:

init:

-clover.disable:

-clover.load:

-clover.classpath:

-clover.setup:

clover:

compile-core:

compile-codecs:
     [echo] Building codecs...

ivy-availability-check:
     [echo] Building codecs...

ivy-fail:

ivy-configure:
[ivy:configure] :: loading settings :: file = /mnt/ssd/jenkins/workspace/Lucene-Solr-4.x-Linux/lucene/ivy-settings.xml

resolve:

common.init:

compile-lucene-core:

init:

-clover.disable:

-clover.load:

-clover.classpath:

-clover.setup:

clover:

compile-core:
    [mkdir] Created dir: /mnt/ssd/jenkins/workspace/Lucene-Solr-4.x-Linux/lucene/build/codecs/classes/java
    [javac] Compiling 74 source files to /mnt/ssd/jenkins/workspace/Lucene-Solr-4.x-Linux/lucene/build/codecs/classes/java
    [javac] Note: Some input files use or override a deprecated API.
    [javac] Note: Recompile with -Xlint:deprecation for details.
     [copy] Copying 3 files to /mnt/ssd/jenkins/workspace/Lucene-Solr-4.x-Linux/lucene/build/codecs/classes/java

-clover.disable:

-clover.load:

-clover.classpath:

-clover.setup:

clover:

common.compile-core:
    [mkdir] Created dir: /mnt/ssd/jenkins/workspace/Lucene-Solr-4.x-Linux/lucene/build/test-framework/classes/java
    [javac] Compiling 145 source files to /mnt/ssd/jenkins/workspace/Lucene-Solr-4.x-Linux/lucene/build/test-framework/classes/java
    [javac] Note: Some input files use or override a deprecated API.
    [javac] Note: Recompile with -Xlint:deprecation for details.
     [copy] Copying 4 files to /mnt/ssd/jenkins/workspace/Lucene-Solr-4.x-Linux/lucene/build/test-framework/classes/java

compile-core:

compile-test:
    [mkdir] Created dir: /mnt/ssd/jenkins/workspace/Lucene-Solr-4.x-Linux/lucene/build/core/classes/test
    [javac] Compiling 401 source files to /mnt/ssd/jenkins/workspace/Lucene-Solr-4.x-Linux/lucene/build/core/classes/test
    [javac] Note: Some input files use or override a deprecated API.
    [javac] Note: Recompile with -Xlint:deprecation for details.
     [copy] Copying 42 files to /mnt/ssd/jenkins/workspace/Lucene-Solr-4.x-Linux/lucene/build/core/classes/test

install-junit4-taskdef:

validate:

resolve-groovy:

-init-totals:

-test:
    [mkdir] Created dir: /mnt/ssd/jenkins/workspace/Lucene-Solr-4.x-Linux/lucene/build/core/test
    [mkdir] Created dir: /mnt/ssd/jenkins/workspace/Lucene-Solr-4.x-Linux/lucene/build/core/test/temp
    [mkdir] Created dir: /mnt/ssd/jenkins/workspace/Lucene-Solr-4.x-Linux/.caches/test-stats/core
   [junit4] <JUnit4> says salut! Master seed: 443FE98E844B5D4D
   [junit4] Executing 385 suites with 2 JVMs.
   [junit4] 
   [junit4] Started J0 PID(12284@serv1.sd-datasolutions.de).
   [junit4] Started J1 PID(12282@serv1.sd-datasolutions.de).
   [junit4] Suite: org.apache.lucene.search.TestDocIdSet
   [junit4] Completed on J0 in 1.09s, 3 tests
   [junit4] 
   [junit4] Suite: org.apache.lucene.util.TestFilterIterator
   [junit4] Completed on J0 in 0.12s, 8 tests
   [junit4] 
   [junit4] Suite: org.apache.lucene.util.automaton.TestDeterminizeLexicon
   [junit4] Completed on J0 in 4.61s, 1 test
   [junit4] 
   [junit4] Suite: org.apache.lucene.search.TestFieldCacheRewriteMethod
   [junit4] Completed on J0 in 5.15s, 2 tests
   [junit4] 
   [junit4] Suite: org.apache.lucene.index.TestTieredMergePolicy
   [junit4] Completed on J1 in 12.47s, 5 tests
   [junit4] 
   [junit4] Suite: org.apache.lucene.store.TestLockFactory
   [junit4] IGNOR/A 0.11s J0 | TestLockFactory.testStressLocks
   [junit4]    > Assumption #1: 'nightly' test group is disabled (@Nightly)
   [junit4] IGNOR/A 0.01s J0 | TestLockFactory.testStressLocksNativeFSLockFactory
   [junit4]    > Assumption #1: 'nightly' test group is disabled (@Nightly)
   [junit4] Completed on J0 in 1.52s, 11 tests, 2 skipped
   [junit4] 
   [junit4] Suite: org.apache.lucene.util.TestIndexableBinaryStringTools
   [junit4] Completed on J0 in 1.07s, 5 tests
   [junit4] 
   [junit4] Suite: org.apache.lucene.index.TestRollback
   [junit4] Completed on J0 in 0.05s, 1 test
   [junit4] 
   [junit4] Suite: org.apache.lucene.store.TestRateLimiter
   [junit4] Completed on J1 in 1.30s, 1 test
   [junit4] 
   [junit4] Suite: org.apache.lucene.index.TestDocumentsWriterDeleteQueue
   [junit4] Completed on J0 in 0.66s, 5 tests
   [junit4] 
   [junit4] Suite: org.apache.lucene.document.TestDateTools
   [junit4] Completed on J0 in 0.08s, 5 tests
   [junit4] 
   [junit4] Suite: org.apache.lucene.search.TestShardSearching
   [junit4] Completed on J0 in 15.95s, 1 test
   [junit4] 
   [junit4] Suite: org.apache.lucene.search.spans.TestSpanMultiTermQueryWrapper
   [junit4] Completed on J0 in 0.46s, 8 tests
   [junit4] 
   [junit4] Suite: org.apache.lucene.search.TestScorerPerf
   [junit4] Completed on J0 in 24.95s, 1 test
   [junit4] 
   [junit4] Suite: org.apache.lucene.search.TestTimeLimitingCollector
   [junit4] Completed on J0 in 5.42s, 6 tests
   [junit4] 
   [junit4] Suite: org.apache.lucene.index.TestSegmentReader
   [junit4] Completed on J0 in 1.29s, 7 tests
   [junit4] 
   [junit4] Suite: org.apache.lucene.search.TestRegexpQuery
   [junit4] Completed on J0 in 0.25s, 7 tests
   [junit4] 
   [junit4] Suite: org.apache.lucene.search.TestFilteredQuery
   [junit4] Completed on J0 in 0.93s, 12 tests
   [junit4] 
   [junit4] Suite: org.apache.lucene.index.TestIndexableField
   [junit4] Completed on J0 in 1.91s, 1 test
   [junit4] 
   [junit4] Suite: org.apache.lucene.search.TestExplanations
   [junit4] Completed on J0 in 0.09s, 1 test
   [junit4] 
   [junit4] Suite: org.apache.lucene.codecs.perfield.TestPerFieldDocValuesFormat
   [junit4] IGNOR/A 0.07s J1 | TestPerFieldDocValuesFormat.testHugeBinaryValueLimit
   [junit4]    > Assumption #1: test requires codec with limits on max binary field length
   [junit4] Completed on J1 in 54.08s, 79 tests, 1 skipped
   [junit4] 
   [junit4] Suite: org.apache.lucene.index.TestDirectoryReader
   [junit4] Completed on J0 in 2.37s, 27 tests
   [junit4] 
   [junit4] Suite: org.apache.lucene.util.TestMathUtil
   [junit4] Completed on J0 in 0.06s, 5 tests
   [junit4] 
   [junit4] Suite: org.apache.lucene.index.TestBagOfPostings
   [junit4] Completed on J1 in 3.95s, 1 test
   [junit4] 
   [junit4] Suite: org.apache.lucene.util.packed.TestEliasFanoSequence
   [junit4] Completed on J0 in 4.15s, 24 tests
   [junit4] 
   [junit4] Suite: org.apache.lucene.search.TestBooleanQuery
   [junit4] Completed on J1 in 0.60s, 6 tests
   [junit4] 
   [junit4] Suite: org.apache.lucene.store.TestByteArrayDataInput
   [junit4] Completed on J1 in 0.03s, 1 test
   [junit4] 
   [junit4] Suite: org.apache.lucene.search.TestDisjunctionMaxQuery
   [junit4] Completed on J0 in 1.03s, 11 tests
   [junit4] 
   [junit4] Suite: org.apache.lucene.index.TestTransactions
   [junit4] Completed on J1 in 2.17s, 1 test
   [junit4] 
   [junit4] Suite: org.apache.lucene.index.TestIndexInput
   [junit4] Completed on J1 in 1.17s, 3 tests
   [junit4] 
   [junit4] Suite: org.apache.lucene.util.automaton.TestLevenshteinAutomata
   [junit4] Completed on J1 in 2.53s, 4 tests
   [junit4] 
   [junit4] Suite: org.apache.lucene.codecs.lucene41.TestBlockPostingsFormat
   [junit4] Completed on J1 in 2.65s, 7 tests
   [junit4] 
   [junit4] Suite: org.apache.lucene.TestWorstCaseTestBehavior
   [junit4] Completed on J1 in 0.03s, 6 tests, 6 skipped
   [junit4] 
   [junit4] Suite: org.apache.lucene.util.TestRollingBuffer
   [junit4] Completed on J1 in 0.53s, 1 test
   [junit4] 
   [junit4] Suite: org.apache.lucene.index.TestNoMergePolicy
   [junit4] Completed on J1 in 0.05s, 4 tests
   [junit4] 
   [junit4] Suite: org.apache.lucene.index.TestSameTokenSamePosition
   [junit4] Completed on J1 in 0.12s, 2 tests
   [junit4] 
   [junit4] Suite: org.apache.lucene.util.TestNamedSPILoader
   [junit4] Completed on J1 in 0.03s, 3 tests
   [junit4] 
   [junit4] Suite: org.apache.lucene.search.TestLiveFieldValues
   [junit4] Completed on J1 in 4.18s, 1 test
   [junit4] 
   [junit4] Suite: org.apache.lucene.analysis.TestToken
   [junit4] Completed on J1 in 1.03s, 10 tests
   [junit4] 
   [junit4] Suite: org.apache.lucene.index.TestLazyProxSkipping
   [junit4] Completed on J1 in 0.71s, 2 tests
   [junit4] 
   [junit4] Suite: org.apache.lucene.index.TestDocsAndPositions
   [junit4] Completed on J1 in 2.12s, 6 tests
   [junit4] 
   [junit4] Suite: org.apache.lucene.util.TestTimSorter
   [junit4] Completed on J1 in 0.57s, 9 tests
   [junit4] 
   [junit4] Suite: org.apache.lucene.search.TestMultiTermConstantScore
   [junit4] Completed on J1 in 1.03s, 8 tests
   [junit4] 
   [junit4] Suite: org.apache.lucene.search.TestSearchWithThreads
   [junit4] Completed on J1 in 5.74s, 1 test
   [junit4] 
   [junit4] Suite: org.apache.lucene.search.TestCachingWrapperFilter
   [junit4] Completed on J1 in 0.64s, 11 tests
   [junit4] 
   [junit4] Suite: org.apache.lucene.codecs.lucene40.TestLucene40StoredFieldsFormat
   [junit4] IGNOR/A 0.01s J1 | TestLucene40StoredFieldsFormat.testBigDocuments
   [junit4]    > Assumption #1: 'nightly' test group is disabled (@Nightly)
   [junit4] Completed on J1 in 4.50s, 10 tests, 1 skipped
   [junit4] 
   [junit4] Suite: org.apache.lucene.util.TestBroadWord
   [junit4] Completed on J1 in 0.50s, 11 tests
   [junit4] 
   [junit4] Suite: org.apache.lucene.codecs.lucene42.TestLucene42DocValuesFormat
   [junit4] IGNOR/A 0.01s J0 | TestLucene42DocValuesFormat.testThreeNumbersOneMissingWithMerging
   [junit4]    > Assumption #1: Codec does not support getDocsWithField
   [junit4] IGNOR/A 0.01s J0 | TestLucene42DocValuesFormat.testTwoNumbersOneMissing
   [junit4]    > Assumption #1: Codec does not support getDocsWithField
   [junit4] IGNOR/A 0.01s J0 | TestLucene42DocValuesFormat.testThreads2
   [junit4]    > Assumption #1: Codec does not support getDocsWithField
   [junit4] IGNOR/A 0.01s J0 | TestLucene42DocValuesFormat.testTwoBytesOneMissingWithMerging
   [junit4]    > Assumption #1: Codec does not support getDocsWithField
   [junit4] IGNOR/A 0.01s J0 | TestLucene42DocValuesFormat.testThreeBytesOneMissingWithMerging
   [junit4]    > Assumption #1: Codec does not support getDocsWithField
   [junit4] IGNOR/A 0.01s J0 | TestLucene42DocValuesFormat.testLongMissingVsFieldCache
   [junit4]    > Assumption #1: Codec does not support getDocsWithField
   [junit4] IGNOR/A 0.01s J0 | TestLucene42DocValuesFormat.testTwoNumbersOneMissingWithMerging
   [junit4]    > Assumption #1: Codec does not support getDocsWithField
   [junit4] IGNOR/A 0.01s J0 | TestLucene42DocValuesFormat.testShortMissingVsFieldCache
   [junit4]    > Assumption #1: Codec does not support getDocsWithField
   [junit4] IGNOR/A 0.01s J0 | TestLucene42DocValuesFormat.testTwoBytesOneMissing
   [junit4]    > Assumption #1: Codec does not support getDocsWithField
   [junit4] IGNOR/A 0.01s J0 | TestLucene42DocValuesFormat.testByteMissingVsFieldCache
   [junit4]    > Assumption #1: Codec does not support getDocsWithField
   [junit4] IGNOR/A 0.01s J0 | TestLucene42DocValuesFormat.testIntMissingVsFieldCache
   [junit4]    > Assumption #1: Codec does not support getDocsWithField
   [junit4] Completed on J0 in 35.74s, 81 tests, 11 skipped
   [junit4] 
   [junit4] Suite: org.apache.lucene.search.TestCustomSearcherSort
   [junit4] Completed on J0 in 2.23s, 2 tests
   [junit4] 
   [junit4] Suite: org.apache.lucene.util.automaton.TestUTF32ToUTF8
   [junit4] Completed on J0 in 4.11s, 5 tests
   [junit4] 
   [junit4] Suite: org.apache.lucene.index.TestNoDeletionPolicy
   [junit4] Completed on J0 in 0.17s, 4 tests
   [junit4] 
   [junit4] Suite: org.apache.lucene.codecs.lucene45.TestLucene45DocValuesFormat
   [junit4] IGNOR/A 0.01s J1 | TestLucene45DocValuesFormat.testHugeBinaryValueLimit
   [junit4]    > Assumption #1: test requires codec with limits on max binary field length
   [junit4] Completed on J1 in 23.06s, 81 tests, 1 skipped
   [junit4] 
   [junit4] Suite: org.apache.lucene.search.spans.TestSpans
   [junit4] Completed on J1 in 0.61s, 26 tests
   [junit4] 
   [junit4] Suite: org.apache.lucene.util.TestFixedBitSet
   [junit4] Completed on J0 in 13.13s, 11 tests
   [junit4] 
   [junit4] Suite: org.apache.lucene.util.automaton.TestMinimize
   [junit4] Completed on J1 in 2.29s, 3 tests
   [junit4] 
   [junit4] Suite: org.apache.lucene.search.TestFieldValueFilter
   [junit4] Completed on J1 in 0.05s, 2 tests
   [junit4] 
   [junit4] Suite: org.apache.lucene.search.TestAutomatonQueryUnicode
   [junit4] Completed on J0 in 0.02s, 1 test
   [junit4] 
   [junit4] Suite: org.apache.lucene.search.TestFieldCacheRangeFilter
   [junit4] Completed on J0 in 0.83s, 9 tests
   [junit4] 
   [junit4] Suite: org.apache.lucene.search.TestSubScorerFreqs
   [junit4] Completed on J0 in 0.14s, 3 tests
   [junit4] 
   [junit4] Suite: org.apache.lucene.index.TestDuelingCodecs
   [junit4] Completed on J1 in 11.53s, 1 test
   [junit4] 
   [junit4] Suite: org.apache.lucene.index.TestParallelCompositeReader
   [junit4] Completed on J1 in 0.82s, 13 tests
   [junit4] 
   [junit4] Suite: org.apache.lucene.index.TestPerSegmentDeletes
   [junit4] Completed on J1 in 0.06s, 1 test
   [junit4] 
   [junit4] Suite: org.apache.lucene.analysis.TestCachingTokenFilter
   [junit4] Completed on J1 in 0.03s, 1 test
   [junit4] 
   [junit4] Suite: org.apache.lucene.util.TestRamUsageEstimatorOnWildAnimals
   [junit4] Completed on J1 in 0.65s, 1 test
   [junit4] 
   [junit4] Suite: org.apache.lucene.search.TestTermVectors
   [junit4] Completed on J1 in 0.21s, 4 tests
   [junit4] 
   [junit4] Suite: org.apache.lucene.util.TestCollectionUtil
   [junit4] Completed on J1 in 9.68s, 4 tests
   [junit4] 
   [junit4] Suite: org.apache.lucene.util.TestSloppyMath
   [junit4] Completed on J1 in 0.14s, 3 tests
   [junit4] 
   [junit4] Suite: org.apache.lucene.document.TestDocument
   [junit4] Completed on J1 in 0.20s, 11 tests
   [junit4] 
   [junit4] Suite: org.apache.lucene.search.TestMatchAllDocsQuery
   [junit4] Completed on J1 in 0.04s, 2 tests
   [junit4] 
   [junit4] Suite: org.apache.lucene.util.TestAttributeSource
   [junit4] Completed on J1 in 0.04s, 5 tests
   [junit4] 
   [junit4] Suite: org.apache.lucene.util.TestRecyclingIntBlockAllocator
   [junit4] Completed on J1 in 0.08s, 3 tests
   [junit4] 
   [junit4] Suite: org.apache.lucene.util.TestIOUtils
   [junit4] Completed on J1 in 0.02s, 1 test
   [junit4] 
   [junit4] Suite: org.apache.lucene.index.TestLongPostings
   [junit4] Completed on J1 in 3.13s, 2 tests
   [junit4] 
   [junit4] Suite: org.apache.lucene.index.TestAddIndexes
   [junit4] Completed on J1 in 3.32s, 23 tests
   [junit4] 
   [junit4] Suite: org.apache.lucene.index.TestIndexWriterMergePolicy
   [junit4] Completed on J1 in 3.47s, 7 tests
   [junit4] 
   [junit4] Suite: org.apache.lucene.index.TestBinaryTerms
   [junit4] Completed on J1 in 0.13s, 2 tests
   [junit4] 
   [junit4] Suite: org.apache.lucene.search.payloads.TestPayloadExplanations
   [junit4] Completed on J1 in 0.64s, 5 tests
   [junit4] 
   [junit4] Suite: org.apache.lucene.codecs.compressing.TestCompressingTermVectorsFormat
   [junit4] Completed on J0 in 41.19s, 40 tests
   [junit4] 
   [junit4] Suite: org.apache.lucene.codecs.compressing.TestFastCompressionMode
   [junit4] Completed on J0 in 1.15s, 11 tests
   [junit4] 
   [junit4] Suite: org.apache.lucene.search.payloads.TestPayloadTermQuery
   [junit4] Completed on J0 in 0.46s, 6 tests
   [junit4] 
   [junit4] Suite: org.apache.lucene.codecs.compressing.TestFastDecompressionMode
   [junit4] Completed on J0 in 2.41s, 11 tests
   [junit4] 
   [junit4] Suite: org.apache.lucene.index.TestSegmentTermDocs
   [junit4] Completed on J0 in 0.73s, 5 tests
   [junit4] 
   [junit4] Suite: org.apache.lucene.search.TestSameScoresWithThreads
   [junit4] Completed on J0 in 2.01s, 1 test
   [junit4] 
   [junit4] Suite: org.apache.lucene.index.TestPostingsOffsets
   [junit4] Completed on J0 in 2.30s, 11 tests
   [junit4] 
   [junit4] Suite: org.apache.lucene.util.TestPriorityQueue
   [junit4] Completed on J0 in 0.06s, 4 tests
   [junit4] 
   [junit4] Suite: org.apache.lucene.util.TestQueryBuilder
   [junit4] Completed on J0 in 0.10s, 19 tests
   [junit4] 
   [junit4] Suite: org.apache.lucene.index.TestCrashCausesCorruptIndex
   [junit4] Completed on J0 in 0.26s, 1 test
   [junit4] 
   [junit4] Suite: org.apache.lucene.codecs.compressing.TestCompressingStoredFieldsFormat
   [junit4] IGNOR/A 0.01s J1 | TestCompressingStoredFieldsFormat.testBigDocuments {#0 seed=[443FE98E844B5D4D:B515B3D13767F36A]}
   [junit4]    > Assumption #1: 'nightly' test group is disabled (@Nightly)
   [junit4] IGNOR/A 0.01s J1 | TestCompressingStoredFieldsFormat.testBigDocuments {#1 seed=[443FE98E844B5D4D:1430F2D03A53846]}
   [junit4]    > Assumption #1: 'nightly' test group is disabled (@Nightly)
   [junit4] IGNOR/A 0.01s J1 | TestCompressingStoredFieldsFormat.testBigDocuments {#2 seed=[443FE98E844B5D4D:8FAA99F15261708D]}
   [junit4]    > Assumption #1: 'nightly' test group is disabled (@Nightly)
   [junit4] IGNOR/A 0.01s J1 | TestCompressingStoredFieldsFormat.testBigDocuments {#3 seed=[443FE98E844B5D4D:BE4432143E9F2BA4]}
   [junit4]    > Assumption #1: 'nightly' test group is disabled (@Nightly)
   [junit4] IGNOR/A 0.01s J1 | TestCompressingStoredFieldsFormat.testBigDocuments {#4 seed=[443FE98E844B5D4D:F285B7B99F97EB1F]}
   [junit4]    > Assumption #1: 'nightly' test group is disabled (@Nightly)
   [junit4] Completed on J1 in 18.60s, 55 tests, 5 skipped
   [junit4] 
   [junit4] Suite: org.apache.lucene.document.TestBinaryDocument
   [junit4] Completed on J1 in 0.02s, 2 tests
   [junit4] 
   [junit4] Suite: org.apache.lucene.index.TestMixedCodecs
   [junit4] Completed on J1 in 1.62s, 1 test
   [junit4] 
   [junit4] Suite: org.apache.lucene.index.TestIndexWriterUnicode
   [junit4] Completed on J1 in 3.99s, 5 tests
   [junit4] 
   [junit4] Suite: org.apache.lucene.codecs.lucene41.TestBlockPostingsFormat3
   [junit4] Completed on J0 in 7.02s, 1 test
   [junit4] 
   [junit4] Suite: org.apache.lucene.index.TestThreadedForceMerge
   [junit4] Completed on J1 in 0.81s, 1 test
   [junit4] 
   [junit4] Suite: org.apache.lucene.index.TestDirectoryReaderReopen
   [junit4] Completed on J1 in 2.25s, 6 tests
   [junit4] 
   [junit4] Suite: org.apache.lucene.search.TestPositionIncrement
   [junit4] Completed on J1 in 0.11s, 2 tests
   [junit4] 
   [junit4] Suite: org.apache.lucene.store.TestWindowsMMap
   [junit4] Completed on J1 in 0.26s, 1 test
   [junit4] 
   [junit4] Suite: org.apache.lucene.util.TestVersionComparator
   [junit4] Completed on J1 in 0.06s, 1 test
   [junit4] 
   [junit4] Suite: org.apache.lucene.index.TestStressNRT
   [junit4] Completed on J0 in 4.71s, 1 test
   [junit4] 
   [junit4] Suite: org.apache.lucene.util.automaton.TestSpecialOperations
   [junit4] Completed on J0 in 0.17s, 2 tests
   [junit4] 
   [junit4] Suite: org.apache.lucene.index.TestMaxTermFrequency
   [junit4] Completed on J0 in 0.19s, 1 test
   [junit4] 
   [junit4] Suite: org.apache.lucene.index.TestAtomicUpdate
   [junit4] Completed on J1 in 4.58s, 1 test
   [junit4] 
   [junit4] Suite: org.apache.lucene.search.TestTopDocsMerge
   [junit4] Completed on J0 in 19.85s, 1 test
   [junit4] 
   [junit4] Suite: org.apache.lucene.util.packed.TestPackedInts
   [junit4] IGNOR/A 0.00s J1 | TestPackedInts.testBlockReaderOverflow
   [junit4]    > Assumption #1: 'nightly' test group is disabled (@Nightly)
   [junit4] Completed on J1 in 19.30s, 27 tests, 3 skipped
   [junit4] 
   [junit4] Suite: org.apache.lucene.index.TestMultiFields
   [junit4] Completed on J0 in 2.65s, 3 tests
   [junit4] 
   [junit4] Suite: org.apache.lucene.search.TestMultiTermQueryRewrites
   [junit4] Completed on J0 in 0.11s, 3 tests
   [junit4] 
   [junit4] Suite: org.apache.lucene.search.TestSloppyPhraseQuery2
   [junit4] Completed on J1 in 0.98s, 9 tests
   [junit4] 
   [junit4] Suite: org.apache.lucene.index.TestLogMergePolicy
   [junit4] Completed on J1 in 0.02s, 1 test
   [junit4] 
   [junit4] Suite: org.apache.lucene.util.junitcompat.TestSetupTeardownChaining
   [junit4] Completed on J1 in 0.05s, 2 tests
   [junit4] 
   [junit4] Suite: org.apache.lucene.index.TestTerm
   [junit4] Completed on J1 in 0.01s, 1 test
   [junit4] 
   [junit4] Suite: org.apache.lucene.search.TestBooleanScorer
   [junit4] Completed on J1 in 0.03s, 3 tests
   [junit4] 
   [junit4] Suite: org.apache.lucene.util.TestSmallFloat
   [junit4] Completed on J1 in 0.13s, 2 tests
   [junit4] 
   [junit4] Suite: org.apache.lucene.index.TestPersistentSnapshotDeletionPolicy
   [junit4] Completed on J0 in 2.48s, 13 tests
   [junit4] 
   [junit4] Suite: org.apache.lucene.codecs.lucene40.TestLucene40TermVectorsFormat
   [junit4] Completed on J1 in 7.39s, 7 tests
   [junit4] 
   [junit4] Suite: org.apache.lucene.search.TestNGramPhraseQuery
   [junit4] Completed on J1 in 0.02s, 1 test
   [junit4] 
   [junit4] Suite: org.apache.lucene.search.TestDocValuesScoring
   [junit4] Completed on J1 in 0.12s, 1 test
   [junit4] 
   [junit4] Suite: org.apache.lucene.index.TestFieldInfos
   [junit4] Completed on J1 in 0.01s, 2 tests
   [junit4] 
   [junit4] Suite: org.apache.lucene.search.TestPositiveScoresOnlyCollector
   [junit4] Completed on J1 in 0.02s, 1 test
   [junit4] 
   [junit4] Suite: org.apache.lucene.search.TestFieldCache
   [junit4] Completed on J1 in 1.68s, 10 tests
   [junit4] 
   [junit4] Suite: org.apache.lucene.search.TestTotalHitCountCollector
   [junit4] Completed on J1 in 0.02s, 1 test
   [junit4] 
   [junit4] Suite: org.apache.lucene.codecs.lucene3x.TestLucene3xTermVectorsFormat
   [junit4] Completed on J1 in 7.11s, 7 tests
   [junit4] 
   [junit4] Suite: org.apache.lucene.index.TestDocumentsWriterStallControl
   [junit4] Completed on J0 in 16.08s, 3 tests
   [junit4] 
   [junit4] Suite: org.apache.lucene.util.TestFieldCacheSanityChecker
   [junit4] Completed on J0 in 0.66s, 3 tests
   [junit4] 
   [junit4] Suite: org.apache.lucene.search.TestComplexExplanationsOfNonMatches
   [junit4] Completed on J0 in 0.11s, 22 tests
   [junit4] 
   [junit4] Suite: org.apache.lucene.index.TestIndexWriterLockRelease
   [junit4] Completed on J0 in 0.01s, 1 test
   [junit4] 
   [junit4] Suite: org.apache.lucene.index.TestBagOfPositions
   [junit4] Completed on J0 in 20.68s, 1 test
   [junit4] 
   [junit4] Suite: org.apache.lucene.util.TestOpenBitSet
   [junit4] Completed on J1 in 22.80s, 9 tests
   [junit4] 
   [junit4] Suite: org.apache.lucene.search.TestQueryWrapperFilter
   [junit4] Completed on J1 in 0.30s, 3 tests
   [junit4] 
   [junit4] Suite: org.apache.lucene.index.TestDocInverterPerFieldErrorInfo
   [junit4] Completed on J1 in 0.03s, 2 tests
   [junit4] 
   [junit4] Suite: org.apache.lucene.store.TestMockDirectoryWrapper
   [junit4] Completed on J1 in 0.02s, 3 tests
   [junit4] 
   [junit4] Suite: org.apache.lucene.index.TestIntBlockPool
   [junit4] Completed on J1 in 0.80s, 2 tests
   [junit4] 
   [junit4] Suite: org.apache.lucene.util.TestIntroSorter
   [junit4] Completed on J1 in 0.15s, 9 tests
   [junit4] 
   [junit4] Suite: org.apache.lucene.search.TestAutomatonQuery
   [junit4] Completed on J1 in 0.18s, 6 tests
   [junit4] 
   [junit4] Suite: org.apache.lucene.search.TestSimpleExplanationsOfNonMatches
   [junit4] Completed on J1 in 0.26s, 69 tests
   [junit4] 
   [junit4] Suite: org.apache.lucene.search.TestBooleanMinShouldMatch
   [junit4] Completed on J0 in 3.50s, 17 tests
   [junit4] 
   [junit4] Suite: org.apache.lucene.index.TestIndexWriterCommit
   [junit4] Completed on J0 in 2.10s, 12 tests
   [junit4] 
   [junit4] Suite: org.apache.lucene.analysis.TestMockCharFilter
   [junit4] Completed on J0 in 0.02s, 1 test
   [junit4] 
   [junit4] Suite: org.apache.lucene.index.TestParallelAtomicReader
   [junit4] Completed on J0 in 0.47s, 7 tests
   [junit4] 
   [junit4] Suite: org.apache.lucene.search.spans.TestSpanFirstQuery
   [junit4] Completed on J0 in 0.02s, 1 test
   [junit4] 
   [junit4] Suite: org.apache.lucene.search.TestSortRandom
   [junit4] Completed on J0 in 0.46s, 1 test
   [junit4] 
   [junit4] Suite: org.apache.lucene.search.TestWildcardRandom
   [junit4] Completed on J0 in 0.11s, 1 test
   [junit4] 
   [junit4] Suite: org.apache.lucene.util.automaton.TestDeterminism
   [junit4] Completed on J0 in 0.67s, 2 tests
   [junit4] 
   [junit4] Suite: org.apache.lucene.index.Test2BPositions
   [junit4] Completed on J0 in 0.01s, 1 test, 1 skipped
   [junit4] 
   [junit4] Suite: org.apache.lucene.index.TestIndexWriterExceptions
   [junit4] Completed on J1 in 17.17s, 27 tests
   [junit4] 
   [junit4] Suite: org.apache.lucene.util.TestIntsRef
   [junit4] Completed on J1 in 0.02s, 2 tests
   [junit4] 
   [junit4] Suite: org.apache.lucene.document.TestField
   [junit4] Completed on J1 in 0.06s, 18 tests
   [junit4] 
   [junit4] Suite: org.apache.lucene.search.spans.TestSpansAdvanced
   [junit4] Completed on J1 in 0.06s, 1 test
   [junit4] 
   [junit4] Suite: org.apache.lucene.store.TestHugeRamFile
   [junit4] Completed on J1 in 1.25s, 1 test
   [junit4] 
   [junit4] Suite: org.apache.lucene.analysis.TestCharFilter
   [junit4] Completed on J1 in 0.54s, 4 tests
   [junit4] 
   [junit4] Suite: org.apache.lucene.util.TestUnicodeUtil
   [junit4] Completed on J1 in 1.21s, 4 tests
   [junit4] 
   [junit4] Suite: org.apache.lucene.search.TestTermRangeFilter
   [junit4] Completed on J1 in 0.96s, 3 tests
   [junit4] 
   [junit4] Suite: org.apache.lucene.index.TestMultiDocValues
   [junit4] IGNOR/A 0.01s J1 | TestMultiDocValues.testSortedSetWithDups
   [junit4]    > Assumption #1: codec does not support SORTED_SET
   [junit4] IGNOR/A 0.01s J1 | TestMultiDocValues.testDocsWithField
   [junit4]    > Assumption #1: codec does not support docsWithField
   [junit4] IGNOR/A 0.01s J1 | TestMultiDocValues.testSortedSet
   [junit4]    > Assumption #1: codec does not support SORTED_SET
   [junit4] Completed on J1 in 4.18s, 7 tests, 3 skipped
   [junit4] 
   [junit4] Suite: org.apache.lucene.search.spans.TestNearSpansOrdered
   [junit4] Completed on J1 in 0.18s, 10 tests
   [junit4] 
   [junit4] Suite: org.apache.lucene.index.Test4GBStoredFields
   [junit4] IGNOR/A 0.00s J1 | Test4GBStoredFields.test
   [junit4]    > Assumption #1: 'nightly' test group is disabled (@Nightly)
   [junit4] Completed on J1 in 0.01s, 1 test, 1 skipped
   [junit4] 
   [junit4] Suite: org.apache.lucene.search.TestSortDocValues
   [junit4] Completed on J1 in 0.32s, 27 tests
   [junit4] 
   [junit4] Suite: org.apache.lucene.util.junitcompat.TestJUnitRuleOrder
   [junit4] Completed on J1 in 0.02s, 1 test
   [junit4] 
   [junit4] Suite: org.apache.lucene.index.TestCheckIndex
   [junit4] Completed on J1 in 0.06s, 3 tests
   [junit4] 
   [junit4] Suite: org.apache.lucene.analysis.TestMockAnalyzer
   [junit4] Completed on J0 in 20.94s, 17 tests
   [junit4] 
   [junit4] Suite: org.apache.lucene.util.junitcompat.TestSeedFromUncaught
   [junit4] Completed on J0 in 0.09s, 1 test
   [junit4] 
   [junit4] Suite: org.apache.lucene.search.TestFuzzyQuery
   [junit4] Completed on J1 in 0.34s, 6 tests
   [junit4] 
   [junit4] Suite: org.apache.lucene.util.TestBytesRef
   [junit4] Completed on J0 in 0.04s, 5 tests
   [junit4] 
   [junit4] Suite: org.apache.lucene.index.Test2BTerms
   [junit4] Completed on J0 in 0.01s, 1 test, 1 skipped
   [junit4] 
   [junit4] Suite: org.apache.lucene.util.junitcompat.TestFailOnFieldCacheInsanity
   [junit4] Completed on J0 in 0.02s, 1 test
   [junit4] 
   [junit4] Suite: org.apache.lucene.index.TestDocValuesFormat
   [junit4] IGNOR/A 0.01s J1 | TestDocValuesFormat.testTwoBytesOneMissingWithMerging
   [junit4]    > Assumption #1: Codec does not support getDocsWithField
   [junit4] IGNOR/A 0.01s J1 | TestDocValuesFormat.testSortedSetTwoFields
   [junit4]    > Assumption #1: Codec does not support SORTED_SET
   [junit4] IGNOR/A 0.01s J1 | TestDocValuesFormat.testSortedSetTwoDocumentsMerged
   [junit4]    > Assumption #1: Codec does not support SORTED_SET
   [junit4] IGNOR/A 0.01s J1 | TestDocValuesFormat.testSortedSetThreeValuesTwoDocs
   [junit4]    > Assumption #1: Codec does not support SORTED_SET
   [junit4] IGNOR/A 0.01s J1 | TestDocValuesFormat.testSortedSetFixedLengthVsStoredFields
   [junit4]    > Assumption #1: Codec does not support SORTED_SET
   [junit4] IGNOR/A 0.01s J1 | TestDocValuesFormat.testByteMissingVsFieldCache
   [junit4]    > Assumption #1: Codec does not support getDocsWithField
   [junit4] IGNOR/A 0.01s J1 | TestDocValuesFormat.testSortedSetFixedLengthSingleValuedVsStoredFields
   [junit4]    > Assumption #1: Codec does not support SORTED_SET
   [junit4] IGNOR/A 0.01s J1 | TestDocValuesFormat.testSortedSetVariableLengthSingleValuedVsStoredFields
   [junit4]    > Assumption #1: Codec does not support SORTED_SET
   [junit4] IGNOR/A 0.00s J1 | TestDocValuesFormat.testSortedSetFixedLengthVsUninvertedField
   [junit4]    > Assumption #1: Codec does not support SORTED_SET
   [junit4] IGNOR/A 0.01s J1 | TestDocValuesFormat.testSortedSetTwoDocumentsFirstMissingMerge
   [junit4]    > Assumption #1: Codec does not support SORTED_SET
   [junit4] IGNOR/A 0.01s J1 | TestDocValuesFormat.testLongMissingVsFieldCache
   [junit4]    > Assumption #1: Codec does not support getDocsWithField
   [junit4] IGNOR/A 0.01s J1 | TestDocValuesFormat.testTwoNumbersOneMissingWithMerging
   [junit4]    > Assumption #1: Codec does not support getDocsWithField
   [junit4] IGNOR/A 0.01s J1 | TestDocValuesFormat.testSortedSetOneValue
   [junit4]    > Assumption #1: Codec does not support SORTED_SET
   [junit4] IGNOR/A 0.01s J1 | TestDocValuesFormat.testSortedSetTwoDocumentsFirstMissing
   [junit4]    > Assumption #1: Codec does not support SORTED_SET
   [junit4] IGNOR/A 0.01s J1 | TestDocValuesFormat.testSortedSetVariableLengthVsStoredFields
   [junit4]    > Assumption #1: Codec does not support SORTED_SET
   [junit4] IGNOR/A 0.01s J1 | TestDocValuesFormat.testSortedSetTwoDocumentsLastMissing
   [junit4]    > Assumption #1: Codec does not support SORTED_SET
   [junit4] IGNOR/A 0.01s J1 | TestDocValuesFormat.testThreads2
   [junit4]    > Assumption #1: Codec does not support getDocsWithField
   [junit4] IGNOR/A 0.01s J1 | TestDocValuesFormat.testSortedSetTwoValuesUnordered
   [junit4]    > Assumption #1: Codec does not support SORTED_SET
   [junit4] IGNOR/A 0.01s J1 | TestDocValuesFormat.testTwoNumbersOneMissing
   [junit4]    > Assumption #1: Codec does not support getDocsWithField
   [junit4] IGNOR/A 0.01s J1 | TestDocValuesFormat.testShortMissingVsFieldCache
   [junit4]    > Assumption #1: Codec does not support getDocsWithField
   [junit4] IGNOR/A 0.01s J1 | TestDocValuesFormat.testThreeNumbersOneMissingWithMerging
   [junit4]    > Assumption #1: Codec does not support getDocsWithField
   [junit4] IGNOR/A 0.01s J1 | TestDocValuesFormat.testSortedSetTwoDocumentsLastMissingMerge
   [junit4]    > Assumption #1: Codec does not support SORTED_SET
   [junit4] IGNOR/A 0.01s J1 | TestDocValuesFormat.testSortedSetVariableLengthVsUninvertedField
   [junit4]    > Assumption #1: Codec does not support SORTED_SET
   [junit4] IGNOR/A 0.00s J1 | TestDocValuesFormat.testSortedSetTermsEnum
   [junit4]    > Assumption #1: Codec does not support SORTED_SET
   [junit4] IGNOR/A 0.00s J1 | TestDocValuesFormat.testSortedSetMergeAwayAllValues
   [junit4]    > Assumption #1: Codec does not support SORTED_SET
   [junit4] IGNOR/A 0.00s J1 | TestDocValuesFormat.testIntMissingVsFieldCache
   [junit4]    > Assumption #1: Codec does not support getDocsWithField
   [junit4] IGNOR/A 0.01s J1 | TestDocValuesFormat.testSortedSetTwoValues
   [junit4]    > Assumption #1: Codec does not support SORTED_SET
   [junit4] IGNOR/A 0.01s J1 | TestDocValuesFormat.testThreeBytesOneMissingWithMerging
   [junit4]    > Assumption #1: Codec does not support getDocsWithField
   [junit4] IGNOR/A 0.01s J1 | TestDocValuesFormat.testTwoBytesOneMissing
   [junit4]    > Assumption #1: Codec does not support getDocsWithField
   [junit4] Completed on J1 in 12.17s, 78 tests, 29 skipped
   [junit4] 
   [junit4] Suite: org.apache.lucene.index.TestTermVectorsFormat
   [junit4] Completed on J1 in 7.12s, 7 tests
   [junit4] 
   [junit4] Suite: org.apache.lucene.util.fst.TestFSTs
   [junit4] IGNOR/A 0.00s J1 | TestFSTs.testBigSet
   [junit4]    > Assumption #1: 'nightly' test group is disabled (@Nightly)
   [junit4] Completed on J1 in 30.17s, 18 tests, 1 skipped
   [junit4] 
   [junit4] Suite: org.apache.lucene.search.TestNumericRangeQuery64
   [junit4] Completed on J1 in 13.61s, 34 tests
   [junit4] 
   [junit4] Suite: org.apache.lucene.util.fst.TestBytesStore
   [junit4] Completed on J1 in 11.20s, 1 test
   [junit4] 
   [junit4] HEARTBEAT J0 PID(12284@serv1.sd-datasolutions.de): 2014-03-01T01:09:34, stalled for 66.1s at: TestNumericDocValuesUpdates.testTonsOfUpdates
   [junit4] Suite: org.apache.lucene.index.TestIndexWriterWithThreads
   [junit4] Completed on J1 in 6.17s, 12 tests
   [junit4] 
   [junit4] Suite: org.apache.lucene.search.TestNumericRangeQuery32
   [junit4] Completed on J1 in 9.05s, 27 tests
   [junit4] 
   [junit4] Suite: org.apache.lucene.index.TestBackwardsCompatibility
   [junit4] Completed on J1 in 10.16s, 15 tests
   [junit4] 
   [junit4] Suite: org.apache.lucene.analysis.TestGraphTokenizers
   [junit4] Completed on J1 in 20.35s, 21 tests
   [junit4] 
   [junit4] Suite: org.apache.lucene.analysis.TestLookaheadTokenFilter
   [junit4] Completed on J1 in 8.65s, 3 tests
   [junit4] 
   [junit4] HEARTBEAT J0 PID(12284@serv1.sd-datasolutions.de): 2014-03-01T01:10:34, stalled for  126s at: TestNumericDocValuesUpdates.testTonsOfUpdates
   [junit4] Suite: org.apache.lucene.store.TestMultiMMap
   [junit4] Completed on J1 in 8.46s, 11 tests
   [junit4] 
   [junit4] Suite: org.apache.lucene.index.TestDeletionPolicy
   [junit4] Completed on J1 in 4.65s, 6 tests
   [junit4] 
   [junit4] Suite: org.apache.lucene.search.TestBooleanOr
   [junit4] Completed on J1 in 1.06s, 6 tests
   [junit4] 
   [junit4] Suite: org.apache.lucene.search.spans.TestBasics
   [junit4] Completed on J1 in 3.58s, 28 tests
   [junit4] 
   [junit4] Suite: org.apache.lucene.index.TestFlushByRamOrCountsPolicy
   [junit4] Completed on J1 in 2.30s, 5 tests
   [junit4] 
   [junit4] Suite: org.apache.lucene.index.TestIndexWriterDelete
   [junit4] IGNOR/A 0.00s J1 | TestIndexWriterDelete.testApplyDeletesOnFlush
   [junit4]    > Assumption #1: 'nightly' test group is disabled (@Nightly)
   [junit4] Completed on J1 in 5.47s, 22 tests, 1 skipped
   [junit4] 
   [junit4] Suite: org.apache.lucene.codecs.lucene40.TestLucene40DocValuesFormat
   [junit4] IGNOR/A 0.01s J1 | TestLucene40DocValuesFormat.testTwoBytesOneMissingWithMerging
   [junit4]    > Assumption #1: Codec does not support getDocsWithField
   [junit4] IGNOR/A 0.01s J1 | TestLucene40DocValuesFormat.testSortedSetTwoFields
   [junit4]    > Assumption #1: Codec does not support SORTED_SET
   [junit4] IGNOR/A 0.01s J1 | TestLucene40DocValuesFormat.testSortedSetTwoDocumentsMerged
   [junit4]    > Assumption #1: Codec does not support SORTED_SET
   [junit4] IGNOR/A 0.01s J1 | TestLucene40DocValuesFormat.testSortedSetThreeValuesTwoDocs
   [junit4]    > Assumption #1: Codec does not support SORTED_SET
   [junit4] IGNOR/A 0.01s J1 | TestLucene40DocValuesFormat.testSortedSetFixedLengthVsStoredFields
   [junit4]    > Assumption #1: Codec does not support SORTED_SET
   [junit4] IGNOR/A 0.00s J1 | TestLucene40DocValuesFormat.testByteMissingVsFieldCache
   [junit4]    > Assumption #1: Codec does not support getDocsWithField
   [junit4] IGNOR/A 0.01s J1 | TestLucene40DocValuesFormat.testSortedSetFixedLengthSingleValuedVsStoredFields
   [junit4]    > Assumption #1: Codec does not support SORTED_SET
   [junit4] IGNOR/A 0.01s J1 | TestLucene40DocValuesFormat.testSortedSetVariableLengthSingleValuedVsStoredFields
   [junit4]    > Assumption #1: Codec does not support SORTED_SET
   [junit4] IGNOR/A 0.01s J1 | TestLucene40DocValuesFormat.testSortedSetFixedLengthVsUninvertedField
   [junit4]    > Assumption #1: Codec does not support SORTED_SET
   [junit4] IGNOR/A 0.01s J1 | TestLucene40DocValuesFormat.testSortedSetTwoDocumentsFirstMissingMerge
   [junit4]    > Assumption #1: Codec does not support SORTED_SET
   [junit4] IGNOR/A 0.01s J1 | TestLucene40DocValuesFormat.testLongMissingVsFieldCache
   [junit4]    > Assumption #1: Codec does not support getDocsWithField
   [junit4] IGNOR/A 0.01s J1 | TestLucene40DocValuesFormat.testTwoNumbersOneMissingWithMerging
   [junit4]    > Assumption #1: Codec does not support getDocsWithField
   [junit4] IGNOR/A 0.01s J1 | TestLucene40DocValuesFormat.testSortedSetOneValue
   [junit4]    > Assumption #1: Codec does not support SORTED_SET
   [junit4] IGNOR/A 0.01s J1 | TestLucene40DocValuesFormat.testSortedSetTwoDocumentsFirstMissing
   [junit4]    > Assumption #1: Codec does not support SORTED_SET
   [junit4] IGNOR/A 0.00s J1 | TestLucene40DocValuesFormat.testSortedSetVariableLengthVsStoredFields
   [junit4]    > Assumption #1: Codec does not support SORTED_SET
   [junit4] IGNOR/A 0.01s J1 | TestLucene40DocValuesFormat.testSortedSetTwoDocumentsLastMissing
   [junit4]    > Assumption #1: Codec does not support SORTED_SET
   [junit4] IGNOR/A 0.00s J1 | TestLucene40DocValuesFormat.testThreads2
   [junit4]    > Assumption #1: Codec does not support getDocsWithField
   [junit4] IGNOR/A 0.00s J1 | TestLucene40DocValuesFormat.testSortedSetTwoValuesUnordered
   [junit4]    > Assumption #1: Codec does not support SORTED_SET
   [junit4] IGNOR/A 0.00s J1 | TestLucene40DocValuesFormat.testTwoNumbersOneMissing
   [junit4]    > Assumption #1: Codec does not support getDocsWithField
   [junit4] IGNOR/A 0.01s J1 | TestLucene40DocValuesFormat.testShortMissingVsFieldCache
   [junit4]    > Assumption #1: Codec does not support getDocsWithField
   [junit4] IGNOR/A 0.01s J1 | TestLucene40DocValuesFormat.testThreeNumbersOneMissingWithMerging
   [junit4]    > Assumption #1: Codec does not support getDocsWithField
   [junit4] IGNOR/A 0.00s J1 | TestLucene40DocValuesFormat.testSortedSetTwoDocumentsLastMissingMerge
   [junit4]    > Assumption #1: Codec does not support SORTED_SET
   [junit4] IGNOR/A 0.01s J1 | TestLucene40DocValuesFormat.testSortedSetVariableLengthVsUninvertedField
   [junit4]    > Assumption #1: Codec does not support SORTED_SET
   [junit4] IGNOR/A 0.01s J1 | TestLucene40DocValuesFormat.testSortedSetTermsEnum
   [junit4]    > Assumption #1: Codec does not support SORTED_SET
   [junit4] IGNOR/A 0.00s J1 | TestLucene40DocValuesFormat.testSortedSetMergeAwayAllValues
   [junit4]    > Assumption #1: Codec does not support SORTED_SET
   [junit4] IGNOR/A 0.00s J1 | TestLucene40DocValuesFormat.testIntMissingVsFieldCache
   [junit4]    > Assumption #1: Codec does not support getDocsWithField
   [junit4] IGNOR/A 0.00s J1 | TestLucene40DocValuesFormat.testSortedSetTwoValues
   [junit4]    > Assumption #1: Codec does not support SORTED_SET
   [junit4] IGNOR/A 0.00s J1 | TestLucene40DocValuesFormat.testThreeBytesOneMissingWithMerging
   [junit4]    > Assumption #1: Codec does not support getDocsWithField
   [junit4] IGNOR/A 0.00s J1 | TestLucene40DocValuesFormat.testTwoBytesOneMissing
   [junit4]    > Assumption #1: Codec does not support getDocsWithField
   [junit4] Completed on J1 in 11.20s, 78 tests, 29 skipped
   [junit4] 
   [junit4] Suite: org.apache.lucene.index.TestNumericDocValuesUpdates
   [junit4] Completed on J0 in 171.41s, 31 tests
   [junit4] 
   [junit4] Suite: org.apache.lucene.index.TestSegmentTermEnum
   [junit4] Completed on J0 in 0.04s, 2 tests
   [junit4] 
   [junit4] Suite: org.apache.lucene.search.TestSimpleExplanations
   [junit4] Completed on J0 in 1.66s, 69 tests
   [junit4] 
   [junit4] Suite: org.apache.lucene.index.TestNRTThreads
   [junit4] Completed on J1 in 7.30s, 1 test
   [junit4] 
   [junit4] Suite: org.apache.lucene.search.TestBoolean2
   [junit4] Completed on J1 in 3.33s, 11 tests
   [junit4] 
   [junit4] Suite: org.apache.lucene.index.TestIndexWriterMerging
   [junit4] Completed on J0 in 7.83s, 6 tests
   [junit4] 
   [junit4] Suite: org.apache.lucene.TestMergeSchedulerExternal
   [junit4] Completed on J0 in 0.39s, 2 tests
   [junit4] 
   [junit4] Suite: org.apache.lucene.index.TestStressAdvance
   [junit4] Completed on J1 in 5.22s, 1 test
   [junit4] 
   [junit4] Suite: org.apache.lucene.index.TestNorms
   [junit4] Completed on J1 in 1.62s, 2 tests
   [junit4] 
   [junit4] Suite: org.apache.lucene.index.TestIndexWriter
   [junit4] Completed on J0 in 31.29s, 59 tests
   [junit4] 
   [junit4] Suite: org.apache.lucene.index.TestIsCurrent
   [junit4] Completed on J0 in 0.14s, 2 tests
   [junit4] 
   [junit4] Suite: org.apache.lucene.search.TestPhraseQuery
   [junit4] Completed on J0 in 1.97s, 18 tests
   [junit4] 
   [junit4] Suite: org.apache.lucene.index.TestIndexWriterForceMerge
   [junit4] Completed on J0 in 2.27s, 4 tests
   [junit4] 
   [junit4] Suite: org.apache.lucene.index.TestCrash
   [junit4] Completed on J0 in 0.52s, 5 tests
   [junit4] 
   [junit4] Suite: org.apache.lucene.index.TestCompoundFile
   [junit4] Completed on J0 in 1.11s, 18 tests
   [junit4] 
   [junit4] Suite: org.apache.lucene.search.TestPhrasePrefixQuery
   [junit4] Completed on J0 in 0.02s, 1 test
   [junit4] 
   [junit4] Suite: org.apache.lucene.index.Test2BSortedDocValues
   [junit4] Completed on J0 in 0.00s, 0 tests
   [junit4] 
   [junit4] Suite: org.apache.lucene.analysis.tokenattributes.TestCharTermAttributeImpl
   [junit4] Completed on J0 in 0.50s, 12 tests
   [junit4] 
   [junit4] Suite: org.apache.lucene.util.TestCloseableThreadLocal
   [junit4] Completed on J0 in 0.02s, 3 tests
   [junit4] 
   [junit4] Suite: org.apache.lucene.index.TestPostingsFormat
   [junit4] Completed on J0 in 1.70s, 7 tests
   [junit4] 
   [junit4] Suite: org.apache.lucene.search.TestSearchAfter
   [junit4] Completed on J1 in 36.98s, 1 test
   [junit4] 
   [junit4] Suite: org.apache.lucene.search.TestSloppyPhraseQuery
   [junit4] Completed on J0 in 3.08s, 9 tests
   [junit4] 
   [junit4] Suite: org.apache.lucene.search.TestRegexpRandom
   [junit4] Completed on J0 in 0.11s, 1 test
   [junit4] 
   [junit4] Suite: org.apache.lucene.index.TestIndexWriterConfig
   [junit4] Completed on J0 in 0.05s, 9 tests
   [junit4] 
   [junit4] Suite: org.apache.lucene.index.TestConcurrentMergeScheduler
   [junit4] Completed on J1 in 2.78s, 6 tests
   [junit4] 
   [junit4] Suite: org.apache.lucene.codecs.compressing.TestHighCompressionMode
   [junit4] Completed on J1 in 5.12s, 7 tests
   [junit4] 
   [junit4] Suite: org.apache.lucene.index.TestIndexWriterReader
   [junit4] Completed on J0 in 7.43s, 23 tests
   [junit4] 
   [junit4] Suite: org.apache.lucene.codecs.lucene3x.TestLucene3xPostingsFormat
   [junit4] Completed on J0 in 2.37s, 7 tests
   [junit4] 
   [junit4] Suite: org.apache.lucene.search.TestMultiPhraseQuery
   [junit4] Completed on J0 in 0.43s, 17 tests, 1 skipped
   [junit4] 
   [junit4] Suite: org.apache.lucene.index.TestNeverDelete
   [junit4] Completed on J1 in 4.27s, 1 test
   [junit4] 
   [junit4] Suite: org.apache.lucene.index.TestStressIndexing
   [junit4] Completed on J1 in 4.49s, 1 test
   [junit4] 
   [junit4] Suite: org.apache.lucene.search.TestSearcherManager
   [junit4] Completed on J0 in 7.30s, 8 tests
   [junit4] 
   [junit4] Suite: org.apache.lucene.index.TestTransactionRollback
   [junit4] Completed on J0 in 0.36s, 2 tests
   [junit4] 
   [junit4] Suite: org.apache.lucene.store.TestFilterDirectory
   [junit4] Completed on J0 in 0.02s, 1 test
   [junit4] 
   [junit4] Suite: org.apache.lucene.search.TestSimilarityProvider
   [junit4] Completed on J0 in 0.03s, 1 test
   [junit4] 
   [junit4] Suite: org.apache.lucene.index.TestRollingUpdates
   [junit4] Completed on J1 in 2.03s, 2 tests
   [junit4] 
   [junit4] Suite: org.apache.lucene.util.packed.TestEliasFanoDocIdSet
   [junit4] Completed on J0 in 0.49s, 4 tests
   [junit4] 
   [junit4] Suite: org.apache.lucene.search.TestPrefixInBooleanQuery
   [junit4] Completed on J0 in 1.13s, 4 tests
   [junit4] 
   [junit4] Suite: org.apache.lucene.codecs.lucene41.TestBlockPostingsFormat2
   [junit4] Completed on J1 in 1.85s, 4 tests
   [junit4] 
   [junit4] Suite: org.apache.lucene.search.TestDocTermOrdsRewriteMethod
   [junit4] Completed on J1 in 3.25s, 2 tests
   [junit4] 
   [junit4] Suite: org.apache.lucene.index.TestSnapshotDeletionPolicy
   [junit4] Completed on J1 in 2.15s, 7 tests
   [junit4] 
   [junit4] Suite: org.apache.lucene.codecs.lucene40.TestLucene40PostingsReader
   [junit4] Completed on J1 in 3.90s, 1 test
   [junit4] 
   [junit4] Suite: org.apache.lucene.index.TestNRTReaderWithThreads
   [junit4] Completed on J1 in 1.22s, 1 test
   [junit4] 
   [junit4] Suite: org.apache.lucene.codecs.perfield.TestPerFieldPostingsFormat
   [junit4] Completed on J1 in 1.59s, 7 tests
   [junit4] 
   [junit4] Suite: org.apache.lucene.util.TestArrayUtil
   [junit4] Completed on J1 in 3.63s, 11 tests
   [junit4] 
   [junit4] Suite: org.apache.lucene.codecs.lucene3x.TestLucene3xStoredFieldsFormat
   [junit4] IGNOR/A 0.02s J0 | TestLucene3xStoredFieldsFormat.testWriteReadMerge
   [junit4]    > Assumption #1: impersonation isnt good enough
   [junit4] IGNOR/A 0.01s J0 | TestLucene3xStoredFieldsFormat.testBigDocuments
   [junit4]    > Assumption #1: 'nightly' test group is disabled (@Nightly)
   [junit4] Completed on J0 in 23.99s, 10 tests, 2 skipped
   [junit4] 
   [junit4] Suite: org.apache.lucene.analysis.tokenattributes.TestSimpleAttributeImpl
   [junit4] Completed on J0 in 0.01s, 1 test
   [junit4] 
   [junit4] Suite: org.apache.lucene.search.TestSimilarity
   [junit4] Completed on J0 in 0.02s, 1 test
   [junit4] 
   [junit4] Suite: org.apache.lucene.index.TestByteSlices
   [junit4] Completed on J1 in 7.24s, 1 test
   [junit4] 
   [junit4] Suite: org.apache.lucene.store.TestBufferedIndexInput
   [junit4] Completed on J0 in 0.31s, 4 tests
   [junit4] 
   [junit4] Suite: org.apache.lucene.index.TestConsistentFieldNumbers
   [junit4] Completed on J0 in 3.77s, 4 tests
   [junit4] 
   [junit4] Suite: org.apache.lucene.util.TestWeakIdentityMap
   [junit4] Completed on J0 in 9.10s, 2 tests
   [junit4] 
   [junit4] Suite: org.apache.lucene.index.TestTermsEnum
   [junit4] Completed on J1 in 14.88s, 9 tests
   [junit4] 
   [junit4] Suite: org.apache.lucene.search.TestDocTermOrdsRangeFilter
   [junit4] Completed on J0 in 1.45s, 1 test
   [junit4] 
   [junit4] Suite: org.apache.lucene.index.TestSegmentMerger
   [junit4] Completed on J1 in 0.50s, 3 tests
   [junit4] 
   [junit4] Suite: org.apache.lucene.index.TestOmitNorms
   [junit4] Completed on J0 in 0.40s, 5 tests
   [junit4] 
   [junit4] Suite: org.apache.lucene.util.TestDoubleBarrelLRUCache
   [junit4] Completed on J1 in 1.02s, 2 tests
   [junit4] 
   [junit4] Suite: org.apache.lucene.search.TestComplexExplanations
   [junit4] Completed on J0 in 1.47s, 22 tests
   [junit4] 
   [junit4] Suite: org.apache.lucene.store.TestNRTCachingDirectory
   [junit4] Completed on J0 in 0.36s, 5 tests
   [junit4] 
   [junit4] Suite: org.apache.lucene.search.TestRegexpRandom2
   [junit4] Completed on J1 in 2.83s, 1 test
   [junit4] 
   [junit4] Suite: org.apache.lucene.index.TestIndexWriterNRTIsCurrent
   [junit4] Completed on J0 in 4.32s, 1 test
   [junit4] 
   [junit4] Suite: org.apache.lucene.search.TestMultiThreadTermVectors
   [junit4] Completed on J0 in 0.35s, 1 test
   [junit4] 
   [junit4] Suite: org.apache.lucene.codecs.perfield.TestPerFieldPostingsFormat2
   [junit4] Completed on J0 in 4.93s, 5 tests
   [junit4] 
   [junit4] Suite: org.apache.lucene.search.TestSort
   [junit4] Completed on J0 in 0.92s, 53 tests
   [junit4] 
   [junit4] Suite: org.apache.lucene.util.TestPagedBytes
   [junit4] Completed on J1 in 10.24s, 3 tests, 1 skipped
   [junit4] 
   [junit4] Suite: org.apache.lucene.codecs.lucene40.TestBitVector
   [junit4] Completed on J0 in 1.41s, 9 tests
   [junit4] 
   [junit4] Suite: org.apache.lucene.index.TestFieldsReader
   [junit4] Completed on J0 in 0.28s, 2 tests
   [junit4] 
   [junit4] Suite: org.apache.lucene.codecs.lucene40.TestReuseDocsEnum
   [junit4] Completed on J1 in 0.97s, 3 tests
   [junit4] 
   [junit4] Suite: org.apache.lucene.search.TestSimpleSearchEquivalence
   [junit4] Completed on J0 in 0.55s, 12 tests
   [junit4] 
   [junit4] Suite: org.apache.lucene.index.TestDocValuesIndexing
   [junit4] Completed on J1 in 0.67s, 30 tests
   [junit4] 
   [junit4] Suite: org.apache.lucene.search.similarities.TestSimilarityBase
   [junit4] Completed on J0 in 0.55s, 30 tests
   [junit4] 
   [junit4] Suite: org.apache.lucene.index.TestTermsEnum2
   [junit4] Completed on J1 in 0.99s, 4 tests
   [junit4] 
   [junit4] Suite: org.apache.lucene.index.Test2BDocs
   [junit4] Completed on J1 in 0.59s, 2 tests
   [junit4] 
   [junit4] Suite: org.apache.lucene.index.TestIndexWriterOnDiskFull
   [junit4] Completed on J1 in 0.47s, 4 tests
   [junit4] 
   [junit4] Suite: org.apache.lucene.util.TestNumericUtils
   [junit4] Completed on J0 in 2.60s, 12 tests
   [junit4] 
   [junit4] Suite: org.apache.lucene.index.TestCustomNorms
   [junit4] Completed on J1 in 0.79s, 1 test
   [junit4] 
   [junit4] Suite: org.apache.lucene.search.spans.TestPayloadSpans
   [junit4] Completed on J0 in 0.58s, 10 tests
   [junit4] 
   [junit4] Suite: org.apache.lucene.index.TestFlex
   [junit4] Completed on J0 in 0.16s, 2 tests
   [junit4] 
   [junit4] Suite: org.apache.lucene.codecs.lucene40.TestLucene40PostingsFormat
   [junit4] Completed on J1 in 1.44s, 7 tests
   [junit4] 
   [junit4] Suite: org.apache.lucene.index.TestDocTermOrds
   [junit4] Completed on J1 in 1.26s, 5 tests
   [junit4] 
   [junit4] Suite: org.apache.lucene.search.spans.TestSpanExplanations
   [junit4] Completed on J0 in 2.35s, 31 tests
   [junit4] 
   [junit4] Suite: org.apache.lucene.util.TestMaxFailuresRule
   [junit4] Completed on J1 in 0.82s, 1 test
   [junit4] 
   [junit4] Suite: org.apache.lucene.index.TestStressIndexing2
   [junit4] Completed on J0 in 0.87s, 3 tests
   [junit4] 
   [junit4] Suite: org.apache.lucene.store.TestRAMDirectory
   [junit4] Completed on J1 in 0.34s, 4 tests
   [junit4] 
   [junit4] Suite: org.apache.lucene.index.TestTermVectorsWriter
   [junit4] Completed on J0 in 0.41s, 13 tests
   [junit4] 
   [junit4] Suite: org.apache.lucene.index.TestCodecs
   [junit4] Completed on J1 in 0.46s, 5 tests
   [junit4] 
   [junit4] Suite: org.apache.lucene.index.TestOmitPositions
   [junit4] Completed on J0 in 0.49s, 4 tests
   [junit4] 
   [junit4] Suite: org.apache.lucene.store.TestCopyBytes
   [junit4] Completed on J0 in 0.62s, 2 tests
   [junit4] 
   [junit4] Suite: org.apache.lucene.index.TestForceMergeForever
   [junit4] Completed on J0 in 0.41s, 1 test
   [junit4] 
   [junit4] Suite: org.apache.lucene.util.TestBytesRefHash
   [junit4] Completed on J1 in 1.67s, 8 tests
   [junit4] 
   [junit4] Suite: org.apache.lucene.search.TestTermRangeQuery
   [junit4] Completed on J1 in 0.13s, 7 tests
   [junit4] 
   [junit4] Suite: org.apache.lucene.index.TestOmitTf
   [junit4] Completed on J0 in 0.34s, 6 tests
   [junit4] 
   [junit4] Suite: org.apache.lucene.search.payloads.TestPayloadNearQuery
   [junit4] Completed on J1 in 0.18s, 7 tests
   [junit4] 
   [junit4] Suite: org.apache.lucene.index.TestDocumentWriter
   [junit4] Completed on J0 in 0.19s, 7 tests
   [junit4] 
   [junit4] Suite: org.apache.lucene.index.TestForTooMuchCloning
   [junit4] Completed on J1 in 0.16s, 1 test
   [junit4] 
   [junit4] Suite: org.apache.lucene.util.junitcompat.TestReproduceMessage
   [junit4] Completed on J0 in 0.38s, 21 tests
   [junit4] 
   [junit4] Suite: org.apache.lucene.search.spans.TestSpanSearchEquivalence
   [junit4] Completed on J1 in 0.32s, 8 tests
   [junit4] 
   [junit4] Suite: org.apache.lucene.index.TestDoc
   [junit4] Completed on J1 in 0.10s, 1 test
   [junit4] 
   [junit4] Suite: org.apache.lucene.index.TestPayloads
   [junit4] Completed on J0 in 0.48s, 7 tests
   [junit4] 
   [junit4] Suite: org.apache.lucene.search.TestWildcard
   [junit4] Completed on J1 in 0.13s, 8 tests
   [junit4] 
   [junit4] Suite: org.apache.lucene.search.similarities.TestSimilarity2
   [junit4] Completed on J0 in 0.20s, 7 tests
   [junit4] 
   [junit4] Suite: org.apache.lucene.search.spans.TestFieldMaskingSpanQuery
   [junit4] Completed on J1 in 0.30s, 11 tests
   [junit4] 
   [junit4] Suite: org.apache.lucene.index.TestTermVectorsReader
   [junit4] Completed on J1 in 0.05s, 6 tests
   [junit4] 
   [junit4] Suite: org.apache.lucene.search.spans.TestSpansAdvanced2
   [junit4] Completed on J1 in 0.11s, 4 tests
   [junit4] 
   [junit4] Suite: org.apache.lucene.TestExternalCodecs
   [junit4] Completed on J0 in 0.81s, 1 test
   [junit4] 
   [junit4] Suite: org.apache.lucene.search.TestTopDocsCollector
   [junit4] Completed on J0 in 0.20s, 8 tests
   [junit4] 
   [junit4] Suite: org.apache.lucene.index.TestUniqueTermCount
   [junit4] Completed on J0 in 0.09s, 1 test
   [junit4] 
   [junit4] Suite: org.apache.lucene.search.TestMultiValuedNumericRangeQuery
   [junit4] Completed on J1 in 0.92s, 1 test
   [junit4] 
   [junit4] Suite: org.apache.lucene.util.automaton.TestBasicOperations
   [junit4] Completed on J0 in 0.34s, 8 tests
   [junit4] 
   [junit4] Suite: org.apache.lucene.index.TestAllFilesHaveCodecHeader
   [junit4] Completed on J0 in 0.16s, 1 test
   [junit4] 
   [junit4] Suite: org.apache.lucene.index.TestPrefixCodedTerms
   [junit4] Completed on J1 in 0.30s, 5 tests
   [junit4] 
   [junit4] Suite: org.apache.lucene.index.TestParallelReaderEmptyIndex
   [junit4] Completed on J0 in 0.08s, 2 tests
   [junit4] 
   [junit4] Suite: org.apache.lucene.codecs.lucene41.TestForUtil
   [junit4] Completed on J1 in 0.02s, 1 test
   [junit4] 
   [junit4] Suite: org.apache.lucene.search.TestTermScorer
   [junit4] Completed on J0 in 0.08s, 3 tests
   [junit4] 
   [junit4] Suite: org.apache.lucene.search.TestTopFieldCollector
   [junit4] Completed on J1 in 0.11s, 8 tests
   [junit4] 
   [junit4] Suite: org.apache.lucene.store.TestFileSwitchDirectory
   [junit4] Completed on J0 in 0.04s, 4 tests
   [junit4] 
   [junit4] Suite: org.apache.lucene.index.TestSumDocFreq
   [junit4] Completed on J1 in 0.09s, 1 test
   [junit4] 
   [junit4] Suite: org.apache.lucene.util.TestSentinelIntSet
   [junit4] Completed on J0 in 0.15s, 2 tests
   [junit4] 
   [junit4] Suite: org.apache.lucene.store.TestDirectory
   [junit4] IGNOR/A 0.00s J0 | TestDirectory.testThreadSafety
   [junit4]    > Assumption #1: 'nightly' test group is disabled (@Nightly)
   [junit4] Completed on J0 in 0.32s, 8 tests, 1 skipped
   [junit4] 
   [junit4] Suite: org.apache.lucene.index.TestMultiLevelSkipList
   [junit4] Completed on J0 in 0.11s, 1 test
   [junit4] 
   [junit4] Suite: org.apache.lucene.index.TestPayloadsOnVectors
   [junit4] Completed on J0 in 0.08s, 3 tests
   [junit4] 
   [junit4] Suite: org.apache.lucene.util.junitcompat.TestExceptionInBeforeClassHooks
   [junit4] Completed on J0 in 0.26s, 3 tests
   [junit4] 
   [junit4] Suite: org.apache.lucene.search.TestBooleanQueryVisitSubscorers
   [junit4] Completed on J0 in 0.03s, 3 tests
   [junit4] 
   [junit4] Suite: org.apache.lucene.TestSearchForDuplicates
   [junit4] Completed on J0 in 0.08s, 1 test
   [junit4] 
   [junit4] Suite: org.apache.lucene.util.junitcompat.TestSystemPropertiesInvariantRule
   [junit4] Completed on J0 in 0.11s, 5 tests
   [junit4] 
   [junit4] Suite: org.apache.lucene.index.TestSizeBoundedForceMerge
   [junit4] Completed on J0 in 0.09s, 11 tests
   [junit4] 
   [junit4] Suite: org.apache.lucene.index.TestIndexFileDeleter
   [junit4] Completed on J0 in 0.03s, 1 test
   [junit4] 
   [junit4] Suite: org.apache.lucene.search.TestPrefixRandom
   [junit4] Completed on J1 in 2.80s, 1 test
   [junit4] 
   [junit4] Suite: org.apache.lucene.search.TestConstantScoreQuery
   [junit4] Completed on J1 in 0.04s, 4 tests
   [junit4] 
   [junit4] Suite: org.apache.lucene.util.automaton.TestCompiledAutomaton
   [junit4] Completed on J0 in 0.30s, 2 tests
   [junit4] 
   [junit4] Suite: org.apache.lucene.search.TestPrefixQuery
   [junit4] Completed on J1 in 0.01s, 1 test
   [junit4] 
   [junit4] Suite: org.apache.lucene.index.TestDocValuesWithThreads
   [junit4] Completed on J0 in 0.09s, 2 tests
   [junit4] 
   [junit4] Suite: org.apache.lucene.util.junitcompat.TestBeforeAfterOverrides
   [junit4] Completed on J1 in 0.03s, 2 tests
   [junit4] 
   [junit4] Suite: org.apache.lucene.index.TestParallelTermEnum
   [junit4] Completed on J0 in 0.02s, 1 test
   [junit4] 
   [junit4] Suite: org.apache.lucene.search.TestElevationComparator
   [junit4] Completed on J1 in 0.07s, 1 test
   [junit4] 
   [junit4] Suite: org.apache.lucene.search.TestFilteredSearch
   [junit4] Completed on J0 in 0.04s, 1 test
   [junit4] 
   [junit4] Suite: org.apache.lucene.search.TestConjunctions
   [junit4] Completed on J1 in 0.02s, 1 test
   [junit4] 
   [junit4] Suite: org.apache.lucene.util.junitcompat.TestSameRandomnessLocalePassedOrNot
   [junit4] Completed on J0 in 0.03s, 1 test
   [junit4] 
   [junit4] Suite: org.apache.lucene.search.TestDateSort
   [junit4] Completed on J1 in 0.02s, 1 test
   [junit4] 
   [junit4] Suite: org.apache.lucene.util.TestIdentityHashSet
   [junit4] Completed on J0 in 0.12s, 1 test
   [junit4] 
   [junit4] Suite: org.apache.lucene.search.spans.TestSpanExplanationsOfNonMatches
   [junit4] Completed on J1 in 0.09s, 31 tests
   [junit4] 
   [junit4] Suite: org.apache.lucene.util.TestVirtualMethod
   [junit4] Completed on J0 in 0.02s, 2 tests
   [junit4] 
   [junit4] Suite: org.apache.lucene.analysis.TestNumericTokenStream
   [junit4] Completed on J1 in 0.02s, 4 tests
   [junit4] 
   [junit4] Suite: org.apache.lucene.util.TestSetOnce
   [junit4] Completed on J0 in 0.04s, 4 tests
   [junit4] 
   [junit4] Suite: org.apache.lucene.index.TestFilterAtomicReader
   [junit4] Completed on J1 in 0.04s, 2 tests
   [junit4] 
   [junit4] Suite: org.apache.lucene.TestSearch
   [junit4] Completed on J0 in 0.04s, 2 tests
   [junit4] 
   [junit4] Suite: org.apache.lucene.search.TestDateFilter
   [junit4] Completed on J1 in 0.02s, 2 tests
   [junit4] 
   [junit4] Suite: org.apache.lucene.util.TestCharsRef
   [junit4] Completed on J0 in 0.07s, 8 tests
   [junit4] 
   [junit4] Suite: org.apache.lucene.index.Test2BPostings
   [junit4] IGNOR/A 0.04s J1 | Test2BPostings.test
   [junit4]    > Assumption #1: 'nightly' test group is disabled (@Nightly)
   [junit4] Completed on J1 in 0.05s, 1 test, 1 skipped
   [junit4] 
   [junit4] Suite: org.apache.lucene.index.TestDocCount
   [junit4] Completed on J0 in 0.07s, 1 test
   [junit4] 
   [junit4] Suite: org.apache.lucene.search.TestCachingCollector
   [junit4] Completed on J1 in 0.03s, 5 tests
   [junit4] 
   [junit4] Suite: org.apache.lucene.search.TestFieldCacheTermsFilter
   [junit4] Completed on J0 in 0.07s, 1 test
   [junit4] 
   [junit4] Suite: org.apache.lucene.util.TestRecyclingByteBlockAllocator
   [junit4] Completed on J1 in 0.04s, 3 tests
   [junit4] 
   [junit4] Suite: org.apache.lucene.store.TestLock
   [junit4] Completed on J0 in 0.03s, 1 test
   [junit4] 
   [junit4] Suite: org.apache.lucene.util.TestRamUsageEstimator
   [junit4] Completed on J1 in 0.02s, 3 tests
   [junit4] 
   [junit4] Suite: org.apache.lucene.util.junitcompat.TestFailIfUnreferencedFiles
   [junit4] Completed on J0 in 0.02s, 1 test
   [junit4] 
   [junit4] Suite: org.apache.lucene.index.TestNoMergeScheduler
   [junit4] Completed on J1 in 0.02s, 3 tests
   [junit4] 
   [junit4] Suite: org.apache.lucene.util.TestByteBlockPool
   [junit4] Completed on J0 in 0.07s, 1 test
   [junit4] 
   [junit4] Suite: org.apache.lucene.util.junitcompat.TestLeaveFilesIfTestFails
   [junit4] Completed on J1 in 0.02s, 1 test
   [junit4] 
   [junit4] Suite: org.apache.lucene.TestDemo
   [junit4] Completed on J0 in 0.01s, 1 test
   [junit4] 
   [junit4] Suite: org.apache.lucene.TestAssertions
   [junit4] Completed on J1 in 0.01s, 1 test
   [junit4] 
   [junit4] Suite: org.apache.lucene.index.TestTwoPhaseCommitTool
   [junit4] Completed on J0 in 0.02s, 3 tests
   [junit4] 
   [junit4] Suite: org.apache.lucene.search.TestNot
   [junit4] Completed on J1 in 0.07s, 1 test
   [junit4] 
   [junit4] Suite: org.apache.lucene.index.TestIndexWriterOnJRECrash
   [junit4] IGNOR/A 0.00s J0 | TestIndexWriterOnJRECrash.testNRTThreads
   [junit4]    > Assumption #1: 'nightly' test group is disabled (@Nightly)
   [junit4] Completed on J0 in 0.01s, 1 test, 1 skipped
   [junit4] 
   [junit4] Suite: org.apache.lucene.search.TestPrefixFilter
   [junit4] Completed on J1 in 0.02s, 1 test
   [junit4] 
   [junit4] Suite: org.apache.lucene.util.TestVersion
   [junit4] Completed on J0 in 0.02s, 3 tests
   [junit4] 
   [junit4] Suite: org.apache.lucene.util.junitcompat.TestCodecReported
   [junit4] Completed on J1 in 0.01s, 1 test
   [junit4] 
   [junit4] Suite: org.apache.lucene.index.TestCodecHoldsOpenFiles
   [junit4] Completed on J0 in 0.02s, 1 test
   [junit4] 
   [junit4] Suite: org.apache.lucene.index.TestReaderClosed
   [junit4] Completed on J1 in 0.03s, 2 tests
   [junit4] 
   [junit4] Suite: org.apache.lucene.search.MultiCollectorTest
   [junit4] Completed on J0 in 0.02s, 3 tests
   [junit4] 
   [junit4] Suite: org.apache.lucene.search.TestDocBoost
   [junit4] Completed on J1 in 0.01s, 1 test
   [junit4] 
   [junit4] Suite: org.apache.lucene.search.TestScoreCachingWrappingScorer
   [junit4] Completed on J0 in 0.01s, 1 test
   [junit4] 
   [junit4] Suite: org.apache.lucene.util.junitcompat.TestFailIfDirectoryNotClosed
   [junit4] Completed on J1 in 0.02s, 1 test
   [junit4] 
   [junit4] Suite: org.apache.lucene.index.TestTermdocPerf
   [junit4] Completed on J0 in 0.01s, 1 test
   [junit4] 
   [junit4] Suite: org.apache.lucene.index.TestIndexCommit
   [junit4] Completed on J1 in 0.01s, 1 test
   [junit4] 
   [junit4] Suite: org.apache.lucene.index.Test2BPostingsBytes
   [junit4] Completed on J0 in 0.01s, 1 test, 1 skipped
   [junit4] 
   [junit4] Suite: org.apache.lucene.search.TestTopScoreDocCollector
   [junit4] Completed on J1 in 0.01s, 1 test
   [junit4] 
   [junit4] Suite: org.apache.lucene.index.TestNewestSegment
   [junit4] Completed on J0 in 0.01s, 1 test
   [junit4] 
   [junit4] Suite: org.apache.lucene.index.Test2BNumericDocValues
   [junit4] Completed on J1 in 0.00s, 0 tests
   [junit4] 
   [junit4] Suite: org.apache.lucene.index.Test2BBinaryDocValues
   [junit4] Completed on J0 in 0.00s, 0 tests
   [junit4] 
   [junit4] Suite: org.apache.lucene.util.Test2BPagedBytes
   [junit4] Completed on J1 in 0.00s, 0 tests
   [junit4] 
   [junit4] Suite: org.apache.lucene.util.fst.Test2BFST
   [junit4] Completed on J0 in 0.00s, 0 tests
   [junit4] 
   [junit4] Suite: org.apache.lucene.analysis.TestPosition
   [junit4] Completed on J1 in 0.00s, 0 tests
   [junit4] 
   [junit4] Suite: org.apache.lucene.analysis.TestReusableStringReader
   [junit4] Completed on J0 in 0.01s, 1 test
   [junit4] 
   [junit4] Suite: org.apache.lucene.codecs.lucene3x.TestImpersonation
   [junit4] Completed on J1 in 0.01s, 1 test
   [junit4] 
   [junit4] Suite: org.apache.lucene.codecs.lucene3x.TestSurrogates
   [junit4] Completed on J0 in 0.67s, 1 test
   [junit4] 
   [junit4] Suite: org.apache.lucene.codecs.lucene3x.TestTermInfosReaderIndex
   [junit4] Completed on J1 in 0.68s, 3 tests
   [junit4] 
   [junit4] Suite: org.apache.lucene.codecs.lucene41.TestLucene41StoredFieldsFormat
   [junit4] IGNOR/A 0.00s J0 | TestLucene41StoredFieldsFormat.testBigDocuments
   [junit4]    > Assumption #1: 'nightly' test group is disabled (@Nightly)
   [junit4] Completed on J0 in 4.09s, 10 tests, 1 skipped
   [junit4] 
   [junit4] Suite: org.apache.lucene.index.TestBackwardsCompatibility3x
   [junit4] Completed on J1 in 5.52s, 16 tests
   [junit4] 
   [junit4] Suite: org.apache.lucene.index.TestStoredFieldsFormat
   [junit4] IGNOR/A 0.00s J1 | TestStoredFieldsFormat.testBigDocuments
   [junit4]    > Assumption #1: 'nightly' test group is disabled (@Nightly)
   [junit4] Completed on J1 in 3.38s, 10 tests, 1 skipped
   [junit4] 
   [junit4] Suite: org.apache.lucene.index.TestTryDelete
   [junit4] Completed on J1 in 0.02s, 3 tests
   [junit4] 
   [junit4] Suite: org.apache.lucene.search.FuzzyTermOnShortTermsTest
   [junit4] Completed on J1 in 0.10s, 1 test
   [junit4] 
   [junit4] Suite: org.apache.lucene.index.TestIndexWriterOutOfFileDescriptors
   [junit4] Completed on J0 in 6.83s, 1 test
   [junit4] 
   [junit4] Suite: org.apache.lucene.search.TestEarlyTermination
   [junit4] Completed on J0 in 0.03s, 1 test
   [junit4] 
   [junit4] Suite: org.apache.lucene.search.TestIndexSearcher
   [junit4] Completed on J0 in 0.23s, 2 tests
   [junit4] 
   [junit4] Suite: org.apache.lucene.search.TestMinShouldMatch2
   [junit4] Completed on J0 in 4.49s, 6 tests
   [junit4] 
   [junit4] Suite: org.apache.lucene.util.TestBytesRefArray
   [junit4] Completed on J0 in 0.12s, 2 tests
   [junit4] 
   [junit4] Suite: org.apache.lucene.util.TestDocIdBitSet
   [junit4] Completed on J0 in 0.71s, 4 tests
   [junit4] 
   [junit4] Suite: org.apache.lucene.util.TestInPlaceMergeSorter
   [junit4] Completed on J0 in 0.29s, 9 tests
   [junit4] 
   [junit4] Suite: org.apache.lucene.search.TestControlledRealTimeReopenThread
   [junit4] Completed on J1 in 8.33s, 5 tests
   [junit4] 
   [junit4] Suite: org.apache.lucene.util.TestMergedIterator
   [junit4] Completed on J1 in 0.30s, 25 tests
   [junit4] 
   [junit4] Suite: org.apache.lucene.util.TestOfflineSorter
   [junit4] IGNOR/A 0.00s J1 | TestOfflineSorter.testLargerRandom
   [junit4]    > Assumption #1: 'nightly' test group is disabled (@Nightly)
   [junit4] Completed on J1 in 5.48s, 6 tests, 1 skipped
   [junit4] 
   [junit4] Suite: org.apache.lucene.util.TestPForDeltaDocIdSet
   [junit4] Completed on J1 in 0.57s, 4 tests
   [junit4] 
   [junit4] Suite: org.apache.lucene.util.TestLongBitSet
   [junit4] Completed on J0 in 8.17s, 7 tests
   [junit4] 
   [junit4] Suite: org.apache.lucene.util.junitcompat.TestReproduceMessageWithRepeated
   [junit4] Completed on J0 in 0.04s, 1 test
   [junit4] 
   [junit4] Suite: org.apache.lucene.util.TestWAH8DocIdSet
   [junit4] Completed on J1 in 1.43s, 6 tests
   [junit4] 
   [junit4] JVM J0:     1.08 ..   638.44 =   637.36s
   [junit4] JVM J1:     1.09 ..   638.72 =   637.63s
   [junit4] Execution time total: 10 minutes 38 seconds
   [junit4] Tests summary: 385 suites, 2793 tests, 107 ignored (94 assumptions)
     [echo] 5 slowest tests:
[junit4:tophints] 171.41s | org.apache.lucene.index.TestNumericDocValuesUpdates
[junit4:tophints]  54.08s | org.apache.lucene.codecs.perfield.TestPerFieldDocValuesFormat
[junit4:tophints]  41.19s | org.apache.lucene.codecs.compressing.TestCompressingTermVectorsFormat
[junit4:tophints]  36.98s | org.apache.lucene.search.TestSearchAfter
[junit4:tophints]  35.74s | org.apache.lucene.codecs.lucene42.TestLucene42DocValuesFormat

-check-totals:

test:

compile-test:

ivy-availability-check:

ivy-fail:

ivy-configure:
[ivy:configure] :: loading settings :: file = /mnt/ssd/jenkins/workspace/Lucene-Solr-4.x-Linux/lucene/ivy-settings.xml

resolve:

init:

-clover.disable:

-clover.load:

-clover.classpath:

-clover.setup:

clover:

compile-core:

compile-test-framework:

ivy-availability-check:

ivy-fail:

ivy-configure:
[ivy:configure] :: loading settings :: file = /mnt/ssd/jenkins/workspace/Lucene-Solr-4.x-Linux/lucene/ivy-settings.xml

resolve:

init:

compile-lucene-core:

ivy-availability-check:

ivy-fail:

ivy-configure:
[ivy:configure] :: loading settings :: file = /mnt/ssd/jenkins/workspace/Lucene-Solr-4.x-Linux/lucene/ivy-settings.xml

resolve:

init:

-clover.disable:

-clover.load:

-clover.classpath:

-clover.setup:

clover:

compile-core:

compile-codecs:
     [echo] Building codecs...

ivy-availability-check:
     [echo] Building codecs...

ivy-fail:

ivy-configure:
[ivy:configure] :: loading settings :: file = /mnt/ssd/jenkins/workspace/Lucene-Solr-4.x-Linux/lucene/ivy-settings.xml

resolve:

common.init:

compile-lucene-core:

init:

-clover.disable:

-clover.load:

-clover.classpath:

-clover.setup:

clover:

compile-core:

-clover.disable:

-clover.load:

-clover.classpath:

-clover.setup:

clover:

common.compile-core:

compile-core:

compile-test:

compile-test:
     [echo] Building analyzers-common...

ivy-availability-check:
     [echo] Building analyzers-common...

ivy-fail:

ivy-configure:
[ivy:configure] :: loading settings :: file = /mnt/ssd/jenkins/workspace/Lucene-Solr-4.x-Linux/lucene/ivy-settings.xml

resolve:

common.init:

compile-lucene-core:

ivy-availability-check:

ivy-fail:

ivy-configure:
[ivy:configure] :: loading settings :: file = /mnt/ssd/jenkins/workspace/Lucene-Solr-4.x-Linux/lucene/ivy-settings.xml

resolve:

init:

-clover.disable:

-clover.load:

-clover.classpath:

-clover.setup:

clover:

compile-core:

init:

compile-test:
     [echo] Building analyzers-common...

ivy-availability-check:

ivy-configure:
[ivy:configure] :: loading settings :: file = /mnt/ssd/jenkins/workspace/Lucene-Solr-4.x-Linu

[...truncated too long message...]

 P34802 oasc.SyncStrategy.sync WARN Closed, skipping sync up.
   [junit4]   2> 65988 T165 oasc.ShardLeaderElectionContext.rejoinLeaderElection Not rejoining election because CoreContainer is shutdown
   [junit4]   2> 65989 T165 oasc.SolrCore.close [collection1]  CLOSING SolrCore org.apache.solr.core.SolrCore@7eeee0a8
   [junit4]   2> 65991 T165 oasu.DirectUpdateHandler2.close closing DirectUpdateHandler2{commits=6,autocommits=0,soft autocommits=0,optimizes=0,rollbacks=0,expungeDeletes=0,docsPending=0,adds=0,deletesById=0,deletesByQuery=0,errors=0,cumulative_adds=2,cumulative_deletesById=1,cumulative_deletesByQuery=2,cumulative_errors=0,transaction_logs_total_size=0,transaction_logs_total_number=5}
   [junit4]   2> 65992 T165 oasu.SolrCoreState.decrefSolrCoreState Closing SolrCoreState
   [junit4]   2> 65992 T165 oasu.DefaultSolrCoreState.closeIndexWriter SolrCoreState ref count has reached 0 - closing IndexWriter
   [junit4]   2> 65993 T165 oasu.DefaultSolrCoreState.closeIndexWriter closing IndexWriter with IndexWriterCloser
   [junit4]   2> 65996 T165 oasc.SolrCore.closeSearcher [collection1] Closing main searcher on request.
   [junit4]   2> 65996 T165 oasc.CachingDirectoryFactory.close Closing MockDirectoryFactory - 2 directories currently being tracked
   [junit4]   2> 65997 T165 oasc.CachingDirectoryFactory.closeCacheValue looking to close ./org.apache.solr.client.solrj.impl.CloudSolrServerTest-1393638762808/jetty4/index [CachedDir<<refCount=0;path=./org.apache.solr.client.solrj.impl.CloudSolrServerTest-1393638762808/jetty4/index;done=false>>]
   [junit4]   2> 65997 T165 oasc.CachingDirectoryFactory.close Closing directory: ./org.apache.solr.client.solrj.impl.CloudSolrServerTest-1393638762808/jetty4/index
   [junit4]   2> 65997 T165 oasc.CachingDirectoryFactory.closeCacheValue looking to close ./org.apache.solr.client.solrj.impl.CloudSolrServerTest-1393638762808/jetty4 [CachedDir<<refCount=0;path=./org.apache.solr.client.solrj.impl.CloudSolrServerTest-1393638762808/jetty4;done=false>>]
   [junit4]   2> 65998 T165 oasc.CachingDirectoryFactory.close Closing directory: ./org.apache.solr.client.solrj.impl.CloudSolrServerTest-1393638762808/jetty4
   [junit4]   2> 65998 T165 oascc.ZkStateReader$3.process WARN ZooKeeper watch triggered, but Solr cannot talk to ZK
   [junit4]   2> 65998 T165 oasc.LeaderElector$1.process WARN  org.apache.zookeeper.KeeperException$SessionExpiredException: KeeperErrorCode = Session expired for /overseer_elect/election
   [junit4]   2> 	at org.apache.zookeeper.KeeperException.create(KeeperException.java:127)
   [junit4]   2> 	at org.apache.zookeeper.KeeperException.create(KeeperException.java:51)
   [junit4]   2> 	at org.apache.zookeeper.ZooKeeper.getChildren(ZooKeeper.java:1468)
   [junit4]   2> 	at org.apache.solr.common.cloud.SolrZkClient$6.execute(SolrZkClient.java:257)
   [junit4]   2> 	at org.apache.solr.common.cloud.SolrZkClient$6.execute(SolrZkClient.java:254)
   [junit4]   2> 	at org.apache.solr.common.cloud.ZkCmdExecutor.retryOperation(ZkCmdExecutor.java:73)
   [junit4]   2> 	at org.apache.solr.common.cloud.SolrZkClient.getChildren(SolrZkClient.java:254)
   [junit4]   2> 	at org.apache.solr.cloud.LeaderElector.checkIfIamLeader(LeaderElector.java:92)
   [junit4]   2> 	at org.apache.solr.cloud.LeaderElector.access$000(LeaderElector.java:55)
   [junit4]   2> 	at org.apache.solr.cloud.LeaderElector$1.process(LeaderElector.java:137)
   [junit4]   2> 	at org.apache.zookeeper.ClientCnxn$EventThread.processEvent(ClientCnxn.java:519)
   [junit4]   2> 	at org.apache.zookeeper.ClientCnxn$EventThread.run(ClientCnxn.java:495)
   [junit4]   2> 
   [junit4]   2> NOTE: test params are: codec=Lucene45, sim=DefaultSimilarity, locale=ar_SA, timezone=Europe/Paris
   [junit4]   2> NOTE: Linux 3.8.0-36-generic amd64/Oracle Corporation 1.7.0_51 (64-bit)/cpus=8,threads=1,free=35346352,total=131072000
   [junit4]   2> NOTE: All tests run in this JVM: [TestCoreAdmin, LargeVolumeJettyTest, AnlysisResponseBaseTest, CloudSolrServerTest]
   [junit4] Completed on J0 in 57.85s, 2 tests, 1 error <<< FAILURES!
   [junit4] 
   [junit4] Suite: org.apache.solr.client.solrj.util.ClientUtilsTest
   [junit4] Completed on J0 in 0.04s, 1 test
   [junit4] 
   [junit4] Suite: org.apache.solr.common.util.TestXMLEscaping
   [junit4] Completed on J0 in 0.05s, 7 tests
   [junit4] 
   [junit4] Suite: org.apache.solr.common.util.URLUtilTest
   [junit4] Completed on J0 in 0.01s, 1 test
   [junit4] 
   [junit4] Suite: org.apache.solr.client.solrj.SolrExceptionTest
   [junit4] Completed on J0 in 0.06s, 1 test
   [junit4] 
   [junit4] Suite: org.apache.solr.common.util.TestJavaBinCodec
   [junit4] Completed on J0 in 0.53s, 1 test
   [junit4] 
   [junit4] Suite: org.apache.solr.client.solrj.request.TestUpdateRequestCodec
   [junit4] Completed on J0 in 0.06s, 3 tests
   [junit4] 
   [junit4] Suite: org.apache.solr.client.solrj.SolrExampleXMLTest
   [junit4] Completed on J0 in 9.18s, 26 tests
   [junit4] 
   [junit4] Suite: org.apache.solr.client.solrj.response.NoOpResponseParserTest
   [junit4] Completed on J0 in 1.58s, 3 tests
   [junit4] 
   [junit4] Suite: org.apache.solr.client.solrj.impl.LBHttpSolrServerTest
   [junit4] Completed on J0 in 0.00s, 1 test
   [junit4] 
   [junit4] Suite: org.apache.solr.client.solrj.embedded.SolrExampleStreamingTest
   [junit4] Completed on J0 in 20.83s, 27 tests
   [junit4] 
   [junit4] Suite: org.apache.solr.client.solrj.TestLBHttpSolrServer
   [junit4] Completed on J1 in 38.07s, 3 tests
   [junit4] 
   [junit4] Suite: org.apache.solr.client.solrj.embedded.SolrExampleJettyTest
   [junit4] Completed on J1 in 6.97s, 27 tests
   [junit4] 
   [junit4] Suite: org.apache.solr.client.solrj.embedded.SolrExampleEmbeddedTest
   [junit4] Completed on J1 in 6.65s, 26 tests
   [junit4] 
   [junit4] Suite: org.apache.solr.client.solrj.impl.BasicHttpSolrServerTest
   [junit4] Completed on J1 in 3.04s, 10 tests
   [junit4] 
   [junit4] Suite: org.apache.solr.client.solrj.embedded.SolrExampleStreamingBinaryTest
   [junit4] Completed on J0 in 19.16s, 27 tests
   [junit4] 
   [junit4] Suite: org.apache.solr.client.solrj.embedded.LargeVolumeBinaryJettyTest
   [junit4] Completed on J1 in 1.35s, 1 test
   [junit4] 
   [junit4] Suite: org.apache.solr.client.solrj.embedded.JettyWebappTest
   [junit4] Completed on J0 in 1.26s, 1 test
   [junit4] 
   [junit4] Suite: org.apache.solr.client.solrj.embedded.LargeVolumeEmbeddedTest
   [junit4] Completed on J1 in 1.82s, 1 test
   [junit4] 
   [junit4] Suite: org.apache.solr.common.params.SolrParamTest
   [junit4] Completed on J1 in 0.03s, 1 test
   [junit4] 
   [junit4] Suite: org.apache.solr.client.solrj.response.TestSpellCheckResponse
   [junit4] Completed on J0 in 2.21s, 3 tests
   [junit4] 
   [junit4] Suite: org.apache.solr.client.solrj.embedded.TestEmbeddedSolrServer
   [junit4] Completed on J0 in 0.68s, 2 tests
   [junit4] 
   [junit4] Suite: org.apache.solr.client.solrj.response.QueryResponseTest
   [junit4] Completed on J0 in 0.11s, 4 tests
   [junit4] 
   [junit4] Suite: org.apache.solr.client.solrj.response.TermsResponseTest
   [junit4] Completed on J1 in 1.86s, 1 test
   [junit4] 
   [junit4] Suite: org.apache.solr.client.solrj.beans.TestDocumentObjectBinder
   [junit4] Completed on J1 in 0.04s, 5 tests
   [junit4] 
   [junit4] Suite: org.apache.solr.common.util.TestNamedListCodec
   [junit4] Completed on J0 in 0.32s, 4 tests
   [junit4] 
   [junit4] Suite: org.apache.solr.client.solrj.SolrQueryTest
   [junit4] Completed on J1 in 0.07s, 15 tests
   [junit4] 
   [junit4] Suite: org.apache.solr.common.util.TestHash
   [junit4] Completed on J0 in 0.08s, 2 tests
   [junit4] 
   [junit4] Suite: org.apache.solr.common.util.ContentStreamTest
   [junit4] Completed on J1 in 0.08s, 3 tests
   [junit4] 
   [junit4] Suite: org.apache.solr.common.params.ModifiableSolrParamsTest
   [junit4] Completed on J0 in 0.05s, 5 tests
   [junit4] 
   [junit4] Suite: org.apache.solr.client.solrj.response.DocumentAnalysisResponseTest
   [junit4] Completed on J1 in 0.02s, 1 test
   [junit4] 
   [junit4] Suite: org.apache.solr.common.SolrDocumentTest
   [junit4] Completed on J0 in 0.04s, 5 tests
   [junit4] 
   [junit4] Suite: org.apache.solr.client.solrj.request.SolrPingTest
   [junit4] Completed on J1 in 1.04s, 2 tests
   [junit4] 
   [junit4] 
   [junit4] Tests with failures:
   [junit4]   - org.apache.solr.client.solrj.impl.CloudSolrServerTest.testShutdown
   [junit4] 
   [junit4] 
   [junit4] JVM J0:     1.40 ..   127.55 =   126.15s
   [junit4] JVM J1:     1.40 ..   128.75 =   127.35s
   [junit4] Execution time total: 2 minutes 8 seconds
   [junit4] Tests summary: 48 suites, 280 tests, 1 error

BUILD FAILED
/mnt/ssd/jenkins/workspace/Lucene-Solr-4.x-Linux/build.xml:471: The following error occurred while executing this line:
/mnt/ssd/jenkins/workspace/Lucene-Solr-4.x-Linux/build.xml:451: The following error occurred while executing this line:
/mnt/ssd/jenkins/workspace/Lucene-Solr-4.x-Linux/build.xml:39: The following error occurred while executing this line:
/mnt/ssd/jenkins/workspace/Lucene-Solr-4.x-Linux/extra-targets.xml:37: The following error occurred while executing this line:
/mnt/ssd/jenkins/workspace/Lucene-Solr-4.x-Linux/solr/build.xml:202: The following error occurred while executing this line:
/mnt/ssd/jenkins/workspace/Lucene-Solr-4.x-Linux/solr/common-build.xml:490: The following error occurred while executing this line:
/mnt/ssd/jenkins/workspace/Lucene-Solr-4.x-Linux/lucene/common-build.xml:1278: The following error occurred while executing this line:
/mnt/ssd/jenkins/workspace/Lucene-Solr-4.x-Linux/lucene/common-build.xml:911: There were test failures: 48 suites, 280 tests, 1 error

Total time: 50 minutes 53 seconds
Build step 'Invoke Ant' marked build as failure
Description set: Java: 64bit/jdk1.7.0_51 -XX:+UseCompressedOops -XX:+UseG1GC -XX:-UseSuperWord
Archiving artifacts
Recording test results
Email was triggered for: Failure
Sending email for trigger: Failure



Mime
View raw message