lucene-dev mailing list archives

Site index · List index
Message view « Date » · « Thread »
Top « Date » · « Thread »
From Apache Jenkins Server <jenk...@builds.apache.org>
Subject [JENKINS] Lucene-Solr-NightlyTests-4.x - Build # 529 - Still Failing
Date Wed, 05 Mar 2014 08:04:42 GMT
Build: https://builds.apache.org/job/Lucene-Solr-NightlyTests-4.x/529/

All tests passed

Build Log:
[...truncated 1622 lines...]
   [junit4] JVM J0: stdout was not empty, see: /usr/home/hudson/hudson-slave/workspace/Lucene-Solr-NightlyTests-4.x/lucene/build/core/test/temp/junit4-J0-20140305_072211_230.sysout
   [junit4] >>> JVM J0: stdout (verbatim) ----
   [junit4] java.lang.OutOfMemoryError: Java heap space
   [junit4] Dumping heap to /usr/home/hudson/hudson-slave/workspace/Lucene-Solr-NightlyTests-4.x/heapdumps/java_pid30361.hprof
...
   [junit4] Heap dump file created [426784579 bytes in 0.685 secs]
   [junit4] <<< JVM J0: EOF ----

   [junit4] JVM J0: stderr was not empty, see: /usr/home/hudson/hudson-slave/workspace/Lucene-Solr-NightlyTests-4.x/lucene/build/core/test/temp/junit4-J0-20140305_072211_230.syserr
   [junit4] >>> JVM J0: stderr (verbatim) ----
   [junit4] WARN: Unhandled exception in event serialization. -> java.lang.OutOfMemoryError:
GC overhead limit exceeded (stack unavailable; OOM)
   [junit4] WARN: Event serializer exception. -> java.lang.OutOfMemoryError: GC overhead
limit exceeded (stack unavailable; OOM)
   [junit4] WARN: Event serializer exception. -> java.io.IOException: Serializer already
closed.
   [junit4] 	at com.carrotsearch.ant.tasks.junit4.events.Serializer.serialize(Serializer.java:41)
   [junit4] 	at com.carrotsearch.ant.tasks.junit4.slave.RunListenerEmitter.testFinished(RunListenerEmitter.java:113)
   [junit4] 	at com.carrotsearch.ant.tasks.junit4.slave.NoExceptionRunListenerDecorator.testFinished(NoExceptionRunListenerDecorator.java:47)
   [junit4] 	at com.carrotsearch.ant.tasks.junit4.slave.BeforeAfterRunListenerDecorator.testFinished(BeforeAfterRunListenerDecorator.java:51)
   [junit4] 	at com.carrotsearch.ant.tasks.junit4.slave.OrderedRunNotifier$7.notifyListener(OrderedRunNotifier.java:179)
   [junit4] 	at com.carrotsearch.ant.tasks.junit4.slave.OrderedRunNotifier$SafeNotifier.run(OrderedRunNotifier.java:63)
   [junit4] 	at com.carrotsearch.ant.tasks.junit4.slave.OrderedRunNotifier.fireTestFinished(OrderedRunNotifier.java:176)
   [junit4] 	at com.carrotsearch.randomizedtesting.ThreadLeakControl$SubNotifier.fireTestFinished(ThreadLeakControl.java:197)
   [junit4] 	at com.carrotsearch.randomizedtesting.RandomizedRunner.runSingleTest(RandomizedRunner.java:755)
   [junit4] 	at com.carrotsearch.randomizedtesting.RandomizedRunner$3.evaluate(RandomizedRunner.java:648)
   [junit4] 	at com.carrotsearch.randomizedtesting.RandomizedRunner$4.evaluate(RandomizedRunner.java:682)
   [junit4] 	at com.carrotsearch.randomizedtesting.RandomizedRunner$5.evaluate(RandomizedRunner.java:693)
   [junit4] 	at org.apache.lucene.util.AbstractBeforeAfterRule$1.evaluate(AbstractBeforeAfterRule.java:46)
   [junit4] 	at org.apache.lucene.util.TestRuleStoreClassName$1.evaluate(TestRuleStoreClassName.java:42)
   [junit4] 	at com.carrotsearch.randomizedtesting.rules.SystemPropertiesInvariantRule$1.evaluate(SystemPropertiesInvariantRule.java:55)
   [junit4] 	at com.carrotsearch.randomizedtesting.rules.NoShadowingOrOverridesOnMethodsRule$1.evaluate(NoShadowingOrOverridesOnMethodsRule.java:39)
   [junit4] 	at com.carrotsearch.randomizedtesting.rules.NoShadowingOrOverridesOnMethodsRule$1.evaluate(NoShadowingOrOverridesOnMethodsRule.java:39)
   [junit4] 	at com.carrotsearch.randomizedtesting.rules.StatementAdapter.evaluate(StatementAdapter.java:36)
   [junit4] 	at org.apache.lucene.util.TestRuleAssertionsRequired$1.evaluate(TestRuleAssertionsRequired.java:43)
   [junit4] 	at org.apache.lucene.util.TestRuleMarkFailure$1.evaluate(TestRuleMarkFailure.java:48)
   [junit4] 	at org.apache.lucene.util.TestRuleIgnoreAfterMaxFailures$1.evaluate(TestRuleIgnoreAfterMaxFailures.java:70)
   [junit4] 	at org.apache.lucene.util.TestRuleIgnoreTestSuites$1.evaluate(TestRuleIgnoreTestSuites.java:55)
   [junit4] 	at com.carrotsearch.randomizedtesting.rules.StatementAdapter.evaluate(StatementAdapter.java:36)
   [junit4] 	at com.carrotsearch.randomizedtesting.ThreadLeakControl$StatementRunner.run(ThreadLeakControl.java:358)
   [junit4] 	at java.lang.Thread.run(Thread.java:679)
   [junit4] 
   [junit4] WARN: Event serializer exception. -> java.io.IOException: Serializer already
closed.
   [junit4] 	at com.carrotsearch.ant.tasks.junit4.events.Serializer.serialize(Serializer.java:41)
   [junit4] 	at com.carrotsearch.ant.tasks.junit4.slave.RunListenerEmitter.testRunFinished(RunListenerEmitter.java:120)
   [junit4] 	at com.carrotsearch.ant.tasks.junit4.slave.NoExceptionRunListenerDecorator.testRunFinished(NoExceptionRunListenerDecorator.java:31)
   [junit4] 	at com.carrotsearch.ant.tasks.junit4.slave.BeforeAfterRunListenerDecorator.testRunFinished(BeforeAfterRunListenerDecorator.java:33)
   [junit4] 	at com.carrotsearch.ant.tasks.junit4.slave.OrderedRunNotifier$2.notifyListener(OrderedRunNotifier.java:94)
   [junit4] 	at com.carrotsearch.ant.tasks.junit4.slave.OrderedRunNotifier$SafeNotifier.run(OrderedRunNotifier.java:63)
   [junit4] 	at com.carrotsearch.ant.tasks.junit4.slave.OrderedRunNotifier.fireTestRunFinished(OrderedRunNotifier.java:91)
   [junit4] 	at com.carrotsearch.ant.tasks.junit4.slave.SlaveMain.execute(SlaveMain.java:181)
   [junit4] 	at com.carrotsearch.ant.tasks.junit4.slave.SlaveMain.main(SlaveMain.java:275)
   [junit4] 	at com.carrotsearch.ant.tasks.junit4.slave.SlaveMainSafe.main(SlaveMainSafe.java:12)
   [junit4] 
   [junit4] WARN: Exception at main loop level. -> java.lang.RuntimeException: java.io.IOException:
Serializer already closed.
   [junit4] 	at com.carrotsearch.ant.tasks.junit4.slave.StdInLineIterator.computeNext(StdInLineIterator.java:34)
   [junit4] 	at com.carrotsearch.ant.tasks.junit4.slave.StdInLineIterator.computeNext(StdInLineIterator.java:13)
   [junit4] 	at com.carrotsearch.ant.tasks.junit4.dependencies.com.google.common.collect.AbstractIterator.tryToComputeNext(AbstractIterator.java:143)
   [junit4] 	at com.carrotsearch.ant.tasks.junit4.dependencies.com.google.common.collect.AbstractIterator.hasNext(AbstractIterator.java:138)
   [junit4] 	at com.carrotsearch.ant.tasks.junit4.dependencies.com.google.common.collect.Iterators$5.hasNext(Iterators.java:596)
   [junit4] 	at com.carrotsearch.ant.tasks.junit4.slave.SlaveMain.execute(SlaveMain.java:169)
   [junit4] 	at com.carrotsearch.ant.tasks.junit4.slave.SlaveMain.main(SlaveMain.java:275)
   [junit4] 	at com.carrotsearch.ant.tasks.junit4.slave.SlaveMainSafe.main(SlaveMainSafe.java:12)
   [junit4] Caused by: java.io.IOException: Serializer already closed.
   [junit4] 	at com.carrotsearch.ant.tasks.junit4.events.Serializer.serialize(Serializer.java:41)
   [junit4] 	at com.carrotsearch.ant.tasks.junit4.slave.StdInLineIterator.computeNext(StdInLineIterator.java:28)
   [junit4] 	... 7 more
   [junit4] <<< JVM J0: EOF ----

[...truncated 39 lines...]
   [junit4] ERROR: JVM J0 ended with an exception, command line: /usr/local/openjdk6/jre/bin/java
-XX:+HeapDumpOnOutOfMemoryError -XX:HeapDumpPath=/usr/home/hudson/hudson-slave/workspace/Lucene-Solr-NightlyTests-4.x/heapdumps
-Dtests.prefix=tests -Dtests.seed=2249C0CE5C759158 -Xmx512M -Dtests.iters= -Dtests.verbose=false
-Dtests.infostream=false -Dtests.codec=random -Dtests.postingsformat=random -Dtests.docvaluesformat=random
-Dtests.locale=random -Dtests.timezone=random -Dtests.directory=random -Dtests.linedocsfile=/home/hudson/lucene-data/enwiki.random.lines.txt
-Dtests.luceneMatchVersion=4.8 -Dtests.cleanthreads=perMethod -Djava.util.logging.config.file=/usr/home/hudson/hudson-slave/workspace/Lucene-Solr-NightlyTests-4.x/lucene/tools/junit4/logging.properties
-Dtests.nightly=true -Dtests.weekly=false -Dtests.slow=true -Dtests.asserts.gracious=false
-Dtests.multiplier=2 -DtempDir=. -Djava.io.tmpdir=. -Djunit4.tempDir=/usr/home/hudson/hudson-slave/workspace/Lucene-Solr-NightlyTests-4.x/lucene/build/core/test/temp
-Dclover.db.dir=/usr/home/hudson/hudson-slave/workspace/Lucene-Solr-NightlyTests-4.x/lucene/build/clover/db
-Djava.security.manager=org.apache.lucene.util.TestSecurityManager -Djava.security.policy=/usr/home/hudson/hudson-slave/workspace/Lucene-Solr-NightlyTests-4.x/lucene/tools/junit4/tests.policy
-Dlucene.version=4.8-SNAPSHOT -Djetty.testMode=1 -Djetty.insecurerandom=1 -Dsolr.directoryFactory=org.apache.solr.core.MockDirectoryFactory
-Djava.awt.headless=true -Djdk.map.althashing.threshold=0 -Dtests.jettyConnector=Socket -Dtests.disableHdfs=true
-Dfile.encoding=US-ASCII -classpath /usr/home/hudson/hudson-slave/workspace/Lucene-Solr-NightlyTests-4.x/lucene/build/test-framework/classes/java:/usr/home/hudson/hudson-slave/workspace/Lucene-Solr-NightlyTests-4.x/lucene/build/codecs/classes/java:/usr/home/hudson/hudson-slave/workspace/Lucene-Solr-NightlyTests-4.x/lucene/test-framework/lib/junit-4.10.jar:/usr/home/hudson/hudson-slave/workspace/Lucene-Solr-NightlyTests-4.x/lucene/test-framework/lib/randomizedtesting-runner-2.0.13.jar:/usr/home/hudson/hudson-slave/workspace/Lucene-Solr-NightlyTests-4.x/lucene/build/core/classes/java:/usr/home/hudson/hudson-slave/workspace/Lucene-Solr-NightlyTests-4.x/lucene/build/core/classes/test:/home/hudson/hudson-slave/tools/hudson.tasks.Ant_AntInstallation/ant-1.8.2/lib/ant-launcher.jar:/home/hudson/.ant/lib/ivy-2.3.0.jar:/home/hudson/hudson-slave/tools/hudson.tasks.Ant_AntInstallation/ant-1.8.2/lib/ant-commons-logging.jar:/home/hudson/hudson-slave/tools/hudson.tasks.Ant_AntInstallation/ant-1.8.2/lib/ant-apache-regexp.jar:/home/hudson/hudson-slave/tools/hudson.tasks.Ant_AntInstallation/ant-1.8.2/lib/ant-apache-oro.jar:/home/hudson/hudson-slave/tools/hudson.tasks.Ant_AntInstallation/ant-1.8.2/lib/ant-swing.jar:/home/hudson/hudson-slave/tools/hudson.tasks.Ant_AntInstallation/ant-1.8.2/lib/ant-jdepend.jar:/home/hudson/hudson-slave/tools/hudson.tasks.Ant_AntInstallation/ant-1.8.2/lib/ant-apache-xalan2.jar:/home/hudson/hudson-slave/tools/hudson.tasks.Ant_AntInstallation/ant-1.8.2/lib/ant-apache-bsf.jar:/home/hudson/hudson-slave/tools/hudson.tasks.Ant_AntInstallation/ant-1.8.2/lib/ant-junit4.jar:/home/hudson/hudson-slave/tools/hudson.tasks.Ant_AntInstallation/ant-1.8.2/lib/ant-commons-net.jar:/home/hudson/hudson-slave/tools/hudson.tasks.Ant_AntInstallation/ant-1.8.2/lib/ant-antlr.jar:/home/hudson/hudson-slave/tools/hudson.tasks.Ant_AntInstallation/ant-1.8.2/lib/ant-junit.jar:/home/hudson/hudson-slave/tools/hudson.tasks.Ant_AntInstallation/ant-1.8.2/lib/ant-jmf.jar:/home/hudson/hudson-slave/tools/hudson.tasks.Ant_AntInstallation/ant-1.8.2/lib/ant-netrexx.jar:/home/hudson/hudson-slave/tools/hudson.tasks.Ant_AntInstallation/ant-1.8.2/lib/ant-apache-log4j.jar:/home/hudson/hudson-slave/tools/hudson.tasks.Ant_AntInstallation/ant-1.8.2/lib/ant-apache-resolver.jar:/home/hudson/hudson-slave/tools/hudson.tasks.Ant_AntInstallation/ant-1.8.2/lib/ant.jar:/home/hudson/hudson-slave/tools/hudson.tasks.Ant_AntInstallation/ant-1.8.2/lib/ant-jsch.jar:/home/hudson/hudson-slave/tools/hudson.tasks.Ant_AntInstallation/ant-1.8.2/lib/ant-testutil.jar:/home/hudson/hudson-slave/tools/hudson.tasks.Ant_AntInstallation/ant-1.8.2/lib/ant-apache-bcel.jar:/home/hudson/hudson-slave/tools/hudson.tasks.Ant_AntInstallation/ant-1.8.2/lib/ant-jai.jar:/home/hudson/hudson-slave/tools/hudson.tasks.Ant_AntInstallation/ant-1.8.2/lib/ant-javamail.jar:/usr/local/openjdk6/lib/tools.jar:/home/hudson/.ivy2/cache/com.carrotsearch.randomizedtesting/junit4-ant/jars/junit4-ant-2.0.13.jar
-ea:org.apache.lucene... -ea:org.apache.solr... com.carrotsearch.ant.tasks.junit4.slave.SlaveMainSafe
-eventsfile /usr/home/hudson/hudson-slave/workspace/Lucene-Solr-NightlyTests-4.x/lucene/build/core/test/temp/junit4-J0-20140305_072211_230.events
@/usr/home/hudson/hudson-slave/workspace/Lucene-Solr-NightlyTests-4.x/lucene/build/core/test/temp/junit4-J0-20140305_072211_230.suites
   [junit4] ERROR: JVM J0 ended with an exception: Forked process returned with error code:
240. Very likely a JVM crash.  Process output piped in logs above.
   [junit4] 	at com.carrotsearch.ant.tasks.junit4.JUnit4.executeSlave(JUnit4.java:1373)
   [junit4] 	at com.carrotsearch.ant.tasks.junit4.JUnit4.access$000(JUnit4.java:119)
   [junit4] 	at com.carrotsearch.ant.tasks.junit4.JUnit4$2.call(JUnit4.java:911)
   [junit4] 	at com.carrotsearch.ant.tasks.junit4.JUnit4$2.call(JUnit4.java:908)
   [junit4] 	at java.util.concurrent.FutureTask$Sync.innerRun(FutureTask.java:334)
   [junit4] 	at java.util.concurrent.FutureTask.run(FutureTask.java:166)
   [junit4] 	at java.util.concurrent.ThreadPoolExecutor.runWorker(ThreadPoolExecutor.java:1146)
   [junit4] 	at java.util.concurrent.ThreadPoolExecutor$Worker.run(ThreadPoolExecutor.java:615)
   [junit4] 	at java.lang.Thread.run(Thread.java:679)

BUILD FAILED
/usr/home/hudson/hudson-slave/workspace/Lucene-Solr-NightlyTests-4.x/build.xml:478: The following
error occurred while executing this line:
/usr/home/hudson/hudson-slave/workspace/Lucene-Solr-NightlyTests-4.x/build.xml:451: The following
error occurred while executing this line:
/usr/home/hudson/hudson-slave/workspace/Lucene-Solr-NightlyTests-4.x/build.xml:39: The following
error occurred while executing this line:
/usr/home/hudson/hudson-slave/workspace/Lucene-Solr-NightlyTests-4.x/extra-targets.xml:37:
The following error occurred while executing this line:
/usr/home/hudson/hudson-slave/workspace/Lucene-Solr-NightlyTests-4.x/lucene/build.xml:49:
The following error occurred while executing this line:
/usr/home/hudson/hudson-slave/workspace/Lucene-Solr-NightlyTests-4.x/lucene/common-build.xml:1278:
The following error occurred while executing this line:
/usr/home/hudson/hudson-slave/workspace/Lucene-Solr-NightlyTests-4.x/lucene/common-build.xml:911:
At least one slave process threw an exception, first: Forked process returned with error code:
240. Very likely a JVM crash.  Process output piped in logs above.

Total time: 42 minutes 19 seconds
Build step 'Invoke Ant' marked build as failure
Archiving artifacts
Recording test results
Email was triggered for: Failure
Sending email for trigger: Failure



Mime
View raw message