lucene-dev mailing list archives

Site index · List index
Message view « Date » · « Thread »
Top « Date » · « Thread »
From Apache Jenkins Server <jenk...@builds.apache.org>
Subject [JENKINS] Lucene-Solr-SmokeRelease-4.x - Build # 155 - Still Failing
Date Sat, 01 Mar 2014 17:18:28 GMT
Build: https://builds.apache.org/job/Lucene-Solr-SmokeRelease-4.x/155/

No tests ran.

Build Log:
[...truncated 51266 lines...]
prepare-release-no-sign:
    [mkdir] Created dir: /usr/home/hudson/hudson-slave/workspace/Lucene-Solr-SmokeRelease-4.x/lucene/build/fakeRelease
     [copy] Copying 431 files to /usr/home/hudson/hudson-slave/workspace/Lucene-Solr-SmokeRelease-4.x/lucene/build/fakeRelease/lucene
     [copy] Copying 239 files to /usr/home/hudson/hudson-slave/workspace/Lucene-Solr-SmokeRelease-4.x/lucene/build/fakeRelease/solr
     [exec] JAVA6_HOME is /home/hudson/tools/java/latest1.6
     [exec] JAVA7_HOME is /home/hudson/tools/java/latest1.7
     [exec] NOTE: output encoding is US-ASCII
     [exec] 
     [exec] Load release URL "file:/usr/home/hudson/hudson-slave/workspace/Lucene-Solr-SmokeRelease-4.x/lucene/build/fakeRelease/"...
     [exec] 
     [exec] Test Lucene...
     [exec]   test basics...
     [exec]   get KEYS
     [exec]     0.1 MB in 0.01 sec (13.5 MB/sec)
     [exec]   check changes HTML...
     [exec]   download lucene-4.8.0-src.tgz...
     [exec]     27.4 MB in 0.04 sec (652.5 MB/sec)
     [exec]     verify md5/sha1 digests
     [exec]   download lucene-4.8.0.tgz...
     [exec]     61.7 MB in 0.08 sec (814.9 MB/sec)
     [exec]     verify md5/sha1 digests
     [exec]   download lucene-4.8.0.zip...
     [exec]     71.4 MB in 0.14 sec (499.3 MB/sec)
     [exec]     verify md5/sha1 digests
     [exec]   unpack lucene-4.8.0.tgz...
     [exec]     verify JAR metadata/identity/no javax.* or java.* classes...
     [exec]     test demo with 1.6...
     [exec]       got 5657 hits for query "lucene"
     [exec]     test demo with 1.7...
     [exec]       got 5657 hits for query "lucene"
     [exec]     check Lucene's javadoc JAR
     [exec]   unpack lucene-4.8.0.zip...
     [exec]     verify JAR metadata/identity/no javax.* or java.* classes...
     [exec]     test demo with 1.6...
     [exec]       got 5657 hits for query "lucene"
     [exec]     test demo with 1.7...
     [exec]       got 5657 hits for query "lucene"
     [exec]     check Lucene's javadoc JAR
     [exec]   unpack lucene-4.8.0-src.tgz...
     [exec]     make sure no JARs/WARs in src dist...
     [exec]     run "ant validate"
     [exec]     run tests w/ Java 6 and testArgs='-Dtests.jettyConnector=Socket  -Dtests.disableHdfs=true'...
     [exec]     test demo with 1.6...
     [exec]       got 243 hits for query "lucene"
     [exec]     generate javadocs w/ Java 6...
     [exec]     run tests w/ Java 7 and testArgs='-Dtests.jettyConnector=Socket  -Dtests.disableHdfs=true'...
     [exec]     test demo with 1.7...
     [exec]       got 243 hits for query "lucene"
     [exec]     generate javadocs w/ Java 7...
     [exec] 
     [exec] Crawl/parse...
     [exec] 
     [exec] Verify...
     [exec] 
     [exec] Test Solr...
     [exec]   test basics...
     [exec]   get KEYS
     [exec]     0.1 MB in 0.00 sec (86.1 MB/sec)
     [exec]   check changes HTML...
     [exec]   download solr-4.8.0-src.tgz...
     [exec]     32.5 MB in 0.05 sec (653.3 MB/sec)
     [exec]     verify md5/sha1 digests
     [exec]   download solr-4.8.0.tgz...
     [exec]     144.9 MB in 0.82 sec (176.4 MB/sec)
     [exec]     verify md5/sha1 digests
     [exec]   download solr-4.8.0.zip...
     [exec]     150.2 MB in 0.27 sec (552.1 MB/sec)
     [exec]     verify md5/sha1 digests
     [exec]   unpack solr-4.8.0.tgz...
     [exec]     verify JAR metadata/identity/no javax.* or java.* classes...
     [exec]     unpack lucene-4.8.0.tgz...
     [exec]       **WARNING**: skipping check of /usr/home/hudson/hudson-slave/workspace/Lucene-Solr-SmokeRelease-4.x/lucene/build/fakeReleaseTmp/unpack/solr-4.8.0/contrib/dataimporthandler/lib/mail-1.4.1.jar: it has javax.* classes
     [exec]       **WARNING**: skipping check of /usr/home/hudson/hudson-slave/workspace/Lucene-Solr-SmokeRelease-4.x/lucene/build/fakeReleaseTmp/unpack/solr-4.8.0/contrib/dataimporthandler/lib/activation-1.1.jar: it has javax.* classes
     [exec]     verify WAR metadata/contained JAR identity/no javax.* or java.* classes...
     [exec]     unpack lucene-4.8.0.tgz...
     [exec]     copying unpacked distribution for Java 6 ...
     [exec]     test solr example w/ Java 6...
     [exec]       start Solr instance (log=/usr/home/hudson/hudson-slave/workspace/Lucene-Solr-SmokeRelease-4.x/lucene/build/fakeReleaseTmp/unpack/solr-4.8.0-java6/solr-example.log)...
     [exec]       startup done
     [exec]       test utf8...
     [exec]       index example docs...
     [exec]       run query...
     [exec]       stop server (SIGINT)...
     [exec]     copying unpacked distribution for Java 7 ...
     [exec]     test solr example w/ Java 7...
     [exec]       start Solr instance (log=/usr/home/hudson/hudson-slave/workspace/Lucene-Solr-SmokeRelease-4.x/lucene/build/fakeReleaseTmp/unpack/solr-4.8.0-java7/solr-example.log)...
     [exec]       startup done
     [exec]       test utf8...
     [exec]       index example docs...
     [exec]       run query...
     [exec]       stop server (SIGINT)...
     [exec]   unpack solr-4.8.0.zip...
     [exec]     verify JAR metadata/identity/no javax.* or java.* classes...
     [exec]     unpack lucene-4.8.0.tgz...
     [exec]       **WARNING**: skipping check of /usr/home/hudson/hudson-slave/workspace/Lucene-Solr-SmokeRelease-4.x/lucene/build/fakeReleaseTmp/unpack/solr-4.8.0/contrib/dataimporthandler/lib/mail-1.4.1.jar: it has javax.* classes
     [exec]       **WARNING**: skipping check of /usr/home/hudson/hudson-slave/workspace/Lucene-Solr-SmokeRelease-4.x/lucene/build/fakeReleaseTmp/unpack/solr-4.8.0/contrib/dataimporthandler/lib/activation-1.1.jar: it has javax.* classes
     [exec]     verify WAR metadata/contained JAR identity/no javax.* or java.* classes...
     [exec]     unpack lucene-4.8.0.tgz...
     [exec]     copying unpacked distribution for Java 6 ...
     [exec]     test solr example w/ Java 6...
     [exec]       start Solr instance (log=/usr/home/hudson/hudson-slave/workspace/Lucene-Solr-SmokeRelease-4.x/lucene/build/fakeReleaseTmp/unpack/solr-4.8.0-java6/solr-example.log)...
     [exec]       startup done
     [exec]       test utf8...
     [exec]       index example docs...
     [exec]       run query...
     [exec]       stop server (SIGINT)...
     [exec]     copying unpacked distribution for Java 7 ...
     [exec]     test solr example w/ Java 7...
     [exec]       start Solr instance (log=/usr/home/hudson/hudson-slave/workspace/Lucene-Solr-SmokeRelease-4.x/lucene/build/fakeReleaseTmp/unpack/solr-4.8.0-java7/solr-example.log)...
     [exec]       startup done
     [exec]       test utf8...
     [exec]       index example docs...
     [exec]       run query...
     [exec]       stop server (SIGINT)...
     [exec]   unpack solr-4.8.0-src.tgz...
     [exec]     make sure no JARs/WARs in src dist...
     [exec]     run "ant validate"
     [exec]     run tests w/ Java 6 and testArgs='-Dtests.jettyConnector=Socket  -Dtests.disableHdfs=true'...
     [exec]     generate javadocs w/ Java 6...
     [exec] 
     [exec] /usr/home/hudson/hudson-slave/workspace/Lucene-Solr-SmokeRelease-4.x/lucene/build/fakeReleaseTmp/unpack/solr-4.8.0/solr/build/docs/solr-map-reduce/org/apache/solr/hadoop/package-summary.html
     [exec]   missing: SolrInputDocumentWritable
     [exec]   missing: SolrMapper<KEYIN,VALUEIN>
     [exec]   missing: SolrOutputFormat<K,V>
     [exec]   missing: UnbufferedDataInputInputStream
     [exec]   missing: Utils
     [exec]   missing: SolrCounters
     [exec] 
     [exec] /usr/home/hudson/hudson-slave/workspace/Lucene-Solr-SmokeRelease-4.x/lucene/build/fakeReleaseTmp/unpack/solr-4.8.0/solr/build/docs/solr-map-reduce/org/apache/solr/hadoop/morphline/package-summary.html
     [exec]   missing: MorphlineCounters
     [exec] 
     [exec] /usr/home/hudson/hudson-slave/workspace/Lucene-Solr-SmokeRelease-4.x/lucene/build/fakeReleaseTmp/unpack/solr-4.8.0/solr/build/docs/solr-map-reduce/org/apache/solr/hadoop/dedup/package-summary.html
     [exec]   missing: SolrInputDocumentComparator.TimeStampComparator
     [exec] 
     [exec] /usr/home/hudson/hudson-slave/workspace/Lucene-Solr-SmokeRelease-4.x/lucene/build/fakeReleaseTmp/unpack/solr-4.8.0/solr/build/docs/solr-cell/org/apache/solr/handler/extraction/package-summary.html
     [exec]   missing: SolrContentHandlerFactory
     [exec] 
     [exec] /usr/home/hudson/hudson-slave/workspace/Lucene-Solr-SmokeRelease-4.x/lucene/build/fakeReleaseTmp/unpack/solr-4.8.0/solr/build/docs/solr-core/org/apache/solr/package-summary.html
     [exec]   missing: SolrLogFormatter
     [exec]   missing: SolrLogFormatter.CoreInfo
     [exec]   missing: SolrLogFormatter.Method
     [exec] 
     [exec] /usr/home/hudson/hudson-slave/workspace/Lucene-Solr-SmokeRelease-4.x/lucene/build/fakeReleaseTmp/unpack/solr-4.8.0/solr/build/docs/solr-core/org/apache/solr/util/package-summary.html
     [exec]   missing: ConcurrentLFUCache.EvictionListener<K,V>
     [exec]   missing: ConcurrentLRUCache.EvictionListener<K,V>
     [exec]   missing: AdjustableSemaphore
     [exec]   missing: BCDUtils
     [exec]   missing: ConcurrentLFUCache.Stats
     [exec]   missing: ConcurrentLRUCache.Stats
     [exec]   missing: DefaultSolrThreadFactory
     [exec]   missing: DOMUtil
     [exec]   missing: FileUtils
     [exec]   missing: HdfsUtil
     [exec]   missing: IOUtils
     [exec]   missing: NumberUtils
     [exec]   missing: PrimUtils.IntComparator
     [exec]   missing: PropertiesInputStream
     [exec]   missing: PropertiesOutputStream
     [exec]   missing: SolrLogLayout
     [exec]   missing: SolrLogLayout.CoreInfo
     [exec]   missing: SolrLogLayout.Method
     [exec]   missing: VersionedFile
     [exec] 
     [exec] /usr/home/hudson/hudson-slave/workspace/Lucene-Solr-SmokeRelease-4.x/lucene/build/fakeReleaseTmp/unpack/solr-4.8.0/solr/build/docs/solr-core/org/apache/solr/util/plugin/package-summary.html
     [exec]   missing: SolrCoreAware
     [exec]   missing: MapPluginLoader<T extends MapInitializedPlugin>
     [exec]   missing: NamedListPluginLoader<T extends NamedListInitializedPlugin>
     [exec] 
     [exec] /usr/home/hudson/hudson-slave/workspace/Lucene-Solr-SmokeRelease-4.x/lucene/build/fakeReleaseTmp/unpack/solr-4.8.0/solr/build/docs/solr-core/org/apache/solr/cloud/package-summary.html
     [exec]   missing: RecoveryStrategy.RecoveryListener
     [exec]   missing: Assign
     [exec]   missing: CloudDescriptor
     [exec]   missing: DistributedQueue.QueueEvent
     [exec]   missing: ElectionContext
     [exec]   missing: OverseerCollectionProcessor
     [exec]   missing: OverseerSolrResponse
     [exec]   missing: RecoveryStrategy
     [exec]   missing: SolrZkServer
     [exec]   missing: SyncStrategy
     [exec]   missing: ZkCLI
     [exec] 
     [exec] /usr/home/hudson/hudson-slave/workspace/Lucene-Solr-SmokeRelease-4.x/lucene/build/fakeReleaseTmp/unpack/solr-4.8.0/solr/build/docs/solr-core/org/apache/solr/request/package-summary.html
     [exec]   missing: LocalSolrQueryRequest
     [exec]   missing: SolrRequestInfo
     [exec] 
     [exec] /usr/home/hudson/hudson-slave/workspace/Lucene-Solr-SmokeRelease-4.x/lucene/build/fakeReleaseTmp/unpack/solr-4.8.0/solr/build/docs/solr-core/org/apache/solr/search/package-summary.html
     [exec]   missing: ScoreFilter
     [exec]   missing: SolrSortField
     [exec]   missing: CollapsingQParserPlugin.CollapseScore
     [exec]   missing: DocSetCollector
     [exec]   missing: DocSetDelegateCollector
     [exec]   missing: ExtendedDismaxQParser.Clause
     [exec]   missing: ExtendedQueryBase
     [exec]   missing: FunctionQParser
     [exec]   missing: FunctionRangeQuery
     [exec]   missing: JoinQParserPlugin
     [exec]   missing: LRUCache<K,V>
     [exec]   missing: LuceneQParser
     [exec]   missing: MaxScoreQParser
     [exec]   missing: QParserPlugin
     [exec]   missing: QueryUtils
     [exec]   missing: SolrIndexSearcher.DocsEnumState
     [exec]   missing: SolrIndexSearcher.ProcessedFilter
     [exec]   missing: SpatialBoxQParserPlugin
     [exec]   missing: SpatialFilterQParser
     [exec]   missing: SpatialOptions
     [exec]   missing: Grouping.Format
     [exec]   missing: Grouping.TotalCount
     [exec] 
     [exec] /usr/home/hudson/hudson-slave/workspace/Lucene-Solr-SmokeRelease-4.x/lucene/build/fakeReleaseTmp/unpack/solr-4.8.0/solr/build/docs/solr-core/org/apache/solr/search/join/package-summary.html
     [exec]   missing: BlockJoinChildQParser
     [exec]   missing: IgnoreAcceptDocsQuery
     [exec] 
     [exec] /usr/home/hudson/hudson-slave/workspace/Lucene-Solr-SmokeRelease-4.x/lucene/build/fakeReleaseTmp/unpack/solr-4.8.0/solr/build/docs/solr-core/org/apache/solr/search/grouping/package-summary.html
     [exec]   missing: CommandHandler.Builder
     [exec] 
     [exec] /usr/home/hudson/hudson-slave/workspace/Lucene-Solr-SmokeRelease-4.x/lucene/build/fakeReleaseTmp/unpack/solr-4.8.0/solr/build/docs/solr-core/org/apache/solr/search/grouping/distributed/command/package-summary.html
     [exec]   missing: QueryCommand
     [exec]   missing: QueryCommand.Builder
     [exec]   missing: SearchGroupsFieldCommand.Builder
     [exec]   missing: TopGroupsFieldCommand.Builder
     [exec] 
     [exec] /usr/home/hudson/hudson-slave/workspace/Lucene-Solr-SmokeRelease-4.x/lucene/build/fakeReleaseTmp/unpack/solr-4.8.0/solr/build/docs/solr-core/org/apache/solr/search/grouping/distributed/requestfactory/package-summary.html
     [exec]   missing: StoredFieldsShardRequestFactory
     [exec] 
     [exec] /usr/home/hudson/hudson-slave/workspace/Lucene-Solr-SmokeRelease-4.x/lucene/build/fakeReleaseTmp/unpack/solr-4.8.0/solr/build/docs/solr-core/org/apache/solr/search/function/package-summary.html
     [exec]   missing: CollapseScoreFunction
     [exec]   missing: FileFloatSource.ReloadCacheRequestHandler
     [exec] 
     [exec] /usr/home/hudson/hudson-slave/workspace/Lucene-Solr-SmokeRelease-4.x/lucene/build/fakeReleaseTmp/unpack/solr-4.8.0/solr/build/docs/solr-core/org/apache/solr/search/function/distance/package-summary.html
     [exec]   missing: StringDistanceFunction
     [exec] 
     [exec] /usr/home/hudson/hudson-slave/workspace/Lucene-Solr-SmokeRelease-4.x/lucene/build/fakeReleaseTmp/unpack/solr-4.8.0/solr/build/docs/solr-core/org/apache/solr/parser/package-summary.html
     [exec]   missing: QueryParser
     [exec] 
     [exec] /usr/home/hudson/hudson-slave/workspace/Lucene-Solr-SmokeRelease-4.x/lucene/build/fakeReleaseTmp/unpack/solr-4.8.0/solr/build/docs/solr-core/org/apache/solr/handler/package-summary.html
     [exec]   missing: DumpRequestHandler
     [exec]   missing: MoreLikeThisHandler.InterestingTerm
     [exec]   missing: RealTimeGetHandler
     [exec]   missing: RequestHandlerBase
     [exec]   missing: PingRequestHandler.ACTIONS
     [exec] 
     [exec] /usr/home/hudson/hudson-slave/workspace/Lucene-Solr-SmokeRelease-4.x/lucene/build/fakeReleaseTmp/unpack/solr-4.8.0/solr/build/docs/solr-core/org/apache/solr/handler/admin/package-summary.html
     [exec]   missing: CollectionsHandler
     [exec]   missing: CoreAdminHandler
     [exec]   missing: InfoHandler
     [exec]   missing: PluginInfoHandler
     [exec]   missing: PropertiesRequestHandler
     [exec]   missing: ThreadDumpHandler
     [exec] 
     [exec] /usr/home/hudson/hudson-slave/workspace/Lucene-Solr-SmokeRelease-4.x/lucene/build/fakeReleaseTmp/unpack/solr-4.8.0/solr/build/docs/solr-core/org/apache/solr/handler/loader/package-summary.html
     [exec]   missing: CSVLoader
     [exec]   missing: JsonLoader
     [exec]   missing: XMLLoader
     [exec] 
     [exec] /usr/home/hudson/hudson-slave/workspace/Lucene-Solr-SmokeRelease-4.x/lucene/build/fakeReleaseTmp/unpack/solr-4.8.0/solr/build/docs/solr-core/org/apache/solr/handler/component/package-summary.html
     [exec]   missing: HttpShardHandler
     [exec]   missing: HttpShardHandlerFactory
     [exec]   missing: PivotFacetHelper
     [exec]   missing: RealTimeGetComponent
     [exec]   missing: ResponseBuilder.GlobalCollectionStat
     [exec]   missing: ShardDoc
     [exec]   missing: ShardHandler
     [exec]   missing: ShardHandlerFactory
     [exec]   missing: ShardRequest
     [exec]   missing: ShardResponse
     [exec]   missing: SpellCheckMergeData
     [exec] 
     [exec] /usr/home/hudson/hudson-slave/workspace/Lucene-Solr-SmokeRelease-4.x/lucene/build/fakeReleaseTmp/unpack/solr-4.8.0/solr/build/docs/solr-core/org/apache/solr/update/package-summary.html
     [exec]   missing: SolrCmdDistributor.AbortCheck
     [exec]   missing: SolrCoreState.IndexWriterCloser
     [exec]   missing: AddUpdateCommand
     [exec]   missing: CommitUpdateCommand
     [exec]   missing: DefaultSolrCoreState
     [exec]   missing: DeleteUpdateCommand
     [exec]   missing: DocumentBuilder
     [exec]   missing: HdfsUpdateLog
     [exec]   missing: MemOutputStream
     [exec]   missing: PeerSync
     [exec]   missing: RollbackUpdateCommand
     [exec]   missing: SolrCmdDistributor
     [exec]   missing: SolrCmdDistributor.Error
     [exec]   missing: SolrCmdDistributor.Node
     [exec]   missing: SolrCmdDistributor.Req
     [exec]   missing: SolrCmdDistributor.Response
     [exec]   missing: SolrCmdDistributor.RetryNode
     [exec]   missing: SolrCmdDistributor.StdNode
     [exec]   missing: SolrIndexSplitter
     [exec]   missing: StreamingSolrServers
     [exec]   missing: UpdateLog
     [exec]   missing: UpdateLog.LogPtr
     [exec]   missing: UpdateLog.RecoveryInfo
     [exec]   missing: UpdateShardHandler
     [exec]   missing: VersionBucket
     [exec]   missing: VersionInfo
     [exec]   missing: UpdateLog.State
     [exec]   missing: UpdateLog.SyncLevel
     [exec] 
     [exec] /usr/home/hudson/hudson-slave/workspace/Lucene-Solr-SmokeRelease-4.x/lucene/build/fakeReleaseTmp/unpack/solr-4.8.0/solr/build/docs/solr-core/org/apache/solr/update/processor/package-summary.html
     [exec]   missing: DistributedUpdateProcessor
     [exec]   missing: FieldMutatingUpdateProcessorFactory.SelectorParams
     [exec]   missing: Lookup3Signature
     [exec]   missing: MD5Signature
     [exec]   missing: Signature
     [exec]   missing: SignatureUpdateProcessorFactory
     [exec] 
     [exec] /usr/home/hudson/hudson-slave/workspace/Lucene-Solr-SmokeRelease-4.x/lucene/build/fakeReleaseTmp/unpack/solr-4.8.0/solr/build/docs/solr-core/org/apache/solr/spelling/package-summary.html
     [exec]   missing: ResultEntry
     [exec]   missing: SpellCheckCollation
     [exec]   missing: SpellCheckCollator
     [exec]   missing: SpellCheckCorrection
     [exec]   missing: SpellingOptions
     [exec] 
     [exec] /usr/home/hudson/hudson-slave/workspace/Lucene-Solr-SmokeRelease-4.x/lucene/build/fakeReleaseTmp/unpack/solr-4.8.0/solr/build/docs/solr-core/org/apache/solr/spelling/suggest/package-summary.html
     [exec]   missing: SuggesterParams
     [exec]   missing: Suggester
     [exec] 
     [exec] /usr/home/hudson/hudson-slave/workspace/Lucene-Solr-SmokeRelease-4.x/lucene/build/fakeReleaseTmp/unpack/solr-4.8.0/solr/build/docs/solr-core/org/apache/solr/highlight/package-summary.html
     [exec]   missing: SolrEncoder
     [exec]   missing: SolrFormatter
     [exec]   missing: SolrFragListBuilder
     [exec]   missing: SolrFragmenter
     [exec]   missing: BreakIteratorBoundaryScanner
     [exec]   missing: DefaultSolrHighlighter
     [exec]   missing: GapFragmenter
     [exec]   missing: HighlightingPluginBase
     [exec]   missing: ScoreOrderFragmentsBuilder
     [exec]   missing: SimpleBoundaryScanner
     [exec]   missing: SimpleFragListBuilder
     [exec]   missing: SimpleFragmentsBuilder
     [exec]   missing: SingleFragListBuilder
     [exec]   missing: SolrBoundaryScanner
     [exec]   missing: SolrFragmentsBuilder
     [exec]   missing: SolrHighlighter
     [exec]   missing: WeightedFragListBuilder
     [exec] 
     [exec] /usr/home/hudson/hudson-slave/workspace/Lucene-Solr-SmokeRelease-4.x/lucene/build/fakeReleaseTmp/unpack/solr-4.8.0/solr/build/docs/solr-core/org/apache/solr/internal/csv/writer/package-summary.html
     [exec]   missing: CSVField
     [exec] 
     [exec] /usr/home/hudson/hudson-slave/workspace/Lucene-Solr-SmokeRelease-4.x/lucene/build/fakeReleaseTmp/unpack/solr-4.8.0/solr/build/docs/solr-core/org/apache/solr/core/package-summary.html
     [exec]   missing: CachingDirectoryFactory.CloseListener
     [exec]   missing: Diagnostics.Callable
     [exec]   missing: SolrEventListener
     [exec]   missing: AbstractSolrEventListener
     [exec]   missing: Config
     [exec]   missing: ConfigSolr
     [exec]   missing: ConfigSolrXml
     [exec]   missing: ConfigSolrXmlOld
     [exec]   missing: CoreContainer
     [exec]   missing: Diagnostics
     [exec]   missing: HdfsDirectoryFactory
     [exec]   missing: QuerySenderListener
     [exec]   missing: RequestHandlers
     [exec]   missing: SolrConfig.HttpCachingConfig
     [exec]   missing: SolrConfig.JmxConfiguration
     [exec]   missing: SolrConfig.UpdateHandlerInfo
     [exec]   missing: SolrCore
     [exec]   missing: SolrResourceLoader
     [exec]   missing: SolrXMLCoresLocator.NonPersistingLocator
     [exec]   missing: SolrXMLSerializer
     [exec]   missing: SolrXMLSerializer.SolrCoreXMLDef
     [exec]   missing: SolrXMLSerializer.SolrXMLDef
     [exec]   missing: ZkContainer
     [exec]   missing: ConfigSolr.CfgProp
     [exec]   missing: DirectoryFactory.DirContext
     [exec]   missing: SolrConfig.HttpCachingConfig.LastModFrom
     [exec]   missing: SolrInfoMBean.Category
     [exec] 
     [exec] /usr/home/hudson/hudson-slave/workspace/Lucene-Solr-SmokeRelease-4.x/lucene/build/fakeReleaseTmp/unpack/solr-4.8.0/solr/build/docs/solr-core/org/apache/solr/logging/package-summary.html
     [exec]   missing: ListenerConfig
     [exec] 
     [exec] /usr/home/hudson/hudson-slave/workspace/Lucene-Solr-SmokeRelease-4.x/lucene/build/fakeReleaseTmp/unpack/solr-4.8.0/solr/build/docs/solr-core/org/apache/solr/logging/log4j/package-summary.html
     [exec]   missing: EventAppender
     [exec]   missing: Log4jInfo
     [exec]   missing: Log4jWatcher
     [exec] 
     [exec] /usr/home/hudson/hudson-slave/workspace/Lucene-Solr-SmokeRelease-4.x/lucene/build/fakeReleaseTmp/unpack/solr-4.8.0/solr/build/docs/solr-core/org/apache/solr/logging/jul/package-summary.html
     [exec]   missing: JulInfo
     [exec]   missing: JulWatcher
     [exec]   missing: RecordHandler
     [exec] 
     [exec] /usr/home/hudson/hudson-slave/workspace/Lucene-Solr-SmokeRelease-4.x/lucene/build/fakeReleaseTmp/unpack/solr-4.8.0/solr/build/docs/solr-core/org/apache/solr/store/blockcache/package-summary.html
     [exec]   missing: Cache
     [exec]   missing: Store
     [exec]   missing: BlockCache
     [exec]   missing: BlockCacheKey
     [exec]   missing: BlockCacheLocation
     [exec]   missing: BlockDirectory
     [exec]   missing: BlockDirectoryCache
     [exec]   missing: BlockLocks
     [exec]   missing: BufferStore
     [exec]   missing: CachedIndexOutput
     [exec]   missing: CustomBufferedIndexInput
     [exec]   missing: Metrics
     [exec]   missing: Metrics.MethodCall
     [exec]   missing: ReusedBufferedIndexOutput
     [exec] 
     [exec] /usr/home/hudson/hudson-slave/workspace/Lucene-Solr-SmokeRelease-4.x/lucene/build/fakeReleaseTmp/unpack/solr-4.8.0/solr/build/docs/solr-core/org/apache/solr/store/hdfs/package-summary.html
     [exec]   missing: HdfsDirectory
     [exec]   missing: HdfsFileReader
     [exec]   missing: HdfsFileWriter
     [exec]   missing: HdfsLockFactory
     [exec]   missing: NullIndexOutput
     [exec] 
     [exec] /usr/home/hudson/hudson-slave/workspace/Lucene-Solr-SmokeRelease-4.x/lucene/build/fakeReleaseTmp/unpack/solr-4.8.0/solr/build/docs/solr-core/org/apache/solr/rest/package-summary.html
     [exec]   missing: SolrRestApi
     [exec] 
     [exec] /usr/home/hudson/hudson-slave/workspace/Lucene-Solr-SmokeRelease-4.x/lucene/build/fakeReleaseTmp/unpack/solr-4.8.0/solr/build/docs/solr-core/org/apache/solr/schema/package-summary.html
     [exec]   missing: AbstractSpatialPrefixTreeFieldType<T extends PrefixTreeStrategy>
     [exec]   missing: BCDIntField
     [exec]   missing: BCDLongField
     [exec]   missing: BCDStrField
     [exec]   missing: BinaryField
     [exec]   missing: BoolField
     [exec]   missing: ClassicIndexSchemaFactory
     [exec]   missing: FieldProperties
     [exec]   missing: FieldTypePluginLoader
     [exec]   missing: IndexSchema.DynamicCopy
     [exec]   missing: IndexSchema.DynamicField
     [exec]   missing: IndexSchema.DynamicReplacement
     [exec]   missing: IndexSchema.DynamicReplacement.DynamicPattern
     [exec]   missing: JsonPreAnalyzedParser
     [exec]   missing: SpatialPointVectorFieldType
     [exec]   missing: SpatialRecursivePrefixTreeFieldType
     [exec]   missing: SpatialTermQueryPrefixTreeFieldType
     [exec]   missing: StrField
     [exec]   missing: StrFieldSource
     [exec]   missing: TrieField.TrieTypes
     [exec] 
     [exec] /usr/home/hudson/hudson-slave/workspace/Lucene-Solr-SmokeRelease-4.x/lucene/build/fakeReleaseTmp/unpack/solr-4.8.0/solr/build/docs/solr-core/org/apache/solr/servlet/package-summary.html
     [exec]   missing: SolrRequestParsers
     [exec] 
     [exec] /usr/home/hudson/hudson-slave/workspace/Lucene-Solr-SmokeRelease-4.x/lucene/build/fakeReleaseTmp/unpack/solr-4.8.0/solr/build/docs/solr-core/org/apache/solr/servlet/cache/package-summary.html
     [exec]   missing: HttpCacheHeaderUtil
     [exec]   missing: Method
     [exec] 
     [exec] /usr/home/hudson/hudson-slave/workspace/Lucene-Solr-SmokeRelease-4.x/lucene/build/fakeReleaseTmp/unpack/solr-4.8.0/solr/build/docs/solr-core/org/apache/solr/analysis/package-summary.html
     [exec]   missing: SolrAnalyzer
     [exec] 
     [exec] /usr/home/hudson/hudson-slave/workspace/Lucene-Solr-SmokeRelease-4.x/lucene/build/fakeReleaseTmp/unpack/solr-4.8.0/solr/build/docs/solr-core/org/apache/solr/response/package-summary.html
     [exec]   missing: BinaryResponseWriter
     [exec]   missing: BinaryResponseWriter.Resolver
     [exec]   missing: CSVResponseWriter
     [exec]   missing: JSONResponseWriter
     [exec]   missing: PHPResponseWriter
     [exec]   missing: PythonResponseWriter
     [exec]   missing: RubyResponseWriter
     [exec]   missing: SchemaXmlResponseWriter
     [exec]   missing: SchemaXmlWriter
     [exec]   missing: XMLResponseWriter
     [exec]   missing: XMLWriter
     [exec] 
     [exec] /usr/home/hudson/hudson-slave/workspace/Lucene-Solr-SmokeRelease-4.x/lucene/build/fakeReleaseTmp/unpack/solr-4.8.0/solr/build/docs/solr-core/org/apache/solr/response/transform/package-summary.html
     [exec]   missing: BaseEditorialTransformer
     [exec]   missing: DocIdAugmenterFactory
     [exec]   missing: ExcludedMarkerFactory
     [exec]   missing: ExplainAugmenterFactory
     [exec]   missing: ShardAugmenterFactory
     [exec]   missing: TransformerWithContext
     [exec]   missing: ValueAugmenterFactory
     [exec]   missing: ExplainAugmenterFactory.Style
     [exec] 
     [exec] /usr/home/hudson/hudson-slave/workspace/Lucene-Solr-SmokeRelease-4.x/lucene/build/fakeReleaseTmp/unpack/solr-4.8.0/solr/build/docs/solr-core/org/apache/solr/client/solrj/embedded/package-summary.html
     [exec]   missing: JettySolrRunner.DebugFilter
     [exec]   missing: SSLConfig
     [exec] 
     [exec] /usr/home/hudson/hudson-slave/workspace/Lucene-Solr-SmokeRelease-4.x/lucene/build/fakeReleaseTmp/unpack/solr-4.8.0/solr/build/docs/solr-dataimporthandler/org/apache/solr/handler/dataimport/package-summary.html
     [exec]   missing: DIHWriter
     [exec]   missing: CachePropertyUtil
     [exec]   missing: ConfigParseUtil
     [exec]   missing: DebugInfo
     [exec]   missing: DIHCacheSupport
     [exec]   missing: DIHWriterBase
     [exec]   missing: DocBuilder.Statistics
     [exec]   missing: RequestInfo
     [exec]   missing: SolrQueryEscapingEvaluator
     [exec]   missing: SortedMapBackedCache
     [exec]   missing: DataImporter.Status
     [exec]   missing: DIHLogLevels
     [exec] 
     [exec] /usr/home/hudson/hudson-slave/workspace/Lucene-Solr-SmokeRelease-4.x/lucene/build/fakeReleaseTmp/unpack/solr-4.8.0/solr/build/docs/solr-dataimporthandler/org/apache/solr/handler/dataimport/config/package-summary.html
     [exec]   missing: ConfigNameConstants
     [exec]   missing: ConfigParseUtil
     [exec]   missing: Entity
     [exec]   missing: EntityField
     [exec]   missing: EntityField.Builder
     [exec]   missing: Field
     [exec]   missing: Field.Builder
     [exec]   missing: PropertyWriter
     [exec]   missing: Script
     [exec] 
     [exec] /usr/home/hudson/hudson-slave/workspace/Lucene-Solr-SmokeRelease-4.x/lucene/build/fakeReleaseTmp/unpack/solr-4.8.0/solr/build/docs/solr-dataimporthandler-extras/org/apache/solr/handler/dataimport/package-summary.html
     [exec]   missing: MailEntityProcessor.CustomFilter
     [exec] 
     [exec] /usr/home/hudson/hudson-slave/workspace/Lucene-Solr-SmokeRelease-4.x/lucene/build/fakeReleaseTmp/unpack/solr-4.8.0/solr/build/docs/solr-clustering/org/apache/solr/handler/clustering/package-summary.html
     [exec]   missing: ClusteringParams
     [exec]   missing: DocumentClusteringEngine
     [exec] 
     [exec] /usr/home/hudson/hudson-slave/workspace/Lucene-Solr-SmokeRelease-4.x/lucene/build/fakeReleaseTmp/unpack/solr-4.8.0/solr/build/docs/solr-test-framework/org/apache/solr/package-summary.html
     [exec]   missing: BaseDistributedSearchTestCase.RandDate
     [exec]   missing: BaseDistributedSearchTestCase.RandVal
     [exec]   missing: JSONTestUtil
     [exec]   missing: SolrJettyTestBase
     [exec]   missing: SolrTestCaseJ4.CoreDescriptorBuilder
     [exec]   missing: SolrTestCaseJ4.Doc
     [exec]   missing: SolrTestCaseJ4.Fld
     [exec]   missing: SolrTestCaseJ4.FVal
     [exec]   missing: SolrTestCaseJ4.IRange
     [exec]   missing: SolrTestCaseJ4.IVals
     [exec]   missing: SolrTestCaseJ4.IValsPercent
     [exec]   missing: SolrTestCaseJ4.SVal
     [exec]   missing: SolrTestCaseJ4.Vals
     [exec] 
     [exec] /usr/home/hudson/hudson-slave/workspace/Lucene-Solr-SmokeRelease-4.x/lucene/build/fakeReleaseTmp/unpack/solr-4.8.0/solr/build/docs/solr-test-framework/org/apache/solr/core/package-summary.html
     [exec]   missing: AbstractBadConfigTestBase
     [exec] 
     [exec] /usr/home/hudson/hudson-slave/workspace/Lucene-Solr-SmokeRelease-4.x/lucene/build/fakeReleaseTmp/unpack/solr-4.8.0/solr/build/docs/solr-test-framework/org/apache/solr/update/processor/package-summary.html
     [exec]   missing: BufferingRequestProcessor
     [exec] 
     [exec] /usr/home/hudson/hudson-slave/workspace/Lucene-Solr-SmokeRelease-4.x/lucene/build/fakeReleaseTmp/unpack/solr-4.8.0/solr/build/docs/solr-test-framework/org/apache/solr/cloud/package-summary.html
     [exec]   missing: AbstractDistribZkTestBase
     [exec]   missing: AbstractFullDistribZkTestBase.CloudJettyRunner
     [exec]   missing: ZkTestServer
     [exec]   missing: ZkTestServer.HostPort
     [exec] 
     [exec] /usr/home/hudson/hudson-slave/workspace/Lucene-Solr-SmokeRelease-4.x/lucene/build/fakeReleaseTmp/unpack/solr-4.8.0/solr/build/docs/solr-test-framework/org/apache/solr/util/package-summary.html
     [exec]   missing: RESTfulServerProvider
     [exec]   missing: BaseTestHarness
     [exec]   missing: DOMUtilTestBase
     [exec]   missing: RestTestBase
     [exec]   missing: RevertDefaultThreadHandlerRule
     [exec]   missing: SSLTestConfig
     [exec] 
     [exec] /usr/home/hudson/hudson-slave/workspace/Lucene-Solr-SmokeRelease-4.x/lucene/build/fakeReleaseTmp/unpack/solr-4.8.0/solr/build/docs/solr-langid/org/apache/solr/update/processor/package-summary.html
     [exec]   missing: LangIdParams
     [exec] 
     [exec] /usr/home/hudson/hudson-slave/workspace/Lucene-Solr-SmokeRelease-4.x/lucene/build/fakeReleaseTmp/unpack/solr-4.8.0/solr/build/docs/solr-solrj/org/apache/solr/client/solrj/package-summary.html
     [exec]   missing: ResponseParser
     [exec]   missing: SolrRequest
     [exec]   missing: SolrResponse
     [exec]   missing: SolrServer
     [exec]   missing: SolrQuery.ORDER
     [exec]   missing: SolrRequest.METHOD
     [exec] 
     [exec] /usr/home/hudson/hudson-slave/workspace/Lucene-Solr-SmokeRelease-4.x/lucene/build/fakeReleaseTmp/unpack/solr-4.8.0/solr/build/docs/solr-solrj/org/apache/solr/client/solrj/util/package-summary.html
     [exec]   missing: ClientUtils
     [exec] 
     [exec] /usr/home/hudson/hudson-slave/workspace/Lucene-Solr-SmokeRelease-4.x/lucene/build/fakeReleaseTmp/unpack/solr-4.8.0/solr/build/docs/solr-solrj/org/apache/solr/client/solrj/beans/package-summary.html
     [exec]   missing: BindingException
     [exec]   missing: Field
     [exec] 
     [exec] /usr/home/hudson/hudson-slave/workspace/Lucene-Solr-SmokeRelease-4.x/lucene/build/fakeReleaseTmp/unpack/solr-4.8.0/solr/build/docs/solr-solrj/org/apache/solr/client/solrj/impl/package-summary.html
     [exec]   missing: BinaryResponseParser
     [exec]   missing: HttpSolrServer
     [exec]   missing: LBHttpSolrServer.Req
     [exec]   missing: LBHttpSolrServer.Rsp
     [exec]   missing: LBHttpSolrServer.ServerWrapper
     [exec]   missing: XMLResponseParser
     [exec]   missing: XMLResponseParser.KnownType
     [exec] 
     [exec] /usr/home/hudson/hudson-slave/workspace/Lucene-Solr-SmokeRelease-4.x/lucene/build/fakeReleaseTmp/unpack/solr-4.8.0/solr/build/docs/solr-solrj/org/apache/solr/client/solrj/response/package-summary.html
     [exec]   missing: CollectionAdminResponse
     [exec]   missing: CoreAdminResponse
     [exec]   missing: FacetField.Count
     [exec]   missing: LukeResponse.FieldInfo
     [exec]   missing: LukeResponse.FieldTypeInfo
     [exec]   missing: PivotField
     [exec]   missing: QueryResponse
     [exec]   missing: RangeFacet.Count
     [exec]   missing: RangeFacet.Date
     [exec]   missing: RangeFacet.Numeric
     [exec]   missing: SolrPingResponse
     [exec]   missing: SolrResponseBase
     [exec]   missing: SpellCheckResponse.Suggestion
     [exec]   missing: TermsResponse.Term
     [exec] 
     [exec] /usr/home/hudson/hudson-slave/workspace/Lucene-Solr-SmokeRelease-4.x/lucene/build/fakeReleaseTmp/unpack/solr-4.8.0/solr/build/docs/solr-solrj/org/apache/solr/client/solrj/request/package-summary.html
     [exec]   missing: JavaBinUpdateRequestCodec.StreamingUpdateHandler
     [exec]   missing: AbstractUpdateRequest
     [exec]   missing: CollectionAdminRequest.CollectionShardAdminRequest
     [exec]   missing: CollectionAdminRequest.Create
     [exec]   missing: CollectionAdminRequest.CreateAlias
     [exec]   missing: CollectionAdminRequest.CreateShard
     [exec]   missing: CollectionAdminRequest.Delete
     [exec]   missing: CollectionAdminRequest.DeleteAlias
     [exec]   missing: CollectionAdminRequest.DeleteShard
     [exec]   missing: CollectionAdminRequest.Reload
     [exec]   missing: CollectionAdminRequest.SplitShard
     [exec]   missing: CoreAdminRequest.Create
     [exec]   missing: CoreAdminRequest.MergeIndexes
     [exec]   missing: CoreAdminRequest.Persist
     [exec]   missing: CoreAdminRequest.RequestRecovery
     [exec]   missing: CoreAdminRequest.RequestSyncShard
     [exec]   missing: CoreAdminRequest.Unload
     [exec]   missing: CoreAdminRequest.WaitForState
     [exec]   missing: LukeRequest
     [exec]   missing: QueryRequest
     [exec]   missing: UpdateRequest
     [exec]   missing: AbstractUpdateRequest.ACTION
     [exec] 
     [exec] /usr/home/hudson/hudson-slave/workspace/Lucene-Solr-SmokeRelease-4.x/lucene/build/fakeReleaseTmp/unpack/solr-4.8.0/solr/build/docs/solr-solrj/org/apache/solr/common/package-summary.html
     [exec]   missing: SolrInputField
     [exec]   missing: SolrException
     [exec] 
     [exec] /usr/home/hudson/hudson-slave/workspace/Lucene-Solr-SmokeRelease-4.x/lucene/build/fakeReleaseTmp/unpack/solr-4.8.0/solr/build/docs/solr-solrj/org/apache/solr/common/util/package-summary.html
     [exec]   missing: ContentStream
     [exec]   missing: JavaBinCodec.ObjectResolver
     [exec]   missing: ByteUtils
     [exec]   missing: ExecutorUtil
     [exec]   missing: SolrjNamedThreadFactory
     [exec]   missing: StrUtils
     [exec]   missing: URLUtil
     [exec]   missing: XML
     [exec]   missing: XMLErrorLogger
     [exec] 
     [exec] /usr/home/hudson/hudson-slave/workspace/Lucene-Solr-SmokeRelease-4.x/lucene/build/fakeReleaseTmp/unpack/solr-4.8.0/solr/build/docs/solr-solrj/org/apache/solr/common/params/package-summary.html
     [exec]   missing: CollectionParams
     [exec]   missing: EventParams
     [exec]   missing: HighlightParams
     [exec]   missing: MoreLikeThisParams
     [exec]   missing: SpatialParams
     [exec]   missing: TermsParams
     [exec]   missing: TermVectorParams
     [exec]   missing: CoreAdminParams
     [exec]   missing: DefaultSolrParams
     [exec]   missing: MapSolrParams
     [exec]   missing: MultiMapSolrParams
     [exec]   missing: CollectionParams.CollectionAction
     [exec]   missing: CoreAdminParams.CoreAdminAction
     [exec]   missing: MoreLikeThisParams.TermStyle
     [exec]   missing: TermsParams.TermsRegexpFlag
     [exec] 
     [exec] /usr/home/hudson/hudson-slave/workspace/Lucene-Solr-SmokeRelease-4.x/lucene/build/fakeReleaseTmp/unpack/solr-4.8.0/solr/build/docs/solr-solrj/org/apache/solr/common/luke/package-summary.html
     [exec]   missing: FieldFlag
     [exec] 
     [exec] /usr/home/hudson/hudson-slave/workspace/Lucene-Solr-SmokeRelease-4.x/lucene/build/fakeReleaseTmp/unpack/solr-4.8.0/solr/build/docs/solr-solrj/org/apache/solr/common/cloud/package-summary.html
     [exec]   missing: BeforeReconnect
     [exec]   missing: ClosableThread
     [exec]   missing: OnReconnect
     [exec]   missing: ZkClientConnectionStrategy.ConnectedListener
     [exec]   missing: ZkClientConnectionStrategy.DisconnectedListener
     [exec]   missing: Aliases
     [exec]   missing: CompositeIdRouter
     [exec]   missing: ConnectionManager
     [exec]   missing: DocRouter.Range
     [exec]   missing: HashBasedRouter
     [exec]   missing: HashPartitioner.Range
     [exec]   missing: PlainIdRouter
     [exec]   missing: Replica
     [exec]   missing: SolrZooKeeper
     [exec]   missing: ZkClientConnectionStrategy
     [exec]   missing: ZkClientConnectionStrategy.ZkUpdate
     [exec]   missing: ZkCmdExecutor
     [exec]   missing: ZkCoreNodeProps
     [exec]   missing: ZkStateReader
     [exec]   missing: ZooKeeperException
     [exec] 
     [exec] /usr/home/hudson/hudson-slave/workspace/Lucene-Solr-SmokeRelease-4.x/lucene/build/fakeReleaseTmp/unpack/solr-4.8.0/solr/build/docs/solr-velocity/org/apache/solr/response/package-summary.html
     [exec]   missing: SolrParamResourceLoader
     [exec]   missing: VelocityResponseWriter
     [exec] 
     [exec] ***WARNING***: javadocs want to fail!
     [exec] 
     [exec]     run tests w/ Java 7 and testArgs='-Dtests.jettyConnector=Socket  -Dtests.disableHdfs=true'...
     [exec] 
     [exec] command "export JAVA_HOME="/home/hudson/tools/java/latest1.7" PATH="/home/hudson/tools/java/latest1.7/bin:$PATH" JAVACMD="/home/hudson/tools/java/latest1.7/bin/java"; ant clean test -Dtests.jettyConnector=Socket  -Dtests.disableHdfs=true" failed:
     [exec] Buildfile: /usr/home/hudson/hudson-slave/workspace/Lucene-Solr-SmokeRelease-4.x/lucene/build/fakeReleaseTmp/unpack/solr-4.8.0/solr/build.xml
     [exec]      [echo] Building solr...
     [exec] 
     [exec] clean:
     [exec]    [delete] Deleting directory /usr/home/hudson/hudson-slave/workspace/Lucene-Solr-SmokeRelease-4.x/lucene/build/fakeReleaseTmp/unpack/solr-4.8.0/solr/build
     [exec] 
     [exec] ivy-availability-check:
     [exec]      [echo] Building solr...
     [exec] 
     [exec] ivy-fail:
     [exec] 
     [exec] ivy-configure:
     [exec] [ivy:configure] :: Apache Ivy 2.3.0 - 20130110142753 :: http://ant.apache.org/ivy/ ::
     [exec] [ivy:configure] :: loading settings :: file = /usr/home/hudson/hudson-slave/workspace/Lucene-Solr-SmokeRelease-4.x/lucene/build/fakeReleaseTmp/unpack/solr-4.8.0/lucene/ivy-settings.xml
     [exec] 
     [exec] resolve-groovy:
     [exec] [ivy:cachepath] :: resolving dependencies :: org.codehaus.groovy#groovy-all-caller;working
     [exec] [ivy:cachepath] 	confs: [default]
     [exec] [ivy:cachepath] 	found org.codehaus.groovy#groovy-all;2.2.1 in public
     [exec] [ivy:cachepath] :: resolution report :: resolve 140ms :: artifacts dl 3ms
     [exec] 	---------------------------------------------------------------------
     [exec] 	|                  |            modules            ||   artifacts   |
     [exec] 	|       conf       | number| search|dwnlded|evicted|| number|dwnlded|
     [exec] 	---------------------------------------------------------------------
     [exec] 	|      default     |   1   |   0   |   0   |   0   ||   1   |   0   |
     [exec] 	---------------------------------------------------------------------
     [exec] 
     [exec] -init-totals:
     [exec]     [mkdir] Created dir: /usr/home/hudson/hudson-slave/workspace/Lucene-Solr-SmokeRelease-4.x/lucene/build/fakeReleaseTmp/unpack/solr-4.8.0/solr/build/solr
     [exec] 
     [exec] -clover.load:
     [exec] 
     [exec] test-solr-core:
     [exec]      [echo] Building solr-core...
     [exec] 
     [exec] test:
     [exec]      [echo] Building solr-core...
     [exec] 
     [exec] -clover.disable:
     [exec] 
     [exec] ivy-availability-check:
     [exec]      [echo] Building solr-core...
     [exec] 
     [exec] ivy-fail:
     [exec] 
     [exec] ivy-configure:
     [exec] [ivy:configure] :: loading settings :: file = /usr/home/hudson/hudson-slave/workspace/Lucene-Solr-SmokeRelease-4.x/lucene/build/fakeReleaseTmp/unpack/solr-4.8.0/lucene/ivy-settings.xml
     [exec] 
     [exec] -clover.load:
     [exec] 
     [exec] -clover.classpath:
     [exec] 
     [exec] -clover.setup:
     [exec] 
     [exec] clover:
     [exec] 
     [exec] compile-solr-test-framework:
     [exec]      [echo] Building solr-test-framework...
     [exec] 
     [exec] ivy-availability-check:
     [exec]      [echo] Building solr-test-framework...
     [exec] 
     [exec] ivy-fail:
     [exec] 
     [exec] ivy-configure:
     [exec] [ivy:configure] :: loading settings :: file = /usr/home/hudson/hudson-slave/workspace/Lucene-Solr-SmokeRelease-4.x/lucene/build/fakeReleaseTmp/unpack/solr-4.8.0/lucene/ivy-settings.xml
     [exec] 
     [exec] resolve:
     [exec] 
     [exec] compile-solr-core:
     [exec]      [echo] Building solr-core...
     [exec] 
     [exec] compile-solrj:
     [exec]      [echo] Building solr-solrj...
     [exec] 
     [exec] check-lucene-core-uptodate:
     [exec] 
     [exec] jar-lucene-core:
     [exec] 
     [exec] check-analyzers-phonetic-uptodate:
     [exec] 
     [exec] jar-analyzers-phonetic:
     [exec] 
     [exec] check-analyzers-kuromoji-uptodate:
     [exec] 
     [exec] jar-analyzers-kuromoji:
     [exec] 
     [exec] check-codecs-uptodate:
     [exec] 
     [exec] jar-codecs:
     [exec] 
     [exec] check-expressions-uptodate:
     [exec] 
     [exec] jar-expressions:
     [exec] 
     [exec] check-suggest-uptodate:
     [exec] 
     [exec] jar-suggest:
     [exec] 
     [exec] check-highlighter-uptodate:
     [exec] 
     [exec] jar-highlighter:
     [exec] 
     [exec] check-memory-uptodate:
     [exec] 
     [exec] jar-memory:
     [exec] 
     [exec] check-misc-uptodate:
     [exec] 
     [exec] jar-misc:
     [exec] 
     [exec] check-spatial-uptodate:
     [exec] 
     [exec] jar-spatial:
     [exec] 
     [exec] check-grouping-uptodate:
     [exec] 
     [exec] jar-grouping:
     [exec] 
     [exec] check-queries-uptodate:
     [exec] 
     [exec] jar-queries:
     [exec] 
     [exec] check-queryparser-uptodate:
     [exec] 
     [exec] jar-queryparser:
     [exec] 
     [exec] check-join-uptodate:
     [exec] 
     [exec] jar-join:
     [exec] 
     [exec] prep-lucene-jars:
     [exec] 
     [exec] resolve-example:
     [exec]      [echo] Building solr-example...
     [exec] 
     [exec] ivy-availability-check:
     [exec]      [echo] Building solr-example...
     [exec] 
     [exec] ivy-fail:
     [exec] 
     [exec] ivy-fail:
     [exec] 
     [exec] ivy-configure:
     [exec] [ivy:configure] :: loading settings :: file = /usr/home/hudson/hudson-slave/workspace/Lucene-Solr-SmokeRelease-4.x/lucene/build/fakeReleaseTmp/unpack/solr-4.8.0/lucene/ivy-settings.xml
     [exec] 
     [exec] sync-hack:
     [exec] 
     [exec] resolve:
     [exec]      [echo] Building solr-example-DIH...
     [exec] 
     [exec] ivy-availability-check:
     [exec]      [echo] Building solr-example-DIH...
     [exec] 
     [exec] ivy-fail:
     [exec] 
     [exec] ivy-configure:
     [exec] [ivy:configure] :: loading settings :: file = /usr/home/hudson/hudson-slave/workspace/Lucene-Solr-SmokeRelease-4.x/lucene/build/fakeReleaseTmp/unpack/solr-4.8.0/lucene/ivy-settings.xml
     [exec] 
     [exec] resolve:
     [exec] 
     [exec] ivy-availability-check:
     [exec]      [echo] Building solr-solrj...
     [exec] 
     [exec] ivy-fail:
     [exec] 
     [exec] ivy-configure:
     [exec] [ivy:configure] :: loading settings :: file = /usr/home/hudson/hudson-slave/workspace/Lucene-Solr-SmokeRelease-4.x/lucene/build/fakeReleaseTmp/unpack/solr-4.8.0/lucene/ivy-settings.xml
     [exec] 
     [exec] resolve:
     [exec] 
     [exec] common.init:
     [exec] 
     [exec] compile-lucene-core:
     [exec] 
     [exec] ivy-availability-check:
     [exec] 
     [exec] ivy-fail:
     [exec] 
     [exec] ivy-configure:
     [exec] [ivy:configure] :: loading settings :: file = /usr/home/hudson/hudson-slave/workspace/Lucene-Solr-SmokeRelease-4.x/lucene/build/fakeReleaseTmp/unpack/solr-4.8.0/lucene/ivy-settings.xml
     [exec] 
     [exec] resolve:
     [exec] 
     [exec] init:
     [exec] 
     [exec] -clover.disable:
     [exec] 
     [exec] -clover.load:
     [exec] 
     [exec] -clover.classpath:
     [exec] 
     [exec] -clover.setup:
     [exec] 
     [exec] clover:
     [exec] 
     [exec] compile-core:
     [exec] 
     [exec] init:
     [exec] 
     [exec] -clover.disable:
     [exec] 
     [exec] -clover.load:
     [exec] 
     [exec] -clover.classpath:
     [exec] 
     [exec] -clover.setup:
     [exec] 
     [exec] clover:
     [exec] 
     [exec] common.compile-core:
     [exec]     [mkdir] Created dir: /usr/home/hudson/hudson-slave/workspace/Lucene-Solr-SmokeRelease-4.x/lucene/build/fakeReleaseTmp/unpack/solr-4.8.0/solr/build/solr-solrj/classes/java
     [exec]     [javac] Compiling 134 source files to /usr/home/hudson/hudson-slave/workspace/Lucene-Solr-SmokeRelease-4.x/lucene/build/fakeReleaseTmp/unpack/solr-4.8.0/solr/build/solr-solrj/classes/java
     [exec]     [javac] warning: [options] bootstrap class path not set in conjunction with -source 1.6
     [exec]     [javac] Note: Some input files use or override a deprecated API.
     [exec]     [javac] Note: Recompile with -Xlint:deprecation for details.
     [exec]     [javac] Note: Some input files use unchecked or unsafe operations.
     [exec]     [javac] Note: Recompile with -Xlint:unchecked for details.
     [exec]     [javac] 1 warning
     [exec] 
     [exec] compile-core:
     [exec] 
     [exec] check-lucene-core-uptodate:
     [exec] 
     [exec] jar-lucene-core:
     [exec] 
     [exec] check-analyzers-phonetic-uptodate:
     [exec] 
     [exec] jar-analyzers-phonetic:
     [exec] 
     [exec] check-analyzers-kuromoji-uptodate:
     [exec] 
     [exec] jar-analyzers-kuromoji:
     [exec] 
     [exec] check-codecs-uptodate:
     [exec] 
     [exec] jar-codecs:
     [exec] 
     [exec] check-expressions-uptodate:
     [exec] 
     [exec] jar-expressions:
     [exec] 
     [exec] check-suggest-uptodate:
     [exec] 
     [exec] jar-suggest:
     [exec] 
     [exec] check-highlighter-uptodate:
     [exec] 
     [exec] jar-highlighter:
     [exec] 
     [exec] check-memory-uptodate:
     [exec] 
     [exec] jar-memory:
     [exec] 
     [exec] check-misc-uptodate:
     [exec] 
     [exec] jar-misc:
     [exec] 
     [exec] check-spatial-uptodate:
     [exec] 
     [exec] jar-spatial:
     [exec] 
     [exec] check-grouping-uptodate:
     [exec] 
     [exec] jar-grouping:
     [exec] 
     [exec] check-queries-uptodate:
     [exec] 
     [exec] jar-queries:
     [exec] 
     [exec] check-queryparser-uptodate:
     [exec] 
     [exec] jar-queryparser:
     [exec] 
     [exec] check-join-uptodate:
     [exec] 
     [exec] jar-join:
     [exec] 
     [exec] prep-lucene-jars:
     [exec] 
     [exec] resolve-example:
     [exec]      [echo] Building solr-example...
     [exec] 
     [exec] ivy-availability-check:
     [exec]      [echo] Building solr-example...
     [exec] 
     [exec] ivy-fail:
     [exec] 
     [exec] ivy-fail:
     [exec] 
     [exec] ivy-configure:
     [exec] [ivy:configure] :: loading settings :: file = /usr/home/hudson/hudson-slave/workspace/Lucene-Solr-SmokeRelease-4.x/lucene/build/fakeReleaseTmp/unpack/solr-4.8.0/lucene/ivy-settings.xml
     [exec] 
     [exec] sync-hack:
     [exec] 
     [exec] resolve:
     [exec]      [echo] Building solr-example-DIH...
     [exec] 
     [exec] ivy-availability-check:
     [exec]      [echo] Building solr-example-DIH...
     [exec] 
     [exec] ivy-fail:
     [exec] 
     [exec] ivy-configure:
     [exec] [ivy:configure] :: loading settings :: file = /usr/home/hudson/hudson-slave/workspace/Lucene-Solr-SmokeRelease-4.x/lucene/build/fakeReleaseTmp/unpack/solr-4.8.0/lucene/ivy-settings.xml
     [exec] 
     [exec] resolve:
     [exec] 
     [exec] ivy-availability-check:
     [exec]      [echo] Building solr-core...
     [exec] 
     [exec] ivy-fail:
     [exec] 
     [exec] ivy-fail:
     [exec] 
     [exec] ivy-configure:
     [exec] [ivy:configure] :: loading settings :: file = /usr/home/hudson/hudson-slave/workspace/Lucene-Solr-SmokeRelease-4.x/lucene/build/fakeReleaseTmp/unpack/solr-4.8.0/lucene/ivy-settings.xml
     [exec] 
     [exec] resolve:
     [exec] 
     [exec] common.init:
     [exec] 
     [exec] compile-lucene-core:
     [exec] 
     [exec] ivy-availability-check:
     [exec] 
     [exec] ivy-fail:
     [exec] 
     [exec] ivy-configure:
     [exec] [ivy:configure] :: loading settings :: file = /usr/home/hudson/hudson-slave/workspace/Lucene-Solr-SmokeRelease-4.x/lucene/build/fakeReleaseTmp/unpack/solr-4.8.0/lucene/ivy-settings.xml
     [exec] 
     [exec] resolve:
     [exec] 
     [exec] init:
     [exec] 
     [exec] -clover.disable:
     [exec] 
     [exec] -clover.load:
     [exec] 
     [exec] -clover.classpath:
     [exec] 
     [exec] -clover.setup:
     [exec] 
     [exec] clover:
     [exec] 
     [exec] compile-core:
     [exec] 
     [exec] init:
     [exec] 
     [exec] -clover.disable:
     [exec] 
     [exec] -clover.load:
     [exec] 
     [exec] -clover.classpath:
     [exec] 
     [exec] -clover.setup:
     [exec] 
     [exec] clover:
     [exec] 
     [exec] common.compile-core:
     [exec]     [mkdir] Created dir: /usr/home/hudson/hudson-slave/workspace/Lucene-Solr-SmokeRelease-4.x/lucene/build/fakeReleaseTmp/unpack/solr-4.8.0/solr/build/solr-core/classes/java
     [exec]     [javac] Compiling 640 source files to /usr/home/hudson/hudson-slave/workspace/Lucene-Solr-SmokeRelease-4.x/lucene/build/fakeReleaseTmp/unpack/solr-4.8.0/solr/build/solr-core/classes/java
     [exec]     [javac] warning: [options] bootstrap class path not set in conjunction with -source 1.6
     [exec]     [javac] Note: Some input files use or override a deprecated API.
     [exec]     [javac] Note: Recompile with -Xlint:deprecation for details.
     [exec]     [javac] Note: Some input files use unchecked or unsafe operations.
     [exec]     [javac] Note: Recompile with -Xlint:unchecked for details.
     [exec]     [javac] 1 warning
     [exec] 
     [exec] common-solr.compile-core:
     [exec] 
     [exec] compile-core:
     [exec] 
     [exec] compile-test-framework:
     [exec] 
     [exec] compile-test-framework:
     [exec] 
     [exec] ivy-availability-check:
     [exec] 
     [exec] ivy-fail:
     [exec] 
     [exec] ivy-configure:
     [exec] [ivy:configure] :: loading settings :: file = /usr/home/hudson/hudson-slave/workspace/Lucene-Solr-SmokeRelease-4.x/lucene/build/fakeReleaseTmp/unpack/solr-4.8.0/lucene/ivy-settings.xml
     [exec] 
     [exec] resolve:
     [exec] 
     [exec] init:
     [exec] 
     [exec] compile-lucene-core:
     [exec] 
     [exec] ivy-availability-check:
     [exec] 
     [exec] ivy-fail:
     [exec] 
     [exec] ivy-configure:
     [exec] [ivy:configure] :: loading settings :: file = /usr/home/hudson/hudson-slave/workspace/Lucene-Solr-SmokeRelease-4.x/lucene/build/fakeReleaseTmp/unpack/solr-4.8.0/lucene/ivy-settings.xml
     [exec] 
     [exec] resolve:
     [exec] 
     [exec] init:
     [exec] 
     [exec] -clover.disable:
     [exec] 
     [exec] -clover.load:
     [exec] 
     [exec] -clover.classpath:
     [exec] 
     [exec] -clover.setup:
     [exec] 
     [exec] clover:
     [exec] 
     [exec] compile-core:
     [exec] 
     [exec] compile-codecs:
     [exec]      [echo] Building codecs...
     [exec] 
     [exec] ivy-availability-check:
     [exec]      [echo] Building codecs...
     [exec] 
     [exec] ivy-fail:
     [exec] 
     [exec] ivy-configure:
     [exec] [ivy:configure] :: loading settings :: file = /usr/home/hudson/hudson-slave/workspace/Lucene-Solr-SmokeRelease-4.x/lucene/build/fakeReleaseTmp/unpack/solr-4.8.0/lucene/ivy-settings.xml
     [exec] 
     [exec] resolve:
     [exec] 
     [exec] common.init:
     [exec] 
     [exec] compile-lucene-core:
     [exec] 
     [exec] init:
     [exec] 
     [exec] -clover.disable:
     [exec] 
     [exec] -clover.load:
     [exec] 
     [exec] -clover.classpath:
     [exec] 
     [exec] -clover.setup:
     [exec] 
     [exec] clover:
     [exec] 
     [exec] compile-core:
     [exec] 
     [exec] -clover.disable:
     [exec] 
     [exec] -clover.load:
     [exec] 
     [exec] -clover.classpath:
     [exec] 
     [exec] -clover.setup:
     [exec] 
     [exec] clover:
     [exec] 
     [exec] common.compile-core:
     [exec] 
     [exec] compile-core:
     [exec] 
     [exec] compile-core:
     [exec]     [mkdir] Created dir: /usr/home/hudson/hudson-slave/workspace/Lucene-Solr-SmokeRelease-4.x/lucene/build/fakeReleaseTmp/unpack/solr-4.8.0/solr/build/solr-test-framework/classes/java
     [exec]     [javac] Compiling 30 source files to /usr/home/hudson/hudson-slave/workspace/Lucene-Solr-SmokeRelease-4.x/lucene/build/fakeReleaseTmp/unpack/solr-4.8.0/solr/build/solr-test-framework/classes/java
     [exec]     [javac] warning: [options] bootstrap class path not set in conjunction with -source 1.6
     [exec]     [javac] Note: Some input files use or override a deprecated API.
     [exec]     [javac] Note: Recompile with -Xlint:deprecation for details.
     [exec]     [javac] Note: Some input files use unchecked or unsafe operations.
     [exec]     [javac] Note: Recompile with -Xlint:unchecked for details.
     [exec]     [javac] 1 warning
     [exec] 
     [exec] compile-solrj:
     [exec]      [echo] Building solr-solrj...
     [exec] 
     [exec] check-lucene-core-uptodate:
     [exec] 
     [exec] jar-lucene-core:
     [exec] 
     [exec] check-analyzers-phonetic-uptodate:
     [exec] 
     [exec] jar-analyzers-phonetic:
     [exec] 
     [exec] check-analyzers-kuromoji-uptodate:
     [exec] 
     [exec] jar-analyzers-kuromoji:
     [exec] 
     [exec] check-codecs-uptodate:
     [exec] 
     [exec] jar-codecs:
     [exec] 
     [exec] check-expressions-uptodate:
     [exec] 
     [exec] jar-expressions:
     [exec] 
     [exec] check-suggest-uptodate:
     [exec] 
     [exec] jar-suggest:
     [exec] 
     [exec] check-highlighter-uptodate:
     [exec] 
     [exec] jar-highlighter:
     [exec] 
     [exec] check-memory-uptodate:
     [exec] 
     [exec] jar-memory:
     [exec] 
     [exec] check-misc-uptodate:
     [exec] 
     [exec] jar-misc:
     [exec] 
     [exec] check-spatial-uptodate:
     [exec] 
     [exec] jar-spatial:
     [exec] 
     [exec] check-grouping-uptodate:
     [exec] 
     [exec] jar-grouping:
     [exec] 
     [exec] check-queries-uptodate:
     [exec] 
     [exec] jar-queries:
     [exec] 
     [exec] check-queryparser-uptodate:
     [exec] 
     [exec] jar-queryparser:
     [exec] 
     [exec] check-join-uptodate:
     [exec] 
     [exec] jar-join:
     [exec] 
     [exec] prep-lucene-jars:
     [exec] 
     [exec] resolve-example:
     [exec]      [echo] Building solr-example...
     [exec] 
     [exec] ivy-availability-check:
     [exec]      [echo] Building solr-example...
     [exec] 
     [exec] ivy-fail:
     [exec] 
     [exec] ivy-fail:
     [exec] 
     [exec] ivy-configure:
     [exec] [ivy:configure] :: loading settings :: file = /usr/home/hudson/hudson-slave/workspace/Lucene-Solr-SmokeRelease-4.x/lucene/build/fakeReleaseTmp/unpack/solr-4.8.0/lucene/ivy-settings.xml
     [exec] 
     [exec] sync-hack:
     [exec] 
     [exec] resolve:
     [exec]      [echo] Building solr-example-DIH...
     [exec] 
     [exec] ivy-availability-check:
     [exec]      [echo] Building solr-example-DIH...
     [exec] 
     [exec] ivy-fail:
     [exec] 
     [exec] ivy-configure:
     [exec] [ivy:configure] :: loading settings :: file = /usr/home/hudson/hudson-slave/workspace/Lucene-Solr-SmokeRelease-4.x/lucene/build/fakeReleaseTmp/unpack/solr-4.8.0/lucene/ivy-settings.xml
     [exec] 
     [exec] resolve:
     [exec] 
     [exec] ivy-availability-check:
     [exec]      [echo] Building solr-solrj...
     [exec] 
     [exec] ivy-fail:
     [exec] 
     [exec] ivy-configure:
     [exec] [ivy:configure] :: loading settings :: file = /usr/home/hudson/hudson-slave/workspace/Lucene-Solr-SmokeRelease-4.x/lucene/build/fakeReleaseTmp/unpack/solr-4.8.0/lucene/ivy-settings.xml
     [exec] 
     [exec] resolve:
     [exec] 
     [exec] common.init:
     [exec] 
     [exec] compile-lucene-core:
     [exec] 
     [exec] ivy-availability-check:
     [exec] 
     [exec] ivy-fail:
     [exec] 
     [exec] ivy-configure:
     [exec] [ivy:configure] :: loading settings :: file = /usr/home/hudson/hudson-slave/workspace/Lucene-Solr-SmokeRelease-4.x/lucene/build/fakeReleaseTmp/unpack/solr-4.8.0/lucene/ivy-settings.xml
     [exec] 
     [exec] resolve:
     [exec] 
     [exec] init:
     [exec] 
     [exec] -clover.disable:
     [exec] 
     [exec] -clover.load:
     [exec] 
     [exec] -clover.classpath:
     [exec] 
     [exec] -clover.setup:
     [exec] 
     [exec] clover:
     [exec] 
     [exec] compile-core:
     [exec] 
     [exec] init:
     [exec] 
     [exec] -clover.disable:
     [exec] 
     [exec] -clover.load:
     [exec] 
     [exec] -clover.classpath:
     [exec] 
     [exec] -clover.setup:
     [exec] 
     [exec] clover:
     [exec] 
     [exec] common.compile-core:
     [exec] 
     [exec] compile-core:
     [exec] 
     [exec] check-lucene-core-uptodate:
     [exec] 
     [exec] jar-lucene-core:
     [exec] 
     [exec] check-analyzers-phonetic-uptodate:
     [exec] 
     [exec] jar-analyzers-phonetic:
     [exec] 
     [exec] check-analyzers-kuromoji-uptodate:
     [exec] 
     [exec] jar-analyzers-kuromoji:
     [exec] 
     [exec] check-codecs-uptodate:
     [exec] 
     [exec] jar-codecs:
     [exec] 
     [exec] check-expressions-uptodate:
     [exec] 
     [exec] jar-expressions:
     [exec] 
     [exec] check-suggest-uptodate:
     [exec] 
     [exec] jar-suggest:
     [exec] 
     [exec] check-highlighter-uptodate:
     [exec] 
     [exec] jar-highlighter:
     [exec] 
     [exec] check-memory-uptodate:
     [exec] 
     [exec] jar-memory:
     [exec] 
     [exec] check-misc-uptodate:
     [exec] 
     [exec] jar-misc:
     [exec] 
     [exec] check-spatial-uptodate:
     [exec] 
     [exec] jar-spatial:
     [exec] 
     [exec] check-grouping-uptodate:
     [exec] 
     [exec] jar-grouping:
     [exec] 
     [exec] check-queries-uptodate:
     [exec] 
     [exec] jar-queries:
     [exec] 
     [exec] check-queryparser-uptodate:
     [exec] 
     [exec] jar-queryparser:
     [exec] 
     [exec] check-join-uptodate:
     [exec] 
     [exec] jar-join:
     [exec] 
     [exec] prep-lucene-jars:
     [exec] 
     [exec] resolve-example:
     [exec]      [echo] Building solr-example...
     [exec] 
     [exec] ivy-availability-check:
     [exec]      [echo] Building solr-example...
     [exec] 
     [exec] ivy-fail:
     [exec] 
     [exec] ivy-fail:
     [exec] 
     [exec] ivy-configure:
     [exec] [ivy:configure] :: loading settings :: file = /usr/home/hudson/hudson-slave/workspace/Lucene-Solr-SmokeRelease-4.x/lucene/build/fakeReleaseTmp/unpack/solr-4.8.0/lucene/ivy-settings.xml
     [exec] 
     [exec] sync-hack:
     [exec] 
     [exec] resolve:
     [exec]      [echo] Building solr-example-DIH...
     [exec] 
     [exec] ivy-availability-check:
     [exec]      [echo] Building solr-example-DIH...
     [exec] 
     [exec] ivy-fail:
     [exec] 
     [exec] ivy-configure:
     [exec] [ivy:configure] :: loading settings :: file = /usr/home/hudson/hudson-slave/workspace/Lucene-Solr-SmokeRelease-4.x/lucene/build/fakeReleaseTmp/unpack/solr-4.8.0/lucene/ivy-settings.xml
     [exec] 
     [exec] resolve:
     [exec] 
     [exec] ivy-fail:
     [exec] 
     [exec] resolve:
     [exec] 
     [exec] common.init:
     [exec] 
     [exec] compile-lucene-core:
     [exec] 
     [exec] ivy-availability-check:
     [exec] 
     [exec] ivy-fail:
     [exec] 
     [exec] ivy-configure:
     [exec] [ivy:configure] :: loading settings :: file = /usr/home/hudson/hudson-slave/workspace/Lucene-Solr-SmokeRelease-4.x/lucene/build/fakeReleaseTmp/unpack/solr-4.8.0/lucene/ivy-settings.xml
     [exec] 
     [exec] resolve:
     [exec] 
     [exec] init:
     [exec] 
     [exec] -clover.disable:
     [exec] 
     [exec] -clover.load:
     [exec] 
     [exec] -clover.classpath:
     [exec] 
     [exec] -clover.setup:
     [exec] 
     [exec] clover:
     [exec] 
     [exec] compile-core:
     [exec] 
     [exec] init:
     [exec] 
     [exec] common.compile-core:
     [exec] 
     [exec] common-solr.compile-core:
     [exec] 
     [exec] compile-core:
     [exec] 
     [exec] compile-test-framework:
     [exec] 
     [exec] ivy-availability-check:
     [exec] 
     [exec] ivy-fail:
     [exec] 
     [exec] ivy-configure:
     [exec] [ivy:configure] :: loading settings :: file = /usr/home/hudson/hudson-slave/workspace/Lucene-Solr-SmokeRelease-4.x/lucene/build/fakeReleaseTmp/unpack/solr-4.8.0/lucene/ivy-settings.xml
     [exec] 
     [exec] resolve:
     [exec] 
     [exec] init:
     [exec] 
     [exec] compile-lucene-core:
     [exec] 
     [exec] compile-codecs:
     [exec]      [echo] Building codecs...
     [exec] 
     [exec] ivy-availability-check:
     [exec]      [echo] Building codecs...
     [exec] 
     [exec] ivy-fail:
     [exec] 
     [exec] ivy-configure:
     [exec] [ivy:configure] :: loading settings :: file = /usr/home/hudson/hudson-slave/workspace/Lucene-Solr-SmokeRelease-4.x/lucene/build/fakeReleaseTmp/unpack/solr-4.8.0/lucene/ivy-settings.xml
     [exec] 
     [exec] resolve:
     [exec] 
     [exec] common.init:
     [exec] 
     [exec] compile-lucene-core:
     [exec] 
     [exec] init:
     [exec] 
     [exec] -clover.disable:
     [exec] 
     [exec] -clover.load:
     [exec] 
     [exec] -clover.classpath:
     [exec] 
     [exec] -clover.setup:
     [exec] 
     [exec] clover:
     [exec] 
     [exec] compile-core:
     [exec] 
     [exec] -clover.disable:
     [exec] 
     [exec] -clover.load:
     [exec] 
     [exec] -clover.classpath:
     [exec] 
     [exec] -clover.setup:
     [exec] 
     [exec] clover:
     [exec] 
     [exec] common.compile-core:
     [exec] 
     [exec] compile-core:
     [exec] 
     [exec] common.compile-test:
     [exec]     [mkdir] Created dir: /usr/home/hudson/hudson-slave/workspace/Lucene-Solr-SmokeRelease-4.x/lucene/build/fakeReleaseTmp/unpack/solr-4.8.0/solr/build/solr-core/classes/test
     [exec]     [javac] Compiling 395 source files to /usr/home/hudson/hudson-slave/workspace/Lucene-Solr-SmokeRelease-4.x/lucene/build/fakeReleaseTmp/unpack/solr-4.8.0/solr/build/solr-core/classes/test
     [exec]     [javac] warning: [options] bootstrap class path not set in conjunction with -source 1.6
     [exec]     [javac] Note: Some input files use or override a deprecated API.
     [exec]     [javac] Note: Recompile with -Xlint:deprecation for details.
     [exec]     [javac] Note: Some input files use unchecked or unsafe operations.
     [exec]     [javac] Note: Recompile with -Xlint:unchecked for details.
     [exec]     [javac] 1 warning
     [exec]      [copy] Copying 1 file to /usr/home/hudson/hudson-slave/workspace/Lucene-Solr-SmokeRelease-4.x/lucene/build/fakeReleaseTmp/unpack/solr-4.8.0/solr/build/solr-core/classes/test
     [exec] 
     [exec] compile-test:
     [exec] 
     [exec] install-junit4-taskdef:
     [exec] 
     [exec] compile-tools:
     [exec] 
     [exec] ivy-availability-check:
     [exec] 
     [exec] ivy-fail:
     [exec] 
     [exec] ivy-configure:
     [exec] [ivy:configure] :: loading settings :: file = /usr/home/hudson/hudson-slave/workspace/Lucene-Solr-SmokeRelease-4.x/lucene/build/fakeReleaseTmp/unpack/solr-4.8.0/lucene/ivy-settings.xml
     [exec] 
     [exec] resolve:
     [exec] 
     [exec] init:
     [exec] 
     [exec] compile-core:
     [exec] 
     [exec] validate:
     [exec] 
     [exec] resolve-groovy:
     [exec] 
     [exec] -init-totals:
     [exec] 
     [exec] -test:
     [exec]     [mkdir] Created dir: /usr/home/hudson/hudson-slave/workspace/Lucene-Solr-SmokeRelease-4.x/lucene/build/fakeReleaseTmp/unpack/solr-4.8.0/solr/build/solr-core/test
     [exec]     [mkdir] Created dir: /usr/home/hudson/hudson-slave/workspace/Lucene-Solr-SmokeRelease-4.x/lucene/build/fakeReleaseTmp/unpack/solr-4.8.0/solr/build/solr-core/test/temp
     [exec]    [junit4] <JUnit4> says hi! Master seed: 892AB7C8F04E70EF
     [exec]    [junit4] Your default console's encoding may not display certain unicode glyphs: US-ASCII
     [exec]    [junit4] Executing 363 suites with 4 JVMs.
     [exec]    [junit4] 
     [exec]    [junit4] Started J2 PID(34687@lucene.zones.apache.org).
     [exec]    [junit4] Started J0 PID(34688@lucene.zones.apache.org).
     [exec]    [junit4] Started J3 PID(34689@lucene.zones.apache.org).
     [exec]    [junit4] Started J1 PID(34690@lucene.zones.apache.org).
     [exec]    [junit4] Suite: org.apache.solr.schema.MultiTermTest
     [exec]    [junit4] Completed on J3 in 32.43s, 3 tests
     [exec]    [junit4] 
     [exec]    [junit4] Suite: org.apache.solr.MinimalSchemaTest
     [exec]    [junit4] Completed on J2 in 38.76s, 3 tests
     [exec]    [junit4] 
     [exec]    [junit4] Suite: org.apache.solr.analysis.TestWordDelimiterFilterFactory
     [exec]    [junit4] Completed on J2 in 9.67s, 7 tests
     [exec]    [junit4] 
     [exec]    [junit4] Suite: org.apache.solr.handler.admin.LoggingHandlerTest
     [exec]    [junit4] Completed on J2 in 3.80s, 1 test
     [exec]    [junit4] 
     [exec]    [junit4] Suite: org.apache.solr.util.TestUtils
     [exec]    [junit4] Completed on J2 in 0.03s, 3 tests
     [exec]    [junit4] 
     [exec]    [junit4] Suite: org.apache.solr.handler.component.SpellCheckComponentTest
     [exec]    [junit4] Completed on J3 in 21.63s, 9 tests
     [exec]    [junit4] 
     [exec]    [junit4] Suite: org.apache.solr.cloud.AssignTest
     [exec]    [junit4] Completed on J2 in 2.35s, 1 test
     [exec]    [junit4] 
     [exec]    [junit4] Suite: org.apache.solr.analysis.TestCollationKeyRangeQueries
     [exec]    [junit4] Completed on J3 in 2.56s, 3 tests
     [exec]    [junit4] 
     [exec]    [junit4] Suite: org.apache.solr.TestDistributedMissingSort
     [exec]    [junit4] Completed on J1 in 68.18s, 1 test
     [exec]    [junit4] 
     [exec]    [junit4] Suite: org.apache.solr.analysis.TestCharFilters
     [exec]    [junit4] Completed on J1 in 2.55s, 2 tests
     [exec]    [junit4] 
     [exec]    [junit4] Suite: org.apache.solr.cloud.SliceStateUpdateTest
     [exec]    [junit4] Completed on J3 in 15.87s, 1 test
     [exec]    [junit4] 
     [exec]    [junit4] Suite: org.apache.solr.core.TestQuerySenderNoQuery
     [exec]    [junit4] Completed on J3 in 3.03s, 3 tests
     [exec]    [junit4] 
     [exec]    [junit4] HEARTBEAT J0 PID(34688@lucene.zones.apache.org): 2014-03-01T17:02:47, stalled for 66.8s at: SyncSliceTest.testDistribSearch
     [exec]    [junit4] Suite: org.apache.solr.handler.PingRequestHandlerTest
     [exec]    [junit4] Completed on J3 in 3.08s, 5 tests
     [exec]    [junit4] 
     [exec]    [junit4] Suite: org.apache.solr.util.TestFastWriter
     [exec]    [junit4] Completed on J3 in 0.49s, 1 test
     [exec]    [junit4] 
     [exec]    [junit4] Suite: org.apache.solr.spelling.suggest.SuggesterWFSTTest
     [exec]    [junit4] Completed on J3 in 5.04s, 4 tests
     [exec]    [junit4] 
     [exec]    [junit4] Suite: org.apache.solr.handler.component.TermVectorComponentDistributedTest
     [exec]    [junit4] Completed on J2 in 33.34s, 1 test
     [exec]    [junit4] 
     [exec]    [junit4] Suite: org.apache.solr.cloud.hdfs.HdfsChaosMonkeySafeLeaderTest
     [exec]    [junit4] Completed on J2 in 0.46s, 1 test, 1 skipped
     [exec]    [junit4] 
     [exec]    [junit4] Suite: org.apache.solr.search.TestIndexSearcher
     [exec]    [junit4] Completed on J2 in 3.14s, 2 tests
     [exec]    [junit4] 
     [exec]    [junit4] Suite: org.apache.solr.handler.component.TermsComponentTest
     [exec]    [junit4] Completed on J2 in 3.64s, 13 tests
     [exec]    [junit4] 
     [exec]    [junit4] Suite: org.apache.solr.cloud.ZkSolrClientTest
     [exec]    [junit4] Completed on J3 in 11.59s, 5 tests
     [exec]    [junit4] 
     [exec]    [junit4] Suite: org.apache.solr.handler.component.DistributedSpellCheckComponentTest
     [exec]    [junit4] Completed on J1 in 25.02s, 1 test
     [exec]    [junit4] 
     [exec]    [junit4] Suite: org.apache.solr.search.similarities.TestSweetSpotSimilarityFactory
     [exec]    [junit4] Completed on J2 in 0.96s, 3 tests
     [exec]    [junit4] 
     [exec]    [junit4] Suite: org.apache.solr.util.TimeZoneUtilsTest
     [exec]    [junit4] Completed on J1 in 0.15s, 5 tests
     [exec]    [junit4] 
     [exec]    [junit4] Suite: org.apache.solr.internal.csv.CSVParserTest
     [exec]    [junit4] Completed on J2 in 0.10s, 23 tests
     [exec]    [junit4] 
     [exec]    [junit4] Suite: org.apache.solr.handler.CSVRequestHandlerTest
     [exec]    [junit4] Completed on J3 in 2.53s, 1 test
     [exec]    [junit4] 
     [exec]    [junit4] Suite: org.apache.solr.schema.IndexSchemaTest
     [exec]    [junit4] Completed on J3 in 3.46s, 3 tests
     [exec]    [junit4] 
     [exec]    [junit4] Suite: org.apache.solr.servlet.NoCacheHeaderTest
     [exec]    [junit4] Completed on J3 in 8.05s, 3 tests
     [exec]    [junit4] 
     [exec]    [junit4] Suite: org.apache.solr.schema.CurrencyFieldOpenExchangeTest
     [exec]    [junit4] Completed on J3 in 4.31s, 10 tests, 1 skipped
     [exec]    [junit4] 
     [exec]    [junit4] Suite: org.apache.solr.handler.component.SuggestComponentTest
     [exec]    [junit4] Completed on J3 in 5.73s, 6 tests
     [exec]    [junit4] 
     [exec]    [junit4] Suite: org.apache.solr.util.TestNumberUtils
     [exec]    [junit4] Completed on J3 in 0.41s, 1 test
     [exec]    [junit4] 
     [exec]    [junit4] Suite: org.apache.solr.search.TestRecoveryHdfs
     [exec]    [junit4] Completed on J3 in 0.15s, 10 tests, 10 skipped
     [exec]    [junit4] 
     [exec]    [junit4] Suite: org.apache.solr.request.JSONWriterTest
     [exec]    [junit4] Completed on J3 in 2.40s, 3 tests
     [exec]    [junit4] 
     [exec]    [junit4] Suite: org.apache.solr.handler.component.DistributedQueryComponentOptimizationTest
     [exec]    [junit4] Completed on J3 in 4.93s, 1 test
     [exec]    [junit4] 
     [exec]    [junit4] HEARTBEAT J0 PID(34688@lucene.zones.apache.org): 2014-03-01T17:03:47, stalled for  127s at: SyncSliceTest.testDistribSearch
     [exec]    [junit4] Suite: org.apache.solr.cloud.RecoveryZkTest
     [exec]    [junit4] Completed on J2 in 41.89s, 1 test
     [exec]    [junit4] 
     [exec]    [junit4] Suite: org.apache.solr.analysis.TestLuceneMatchVersion
     [exec]    [junit4] Completed on J2 in 1.13s, 1 test
     [exec]    [junit4] 
     [exec]    [junit4] Suite: org.apache.solr.handler.component.DistributedSuggestComponentTest
     [exec]    [junit4] Completed on J3 in 16.71s, 1 test
     [exec]    [junit4] 
     [exec]    [junit4] Suite: org.apache.solr.core.TestSolrXMLSerializer
     [exec]    [junit4] Completed on J3 in 0.13s, 1 test
     [exec]    [junit4] 
     [exec]    [junit4] Suite: org.apache.solr.search.join.BJQParserTest
     [exec]    [junit4] Completed on J3 in 3.09s, 9 tests
     [exec]    [junit4] 
     [exec]    [junit4] Suite: org.apache.solr.TestHighlightDedupGrouping
     [exec]    [junit4] Completed on J3 in 8.01s, 1 test
     [exec]    [junit4] 
     [exec]    [junit4] Suite: org.apache.solr.cloud.ClusterStateUpdateTest
     [exec]    [junit4] Completed on J2 in 16.82s, 1 test
     [exec]    [junit4] 
     [exec]    [junit4] Suite: org.apache.solr.rest.schema.TestFieldTypeResource
     [exec]    [junit4] Completed on J2 in 3.79s, 4 tests
     [exec]    [junit4] 
     [exec]    [junit4] HEARTBEAT J1 PID(34690@lucene.zones.apache.org): 2014-03-01T17:04:11, stalled for 65.2s at: BasicDistributedZk2Test.testDistribSearch
     [exec]    [junit4] Suite: org.apache.solr.core.SolrCoreCheckLockOnStartupTest
     [exec]    [junit4] Completed on J2 in 3.59s, 2 tests
     [exec]    [junit4] 
     [exec]    [junit4] Suite: org.apache.solr.core.PluginInfoTest
     [exec]    [junit4] Completed on J2 in 0.13s, 9 tests
     [exec]    [junit4] 
     [exec]    [junit4] Suite: org.apache.solr.search.TestExtendedDismaxParser
     [exec]    [junit4] Completed on J2 in 4.04s, 18 tests
     [exec]    [junit4] 
     [exec]    [junit4] Suite: org.apache.solr.core.SolrCoreTest
     [exec]    [junit4] Completed on J3 in 13.46s, 6 tests
     [exec]    [junit4] 
     [exec]    [junit4] Suite: org.apache.solr.rest.schema.TestFieldTypeCollectionResource
     [exec]    [junit4] Completed on J2 in 1.76s, 2 tests
     [exec]    [junit4] 
     [exec]    [junit4] Suite: org.apache.solr.handler.TestCSVLoader
     [exec]    [junit4] Completed on J2 in 2.97s, 6 tests
     [exec]    [junit4] 
     [exec]    [junit4] Suite: org.apache.solr.store.hdfs.HdfsLockFactoryTest
     [exec]    [junit4] Completed on J2 in 0.03s, 1 test, 1 skipped
     [exec]    [junit4] 
     [exec]    [junit4] Suite: org.apache.solr.core.TestBadConfig
     [exec]    [junit4] Completed on J3 in 17.37s, 13 tests
     [exec]    [junit4] 
     [exec]    [junit4] Suite: org.apache.solr.search.function.TestFunctionQuery
     [exec]    [junit4] Completed on J3 in 9.42s, 15 tests
     [exec]    [junit4] 
     [exec]    [junit4] HEARTBEAT J0 PID(34688@lucene.zones.apache.org): 2014-03-01T17:04:47, stalled for  187s at: SyncSliceTest.testDistribSearch
     [exec]    [junit4] Suite: org.apache.solr.search.TestStressReorder
     [exec]    [junit4] Completed on J2 in 25.43s, 1 test
     [exec]    [junit4] 
     [exec]    [junit4] Suite: org.apache.solr.DisMaxRequestHandlerTest
     [exec]    [junit4] Completed on J3 in 3.74s, 2 tests
     [exec]    [junit4] 
     [exec]    [junit4] Suite: org.apache.solr.search.TestCollapseQParserPlugin
     [exec]    [junit4] Completed on J2 in 3.00s, 1 test
     [exec]    [junit4] 
     [exec]    [junit4] Suite: org.apache.solr.core.SOLR749Test
     [exec]    [junit4] Completed on J2 in 2.80s, 2 tests
     [exec]    [junit4] 
     [exec]    [junit4] Suite: org.apache.solr.rest.schema.TestDynamicFieldResource
     [exec]    [junit4] Completed on J2 in 1.51s, 3 tests
     [exec]    [junit4] 
     [exec]    [junit4] Suite: org.apache.solr.handler.component.DistributedQueryComponentCustomSortTest
     [exec]    [junit4] Completed on J3 in 5.63s, 1 test
     [exec]    [junit4] 
     [exec]    [junit4] Suite: org.apache.solr.rest.schema.TestDefaultSearchFieldResource
     [exec]    [junit4] Completed on J2 in 1.45s, 1 test
     [exec]    [junit4] 
     [exec]    [junit4] Suite: org.apache.solr.internal.csv.writer.CSVConfigTest
     [exec]    [junit4] Completed on J2 in 0.02s, 7 tests
     [exec]    [junit4] 
     [exec]    [junit4] Suite: org.apache.solr.core.TestCodecSupport
     [exec]    [junit4] Completed on J2 in 0.58s, 4 tests
     [exec]    [junit4] 
     [exec]    [junit4] Suite: org.apache.solr.handler.FieldAnalysisRequestHandlerTest
     [exec]    [junit4] Completed on J3 in 2.53s, 4 tests
     [exec]    [junit4] 
     [exec]    [junit4] HEARTBEAT J1 PID(34690@lucene.zones.apache.org): 2014-03-01T17:05:11, stalled for  125s at: BasicDistributedZk2Test.testDistribSearch
     [exec]    [junit4] Suite: org.apache.solr.cloud.OverseerRolesTest
     [exec]    [junit4] Completed on J2 in 27.17s, 1 test
     [exec]    [junit4] 
     [exec]    [junit4] Suite: org.apache.solr.cloud.hdfs.HdfsRecoveryZkTest
     [exec]    [junit4] Completed on J2 in 0.05s, 1 test, 1 skipped
     [exec]    [junit4] 
     [exec]    [junit4] Suite: org.apache.solr.update.TestUpdate
     [exec]    [junit4] Completed on J2 in 3.36s, 1 test
     [exec]    [junit4] 
     [exec]    [junit4] Suite: org.apache.solr.core.TestSolrXml
     [exec]    [junit4] Completed on J2 in 0.36s, 2 tests
     [exec]    [junit4] 
     [exec]    [junit4] Suite: org.apache.solr.core.OpenCloseCoreStressTest
     [exec]    [junit4] IGNOR/A 0.00s J3 | OpenCloseCoreStressTest.test1HourNew
     [exec]    [junit4]    > Assumption #1: 'weekly' test group is disabled (@Weekly)
     [exec]    [junit4] IGNOR/A 0.00s J3 | OpenCloseCoreStressTest.test10MinutesNew
     [exec]    [junit4]    > Assumption #1: 'nightly' test group is disabled (@Nightly)
     [exec]    [junit4] IGNOR/A 0.00s J3 | OpenCloseCoreStressTest.test10MinutesOld
     [exec]    [junit4]    > Assumption #1: 'nightly' test group is disabled (@Nightly)
     [exec]    [junit4] IGNOR/A 0.00s J3 | OpenCloseCoreStressTest.test1HourOld
     [exec]    [junit4]    > Assumption #1: 'weekly' test group is disabled (@Weekly)
     [exec]    [junit4] Completed on J3 in 32.53s, 6 tests, 4 skipped
     [exec]    [junit4] 
     [exec]    [junit4] Suite: org.apache.solr.TestDocumentBuilder
     [exec]    [junit4] Completed on J3 in 0.02s, 1 test
     [exec]    [junit4] 
     [exec]    [junit4] Suite: org.apache.solr.spelling.suggest.TestAnalyzeInfixSuggestions
     [exec]    [junit4] Completed on J2 in 3.32s, 2 tests
     [exec]    [junit4] 
     [exec]    [junit4] Suite: org.apache.solr.schema.TestOmitPositions
     [exec]    [junit4] Completed on J2 in 1.99s, 2 tests
     [exec]    [junit4] 
     [exec]    [junit4] Suite: org.apache.solr.update.AddBlockUpdateTest
     [exec]    [junit4] Completed on J2 in 3.37s, 6 tests
     [exec]    [junit4] 
     [exec]    [junit4] Suite: org.apache.solr.update.processor.ScriptEngineTest
     [exec]    [junit4] IGNOR/A 0.01s J2 | ScriptEngineTest.testJRuby
     [exec]    [junit4]    > Assumption #1: got: <[null]>, expected: each not null
     [exec]    [junit4] Completed on J2 in 0.43s, 6 tests, 1 skipped
     [exec]    [junit4] 
     [exec]    [junit4] Suite: org.apache.solr.response.TestCSVResponseWriter
     [exec]    [junit4] Completed on J2 in 2.20s, 2 tests
     [exec]    [junit4] 
     [exec]    [junit4] Suite: org.apache.solr.schema.AbstractCurrencyFieldTest
     [exec]    [junit4] Completed on J2 in 0.00s, 0 tests
     [exec]    [junit4] 
     [exec]    [junit4] Suite: org.apache.solr.search.CursorMarkTest
     [exec]    [junit4] Completed on J2 in 1.42s, 4 tests
     [exec]    [junit4] 
     [exec]    [junit4] Suite: org.apache.solr.schema.SchemaVersionSpecificBehaviorTest
     [exec]    [junit4] Completed on J2 in 5.06s, 1 test
     [exec]    [junit4] 
     [exec]    [junit4] Suite: org.apache.solr.spelling.SpellPossibilityIteratorTest
     [exec]    [junit4] Completed on J2 in 0.46s, 3 tests
     [exec]    [junit4] 
     [exec]    [junit4] HEARTBEAT J0 PID(34688@lucene.zones.apache.org): 2014-03-01T17:05:47, stalled for  247s at: SyncSliceTest.testDistribSearch
     [exec]    [junit4] Suite: org.apache.solr.schema.PreAnalyzedFieldTest
     [exec]    [junit4] Completed on J2 in 2.30s, 3 tests
     [exec]    [junit4] 
     [exec]    [junit4] Suite: org.apache.solr.handler.StandardRequestHandlerTest
     [exec]    [junit4] Completed on J2 in 2.20s, 1 test
     [exec]    [junit4] 
     [exec]    [junit4] Suite: org.apache.solr.search.TestInitQParser
     [exec]    [junit4] Completed on J2 in 1.44s, 1 test
     [exec]    [junit4] 
     [exec]    [junit4] Suite: org.apache.solr.internal.csv.CSVPrinterTest
     [exec]    [junit4] Completed on J2 in 0.53s, 6 tests
     [exec]    [junit4] 
     [exec]    [junit4] Suite: org.apache.solr.cloud.OverseerCollectionProcessorTest
     [exec]    [junit4] Completed on J2 in 2.75s, 14 tests
     [exec]    [junit4] 
     [exec]    [junit4] Suite: org.apache.solr.search.similarities.TestNonDefinedSimilarityFactory
     [exec]    [junit4] Completed on J2 in 1.86s, 3 tests
     [exec]    [junit4] 
     [exec]    [junit4] Suite: org.apache.solr.core.TestInfoStreamLogging
     [exec]    [junit4] Completed on J2 in 1.84s, 1 test
     [exec]    [junit4] 
     [exec]    [junit4] Suite: org.apache.solr.AnalysisAfterCoreReloadTest
     [exec]    [junit4] Completed on J2 in 4.49s, 1 test
     [exec]    [junit4] 
     [exec]    [junit4] Suite: org.apache.solr.cloud.hdfs.HdfsSyncSliceTest
     [exec]    [junit4] Completed on J2 in 0.03s, 1 test, 1 skipped
     [exec]    [junit4] 
     [exec]    [junit4] HEARTBEAT J1 PID(34690@lucene.zones.apache.org): 2014-03-01T17:06:11, stalled for  185s at: BasicDistributedZk2Test.testDistribSearch
     [exec]    [junit4] Suite: org.apache.solr.request.SimpleFacetsTest
     [exec]    [junit4] Completed on J2 in 8.62s, 32 tests
     [exec]    [junit4] 
     [exec]    [junit4] Suite: org.apache.solr.schema.TestCollationFieldDocValues
     [exec]    [junit4] Completed on J2 in 1.29s, 8 tests
     [exec]    [junit4] 
     [exec]    [junit4] Suite: org.apache.solr.spelling.DirectSolrSpellCheckerTest
     [exec]    [junit4] Completed on J2 in 2.54s, 2 tests
     [exec]    [junit4] 
     [exec]    [junit4] Suite: org.apache.solr.rest.schema.TestDynamicFieldCollectionResource
     [exec]    [junit4] Completed on J2 in 1.55s, 5 tests
     [exec]    [junit4] 
     [exec]    [junit4] Suite: org.apache.solr.update.processor.AddSchemaFieldsUpdateProcessorFactoryTest
     [exec]    [junit4] Completed on J2 in 7.79s, 6 tests
     [exec]    [junit4] 
     [exec]    [junit4] Suite: org.apache.solr.spelling.suggest.SuggesterTSTTest
     [exec]    [junit4] Completed on J2 in 3.55s, 4 tests
     [exec]    [junit4] 
     [exec]    [junit4] Suite: org.apache.solr.cloud.ChaosMonkeyShardSplitTest
     [exec]    [junit4] Completed on J2 in 0.00s, 0 tests
     [exec]    [junit4] 
     [exec]    [junit4] Suite: org.apache.solr.internal.csv.CharBufferTest
     [exec]    [junit4] Completed on J2 in 0.01s, 13 tests
     [exec]    [junit4] 
     [exec]    [junit4] Suite: org.apache.solr.request.TestRemoteStreaming
     [exec]    [junit4] Completed on J2 in 1.81s, 4 tests
     [exec]    [junit4] 
     [exec]    [junit4] HEARTBEAT J3 PID(34689@lucene.zones.apache.org): 2014-03-01T17:06:35, stalled for 64.4s at: CollectionsAPIDistributedZkTest.testDistribSearch
     [exec]    [junit4] HEARTBEAT J0 PID(34688@lucene.zones.apache.org): 2014-03-01T17:06:47, stalled for  307s at: SyncSliceTest.testDistribSearch
     [exec]    [junit4] HEARTBEAT J1 PID(34690@lucene.zones.apache.org): 2014-03-01T17:07:11, stalled for  245s at: BasicDistributedZk2Test.testDistribSearch
     [exec]    [junit4] HEARTBEAT J2 PID(34687@lucene.zones.apache.org): 2014-03-01T17:07:35, stalled for 63.9s at: ShardSplitTest.testDistribSearch
     [exec]    [junit4] HEARTBEAT J3 PID(34689@lucene.zones.apache.org): 2014-03-01T17:07:35, stalled for  124s at: CollectionsAPIDistributedZkTest.testDistribSearch
     [exec]    [junit4] HEARTBEAT J0 PID(34688@lucene.zones.apache.org): 2014-03-01T17:07:47, stalled for  367s at: SyncSliceTest.testDistribSearch
     [exec]    [junit4] Suite: org.apache.solr.cloud.ShardSplitTest
     [exec]    [junit4] Completed on J2 in 92.04s, 1 test
     [exec]    [junit4] 
     [exec]    [junit4] Suite: org.apache.solr.cloud.BasicDistributedZk2Test
     [exec]    [junit4] Completed on J1 in 304.29s, 1 test
     [exec]    [junit4] 
     [exec]    [junit4] Suite: org.apache.solr.internal.csv.writer.CSVConfigGuesserTest
     [exec]    [junit4] Completed on J1 in 0.07s, 3 tests
     [exec]    [junit4] 
     [exec]    [junit4] Suite: org.apache.solr.core.ResourceLoaderTest
     [exec]    [junit4] Completed on J1 in 0.43s, 7 tests
     [exec]    [junit4] 
     [exec]    [junit4] Suite: org.apache.solr.update.AutoCommitTest
     [exec]    [junit4] Completed on J2 in 14.92s, 3 tests
     [exec]    [junit4] 
     [exec]    [junit4] Suite: org.apache.solr.cloud.SyncSliceTest
     [exec]    [junit4] Completed on J0 in 411.40s, 1 test
     [exec]    [junit4] 
     [exec]    [junit4] Suite: org.apache.solr.search.TestReload
     [exec]    [junit4] Completed on J1 in 12.94s, 1 test
     [exec]    [junit4] 
     [exec]    [junit4] Suite: org.apache.solr.logging.TestLogWatcher
     [exec]    [junit4] Completed on J1 in 0.06s, 1 test
     [exec]    [junit4] 
     [exec]    [junit4] Suite: org.apache.solr.store.blockcache.BlockDirectoryTest
     [exec]    [junit4] Completed on J1 in 10.80s, 4 tests
     [exec]    [junit4] 
     [exec]    [junit4] HEARTBEAT J3 PID(34689@lucene.zones.apache.org): 2014-03-01T17:08:35, stalled for  184s at: CollectionsAPIDistributedZkTest.testDistribSearch
     [exec]    [junit4] Suite: org.apache.solr.rest.schema.TestFieldCollectionResource
     [exec]    [junit4] Completed on J1 in 4.34s, 7 tests
     [exec]    [junit4] 
     [exec]    [junit4] Suite: org.apache.solr.cloud.TestZkChroot
     [exec]    [junit4] Completed on J1 in 14.41s, 4 tests
     [exec]    [junit4] 
     [exec]    [junit4] Suite: org.apache.solr.analysis.PathHierarchyTokenizerFactoryTest
     [exec]    [junit4] Completed on J1 in 2.50s, 2 tests
     [exec]    [junit4] 
     [exec]    [junit4] Suite: org.apache.solr.cloud.CollectionsAPIDistributedZkTest
     [exec]    [junit4] Completed on J3 in 213.28s, 1 test
     [exec]    [junit4] 
     [exec]    [junit4] Suite: org.apache.solr.handler.component.TermVectorComponentTest
     [exec]    [junit4] Completed on J3 in 2.47s, 3 tests
     [exec]    [junit4] 
     [exec]    [junit4] Suite: org.apache.solr.cloud.LeaderElectionTest
     [exec]    [junit4] Completed on J1 in 14.95s, 4 tests
     [exec]    [junit4] 
     [exec]    [junit4] Suite: org.apache.solr.schema.PrimitiveFieldTypeTest
     [exec]    [junit4] Completed on J1 in 1.71s, 1 test
     [exec]    [junit4] 
     [exec]    [junit4] Suite: org.apache.solr.core.TestSolrDeletionPolicy2
     [exec]    [junit4] Completed on J1 in 1.67s, 1 test
     [exec]    [junit4] 
     [exec]    [junit4] Suite: org.apache.solr.core.CachingDirectoryFactoryTest
     [exec]    [junit4] Completed on J3 in 8.24s, 1 test
     [exec]    [junit4] 
     [exec]    [junit4] Suite: org.apache.solr.search.TestCustomSort
     [exec]    [junit4] Completed on J3 in 1.25s, 1 test
     [exec]    [junit4] 
     [exec]    [junit4] Suite: org.apache.solr.analysis.TestReversedWildcardFilterFactory
     [exec]    [junit4] Completed on J3 in 1.65s, 4 tests
     [exec]    [junit4] 
     [exec]    [junit4] Suite: org.apache.solr.cloud.ChaosMonkeyNothingIsSafeTest
     [exec]    [junit4] Completed on J2 in 60.70s, 1 test
     [exec]    [junit4] 
     [exec]    [junit4] Suite: org.apache.solr.core.TestReloadAndDeleteDocs
     [exec]    [junit4] Completed on J1 in 6.48s, 2 tests
     [exec]    [junit4] 
     [exec]    [junit4] Suite: org.apache.solr.search.TestQueryUtils
     [exec]    [junit4] Completed on J1 in 2.31s, 1 test
     [exec]    [junit4] 
     [exec]    [junit4] Suite: org.apache.solr.schema.OpenExchangeRatesOrgProviderTest
     [exec]    [junit4] Completed on J1 in 0.21s, 5 tests
     [exec]    [junit4] 
     [exec]    [junit4] Suite: org.apache.solr.handler.component.DebugComponentTest
     [exec]    [junit4] Completed on J1 in 2.71s, 4 tests
     [exec]    [junit4] 
     [exec]    [junit4] Suite: org.apache.solr.update.processor.FieldMutatingUpdateProcessorTest
     [exec]    [junit4] Completed on J1 in 4.50s, 27 tests
     [exec]    [junit4] 
     [exec]    [junit4] Suite: org.apache.solr.spelling.SpellCheckCollatorTest
     [exec]    [junit4] Completed on J1 in 4.04s, 8 tests
     [exec]    [junit4] 
     [exec]    [junit4] HEARTBEAT J0 PID(34688@lucene.zones.apache.org): 2014-03-01T17:09:35, stalled for 66.8s at: BasicZkTest.testBasic
     [exec]    [junit4] Suite: org.apache.solr.search.TestOverriddenPrefixQueryForCustomFieldType
     [exec]    [junit4] Completed on J1 in 1.19s, 2 tests
     [exec]    [junit4] 
     [exec]    [junit4] Suite: org.apache.solr.core.TestSolrDeletionPolicy1
     [exec]    [junit4] Completed on J1 in 3.12s, 3 tests
     [exec]    [junit4] 
     [exec]    [junit4] Suite: org.apache.solr.schema.NumericFieldsTest
     [exec]    [junit4] Completed on J1 in 1.14s, 1 test
     [exec]    [junit4] 
     [exec]    [junit4] Suite: org.apache.solr.TestDistributedGrouping
     [exec]    [junit4] Completed on J3 in 24.71s, 1 test
     [exec]    [junit4] 
     [exec]    [junit4] Suite: org.apache.solr.schema.DocValuesTest
     [exec]    [junit4] Completed on J1 in 2.35s, 6 tests
     [exec]    [junit4] 
     [exec] 

[...truncated too long message...]

, 3 tests
     [exec]    [junit4] 
     [exec]    [junit4] Suite: org.apache.solr.search.similarities.TestBM25SimilarityFactory
     [exec]    [junit4] Completed on J3 in 0.83s, 2 tests
     [exec]    [junit4] 
     [exec]    [junit4] Suite: org.apache.solr.search.similarities.TestLMDirichletSimilarityFactory
     [exec]    [junit4] Completed on J1 in 0.85s, 2 tests
     [exec]    [junit4] 
     [exec]    [junit4] Suite: org.apache.solr.core.TestShardHandlerFactory
     [exec]    [junit4] Completed on J0 in 0.88s, 2 tests
     [exec]    [junit4] 
     [exec]    [junit4] Suite: org.apache.solr.schema.SynonymTokenizerTest
     [exec]    [junit4] Completed on J2 in 0.76s, 1 test
     [exec]    [junit4] 
     [exec]    [junit4] Suite: org.apache.solr.TestCursorMarkWithoutUniqueKey
     [exec]    [junit4] Completed on J3 in 0.74s, 1 test
     [exec]    [junit4] 
     [exec]    [junit4] Suite: org.apache.solr.search.TestDocSet
     [exec]    [junit4] Completed on J2 in 0.62s, 2 tests
     [exec]    [junit4] 
     [exec]    [junit4] Suite: org.apache.solr.SolrTestCaseJ4Test
     [exec]    [junit4] Completed on J0 in 0.82s, 1 test
     [exec]    [junit4] 
     [exec]    [junit4] Suite: org.apache.solr.analysis.LegacyHTMLStripCharFilterTest
     [exec]    [junit4] Completed on J2 in 0.18s, 13 tests, 1 skipped
     [exec]    [junit4] 
     [exec]    [junit4] Suite: org.apache.solr.schema.ExternalFileFieldSortTest
     [exec]    [junit4] Completed on J1 in 1.01s, 1 test
     [exec]    [junit4] 
     [exec]    [junit4] Suite: org.apache.solr.util.SimplePostToolTest
     [exec]    [junit4] Completed on J1 in 0.15s, 11 tests
     [exec]    [junit4] 
     [exec]    [junit4] Suite: org.apache.solr.update.processor.URLClassifyProcessorTest
     [exec]    [junit4] Completed on J0 in 0.38s, 7 tests
     [exec]    [junit4] 
     [exec]    [junit4] Suite: org.apache.solr.core.TestSolrXmlPersistor
     [exec]    [junit4] Completed on J2 in 0.32s, 7 tests
     [exec]    [junit4] 
     [exec]    [junit4] Suite: org.apache.solr.search.similarities.TestPerFieldSimilarity
     [exec]    [junit4] Completed on J3 in 0.85s, 7 tests
     [exec]    [junit4] 
     [exec]    [junit4] Suite: org.apache.solr.util.TestSystemIdResolver
     [exec]    [junit4] Completed on J1 in 0.09s, 1 test
     [exec]    [junit4] 
     [exec]    [junit4] Suite: org.apache.solr.util.DateMathParserTest
     [exec]    [junit4] Completed on J0 in 0.11s, 8 tests
     [exec]    [junit4] 
     [exec]    [junit4] Suite: org.apache.solr.spelling.TestSuggestSpellingConverter
     [exec]    [junit4] Completed on J2 in 0.02s, 2 tests
     [exec]    [junit4] 
     [exec]    [junit4] Suite: org.apache.solr.cloud.hdfs.StressHdfsTest
     [exec]    [junit4] Completed on J3 in 0.04s, 1 test, 1 skipped
     [exec]    [junit4] 
     [exec]    [junit4] Suite: org.apache.solr.cloud.hdfs.HdfsUnloadDistributedZkTest
     [exec]    [junit4] Completed on J1 in 0.20s, 1 test, 1 skipped
     [exec]    [junit4] 
     [exec]    [junit4] Suite: org.apache.solr.internal.csv.CSVUtilsTest
     [exec]    [junit4] Completed on J0 in 0.07s, 14 tests
     [exec]    [junit4] 
     [exec]    [junit4] Suite: org.apache.solr.cloud.hdfs.HdfsCollectionsAPIDistributedZkTest
     [exec]    [junit4] Completed on J2 in 0.05s, 1 test, 1 skipped
     [exec]    [junit4] 
     [exec]    [junit4] Suite: org.apache.solr.spelling.SpellingQueryConverterTest
     [exec]    [junit4] Completed on J3 in 0.04s, 5 tests
     [exec]    [junit4] 
     [exec]    [junit4] Suite: org.apache.solr.schema.DateFieldTest
     [exec]    [junit4] Completed on J1 in 0.06s, 8 tests, 1 skipped
     [exec]    [junit4] 
     [exec]    [junit4] Suite: org.apache.solr.util.DOMUtilTest
     [exec]    [junit4] Completed on J0 in 0.08s, 1 test
     [exec]    [junit4] 
     [exec]    [junit4] Suite: org.apache.solr.cloud.ChaosMonkeySafeLeaderTest
     [exec]    [junit4] IGNOR/A 0.00s J2 | ChaosMonkeySafeLeaderTest.testDistribSearch
     [exec]    [junit4]    > Assumption #1: 'badapple' test group is disabled (@BadApple)
     [exec]    [junit4] Completed on J2 in 0.04s, 1 test, 1 skipped
     [exec]    [junit4] 
     [exec]    [junit4] Suite: org.apache.solr.cloud.hdfs.HdfsBasicDistributedZk2Test
     [exec]    [junit4] Completed on J3 in 0.04s, 1 test, 1 skipped
     [exec]    [junit4] 
     [exec]    [junit4] Suite: org.apache.solr.util.PrimUtilsTest
     [exec]    [junit4] Completed on J1 in 0.03s, 2 tests
     [exec]    [junit4] 
     [exec]    [junit4] Suite: org.apache.solr.util.TestRandomMergePolicy
     [exec]    [junit4] Completed on J2 in 0.03s, 2 tests
     [exec]    [junit4] 
     [exec]    [junit4] Suite: org.apache.solr.search.TestLRUCache
     [exec]    [junit4] Completed on J3 in 0.03s, 3 tests
     [exec]    [junit4] 
     [exec]    [junit4] Suite: org.apache.solr.search.TestSolrJ
     [exec]    [junit4] Completed on J1 in 0.02s, 1 test
     [exec]    [junit4] 
     [exec]    [junit4] Suite: org.apache.solr.store.hdfs.HdfsDirectoryTest
     [exec]    [junit4] Completed on J2 in 0.03s, 3 tests, 3 skipped
     [exec]    [junit4] 
     [exec]    [junit4] Suite: org.apache.solr.core.RAMDirectoryFactoryTest
     [exec]    [junit4] Completed on J3 in 0.02s, 1 test
     [exec]    [junit4] 
     [exec]    [junit4] Suite: org.apache.solr.search.TestStandardQParsers
     [exec]    [junit4] Completed on J1 in 0.02s, 1 test
     [exec]    [junit4] 
     [exec]    [junit4] Suite: org.apache.solr.util.FileUtilsTest
     [exec]    [junit4] Completed on J2 in 0.02s, 1 test
     [exec]    [junit4] 
     [exec]    [junit4] Suite: org.apache.solr.schema.UUIDFieldTest
     [exec]    [junit4] Completed on J3 in 0.02s, 1 test
     [exec]    [junit4] 
     [exec]    [junit4] Suite: org.apache.solr.internal.csv.ExtendedBufferedReaderTest
     [exec]    [junit4] Completed on J1 in 0.02s, 8 tests
     [exec]    [junit4] 
     [exec]    [junit4] Suite: org.apache.solr.handler.component.DistributedMLTComponentTest
     [exec]    [junit4] Completed on J2 in 0.00s, 0 tests
     [exec]    [junit4] 
     [exec]    [junit4] Suite: org.apache.solr.cloud.ClusterStateTest
     [exec]    [junit4] Completed on J0 in 1.84s, 1 test
     [exec]    [junit4] 
     [exec]    [junit4] 
     [exec]    [junit4] Tests with failures:
     [exec]    [junit4]   - org.apache.solr.cloud.OverseerTest.testOverseerFailure
     [exec]    [junit4] 
     [exec]    [junit4] 
     [exec]    [junit4] JVM J0:     3.03 ..  1020.27 =  1017.23s
     [exec]    [junit4] JVM J1:     3.25 ..  1019.25 =  1016.00s
     [exec]    [junit4] JVM J2:     3.03 ..  1019.43 =  1016.40s
     [exec]    [junit4] JVM J3:     3.03 ..  1019.20 =  1016.16s
     [exec]    [junit4] Execution time total: 17 minutes
     [exec]    [junit4] Tests summary: 363 suites, 1570 tests, 1 error, 36 ignored (8 assumptions)
     [exec] 
     [exec] BUILD FAILED
     [exec] /usr/home/hudson/hudson-slave/workspace/Lucene-Solr-SmokeRelease-4.x/lucene/build/fakeReleaseTmp/unpack/solr-4.8.0/solr/build.xml:189: The following error occurred while executing this line:
     [exec] /usr/home/hudson/hudson-slave/workspace/Lucene-Solr-SmokeRelease-4.x/lucene/build/fakeReleaseTmp/unpack/solr-4.8.0/solr/common-build.xml:490: The following error occurred while executing this line:
     [exec] /usr/home/hudson/hudson-slave/workspace/Lucene-Solr-SmokeRelease-4.x/lucene/build/fakeReleaseTmp/unpack/solr-4.8.0/lucene/common-build.xml:1278: The following error occurred while executing this line:
     [exec] /usr/home/hudson/hudson-slave/workspace/Lucene-Solr-SmokeRelease-4.x/lucene/build/fakeReleaseTmp/unpack/solr-4.8.0/lucene/common-build.xml:911: There were test failures: 363 suites, 1570 tests, 1 error, 36 ignored (8 assumptions)
     [exec] 
     [exec] Total time: 17 minutes 27 seconds
     [exec] 
     [exec] 
     [exec] Traceback (most recent call last):
     [exec]   File "/usr/home/hudson/hudson-slave/workspace/Lucene-Solr-SmokeRelease-4.x/dev-tools/scripts/smokeTestRelease.py", line 1376, in <module>
     [exec]     main()
     [exec]   File "/usr/home/hudson/hudson-slave/workspace/Lucene-Solr-SmokeRelease-4.x/dev-tools/scripts/smokeTestRelease.py", line 1320, in main
     [exec]     smokeTest(baseURL, svnRevision, version, tmpDir, isSigned, testArgs)
     [exec]   File "/usr/home/hudson/hudson-slave/workspace/Lucene-Solr-SmokeRelease-4.x/dev-tools/scripts/smokeTestRelease.py", line 1365, in smokeTest
     [exec]     unpackAndVerify('solr', tmpDir, 'solr-%s-src.tgz' % version, svnRevision, version, testArgs, baseURL)
     [exec]   File "/usr/home/hudson/hudson-slave/workspace/Lucene-Solr-SmokeRelease-4.x/dev-tools/scripts/smokeTestRelease.py", line 635, in unpackAndVerify
     [exec]     verifyUnpacked(project, artifact, unpackPath, svnRevision, version, testArgs, tmpDir, baseURL)
     [exec]   File "/usr/home/hudson/hudson-slave/workspace/Lucene-Solr-SmokeRelease-4.x/dev-tools/scripts/smokeTestRelease.py", line 759, in verifyUnpacked
     [exec]     run('%s; ant clean test %s' % (javaExe('1.7'), testArgs), '%s/test.log' % unpackPath)
     [exec]   File "/usr/home/hudson/hudson-slave/workspace/Lucene-Solr-SmokeRelease-4.x/dev-tools/scripts/smokeTestRelease.py", line 560, in run
     [exec]     raise RuntimeError('command "%s" failed; see log file %s' % (command, logPath))
     [exec] RuntimeError: command "export JAVA_HOME="/home/hudson/tools/java/latest1.7" PATH="/home/hudson/tools/java/latest1.7/bin:$PATH" JAVACMD="/home/hudson/tools/java/latest1.7/bin/java"; ant clean test -Dtests.jettyConnector=Socket  -Dtests.disableHdfs=true" failed; see log file /usr/home/hudson/hudson-slave/workspace/Lucene-Solr-SmokeRelease-4.x/lucene/build/fakeReleaseTmp/unpack/solr-4.8.0/test.log

BUILD FAILED
/usr/home/hudson/hudson-slave/workspace/Lucene-Solr-SmokeRelease-4.x/build.xml:390: exec returned: 1

Total time: 163 minutes 36 seconds
Build step 'Invoke Ant' marked build as failure
Email was triggered for: Failure
Sending email for trigger: Failure



Mime
View raw message